lucene-dev mailing list archives

Site index · List index
Message view « Date » · « Thread »
Top « Date » · « Thread »
From Policeman Jenkins Server <jenk...@thetaphi.de>
Subject [JENKINS] Lucene-Solr-trunk-Linux (32bit/jdk1.7.0_60-ea-b01) - Build # 8859 - Failure!
Date Sat, 28 Dec 2013 13:13:31 GMT
Build: http://jenkins.thetaphi.de/job/Lucene-Solr-trunk-Linux/8859/
Java: 32bit/jdk1.7.0_60-ea-b01 -server -XX:+UseParallelGC

9 tests failed.
FAILED:  junit.framework.TestSuite.org.apache.solr.cloud.ChaosMonkeyNothingIsSafeTest

Error Message:
ERROR: SolrIndexSearcher opens=27 closes=26

Stack Trace:
java.lang.AssertionError: ERROR: SolrIndexSearcher opens=27 closes=26
	at __randomizedtesting.SeedInfo.seed([23A66BE88F72EF6F]:0)
	at org.junit.Assert.fail(Assert.java:93)
	at org.apache.solr.SolrTestCaseJ4.endTrackingSearchers(SolrTestCaseJ4.java:335)
	at org.apache.solr.SolrTestCaseJ4.afterClass(SolrTestCaseJ4.java:139)
	at sun.reflect.GeneratedMethodAccessor26.invoke(Unknown Source)
	at sun.reflect.DelegatingMethodAccessorImpl.invoke(DelegatingMethodAccessorImpl.java:43)
	at java.lang.reflect.Method.invoke(Method.java:606)
	at com.carrotsearch.randomizedtesting.RandomizedRunner.invoke(RandomizedRunner.java:1559)
	at com.carrotsearch.randomizedtesting.RandomizedRunner.access$600(RandomizedRunner.java:79)
	at com.carrotsearch.randomizedtesting.RandomizedRunner$5.evaluate(RandomizedRunner.java:700)
	at com.carrotsearch.randomizedtesting.rules.StatementAdapter.evaluate(StatementAdapter.java:36)
	at com.carrotsearch.randomizedtesting.rules.SystemPropertiesRestoreRule$1.evaluate(SystemPropertiesRestoreRule.java:53)
	at org.apache.lucene.util.AbstractBeforeAfterRule$1.evaluate(AbstractBeforeAfterRule.java:46)
	at org.apache.lucene.util.TestRuleStoreClassName$1.evaluate(TestRuleStoreClassName.java:42)
	at com.carrotsearch.randomizedtesting.rules.SystemPropertiesInvariantRule$1.evaluate(SystemPropertiesInvariantRule.java:55)
	at com.carrotsearch.randomizedtesting.rules.NoShadowingOrOverridesOnMethodsRule$1.evaluate(NoShadowingOrOverridesOnMethodsRule.java:39)
	at com.carrotsearch.randomizedtesting.rules.NoShadowingOrOverridesOnMethodsRule$1.evaluate(NoShadowingOrOverridesOnMethodsRule.java:39)
	at com.carrotsearch.randomizedtesting.rules.StatementAdapter.evaluate(StatementAdapter.java:36)
	at org.apache.lucene.util.TestRuleAssertionsRequired$1.evaluate(TestRuleAssertionsRequired.java:43)
	at org.apache.lucene.util.TestRuleMarkFailure$1.evaluate(TestRuleMarkFailure.java:48)
	at org.apache.lucene.util.TestRuleIgnoreAfterMaxFailures$1.evaluate(TestRuleIgnoreAfterMaxFailures.java:70)
	at org.apache.lucene.util.TestRuleIgnoreTestSuites$1.evaluate(TestRuleIgnoreTestSuites.java:55)
	at com.carrotsearch.randomizedtesting.rules.StatementAdapter.evaluate(StatementAdapter.java:36)
	at com.carrotsearch.randomizedtesting.ThreadLeakControl$StatementRunner.run(ThreadLeakControl.java:358)
	at java.lang.Thread.run(Thread.java:744)


FAILED:  junit.framework.TestSuite.org.apache.solr.cloud.ChaosMonkeyNothingIsSafeTest

Error Message:
2 threads leaked from SUITE scope at org.apache.solr.cloud.ChaosMonkeyNothingIsSafeTest:     1) Thread[id=3373, name=qtp28180100-3373, state=RUNNABLE, group=TGRP-ChaosMonkeyNothingIsSafeTest]         at org.apache.solr.client.solrj.impl.ConcurrentUpdateSolrServer.blockUntilFinished(ConcurrentUpdateSolrServer.java:391)         at org.apache.solr.update.StreamingSolrServers.blockUntilFinished(StreamingSolrServers.java:104)         at org.apache.solr.update.SolrCmdDistributor.doRetriesIfNeeded(SolrCmdDistributor.java:148)         at org.apache.solr.update.SolrCmdDistributor.doRetriesIfNeeded(SolrCmdDistributor.java:149)         at org.apache.solr.update.SolrCmdDistributor.finish(SolrCmdDistributor.java:71)         at org.apache.solr.update.processor.DistributedUpdateProcessor.doFinish(DistributedUpdateProcessor.java:606)         at org.apache.solr.update.processor.DistributedUpdateProcessor.finish(DistributedUpdateProcessor.java:1456)         at org.apache.solr.update.processor.LogUpdateProcessor.finish(LogUpdateProcessorFactory.java:179)         at org.apache.solr.handler.ContentStreamHandlerBase.handleRequestBody(ContentStreamHandlerBase.java:83)         at org.apache.solr.handler.RequestHandlerBase.handleRequest(RequestHandlerBase.java:135)         at org.apache.solr.core.SolrCore.execute(SolrCore.java:1874)         at org.apache.solr.servlet.SolrDispatchFilter.execute(SolrDispatchFilter.java:753)         at org.apache.solr.servlet.SolrDispatchFilter.doFilter(SolrDispatchFilter.java:415)         at org.apache.solr.servlet.SolrDispatchFilter.doFilter(SolrDispatchFilter.java:200)         at org.eclipse.jetty.servlet.ServletHandler$CachedChain.doFilter(ServletHandler.java:1419)         at org.apache.solr.client.solrj.embedded.JettySolrRunner$DebugFilter.doFilter(JettySolrRunner.java:136)         at org.eclipse.jetty.servlet.ServletHandler$CachedChain.doFilter(ServletHandler.java:1419)         at org.eclipse.jetty.servlet.ServletHandler.doHandle(ServletHandler.java:455)         at org.eclipse.jetty.server.session.SessionHandler.doHandle(SessionHandler.java:229)         at org.eclipse.jetty.server.handler.ScopedHandler.handle(ScopedHandler.java:137)         at org.eclipse.jetty.server.handler.GzipHandler.handle(GzipHandler.java:301)         at org.eclipse.jetty.server.handler.ContextHandler.doHandle(ContextHandler.java:1077)         at org.eclipse.jetty.servlet.ServletHandler.doScope(ServletHandler.java:384)         at org.eclipse.jetty.server.session.SessionHandler.doScope(SessionHandler.java:193)         at org.eclipse.jetty.server.handler.ContextHandler.doScope(ContextHandler.java:1009)         at org.eclipse.jetty.server.handler.ScopedHandler.handle(ScopedHandler.java:135)         at org.eclipse.jetty.server.handler.HandlerWrapper.handle(HandlerWrapper.java:116)         at org.eclipse.jetty.server.Server.handle(Server.java:368)         at org.eclipse.jetty.server.AbstractHttpConnection.handleRequest(AbstractHttpConnection.java:489)         at org.eclipse.jetty.server.AbstractHttpConnection.content(AbstractHttpConnection.java:953)         at org.eclipse.jetty.server.AbstractHttpConnection$RequestHandler.content(AbstractHttpConnection.java:1014)         at org.eclipse.jetty.http.HttpParser.parseNext(HttpParser.java:861)         at org.eclipse.jetty.http.HttpParser.parseAvailable(HttpParser.java:240)         at org.eclipse.jetty.server.AsyncHttpConnection.handle(AsyncHttpConnection.java:82)         at org.eclipse.jetty.io.nio.SelectChannelEndPoint.handle(SelectChannelEndPoint.java:628)         at org.eclipse.jetty.io.nio.SelectChannelEndPoint$1.run(SelectChannelEndPoint.java:52)         at org.eclipse.jetty.util.thread.QueuedThreadPool.runJob(QueuedThreadPool.java:608)         at org.eclipse.jetty.util.thread.QueuedThreadPool$3.run(QueuedThreadPool.java:543)         at java.lang.Thread.run(Thread.java:744)    2) Thread[id=3381, name=searcherExecutor-2755-thread-1, state=WAITING, group=TGRP-ChaosMonkeyNothingIsSafeTest]         at sun.misc.Unsafe.park(Native Method)         at java.util.concurrent.locks.LockSupport.park(LockSupport.java:186)         at java.util.concurrent.locks.AbstractQueuedSynchronizer$ConditionObject.await(AbstractQueuedSynchronizer.java:2043)         at java.util.concurrent.LinkedBlockingQueue.take(LinkedBlockingQueue.java:442)         at java.util.concurrent.ThreadPoolExecutor.getTask(ThreadPoolExecutor.java:1068)         at java.util.concurrent.ThreadPoolExecutor.runWorker(ThreadPoolExecutor.java:1130)         at java.util.concurrent.ThreadPoolExecutor$Worker.run(ThreadPoolExecutor.java:615)         at java.lang.Thread.run(Thread.java:744)

Stack Trace:
com.carrotsearch.randomizedtesting.ThreadLeakError: 2 threads leaked from SUITE scope at org.apache.solr.cloud.ChaosMonkeyNothingIsSafeTest: 
   1) Thread[id=3373, name=qtp28180100-3373, state=RUNNABLE, group=TGRP-ChaosMonkeyNothingIsSafeTest]
        at org.apache.solr.client.solrj.impl.ConcurrentUpdateSolrServer.blockUntilFinished(ConcurrentUpdateSolrServer.java:391)
        at org.apache.solr.update.StreamingSolrServers.blockUntilFinished(StreamingSolrServers.java:104)
        at org.apache.solr.update.SolrCmdDistributor.doRetriesIfNeeded(SolrCmdDistributor.java:148)
        at org.apache.solr.update.SolrCmdDistributor.doRetriesIfNeeded(SolrCmdDistributor.java:149)
        at org.apache.solr.update.SolrCmdDistributor.finish(SolrCmdDistributor.java:71)
        at org.apache.solr.update.processor.DistributedUpdateProcessor.doFinish(DistributedUpdateProcessor.java:606)
        at org.apache.solr.update.processor.DistributedUpdateProcessor.finish(DistributedUpdateProcessor.java:1456)
        at org.apache.solr.update.processor.LogUpdateProcessor.finish(LogUpdateProcessorFactory.java:179)
        at org.apache.solr.handler.ContentStreamHandlerBase.handleRequestBody(ContentStreamHandlerBase.java:83)
        at org.apache.solr.handler.RequestHandlerBase.handleRequest(RequestHandlerBase.java:135)
        at org.apache.solr.core.SolrCore.execute(SolrCore.java:1874)
        at org.apache.solr.servlet.SolrDispatchFilter.execute(SolrDispatchFilter.java:753)
        at org.apache.solr.servlet.SolrDispatchFilter.doFilter(SolrDispatchFilter.java:415)
        at org.apache.solr.servlet.SolrDispatchFilter.doFilter(SolrDispatchFilter.java:200)
        at org.eclipse.jetty.servlet.ServletHandler$CachedChain.doFilter(ServletHandler.java:1419)
        at org.apache.solr.client.solrj.embedded.JettySolrRunner$DebugFilter.doFilter(JettySolrRunner.java:136)
        at org.eclipse.jetty.servlet.ServletHandler$CachedChain.doFilter(ServletHandler.java:1419)
        at org.eclipse.jetty.servlet.ServletHandler.doHandle(ServletHandler.java:455)
        at org.eclipse.jetty.server.session.SessionHandler.doHandle(SessionHandler.java:229)
        at org.eclipse.jetty.server.handler.ScopedHandler.handle(ScopedHandler.java:137)
        at org.eclipse.jetty.server.handler.GzipHandler.handle(GzipHandler.java:301)
        at org.eclipse.jetty.server.handler.ContextHandler.doHandle(ContextHandler.java:1077)
        at org.eclipse.jetty.servlet.ServletHandler.doScope(ServletHandler.java:384)
        at org.eclipse.jetty.server.session.SessionHandler.doScope(SessionHandler.java:193)
        at org.eclipse.jetty.server.handler.ContextHandler.doScope(ContextHandler.java:1009)
        at org.eclipse.jetty.server.handler.ScopedHandler.handle(ScopedHandler.java:135)
        at org.eclipse.jetty.server.handler.HandlerWrapper.handle(HandlerWrapper.java:116)
        at org.eclipse.jetty.server.Server.handle(Server.java:368)
        at org.eclipse.jetty.server.AbstractHttpConnection.handleRequest(AbstractHttpConnection.java:489)
        at org.eclipse.jetty.server.AbstractHttpConnection.content(AbstractHttpConnection.java:953)
        at org.eclipse.jetty.server.AbstractHttpConnection$RequestHandler.content(AbstractHttpConnection.java:1014)
        at org.eclipse.jetty.http.HttpParser.parseNext(HttpParser.java:861)
        at org.eclipse.jetty.http.HttpParser.parseAvailable(HttpParser.java:240)
        at org.eclipse.jetty.server.AsyncHttpConnection.handle(AsyncHttpConnection.java:82)
        at org.eclipse.jetty.io.nio.SelectChannelEndPoint.handle(SelectChannelEndPoint.java:628)
        at org.eclipse.jetty.io.nio.SelectChannelEndPoint$1.run(SelectChannelEndPoint.java:52)
        at org.eclipse.jetty.util.thread.QueuedThreadPool.runJob(QueuedThreadPool.java:608)
        at org.eclipse.jetty.util.thread.QueuedThreadPool$3.run(QueuedThreadPool.java:543)
        at java.lang.Thread.run(Thread.java:744)
   2) Thread[id=3381, name=searcherExecutor-2755-thread-1, state=WAITING, group=TGRP-ChaosMonkeyNothingIsSafeTest]
        at sun.misc.Unsafe.park(Native Method)
        at java.util.concurrent.locks.LockSupport.park(LockSupport.java:186)
        at java.util.concurrent.locks.AbstractQueuedSynchronizer$ConditionObject.await(AbstractQueuedSynchronizer.java:2043)
        at java.util.concurrent.LinkedBlockingQueue.take(LinkedBlockingQueue.java:442)
        at java.util.concurrent.ThreadPoolExecutor.getTask(ThreadPoolExecutor.java:1068)
        at java.util.concurrent.ThreadPoolExecutor.runWorker(ThreadPoolExecutor.java:1130)
        at java.util.concurrent.ThreadPoolExecutor$Worker.run(ThreadPoolExecutor.java:615)
        at java.lang.Thread.run(Thread.java:744)
	at __randomizedtesting.SeedInfo.seed([23A66BE88F72EF6F]:0)


FAILED:  junit.framework.TestSuite.org.apache.solr.cloud.ChaosMonkeyNothingIsSafeTest

Error Message:
There are still zombie threads that couldn't be terminated:    1) Thread[id=3381, name=searcherExecutor-2755-thread-1, state=WAITING, group=TGRP-ChaosMonkeyNothingIsSafeTest]         at sun.misc.Unsafe.park(Native Method)         at java.util.concurrent.locks.LockSupport.park(LockSupport.java:186)         at java.util.concurrent.locks.AbstractQueuedSynchronizer$ConditionObject.await(AbstractQueuedSynchronizer.java:2043)         at java.util.concurrent.LinkedBlockingQueue.take(LinkedBlockingQueue.java:442)         at java.util.concurrent.ThreadPoolExecutor.getTask(ThreadPoolExecutor.java:1068)         at java.util.concurrent.ThreadPoolExecutor.runWorker(ThreadPoolExecutor.java:1130)         at java.util.concurrent.ThreadPoolExecutor$Worker.run(ThreadPoolExecutor.java:615)         at java.lang.Thread.run(Thread.java:744)    2) Thread[id=3373, name=qtp28180100-3373, state=RUNNABLE, group=TGRP-ChaosMonkeyNothingIsSafeTest]         at org.apache.solr.client.solrj.impl.ConcurrentUpdateSolrServer.blockUntilFinished(ConcurrentUpdateSolrServer.java:391)         at org.apache.solr.update.StreamingSolrServers.blockUntilFinished(StreamingSolrServers.java:104)         at org.apache.solr.update.SolrCmdDistributor.doRetriesIfNeeded(SolrCmdDistributor.java:148)         at org.apache.solr.update.SolrCmdDistributor.doRetriesIfNeeded(SolrCmdDistributor.java:149)         at org.apache.solr.update.SolrCmdDistributor.finish(SolrCmdDistributor.java:71)         at org.apache.solr.update.processor.DistributedUpdateProcessor.doFinish(DistributedUpdateProcessor.java:606)         at org.apache.solr.update.processor.DistributedUpdateProcessor.finish(DistributedUpdateProcessor.java:1456)         at org.apache.solr.update.processor.LogUpdateProcessor.finish(LogUpdateProcessorFactory.java:179)         at org.apache.solr.handler.ContentStreamHandlerBase.handleRequestBody(ContentStreamHandlerBase.java:83)         at org.apache.solr.handler.RequestHandlerBase.handleRequest(RequestHandlerBase.java:135)         at org.apache.solr.core.SolrCore.execute(SolrCore.java:1874)         at org.apache.solr.servlet.SolrDispatchFilter.execute(SolrDispatchFilter.java:753)         at org.apache.solr.servlet.SolrDispatchFilter.doFilter(SolrDispatchFilter.java:415)         at org.apache.solr.servlet.SolrDispatchFilter.doFilter(SolrDispatchFilter.java:200)         at org.eclipse.jetty.servlet.ServletHandler$CachedChain.doFilter(ServletHandler.java:1419)         at org.apache.solr.client.solrj.embedded.JettySolrRunner$DebugFilter.doFilter(JettySolrRunner.java:136)         at org.eclipse.jetty.servlet.ServletHandler$CachedChain.doFilter(ServletHandler.java:1419)         at org.eclipse.jetty.servlet.ServletHandler.doHandle(ServletHandler.java:455)         at org.eclipse.jetty.server.session.SessionHandler.doHandle(SessionHandler.java:229)         at org.eclipse.jetty.server.handler.ScopedHandler.handle(ScopedHandler.java:137)         at org.eclipse.jetty.server.handler.GzipHandler.handle(GzipHandler.java:301)         at org.eclipse.jetty.server.handler.ContextHandler.doHandle(ContextHandler.java:1077)         at org.eclipse.jetty.servlet.ServletHandler.doScope(ServletHandler.java:384)         at org.eclipse.jetty.server.session.SessionHandler.doScope(SessionHandler.java:193)         at org.eclipse.jetty.server.handler.ContextHandler.doScope(ContextHandler.java:1009)         at org.eclipse.jetty.server.handler.ScopedHandler.handle(ScopedHandler.java:135)         at org.eclipse.jetty.server.handler.HandlerWrapper.handle(HandlerWrapper.java:116)         at org.eclipse.jetty.server.Server.handle(Server.java:368)         at org.eclipse.jetty.server.AbstractHttpConnection.handleRequest(AbstractHttpConnection.java:489)         at org.eclipse.jetty.server.AbstractHttpConnection.content(AbstractHttpConnection.java:953)         at org.eclipse.jetty.server.AbstractHttpConnection$RequestHandler.content(AbstractHttpConnection.java:1014)         at org.eclipse.jetty.http.HttpParser.parseNext(HttpParser.java:861)         at org.eclipse.jetty.http.HttpParser.parseAvailable(HttpParser.java:240)         at org.eclipse.jetty.server.AsyncHttpConnection.handle(AsyncHttpConnection.java:82)         at org.eclipse.jetty.io.nio.SelectChannelEndPoint.handle(SelectChannelEndPoint.java:628)         at org.eclipse.jetty.io.nio.SelectChannelEndPoint$1.run(SelectChannelEndPoint.java:52)         at org.eclipse.jetty.util.thread.QueuedThreadPool.runJob(QueuedThreadPool.java:608)         at org.eclipse.jetty.util.thread.QueuedThreadPool$3.run(QueuedThreadPool.java:543)         at java.lang.Thread.run(Thread.java:744)

Stack Trace:
com.carrotsearch.randomizedtesting.ThreadLeakError: There are still zombie threads that couldn't be terminated:
   1) Thread[id=3381, name=searcherExecutor-2755-thread-1, state=WAITING, group=TGRP-ChaosMonkeyNothingIsSafeTest]
        at sun.misc.Unsafe.park(Native Method)
        at java.util.concurrent.locks.LockSupport.park(LockSupport.java:186)
        at java.util.concurrent.locks.AbstractQueuedSynchronizer$ConditionObject.await(AbstractQueuedSynchronizer.java:2043)
        at java.util.concurrent.LinkedBlockingQueue.take(LinkedBlockingQueue.java:442)
        at java.util.concurrent.ThreadPoolExecutor.getTask(ThreadPoolExecutor.java:1068)
        at java.util.concurrent.ThreadPoolExecutor.runWorker(ThreadPoolExecutor.java:1130)
        at java.util.concurrent.ThreadPoolExecutor$Worker.run(ThreadPoolExecutor.java:615)
        at java.lang.Thread.run(Thread.java:744)
   2) Thread[id=3373, name=qtp28180100-3373, state=RUNNABLE, group=TGRP-ChaosMonkeyNothingIsSafeTest]
        at org.apache.solr.client.solrj.impl.ConcurrentUpdateSolrServer.blockUntilFinished(ConcurrentUpdateSolrServer.java:391)
        at org.apache.solr.update.StreamingSolrServers.blockUntilFinished(StreamingSolrServers.java:104)
        at org.apache.solr.update.SolrCmdDistributor.doRetriesIfNeeded(SolrCmdDistributor.java:148)
        at org.apache.solr.update.SolrCmdDistributor.doRetriesIfNeeded(SolrCmdDistributor.java:149)
        at org.apache.solr.update.SolrCmdDistributor.finish(SolrCmdDistributor.java:71)
        at org.apache.solr.update.processor.DistributedUpdateProcessor.doFinish(DistributedUpdateProcessor.java:606)
        at org.apache.solr.update.processor.DistributedUpdateProcessor.finish(DistributedUpdateProcessor.java:1456)
        at org.apache.solr.update.processor.LogUpdateProcessor.finish(LogUpdateProcessorFactory.java:179)
        at org.apache.solr.handler.ContentStreamHandlerBase.handleRequestBody(ContentStreamHandlerBase.java:83)
        at org.apache.solr.handler.RequestHandlerBase.handleRequest(RequestHandlerBase.java:135)
        at org.apache.solr.core.SolrCore.execute(SolrCore.java:1874)
        at org.apache.solr.servlet.SolrDispatchFilter.execute(SolrDispatchFilter.java:753)
        at org.apache.solr.servlet.SolrDispatchFilter.doFilter(SolrDispatchFilter.java:415)
        at org.apache.solr.servlet.SolrDispatchFilter.doFilter(SolrDispatchFilter.java:200)
        at org.eclipse.jetty.servlet.ServletHandler$CachedChain.doFilter(ServletHandler.java:1419)
        at org.apache.solr.client.solrj.embedded.JettySolrRunner$DebugFilter.doFilter(JettySolrRunner.java:136)
        at org.eclipse.jetty.servlet.ServletHandler$CachedChain.doFilter(ServletHandler.java:1419)
        at org.eclipse.jetty.servlet.ServletHandler.doHandle(ServletHandler.java:455)
        at org.eclipse.jetty.server.session.SessionHandler.doHandle(SessionHandler.java:229)
        at org.eclipse.jetty.server.handler.ScopedHandler.handle(ScopedHandler.java:137)
        at org.eclipse.jetty.server.handler.GzipHandler.handle(GzipHandler.java:301)
        at org.eclipse.jetty.server.handler.ContextHandler.doHandle(ContextHandler.java:1077)
        at org.eclipse.jetty.servlet.ServletHandler.doScope(ServletHandler.java:384)
        at org.eclipse.jetty.server.session.SessionHandler.doScope(SessionHandler.java:193)
        at org.eclipse.jetty.server.handler.ContextHandler.doScope(ContextHandler.java:1009)
        at org.eclipse.jetty.server.handler.ScopedHandler.handle(ScopedHandler.java:135)
        at org.eclipse.jetty.server.handler.HandlerWrapper.handle(HandlerWrapper.java:116)
        at org.eclipse.jetty.server.Server.handle(Server.java:368)
        at org.eclipse.jetty.server.AbstractHttpConnection.handleRequest(AbstractHttpConnection.java:489)
        at org.eclipse.jetty.server.AbstractHttpConnection.content(AbstractHttpConnection.java:953)
        at org.eclipse.jetty.server.AbstractHttpConnection$RequestHandler.content(AbstractHttpConnection.java:1014)
        at org.eclipse.jetty.http.HttpParser.parseNext(HttpParser.java:861)
        at org.eclipse.jetty.http.HttpParser.parseAvailable(HttpParser.java:240)
        at org.eclipse.jetty.server.AsyncHttpConnection.handle(AsyncHttpConnection.java:82)
        at org.eclipse.jetty.io.nio.SelectChannelEndPoint.handle(SelectChannelEndPoint.java:628)
        at org.eclipse.jetty.io.nio.SelectChannelEndPoint$1.run(SelectChannelEndPoint.java:52)
        at org.eclipse.jetty.util.thread.QueuedThreadPool.runJob(QueuedThreadPool.java:608)
        at org.eclipse.jetty.util.thread.QueuedThreadPool$3.run(QueuedThreadPool.java:543)
        at java.lang.Thread.run(Thread.java:744)
	at __randomizedtesting.SeedInfo.seed([23A66BE88F72EF6F]:0)


REGRESSION:  org.apache.solr.analytics.expression.ExpressionTest.multiplyTest

Error Message:
Caught exception in getStatResult, xPath = /response/lst[@name='stats']/lst[@name='mr']/double[@name='sum']  raw data: <?xml version="1.0" encoding="UTF-8"?> <response>  <lst name="responseHeader">   <int name="status">0</int>   <int name="QTime">7</int> </lst> <result name="response" numFound="100" start="0"> </result> <lst name="stats">   <lst name="stats_fields"/> </lst> <lst name="stats">   <lst name="pr">     <long name="count">100</long>     <null name="mc"/>     <null name="mean"/>     <null name="su"/>     <null name="sum"/>     <null name="unique"/>   </lst>   <lst name="dr">     <long name="count">100</long>     <null name="mc"/>     <null name="mean"/>     <null name="su"/>     <null name="sum"/>     <null name="unique"/>   </lst>   <lst name="cdr">     <date name="cd1">1800-12-31T23:59:59Z</date>     <date name="cd2">1804-06-30T23:59:59Z</date>     <str name="cs1">1800-12-31T23:59:59Z</str>     <str name="cs2">1804-06-30T23:59:59Z</str>   </lst>   <lst name="ar">     <long name="count">100</long>     <null name="mcm"/>     <null name="mean"/>     <null name="median"/>     <null name="su"/>     <null name="sum"/>     <null name="unique"/>   </lst>   <lst name="avr">     <double name="c">100.0</double>     <long name="count">100</long>     <null name="s"/>     <null name="sum"/>   </lst>   <lst name="cr">     <str name="ccmax">this is the secondstr9</str>     <str name="ccmin">this is the firststr0</str>     <str name="csmax">this is the second</str>     <str name="csmin">this is the first</str>     <str name="max">str9</str>     <str name="min">str0</str>   </lst>   <lst name="dmr">     <str name="cma">+2MONTHS</str>     <str name="cme">+2YEARS</str>     <date name="dmma">1812-02-29T23:59:59Z</date>     <date name="dmme">1807-12-31T23:59:59Z</date>     <date name="max">1811-12-31T23:59:59Z</date>     <date name="median">1805-12-31T23:59:59Z</date>   </lst>   <lst name="csr">     <str name="cs1">this is the first</str>     <str name="cs2">this is the second</str>     <str name="cs3">this is the third</str>   </lst>   <lst name="cnr">     <double name="c10">10.0</double>     <double name="c8">8.0</double>   </lst>   <lst name="mr">     <long name="count">100</long>     <null name="mcm"/>     <null name="mean"/>     <null name="median"/>     <null name="su"/>     <null name="sum"/>     <null name="unique"/>   </lst>   <lst name="rr">     <str name="max">str9</str>     <str name="min">str0</str>     <str name="rmax">9rts</str>     <str name="rmin">0rts</str>   </lst>   <lst name="nr">     <double name="c">-100.0</double>     <long name="count">100</long>     <null name="s"/>     <null name="sum"/>   </lst> </lst> </response> 

Stack Trace:
java.lang.AssertionError: Caught exception in getStatResult, xPath = /response/lst[@name='stats']/lst[@name='mr']/double[@name='sum'] 
raw data: <?xml version="1.0" encoding="UTF-8"?>
<response>

<lst name="responseHeader">
  <int name="status">0</int>
  <int name="QTime">7</int>
</lst>
<result name="response" numFound="100" start="0">
</result>
<lst name="stats">
  <lst name="stats_fields"/>
</lst>
<lst name="stats">
  <lst name="pr">
    <long name="count">100</long>
    <null name="mc"/>
    <null name="mean"/>
    <null name="su"/>
    <null name="sum"/>
    <null name="unique"/>
  </lst>
  <lst name="dr">
    <long name="count">100</long>
    <null name="mc"/>
    <null name="mean"/>
    <null name="su"/>
    <null name="sum"/>
    <null name="unique"/>
  </lst>
  <lst name="cdr">
    <date name="cd1">1800-12-31T23:59:59Z</date>
    <date name="cd2">1804-06-30T23:59:59Z</date>
    <str name="cs1">1800-12-31T23:59:59Z</str>
    <str name="cs2">1804-06-30T23:59:59Z</str>
  </lst>
  <lst name="ar">
    <long name="count">100</long>
    <null name="mcm"/>
    <null name="mean"/>
    <null name="median"/>
    <null name="su"/>
    <null name="sum"/>
    <null name="unique"/>
  </lst>
  <lst name="avr">
    <double name="c">100.0</double>
    <long name="count">100</long>
    <null name="s"/>
    <null name="sum"/>
  </lst>
  <lst name="cr">
    <str name="ccmax">this is the secondstr9</str>
    <str name="ccmin">this is the firststr0</str>
    <str name="csmax">this is the second</str>
    <str name="csmin">this is the first</str>
    <str name="max">str9</str>
    <str name="min">str0</str>
  </lst>
  <lst name="dmr">
    <str name="cma">+2MONTHS</str>
    <str name="cme">+2YEARS</str>
    <date name="dmma">1812-02-29T23:59:59Z</date>
    <date name="dmme">1807-12-31T23:59:59Z</date>
    <date name="max">1811-12-31T23:59:59Z</date>
    <date name="median">1805-12-31T23:59:59Z</date>
  </lst>
  <lst name="csr">
    <str name="cs1">this is the first</str>
    <str name="cs2">this is the second</str>
    <str name="cs3">this is the third</str>
  </lst>
  <lst name="cnr">
    <double name="c10">10.0</double>
    <double name="c8">8.0</double>
  </lst>
  <lst name="mr">
    <long name="count">100</long>
    <null name="mcm"/>
    <null name="mean"/>
    <null name="median"/>
    <null name="su"/>
    <null name="sum"/>
    <null name="unique"/>
  </lst>
  <lst name="rr">
    <str name="max">str9</str>
    <str name="min">str0</str>
    <str name="rmax">9rts</str>
    <str name="rmin">0rts</str>
  </lst>
  <lst name="nr">
    <double name="c">-100.0</double>
    <long name="count">100</long>
    <null name="s"/>
    <null name="sum"/>
  </lst>
</lst>
</response>

	at __randomizedtesting.SeedInfo.seed([23A66BE88F72EF6F:48277596BA7CD901]:0)
	at org.junit.Assert.fail(Assert.java:93)
	at org.apache.solr.analytics.AbstractAnalyticsStatsTest.getStatResult(AbstractAnalyticsStatsTest.java:113)
	at org.apache.solr.analytics.expression.ExpressionTest.multiplyTest(ExpressionTest.java:92)
	at sun.reflect.NativeMethodAccessorImpl.invoke0(Native Method)
	at sun.reflect.NativeMethodAccessorImpl.invoke(NativeMethodAccessorImpl.java:57)
	at sun.reflect.DelegatingMethodAccessorImpl.invoke(DelegatingMethodAccessorImpl.java:43)
	at java.lang.reflect.Method.invoke(Method.java:606)
	at com.carrotsearch.randomizedtesting.RandomizedRunner.invoke(RandomizedRunner.java:1559)
	at com.carrotsearch.randomizedtesting.RandomizedRunner.access$600(RandomizedRunner.java:79)
	at com.carrotsearch.randomizedtesting.RandomizedRunner$6.evaluate(RandomizedRunner.java:737)
	at com.carrotsearch.randomizedtesting.RandomizedRunner$7.evaluate(RandomizedRunner.java:773)
	at com.carrotsearch.randomizedtesting.RandomizedRunner$8.evaluate(RandomizedRunner.java:787)
	at com.carrotsearch.randomizedtesting.rules.SystemPropertiesRestoreRule$1.evaluate(SystemPropertiesRestoreRule.java:53)
	at org.apache.lucene.util.TestRuleSetupTeardownChained$1.evaluate(TestRuleSetupTeardownChained.java:50)
	at org.apache.lucene.util.TestRuleFieldCacheSanity$1.evaluate(TestRuleFieldCacheSanity.java:51)
	at org.apache.lucene.util.AbstractBeforeAfterRule$1.evaluate(AbstractBeforeAfterRule.java:46)
	at com.carrotsearch.randomizedtesting.rules.SystemPropertiesInvariantRule$1.evaluate(SystemPropertiesInvariantRule.java:55)
	at org.apache.lucene.util.TestRuleThreadAndTestName$1.evaluate(TestRuleThreadAndTestName.java:49)
	at org.apache.lucene.util.TestRuleIgnoreAfterMaxFailures$1.evaluate(TestRuleIgnoreAfterMaxFailures.java:70)
	at org.apache.lucene.util.TestRuleMarkFailure$1.evaluate(TestRuleMarkFailure.java:48)
	at com.carrotsearch.randomizedtesting.rules.StatementAdapter.evaluate(StatementAdapter.java:36)
	at com.carrotsearch.randomizedtesting.ThreadLeakControl$StatementRunner.run(ThreadLeakControl.java:358)
	at com.carrotsearch.randomizedtesting.ThreadLeakControl.forkTimeoutingTask(ThreadLeakControl.java:782)
	at com.carrotsearch.randomizedtesting.ThreadLeakControl$3.evaluate(ThreadLeakControl.java:442)
	at com.carrotsearch.randomizedtesting.RandomizedRunner.runSingleTest(RandomizedRunner.java:746)
	at com.carrotsearch.randomizedtesting.RandomizedRunner$3.evaluate(RandomizedRunner.java:648)
	at com.carrotsearch.randomizedtesting.RandomizedRunner$4.evaluate(RandomizedRunner.java:682)
	at com.carrotsearch.randomizedtesting.RandomizedRunner$5.evaluate(RandomizedRunner.java:693)
	at com.carrotsearch.randomizedtesting.rules.StatementAdapter.evaluate(StatementAdapter.java:36)
	at com.carrotsearch.randomizedtesting.rules.SystemPropertiesRestoreRule$1.evaluate(SystemPropertiesRestoreRule.java:53)
	at org.apache.lucene.util.AbstractBeforeAfterRule$1.evaluate(AbstractBeforeAfterRule.java:46)
	at org.apache.lucene.util.TestRuleStoreClassName$1.evaluate(TestRuleStoreClassName.java:42)
	at com.carrotsearch.randomizedtesting.rules.SystemPropertiesInvariantRule$1.evaluate(SystemPropertiesInvariantRule.java:55)
	at com.carrotsearch.randomizedtesting.rules.NoShadowingOrOverridesOnMethodsRule$1.evaluate(NoShadowingOrOverridesOnMethodsRule.java:39)
	at com.carrotsearch.randomizedtesting.rules.NoShadowingOrOverridesOnMethodsRule$1.evaluate(NoShadowingOrOverridesOnMethodsRule.java:39)
	at com.carrotsearch.randomizedtesting.rules.StatementAdapter.evaluate(StatementAdapter.java:36)
	at org.apache.lucene.util.TestRuleAssertionsRequired$1.evaluate(TestRuleAssertionsRequired.java:43)
	at org.apache.lucene.util.TestRuleMarkFailure$1.evaluate(TestRuleMarkFailure.java:48)
	at org.apache.lucene.util.TestRuleIgnoreAfterMaxFailures$1.evaluate(TestRuleIgnoreAfterMaxFailures.java:70)
	at org.apache.lucene.util.TestRuleIgnoreTestSuites$1.evaluate(TestRuleIgnoreTestSuites.java:55)
	at com.carrotsearch.randomizedtesting.rules.StatementAdapter.evaluate(StatementAdapter.java:36)
	at com.carrotsearch.randomizedtesting.ThreadLeakControl$StatementRunner.run(ThreadLeakControl.java:358)
	at java.lang.Thread.run(Thread.java:744)


REGRESSION:  org.apache.solr.analytics.expression.ExpressionTest.addTest

Error Message:
Caught exception in getStatResult, xPath = /response/lst[@name='stats']/lst[@name='ar']/double[@name='sum']  raw data: <?xml version="1.0" encoding="UTF-8"?> <response>  <lst name="responseHeader">   <int name="status">0</int>   <int name="QTime">7</int> </lst> <result name="response" numFound="100" start="0"> </result> <lst name="stats">   <lst name="stats_fields"/> </lst> <lst name="stats">   <lst name="pr">     <long name="count">100</long>     <null name="mc"/>     <null name="mean"/>     <null name="su"/>     <null name="sum"/>     <null name="unique"/>   </lst>   <lst name="dr">     <long name="count">100</long>     <null name="mc"/>     <null name="mean"/>     <null name="su"/>     <null name="sum"/>     <null name="unique"/>   </lst>   <lst name="cdr">     <date name="cd1">1800-12-31T23:59:59Z</date>     <date name="cd2">1804-06-30T23:59:59Z</date>     <str name="cs1">1800-12-31T23:59:59Z</str>     <str name="cs2">1804-06-30T23:59:59Z</str>   </lst>   <lst name="ar">     <long name="count">100</long>     <null name="mcm"/>     <null name="mean"/>     <null name="median"/>     <null name="su"/>     <null name="sum"/>     <null name="unique"/>   </lst>   <lst name="avr">     <double name="c">100.0</double>     <long name="count">100</long>     <null name="s"/>     <null name="sum"/>   </lst>   <lst name="cr">     <str name="ccmax">this is the secondstr9</str>     <str name="ccmin">this is the firststr0</str>     <str name="csmax">this is the second</str>     <str name="csmin">this is the first</str>     <str name="max">str9</str>     <str name="min">str0</str>   </lst>   <lst name="dmr">     <str name="cma">+2MONTHS</str>     <str name="cme">+2YEARS</str>     <date name="dmma">1812-02-29T23:59:59Z</date>     <date name="dmme">1807-12-31T23:59:59Z</date>     <date name="max">1811-12-31T23:59:59Z</date>     <date name="median">1805-12-31T23:59:59Z</date>   </lst>   <lst name="csr">     <str name="cs1">this is the first</str>     <str name="cs2">this is the second</str>     <str name="cs3">this is the third</str>   </lst>   <lst name="cnr">     <double name="c10">10.0</double>     <double name="c8">8.0</double>   </lst>   <lst name="mr">     <long name="count">100</long>     <null name="mcm"/>     <null name="mean"/>     <null name="median"/>     <null name="su"/>     <null name="sum"/>     <null name="unique"/>   </lst>   <lst name="rr">     <str name="max">str9</str>     <str name="min">str0</str>     <str name="rmax">9rts</str>     <str name="rmin">0rts</str>   </lst>   <lst name="nr">     <double name="c">-100.0</double>     <long name="count">100</long>     <null name="s"/>     <null name="sum"/>   </lst> </lst> </response> 

Stack Trace:
java.lang.AssertionError: Caught exception in getStatResult, xPath = /response/lst[@name='stats']/lst[@name='ar']/double[@name='sum'] 
raw data: <?xml version="1.0" encoding="UTF-8"?>
<response>

<lst name="responseHeader">
  <int name="status">0</int>
  <int name="QTime">7</int>
</lst>
<result name="response" numFound="100" start="0">
</result>
<lst name="stats">
  <lst name="stats_fields"/>
</lst>
<lst name="stats">
  <lst name="pr">
    <long name="count">100</long>
    <null name="mc"/>
    <null name="mean"/>
    <null name="su"/>
    <null name="sum"/>
    <null name="unique"/>
  </lst>
  <lst name="dr">
    <long name="count">100</long>
    <null name="mc"/>
    <null name="mean"/>
    <null name="su"/>
    <null name="sum"/>
    <null name="unique"/>
  </lst>
  <lst name="cdr">
    <date name="cd1">1800-12-31T23:59:59Z</date>
    <date name="cd2">1804-06-30T23:59:59Z</date>
    <str name="cs1">1800-12-31T23:59:59Z</str>
    <str name="cs2">1804-06-30T23:59:59Z</str>
  </lst>
  <lst name="ar">
    <long name="count">100</long>
    <null name="mcm"/>
    <null name="mean"/>
    <null name="median"/>
    <null name="su"/>
    <null name="sum"/>
    <null name="unique"/>
  </lst>
  <lst name="avr">
    <double name="c">100.0</double>
    <long name="count">100</long>
    <null name="s"/>
    <null name="sum"/>
  </lst>
  <lst name="cr">
    <str name="ccmax">this is the secondstr9</str>
    <str name="ccmin">this is the firststr0</str>
    <str name="csmax">this is the second</str>
    <str name="csmin">this is the first</str>
    <str name="max">str9</str>
    <str name="min">str0</str>
  </lst>
  <lst name="dmr">
    <str name="cma">+2MONTHS</str>
    <str name="cme">+2YEARS</str>
    <date name="dmma">1812-02-29T23:59:59Z</date>
    <date name="dmme">1807-12-31T23:59:59Z</date>
    <date name="max">1811-12-31T23:59:59Z</date>
    <date name="median">1805-12-31T23:59:59Z</date>
  </lst>
  <lst name="csr">
    <str name="cs1">this is the first</str>
    <str name="cs2">this is the second</str>
    <str name="cs3">this is the third</str>
  </lst>
  <lst name="cnr">
    <double name="c10">10.0</double>
    <double name="c8">8.0</double>
  </lst>
  <lst name="mr">
    <long name="count">100</long>
    <null name="mcm"/>
    <null name="mean"/>
    <null name="median"/>
    <null name="su"/>
    <null name="sum"/>
    <null name="unique"/>
  </lst>
  <lst name="rr">
    <str name="max">str9</str>
    <str name="min">str0</str>
    <str name="rmax">9rts</str>
    <str name="rmin">0rts</str>
  </lst>
  <lst name="nr">
    <double name="c">-100.0</double>
    <long name="count">100</long>
    <null name="s"/>
    <null name="sum"/>
  </lst>
</lst>
</response>

	at __randomizedtesting.SeedInfo.seed([23A66BE88F72EF6F:D58AC636CEBDE828]:0)
	at org.junit.Assert.fail(Assert.java:93)
	at org.apache.solr.analytics.AbstractAnalyticsStatsTest.getStatResult(AbstractAnalyticsStatsTest.java:113)
	at org.apache.solr.analytics.expression.ExpressionTest.addTest(ExpressionTest.java:78)
	at sun.reflect.NativeMethodAccessorImpl.invoke0(Native Method)
	at sun.reflect.NativeMethodAccessorImpl.invoke(NativeMethodAccessorImpl.java:57)
	at sun.reflect.DelegatingMethodAccessorImpl.invoke(DelegatingMethodAccessorImpl.java:43)
	at java.lang.reflect.Method.invoke(Method.java:606)
	at com.carrotsearch.randomizedtesting.RandomizedRunner.invoke(RandomizedRunner.java:1559)
	at com.carrotsearch.randomizedtesting.RandomizedRunner.access$600(RandomizedRunner.java:79)
	at com.carrotsearch.randomizedtesting.RandomizedRunner$6.evaluate(RandomizedRunner.java:737)
	at com.carrotsearch.randomizedtesting.RandomizedRunner$7.evaluate(RandomizedRunner.java:773)
	at com.carrotsearch.randomizedtesting.RandomizedRunner$8.evaluate(RandomizedRunner.java:787)
	at com.carrotsearch.randomizedtesting.rules.SystemPropertiesRestoreRule$1.evaluate(SystemPropertiesRestoreRule.java:53)
	at org.apache.lucene.util.TestRuleSetupTeardownChained$1.evaluate(TestRuleSetupTeardownChained.java:50)
	at org.apache.lucene.util.TestRuleFieldCacheSanity$1.evaluate(TestRuleFieldCacheSanity.java:51)
	at org.apache.lucene.util.AbstractBeforeAfterRule$1.evaluate(AbstractBeforeAfterRule.java:46)
	at com.carrotsearch.randomizedtesting.rules.SystemPropertiesInvariantRule$1.evaluate(SystemPropertiesInvariantRule.java:55)
	at org.apache.lucene.util.TestRuleThreadAndTestName$1.evaluate(TestRuleThreadAndTestName.java:49)
	at org.apache.lucene.util.TestRuleIgnoreAfterMaxFailures$1.evaluate(TestRuleIgnoreAfterMaxFailures.java:70)
	at org.apache.lucene.util.TestRuleMarkFailure$1.evaluate(TestRuleMarkFailure.java:48)
	at com.carrotsearch.randomizedtesting.rules.StatementAdapter.evaluate(StatementAdapter.java:36)
	at com.carrotsearch.randomizedtesting.ThreadLeakControl$StatementRunner.run(ThreadLeakControl.java:358)
	at com.carrotsearch.randomizedtesting.ThreadLeakControl.forkTimeoutingTask(ThreadLeakControl.java:782)
	at com.carrotsearch.randomizedtesting.ThreadLeakControl$3.evaluate(ThreadLeakControl.java:442)
	at com.carrotsearch.randomizedtesting.RandomizedRunner.runSingleTest(RandomizedRunner.java:746)
	at com.carrotsearch.randomizedtesting.RandomizedRunner$3.evaluate(RandomizedRunner.java:648)
	at com.carrotsearch.randomizedtesting.RandomizedRunner$4.evaluate(RandomizedRunner.java:682)
	at com.carrotsearch.randomizedtesting.RandomizedRunner$5.evaluate(RandomizedRunner.java:693)
	at com.carrotsearch.randomizedtesting.rules.StatementAdapter.evaluate(StatementAdapter.java:36)
	at com.carrotsearch.randomizedtesting.rules.SystemPropertiesRestoreRule$1.evaluate(SystemPropertiesRestoreRule.java:53)
	at org.apache.lucene.util.AbstractBeforeAfterRule$1.evaluate(AbstractBeforeAfterRule.java:46)
	at org.apache.lucene.util.TestRuleStoreClassName$1.evaluate(TestRuleStoreClassName.java:42)
	at com.carrotsearch.randomizedtesting.rules.SystemPropertiesInvariantRule$1.evaluate(SystemPropertiesInvariantRule.java:55)
	at com.carrotsearch.randomizedtesting.rules.NoShadowingOrOverridesOnMethodsRule$1.evaluate(NoShadowingOrOverridesOnMethodsRule.java:39)
	at com.carrotsearch.randomizedtesting.rules.NoShadowingOrOverridesOnMethodsRule$1.evaluate(NoShadowingOrOverridesOnMethodsRule.java:39)
	at com.carrotsearch.randomizedtesting.rules.StatementAdapter.evaluate(StatementAdapter.java:36)
	at org.apache.lucene.util.TestRuleAssertionsRequired$1.evaluate(TestRuleAssertionsRequired.java:43)
	at org.apache.lucene.util.TestRuleMarkFailure$1.evaluate(TestRuleMarkFailure.java:48)
	at org.apache.lucene.util.TestRuleIgnoreAfterMaxFailures$1.evaluate(TestRuleIgnoreAfterMaxFailures.java:70)
	at org.apache.lucene.util.TestRuleIgnoreTestSuites$1.evaluate(TestRuleIgnoreTestSuites.java:55)
	at com.carrotsearch.randomizedtesting.rules.StatementAdapter.evaluate(StatementAdapter.java:36)
	at com.carrotsearch.randomizedtesting.ThreadLeakControl$StatementRunner.run(ThreadLeakControl.java:358)
	at java.lang.Thread.run(Thread.java:744)


REGRESSION:  org.apache.solr.analytics.expression.ExpressionTest.powerTest

Error Message:
Caught exception in getStatResult, xPath = /response/lst[@name='stats']/lst[@name='pr']/double[@name='sum']  raw data: <?xml version="1.0" encoding="UTF-8"?> <response>  <lst name="responseHeader">   <int name="status">0</int>   <int name="QTime">7</int> </lst> <result name="response" numFound="100" start="0"> </result> <lst name="stats">   <lst name="stats_fields"/> </lst> <lst name="stats">   <lst name="pr">     <long name="count">100</long>     <null name="mc"/>     <null name="mean"/>     <null name="su"/>     <null name="sum"/>     <null name="unique"/>   </lst>   <lst name="dr">     <long name="count">100</long>     <null name="mc"/>     <null name="mean"/>     <null name="su"/>     <null name="sum"/>     <null name="unique"/>   </lst>   <lst name="cdr">     <date name="cd1">1800-12-31T23:59:59Z</date>     <date name="cd2">1804-06-30T23:59:59Z</date>     <str name="cs1">1800-12-31T23:59:59Z</str>     <str name="cs2">1804-06-30T23:59:59Z</str>   </lst>   <lst name="ar">     <long name="count">100</long>     <null name="mcm"/>     <null name="mean"/>     <null name="median"/>     <null name="su"/>     <null name="sum"/>     <null name="unique"/>   </lst>   <lst name="avr">     <double name="c">100.0</double>     <long name="count">100</long>     <null name="s"/>     <null name="sum"/>   </lst>   <lst name="cr">     <str name="ccmax">this is the secondstr9</str>     <str name="ccmin">this is the firststr0</str>     <str name="csmax">this is the second</str>     <str name="csmin">this is the first</str>     <str name="max">str9</str>     <str name="min">str0</str>   </lst>   <lst name="dmr">     <str name="cma">+2MONTHS</str>     <str name="cme">+2YEARS</str>     <date name="dmma">1812-02-29T23:59:59Z</date>     <date name="dmme">1807-12-31T23:59:59Z</date>     <date name="max">1811-12-31T23:59:59Z</date>     <date name="median">1805-12-31T23:59:59Z</date>   </lst>   <lst name="csr">     <str name="cs1">this is the first</str>     <str name="cs2">this is the second</str>     <str name="cs3">this is the third</str>   </lst>   <lst name="cnr">     <double name="c10">10.0</double>     <double name="c8">8.0</double>   </lst>   <lst name="mr">     <long name="count">100</long>     <null name="mcm"/>     <null name="mean"/>     <null name="median"/>     <null name="su"/>     <null name="sum"/>     <null name="unique"/>   </lst>   <lst name="rr">     <str name="max">str9</str>     <str name="min">str0</str>     <str name="rmax">9rts</str>     <str name="rmin">0rts</str>   </lst>   <lst name="nr">     <double name="c">-100.0</double>     <long name="count">100</long>     <null name="s"/>     <null name="sum"/>   </lst> </lst> </response> 

Stack Trace:
java.lang.AssertionError: Caught exception in getStatResult, xPath = /response/lst[@name='stats']/lst[@name='pr']/double[@name='sum'] 
raw data: <?xml version="1.0" encoding="UTF-8"?>
<response>

<lst name="responseHeader">
  <int name="status">0</int>
  <int name="QTime">7</int>
</lst>
<result name="response" numFound="100" start="0">
</result>
<lst name="stats">
  <lst name="stats_fields"/>
</lst>
<lst name="stats">
  <lst name="pr">
    <long name="count">100</long>
    <null name="mc"/>
    <null name="mean"/>
    <null name="su"/>
    <null name="sum"/>
    <null name="unique"/>
  </lst>
  <lst name="dr">
    <long name="count">100</long>
    <null name="mc"/>
    <null name="mean"/>
    <null name="su"/>
    <null name="sum"/>
    <null name="unique"/>
  </lst>
  <lst name="cdr">
    <date name="cd1">1800-12-31T23:59:59Z</date>
    <date name="cd2">1804-06-30T23:59:59Z</date>
    <str name="cs1">1800-12-31T23:59:59Z</str>
    <str name="cs2">1804-06-30T23:59:59Z</str>
  </lst>
  <lst name="ar">
    <long name="count">100</long>
    <null name="mcm"/>
    <null name="mean"/>
    <null name="median"/>
    <null name="su"/>
    <null name="sum"/>
    <null name="unique"/>
  </lst>
  <lst name="avr">
    <double name="c">100.0</double>
    <long name="count">100</long>
    <null name="s"/>
    <null name="sum"/>
  </lst>
  <lst name="cr">
    <str name="ccmax">this is the secondstr9</str>
    <str name="ccmin">this is the firststr0</str>
    <str name="csmax">this is the second</str>
    <str name="csmin">this is the first</str>
    <str name="max">str9</str>
    <str name="min">str0</str>
  </lst>
  <lst name="dmr">
    <str name="cma">+2MONTHS</str>
    <str name="cme">+2YEARS</str>
    <date name="dmma">1812-02-29T23:59:59Z</date>
    <date name="dmme">1807-12-31T23:59:59Z</date>
    <date name="max">1811-12-31T23:59:59Z</date>
    <date name="median">1805-12-31T23:59:59Z</date>
  </lst>
  <lst name="csr">
    <str name="cs1">this is the first</str>
    <str name="cs2">this is the second</str>
    <str name="cs3">this is the third</str>
  </lst>
  <lst name="cnr">
    <double name="c10">10.0</double>
    <double name="c8">8.0</double>
  </lst>
  <lst name="mr">
    <long name="count">100</long>
    <null name="mcm"/>
    <null name="mean"/>
    <null name="median"/>
    <null name="su"/>
    <null name="sum"/>
    <null name="unique"/>
  </lst>
  <lst name="rr">
    <str name="max">str9</str>
    <str name="min">str0</str>
    <str name="rmax">9rts</str>
    <str name="rmin">0rts</str>
  </lst>
  <lst name="nr">
    <double name="c">-100.0</double>
    <long name="count">100</long>
    <null name="s"/>
    <null name="sum"/>
  </lst>
</lst>
</response>

	at __randomizedtesting.SeedInfo.seed([23A66BE88F72EF6F:4D14DCEB6765B1BE]:0)
	at org.junit.Assert.fail(Assert.java:93)
	at org.apache.solr.analytics.AbstractAnalyticsStatsTest.getStatResult(AbstractAnalyticsStatsTest.java:113)
	at org.apache.solr.analytics.expression.ExpressionTest.powerTest(ExpressionTest.java:119)
	at sun.reflect.NativeMethodAccessorImpl.invoke0(Native Method)
	at sun.reflect.NativeMethodAccessorImpl.invoke(NativeMethodAccessorImpl.java:57)
	at sun.reflect.DelegatingMethodAccessorImpl.invoke(DelegatingMethodAccessorImpl.java:43)
	at java.lang.reflect.Method.invoke(Method.java:606)
	at com.carrotsearch.randomizedtesting.RandomizedRunner.invoke(RandomizedRunner.java:1559)
	at com.carrotsearch.randomizedtesting.RandomizedRunner.access$600(RandomizedRunner.java:79)
	at com.carrotsearch.randomizedtesting.RandomizedRunner$6.evaluate(RandomizedRunner.java:737)
	at com.carrotsearch.randomizedtesting.RandomizedRunner$7.evaluate(RandomizedRunner.java:773)
	at com.carrotsearch.randomizedtesting.RandomizedRunner$8.evaluate(RandomizedRunner.java:787)
	at com.carrotsearch.randomizedtesting.rules.SystemPropertiesRestoreRule$1.evaluate(SystemPropertiesRestoreRule.java:53)
	at org.apache.lucene.util.TestRuleSetupTeardownChained$1.evaluate(TestRuleSetupTeardownChained.java:50)
	at org.apache.lucene.util.TestRuleFieldCacheSanity$1.evaluate(TestRuleFieldCacheSanity.java:51)
	at org.apache.lucene.util.AbstractBeforeAfterRule$1.evaluate(AbstractBeforeAfterRule.java:46)
	at com.carrotsearch.randomizedtesting.rules.SystemPropertiesInvariantRule$1.evaluate(SystemPropertiesInvariantRule.java:55)
	at org.apache.lucene.util.TestRuleThreadAndTestName$1.evaluate(TestRuleThreadAndTestName.java:49)
	at org.apache.lucene.util.TestRuleIgnoreAfterMaxFailures$1.evaluate(TestRuleIgnoreAfterMaxFailures.java:70)
	at org.apache.lucene.util.TestRuleMarkFailure$1.evaluate(TestRuleMarkFailure.java:48)
	at com.carrotsearch.randomizedtesting.rules.StatementAdapter.evaluate(StatementAdapter.java:36)
	at com.carrotsearch.randomizedtesting.ThreadLeakControl$StatementRunner.run(ThreadLeakControl.java:358)
	at com.carrotsearch.randomizedtesting.ThreadLeakControl.forkTimeoutingTask(ThreadLeakControl.java:782)
	at com.carrotsearch.randomizedtesting.ThreadLeakControl$3.evaluate(ThreadLeakControl.java:442)
	at com.carrotsearch.randomizedtesting.RandomizedRunner.runSingleTest(RandomizedRunner.java:746)
	at com.carrotsearch.randomizedtesting.RandomizedRunner$3.evaluate(RandomizedRunner.java:648)
	at com.carrotsearch.randomizedtesting.RandomizedRunner$4.evaluate(RandomizedRunner.java:682)
	at com.carrotsearch.randomizedtesting.RandomizedRunner$5.evaluate(RandomizedRunner.java:693)
	at com.carrotsearch.randomizedtesting.rules.StatementAdapter.evaluate(StatementAdapter.java:36)
	at com.carrotsearch.randomizedtesting.rules.SystemPropertiesRestoreRule$1.evaluate(SystemPropertiesRestoreRule.java:53)
	at org.apache.lucene.util.AbstractBeforeAfterRule$1.evaluate(AbstractBeforeAfterRule.java:46)
	at org.apache.lucene.util.TestRuleStoreClassName$1.evaluate(TestRuleStoreClassName.java:42)
	at com.carrotsearch.randomizedtesting.rules.SystemPropertiesInvariantRule$1.evaluate(SystemPropertiesInvariantRule.java:55)
	at com.carrotsearch.randomizedtesting.rules.NoShadowingOrOverridesOnMethodsRule$1.evaluate(NoShadowingOrOverridesOnMethodsRule.java:39)
	at com.carrotsearch.randomizedtesting.rules.NoShadowingOrOverridesOnMethodsRule$1.evaluate(NoShadowingOrOverridesOnMethodsRule.java:39)
	at com.carrotsearch.randomizedtesting.rules.StatementAdapter.evaluate(StatementAdapter.java:36)
	at org.apache.lucene.util.TestRuleAssertionsRequired$1.evaluate(TestRuleAssertionsRequired.java:43)
	at org.apache.lucene.util.TestRuleMarkFailure$1.evaluate(TestRuleMarkFailure.java:48)
	at org.apache.lucene.util.TestRuleIgnoreAfterMaxFailures$1.evaluate(TestRuleIgnoreAfterMaxFailures.java:70)
	at org.apache.lucene.util.TestRuleIgnoreTestSuites$1.evaluate(TestRuleIgnoreTestSuites.java:55)
	at com.carrotsearch.randomizedtesting.rules.StatementAdapter.evaluate(StatementAdapter.java:36)
	at com.carrotsearch.randomizedtesting.ThreadLeakControl$StatementRunner.run(ThreadLeakControl.java:358)
	at java.lang.Thread.run(Thread.java:744)


REGRESSION:  org.apache.solr.analytics.expression.ExpressionTest.negateTest

Error Message:
Caught exception in getStatResult, xPath = /response/lst[@name='stats']/lst[@name='nr']/double[@name='sum']  raw data: <?xml version="1.0" encoding="UTF-8"?> <response>  <lst name="responseHeader">   <int name="status">0</int>   <int name="QTime">7</int> </lst> <result name="response" numFound="100" start="0"> </result> <lst name="stats">   <lst name="stats_fields"/> </lst> <lst name="stats">   <lst name="pr">     <long name="count">100</long>     <null name="mc"/>     <null name="mean"/>     <null name="su"/>     <null name="sum"/>     <null name="unique"/>   </lst>   <lst name="dr">     <long name="count">100</long>     <null name="mc"/>     <null name="mean"/>     <null name="su"/>     <null name="sum"/>     <null name="unique"/>   </lst>   <lst name="cdr">     <date name="cd1">1800-12-31T23:59:59Z</date>     <date name="cd2">1804-06-30T23:59:59Z</date>     <str name="cs1">1800-12-31T23:59:59Z</str>     <str name="cs2">1804-06-30T23:59:59Z</str>   </lst>   <lst name="ar">     <long name="count">100</long>     <null name="mcm"/>     <null name="mean"/>     <null name="median"/>     <null name="su"/>     <null name="sum"/>     <null name="unique"/>   </lst>   <lst name="avr">     <double name="c">100.0</double>     <long name="count">100</long>     <null name="s"/>     <null name="sum"/>   </lst>   <lst name="cr">     <str name="ccmax">this is the secondstr9</str>     <str name="ccmin">this is the firststr0</str>     <str name="csmax">this is the second</str>     <str name="csmin">this is the first</str>     <str name="max">str9</str>     <str name="min">str0</str>   </lst>   <lst name="dmr">     <str name="cma">+2MONTHS</str>     <str name="cme">+2YEARS</str>     <date name="dmma">1812-02-29T23:59:59Z</date>     <date name="dmme">1807-12-31T23:59:59Z</date>     <date name="max">1811-12-31T23:59:59Z</date>     <date name="median">1805-12-31T23:59:59Z</date>   </lst>   <lst name="csr">     <str name="cs1">this is the first</str>     <str name="cs2">this is the second</str>     <str name="cs3">this is the third</str>   </lst>   <lst name="cnr">     <double name="c10">10.0</double>     <double name="c8">8.0</double>   </lst>   <lst name="mr">     <long name="count">100</long>     <null name="mcm"/>     <null name="mean"/>     <null name="median"/>     <null name="su"/>     <null name="sum"/>     <null name="unique"/>   </lst>   <lst name="rr">     <str name="max">str9</str>     <str name="min">str0</str>     <str name="rmax">9rts</str>     <str name="rmin">0rts</str>   </lst>   <lst name="nr">     <double name="c">-100.0</double>     <long name="count">100</long>     <null name="s"/>     <null name="sum"/>   </lst> </lst> </response> 

Stack Trace:
java.lang.AssertionError: Caught exception in getStatResult, xPath = /response/lst[@name='stats']/lst[@name='nr']/double[@name='sum'] 
raw data: <?xml version="1.0" encoding="UTF-8"?>
<response>

<lst name="responseHeader">
  <int name="status">0</int>
  <int name="QTime">7</int>
</lst>
<result name="response" numFound="100" start="0">
</result>
<lst name="stats">
  <lst name="stats_fields"/>
</lst>
<lst name="stats">
  <lst name="pr">
    <long name="count">100</long>
    <null name="mc"/>
    <null name="mean"/>
    <null name="su"/>
    <null name="sum"/>
    <null name="unique"/>
  </lst>
  <lst name="dr">
    <long name="count">100</long>
    <null name="mc"/>
    <null name="mean"/>
    <null name="su"/>
    <null name="sum"/>
    <null name="unique"/>
  </lst>
  <lst name="cdr">
    <date name="cd1">1800-12-31T23:59:59Z</date>
    <date name="cd2">1804-06-30T23:59:59Z</date>
    <str name="cs1">1800-12-31T23:59:59Z</str>
    <str name="cs2">1804-06-30T23:59:59Z</str>
  </lst>
  <lst name="ar">
    <long name="count">100</long>
    <null name="mcm"/>
    <null name="mean"/>
    <null name="median"/>
    <null name="su"/>
    <null name="sum"/>
    <null name="unique"/>
  </lst>
  <lst name="avr">
    <double name="c">100.0</double>
    <long name="count">100</long>
    <null name="s"/>
    <null name="sum"/>
  </lst>
  <lst name="cr">
    <str name="ccmax">this is the secondstr9</str>
    <str name="ccmin">this is the firststr0</str>
    <str name="csmax">this is the second</str>
    <str name="csmin">this is the first</str>
    <str name="max">str9</str>
    <str name="min">str0</str>
  </lst>
  <lst name="dmr">
    <str name="cma">+2MONTHS</str>
    <str name="cme">+2YEARS</str>
    <date name="dmma">1812-02-29T23:59:59Z</date>
    <date name="dmme">1807-12-31T23:59:59Z</date>
    <date name="max">1811-12-31T23:59:59Z</date>
    <date name="median">1805-12-31T23:59:59Z</date>
  </lst>
  <lst name="csr">
    <str name="cs1">this is the first</str>
    <str name="cs2">this is the second</str>
    <str name="cs3">this is the third</str>
  </lst>
  <lst name="cnr">
    <double name="c10">10.0</double>
    <double name="c8">8.0</double>
  </lst>
  <lst name="mr">
    <long name="count">100</long>
    <null name="mcm"/>
    <null name="mean"/>
    <null name="median"/>
    <null name="su"/>
    <null name="sum"/>
    <null name="unique"/>
  </lst>
  <lst name="rr">
    <str name="max">str9</str>
    <str name="min">str0</str>
    <str name="rmax">9rts</str>
    <str name="rmin">0rts</str>
  </lst>
  <lst name="nr">
    <double name="c">-100.0</double>
    <long name="count">100</long>
    <null name="s"/>
    <null name="sum"/>
  </lst>
</lst>
</response>

	at __randomizedtesting.SeedInfo.seed([23A66BE88F72EF6F:2BAE034D2B5FBFDF]:0)
	at org.junit.Assert.fail(Assert.java:93)
	at org.apache.solr.analytics.AbstractAnalyticsStatsTest.getStatResult(AbstractAnalyticsStatsTest.java:113)
	at org.apache.solr.analytics.expression.ExpressionTest.negateTest(ExpressionTest.java:132)
	at sun.reflect.NativeMethodAccessorImpl.invoke0(Native Method)
	at sun.reflect.NativeMethodAccessorImpl.invoke(NativeMethodAccessorImpl.java:57)
	at sun.reflect.DelegatingMethodAccessorImpl.invoke(DelegatingMethodAccessorImpl.java:43)
	at java.lang.reflect.Method.invoke(Method.java:606)
	at com.carrotsearch.randomizedtesting.RandomizedRunner.invoke(RandomizedRunner.java:1559)
	at com.carrotsearch.randomizedtesting.RandomizedRunner.access$600(RandomizedRunner.java:79)
	at com.carrotsearch.randomizedtesting.RandomizedRunner$6.evaluate(RandomizedRunner.java:737)
	at com.carrotsearch.randomizedtesting.RandomizedRunner$7.evaluate(RandomizedRunner.java:773)
	at com.carrotsearch.randomizedtesting.RandomizedRunner$8.evaluate(RandomizedRunner.java:787)
	at com.carrotsearch.randomizedtesting.rules.SystemPropertiesRestoreRule$1.evaluate(SystemPropertiesRestoreRule.java:53)
	at org.apache.lucene.util.TestRuleSetupTeardownChained$1.evaluate(TestRuleSetupTeardownChained.java:50)
	at org.apache.lucene.util.TestRuleFieldCacheSanity$1.evaluate(TestRuleFieldCacheSanity.java:51)
	at org.apache.lucene.util.AbstractBeforeAfterRule$1.evaluate(AbstractBeforeAfterRule.java:46)
	at com.carrotsearch.randomizedtesting.rules.SystemPropertiesInvariantRule$1.evaluate(SystemPropertiesInvariantRule.java:55)
	at org.apache.lucene.util.TestRuleThreadAndTestName$1.evaluate(TestRuleThreadAndTestName.java:49)
	at org.apache.lucene.util.TestRuleIgnoreAfterMaxFailures$1.evaluate(TestRuleIgnoreAfterMaxFailures.java:70)
	at org.apache.lucene.util.TestRuleMarkFailure$1.evaluate(TestRuleMarkFailure.java:48)
	at com.carrotsearch.randomizedtesting.rules.StatementAdapter.evaluate(StatementAdapter.java:36)
	at com.carrotsearch.randomizedtesting.ThreadLeakControl$StatementRunner.run(ThreadLeakControl.java:358)
	at com.carrotsearch.randomizedtesting.ThreadLeakControl.forkTimeoutingTask(ThreadLeakControl.java:782)
	at com.carrotsearch.randomizedtesting.ThreadLeakControl$3.evaluate(ThreadLeakControl.java:442)
	at com.carrotsearch.randomizedtesting.RandomizedRunner.runSingleTest(RandomizedRunner.java:746)
	at com.carrotsearch.randomizedtesting.RandomizedRunner$3.evaluate(RandomizedRunner.java:648)
	at com.carrotsearch.randomizedtesting.RandomizedRunner$4.evaluate(RandomizedRunner.java:682)
	at com.carrotsearch.randomizedtesting.RandomizedRunner$5.evaluate(RandomizedRunner.java:693)
	at com.carrotsearch.randomizedtesting.rules.StatementAdapter.evaluate(StatementAdapter.java:36)
	at com.carrotsearch.randomizedtesting.rules.SystemPropertiesRestoreRule$1.evaluate(SystemPropertiesRestoreRule.java:53)
	at org.apache.lucene.util.AbstractBeforeAfterRule$1.evaluate(AbstractBeforeAfterRule.java:46)
	at org.apache.lucene.util.TestRuleStoreClassName$1.evaluate(TestRuleStoreClassName.java:42)
	at com.carrotsearch.randomizedtesting.rules.SystemPropertiesInvariantRule$1.evaluate(SystemPropertiesInvariantRule.java:55)
	at com.carrotsearch.randomizedtesting.rules.NoShadowingOrOverridesOnMethodsRule$1.evaluate(NoShadowingOrOverridesOnMethodsRule.java:39)
	at com.carrotsearch.randomizedtesting.rules.NoShadowingOrOverridesOnMethodsRule$1.evaluate(NoShadowingOrOverridesOnMethodsRule.java:39)
	at com.carrotsearch.randomizedtesting.rules.StatementAdapter.evaluate(StatementAdapter.java:36)
	at org.apache.lucene.util.TestRuleAssertionsRequired$1.evaluate(TestRuleAssertionsRequired.java:43)
	at org.apache.lucene.util.TestRuleMarkFailure$1.evaluate(TestRuleMarkFailure.java:48)
	at org.apache.lucene.util.TestRuleIgnoreAfterMaxFailures$1.evaluate(TestRuleIgnoreAfterMaxFailures.java:70)
	at org.apache.lucene.util.TestRuleIgnoreTestSuites$1.evaluate(TestRuleIgnoreTestSuites.java:55)
	at com.carrotsearch.randomizedtesting.rules.StatementAdapter.evaluate(StatementAdapter.java:36)
	at com.carrotsearch.randomizedtesting.ThreadLeakControl$StatementRunner.run(ThreadLeakControl.java:358)
	at java.lang.Thread.run(Thread.java:744)


REGRESSION:  org.apache.solr.analytics.expression.ExpressionTest.divideTest

Error Message:
Caught exception in getStatResult, xPath = /response/lst[@name='stats']/lst[@name='dr']/double[@name='sum']  raw data: <?xml version="1.0" encoding="UTF-8"?> <response>  <lst name="responseHeader">   <int name="status">0</int>   <int name="QTime">7</int> </lst> <result name="response" numFound="100" start="0"> </result> <lst name="stats">   <lst name="stats_fields"/> </lst> <lst name="stats">   <lst name="pr">     <long name="count">100</long>     <null name="mc"/>     <null name="mean"/>     <null name="su"/>     <null name="sum"/>     <null name="unique"/>   </lst>   <lst name="dr">     <long name="count">100</long>     <null name="mc"/>     <null name="mean"/>     <null name="su"/>     <null name="sum"/>     <null name="unique"/>   </lst>   <lst name="cdr">     <date name="cd1">1800-12-31T23:59:59Z</date>     <date name="cd2">1804-06-30T23:59:59Z</date>     <str name="cs1">1800-12-31T23:59:59Z</str>     <str name="cs2">1804-06-30T23:59:59Z</str>   </lst>   <lst name="ar">     <long name="count">100</long>     <null name="mcm"/>     <null name="mean"/>     <null name="median"/>     <null name="su"/>     <null name="sum"/>     <null name="unique"/>   </lst>   <lst name="avr">     <double name="c">100.0</double>     <long name="count">100</long>     <null name="s"/>     <null name="sum"/>   </lst>   <lst name="cr">     <str name="ccmax">this is the secondstr9</str>     <str name="ccmin">this is the firststr0</str>     <str name="csmax">this is the second</str>     <str name="csmin">this is the first</str>     <str name="max">str9</str>     <str name="min">str0</str>   </lst>   <lst name="dmr">     <str name="cma">+2MONTHS</str>     <str name="cme">+2YEARS</str>     <date name="dmma">1812-02-29T23:59:59Z</date>     <date name="dmme">1807-12-31T23:59:59Z</date>     <date name="max">1811-12-31T23:59:59Z</date>     <date name="median">1805-12-31T23:59:59Z</date>   </lst>   <lst name="csr">     <str name="cs1">this is the first</str>     <str name="cs2">this is the second</str>     <str name="cs3">this is the third</str>   </lst>   <lst name="cnr">     <double name="c10">10.0</double>     <double name="c8">8.0</double>   </lst>   <lst name="mr">     <long name="count">100</long>     <null name="mcm"/>     <null name="mean"/>     <null name="median"/>     <null name="su"/>     <null name="sum"/>     <null name="unique"/>   </lst>   <lst name="rr">     <str name="max">str9</str>     <str name="min">str0</str>     <str name="rmax">9rts</str>     <str name="rmin">0rts</str>   </lst>   <lst name="nr">     <double name="c">-100.0</double>     <long name="count">100</long>     <null name="s"/>     <null name="sum"/>   </lst> </lst> </response> 

Stack Trace:
java.lang.AssertionError: Caught exception in getStatResult, xPath = /response/lst[@name='stats']/lst[@name='dr']/double[@name='sum'] 
raw data: <?xml version="1.0" encoding="UTF-8"?>
<response>

<lst name="responseHeader">
  <int name="status">0</int>
  <int name="QTime">7</int>
</lst>
<result name="response" numFound="100" start="0">
</result>
<lst name="stats">
  <lst name="stats_fields"/>
</lst>
<lst name="stats">
  <lst name="pr">
    <long name="count">100</long>
    <null name="mc"/>
    <null name="mean"/>
    <null name="su"/>
    <null name="sum"/>
    <null name="unique"/>
  </lst>
  <lst name="dr">
    <long name="count">100</long>
    <null name="mc"/>
    <null name="mean"/>
    <null name="su"/>
    <null name="sum"/>
    <null name="unique"/>
  </lst>
  <lst name="cdr">
    <date name="cd1">1800-12-31T23:59:59Z</date>
    <date name="cd2">1804-06-30T23:59:59Z</date>
    <str name="cs1">1800-12-31T23:59:59Z</str>
    <str name="cs2">1804-06-30T23:59:59Z</str>
  </lst>
  <lst name="ar">
    <long name="count">100</long>
    <null name="mcm"/>
    <null name="mean"/>
    <null name="median"/>
    <null name="su"/>
    <null name="sum"/>
    <null name="unique"/>
  </lst>
  <lst name="avr">
    <double name="c">100.0</double>
    <long name="count">100</long>
    <null name="s"/>
    <null name="sum"/>
  </lst>
  <lst name="cr">
    <str name="ccmax">this is the secondstr9</str>
    <str name="ccmin">this is the firststr0</str>
    <str name="csmax">this is the second</str>
    <str name="csmin">this is the first</str>
    <str name="max">str9</str>
    <str name="min">str0</str>
  </lst>
  <lst name="dmr">
    <str name="cma">+2MONTHS</str>
    <str name="cme">+2YEARS</str>
    <date name="dmma">1812-02-29T23:59:59Z</date>
    <date name="dmme">1807-12-31T23:59:59Z</date>
    <date name="max">1811-12-31T23:59:59Z</date>
    <date name="median">1805-12-31T23:59:59Z</date>
  </lst>
  <lst name="csr">
    <str name="cs1">this is the first</str>
    <str name="cs2">this is the second</str>
    <str name="cs3">this is the third</str>
  </lst>
  <lst name="cnr">
    <double name="c10">10.0</double>
    <double name="c8">8.0</double>
  </lst>
  <lst name="mr">
    <long name="count">100</long>
    <null name="mcm"/>
    <null name="mean"/>
    <null name="median"/>
    <null name="su"/>
    <null name="sum"/>
    <null name="unique"/>
  </lst>
  <lst name="rr">
    <str name="max">str9</str>
    <str name="min">str0</str>
    <str name="rmax">9rts</str>
    <str name="rmin">0rts</str>
  </lst>
  <lst name="nr">
    <double name="c">-100.0</double>
    <long name="count">100</long>
    <null name="s"/>
    <null name="sum"/>
  </lst>
</lst>
</response>

	at __randomizedtesting.SeedInfo.seed([23A66BE88F72EF6F:7BAB801EABB08DB9]:0)
	at org.junit.Assert.fail(Assert.java:93)
	at org.apache.solr.analytics.AbstractAnalyticsStatsTest.getStatResult(AbstractAnalyticsStatsTest.java:113)
	at org.apache.solr.analytics.expression.ExpressionTest.divideTest(ExpressionTest.java:106)
	at sun.reflect.NativeMethodAccessorImpl.invoke0(Native Method)
	at sun.reflect.NativeMethodAccessorImpl.invoke(NativeMethodAccessorImpl.java:57)
	at sun.reflect.DelegatingMethodAccessorImpl.invoke(DelegatingMethodAccessorImpl.java:43)
	at java.lang.reflect.Method.invoke(Method.java:606)
	at com.carrotsearch.randomizedtesting.RandomizedRunner.invoke(RandomizedRunner.java:1559)
	at com.carrotsearch.randomizedtesting.RandomizedRunner.access$600(RandomizedRunner.java:79)
	at com.carrotsearch.randomizedtesting.RandomizedRunner$6.evaluate(RandomizedRunner.java:737)
	at com.carrotsearch.randomizedtesting.RandomizedRunner$7.evaluate(RandomizedRunner.java:773)
	at com.carrotsearch.randomizedtesting.RandomizedRunner$8.evaluate(RandomizedRunner.java:787)
	at com.carrotsearch.randomizedtesting.rules.SystemPropertiesRestoreRule$1.evaluate(SystemPropertiesRestoreRule.java:53)
	at org.apache.lucene.util.TestRuleSetupTeardownChained$1.evaluate(TestRuleSetupTeardownChained.java:50)
	at org.apache.lucene.util.TestRuleFieldCacheSanity$1.evaluate(TestRuleFieldCacheSanity.java:51)
	at org.apache.lucene.util.AbstractBeforeAfterRule$1.evaluate(AbstractBeforeAfterRule.java:46)
	at com.carrotsearch.randomizedtesting.rules.SystemPropertiesInvariantRule$1.evaluate(SystemPropertiesInvariantRule.java:55)
	at org.apache.lucene.util.TestRuleThreadAndTestName$1.evaluate(TestRuleThreadAndTestName.java:49)
	at org.apache.lucene.util.TestRuleIgnoreAfterMaxFailures$1.evaluate(TestRuleIgnoreAfterMaxFailures.java:70)
	at org.apache.lucene.util.TestRuleMarkFailure$1.evaluate(TestRuleMarkFailure.java:48)
	at com.carrotsearch.randomizedtesting.rules.StatementAdapter.evaluate(StatementAdapter.java:36)
	at com.carrotsearch.randomizedtesting.ThreadLeakControl$StatementRunner.run(ThreadLeakControl.java:358)
	at com.carrotsearch.randomizedtesting.ThreadLeakControl.forkTimeoutingTask(ThreadLeakControl.java:782)
	at com.carrotsearch.randomizedtesting.ThreadLeakControl$3.evaluate(ThreadLeakControl.java:442)
	at com.carrotsearch.randomizedtesting.RandomizedRunner.runSingleTest(RandomizedRunner.java:746)
	at com.carrotsearch.randomizedtesting.RandomizedRunner$3.evaluate(RandomizedRunner.java:648)
	at com.carrotsearch.randomizedtesting.RandomizedRunner$4.evaluate(RandomizedRunner.java:682)
	at com.carrotsearch.randomizedtesting.RandomizedRunner$5.evaluate(RandomizedRunner.java:693)
	at com.carrotsearch.randomizedtesting.rules.StatementAdapter.evaluate(StatementAdapter.java:36)
	at com.carrotsearch.randomizedtesting.rules.SystemPropertiesRestoreRule$1.evaluate(SystemPropertiesRestoreRule.java:53)
	at org.apache.lucene.util.AbstractBeforeAfterRule$1.evaluate(AbstractBeforeAfterRule.java:46)
	at org.apache.lucene.util.TestRuleStoreClassName$1.evaluate(TestRuleStoreClassName.java:42)
	at com.carrotsearch.randomizedtesting.rules.SystemPropertiesInvariantRule$1.evaluate(SystemPropertiesInvariantRule.java:55)
	at com.carrotsearch.randomizedtesting.rules.NoShadowingOrOverridesOnMethodsRule$1.evaluate(NoShadowingOrOverridesOnMethodsRule.java:39)
	at com.carrotsearch.randomizedtesting.rules.NoShadowingOrOverridesOnMethodsRule$1.evaluate(NoShadowingOrOverridesOnMethodsRule.java:39)
	at com.carrotsearch.randomizedtesting.rules.StatementAdapter.evaluate(StatementAdapter.java:36)
	at org.apache.lucene.util.TestRuleAssertionsRequired$1.evaluate(TestRuleAssertionsRequired.java:43)
	at org.apache.lucene.util.TestRuleMarkFailure$1.evaluate(TestRuleMarkFailure.java:48)
	at org.apache.lucene.util.TestRuleIgnoreAfterMaxFailures$1.evaluate(TestRuleIgnoreAfterMaxFailures.java:70)
	at org.apache.lucene.util.TestRuleIgnoreTestSuites$1.evaluate(TestRuleIgnoreTestSuites.java:55)
	at com.carrotsearch.randomizedtesting.rules.StatementAdapter.evaluate(StatementAdapter.java:36)
	at com.carrotsearch.randomizedtesting.ThreadLeakControl$StatementRunner.run(ThreadLeakControl.java:358)
	at java.lang.Thread.run(Thread.java:744)


REGRESSION:  org.apache.solr.analytics.expression.ExpressionTest.absoluteValueTest

Error Message:
Caught exception in getStatResult, xPath = /response/lst[@name='stats']/lst[@name='avr']/double[@name='sum']  raw data: <?xml version="1.0" encoding="UTF-8"?> <response>  <lst name="responseHeader">   <int name="status">0</int>   <int name="QTime">7</int> </lst> <result name="response" numFound="100" start="0"> </result> <lst name="stats">   <lst name="stats_fields"/> </lst> <lst name="stats">   <lst name="pr">     <long name="count">100</long>     <null name="mc"/>     <null name="mean"/>     <null name="su"/>     <null name="sum"/>     <null name="unique"/>   </lst>   <lst name="dr">     <long name="count">100</long>     <null name="mc"/>     <null name="mean"/>     <null name="su"/>     <null name="sum"/>     <null name="unique"/>   </lst>   <lst name="cdr">     <date name="cd1">1800-12-31T23:59:59Z</date>     <date name="cd2">1804-06-30T23:59:59Z</date>     <str name="cs1">1800-12-31T23:59:59Z</str>     <str name="cs2">1804-06-30T23:59:59Z</str>   </lst>   <lst name="ar">     <long name="count">100</long>     <null name="mcm"/>     <null name="mean"/>     <null name="median"/>     <null name="su"/>     <null name="sum"/>     <null name="unique"/>   </lst>   <lst name="avr">     <double name="c">100.0</double>     <long name="count">100</long>     <null name="s"/>     <null name="sum"/>   </lst>   <lst name="cr">     <str name="ccmax">this is the secondstr9</str>     <str name="ccmin">this is the firststr0</str>     <str name="csmax">this is the second</str>     <str name="csmin">this is the first</str>     <str name="max">str9</str>     <str name="min">str0</str>   </lst>   <lst name="dmr">     <str name="cma">+2MONTHS</str>     <str name="cme">+2YEARS</str>     <date name="dmma">1812-02-29T23:59:59Z</date>     <date name="dmme">1807-12-31T23:59:59Z</date>     <date name="max">1811-12-31T23:59:59Z</date>     <date name="median">1805-12-31T23:59:59Z</date>   </lst>   <lst name="csr">     <str name="cs1">this is the first</str>     <str name="cs2">this is the second</str>     <str name="cs3">this is the third</str>   </lst>   <lst name="cnr">     <double name="c10">10.0</double>     <double name="c8">8.0</double>   </lst>   <lst name="mr">     <long name="count">100</long>     <null name="mcm"/>     <null name="mean"/>     <null name="median"/>     <null name="su"/>     <null name="sum"/>     <null name="unique"/>   </lst>   <lst name="rr">     <str name="max">str9</str>     <str name="min">str0</str>     <str name="rmax">9rts</str>     <str name="rmin">0rts</str>   </lst>   <lst name="nr">     <double name="c">-100.0</double>     <long name="count">100</long>     <null name="s"/>     <null name="sum"/>   </lst> </lst> </response> 

Stack Trace:
java.lang.AssertionError: Caught exception in getStatResult, xPath = /response/lst[@name='stats']/lst[@name='avr']/double[@name='sum'] 
raw data: <?xml version="1.0" encoding="UTF-8"?>
<response>

<lst name="responseHeader">
  <int name="status">0</int>
  <int name="QTime">7</int>
</lst>
<result name="response" numFound="100" start="0">
</result>
<lst name="stats">
  <lst name="stats_fields"/>
</lst>
<lst name="stats">
  <lst name="pr">
    <long name="count">100</long>
    <null name="mc"/>
    <null name="mean"/>
    <null name="su"/>
    <null name="sum"/>
    <null name="unique"/>
  </lst>
  <lst name="dr">
    <long name="count">100</long>
    <null name="mc"/>
    <null name="mean"/>
    <null name="su"/>
    <null name="sum"/>
    <null name="unique"/>
  </lst>
  <lst name="cdr">
    <date name="cd1">1800-12-31T23:59:59Z</date>
    <date name="cd2">1804-06-30T23:59:59Z</date>
    <str name="cs1">1800-12-31T23:59:59Z</str>
    <str name="cs2">1804-06-30T23:59:59Z</str>
  </lst>
  <lst name="ar">
    <long name="count">100</long>
    <null name="mcm"/>
    <null name="mean"/>
    <null name="median"/>
    <null name="su"/>
    <null name="sum"/>
    <null name="unique"/>
  </lst>
  <lst name="avr">
    <double name="c">100.0</double>
    <long name="count">100</long>
    <null name="s"/>
    <null name="sum"/>
  </lst>
  <lst name="cr">
    <str name="ccmax">this is the secondstr9</str>
    <str name="ccmin">this is the firststr0</str>
    <str name="csmax">this is the second</str>
    <str name="csmin">this is the first</str>
    <str name="max">str9</str>
    <str name="min">str0</str>
  </lst>
  <lst name="dmr">
    <str name="cma">+2MONTHS</str>
    <str name="cme">+2YEARS</str>
    <date name="dmma">1812-02-29T23:59:59Z</date>
    <date name="dmme">1807-12-31T23:59:59Z</date>
    <date name="max">1811-12-31T23:59:59Z</date>
    <date name="median">1805-12-31T23:59:59Z</date>
  </lst>
  <lst name="csr">
    <str name="cs1">this is the first</str>
    <str name="cs2">this is the second</str>
    <str name="cs3">this is the third</str>
  </lst>
  <lst name="cnr">
    <double name="c10">10.0</double>
    <double name="c8">8.0</double>
  </lst>
  <lst name="mr">
    <long name="count">100</long>
    <null name="mcm"/>
    <null name="mean"/>
    <null name="median"/>
    <null name="su"/>
    <null name="sum"/>
    <null name="unique"/>
  </lst>
  <lst name="rr">
    <str name="max">str9</str>
    <str name="min">str0</str>
    <str name="rmax">9rts</str>
    <str name="rmin">0rts</str>
  </lst>
  <lst name="nr">
    <double name="c">-100.0</double>
    <long name="count">100</long>
    <null name="s"/>
    <null name="sum"/>
  </lst>
</lst>
</response>

	at __randomizedtesting.SeedInfo.seed([23A66BE88F72EF6F:20A4BFD42EFB709]:0)
	at org.junit.Assert.fail(Assert.java:93)
	at org.apache.solr.analytics.AbstractAnalyticsStatsTest.getStatResult(AbstractAnalyticsStatsTest.java:113)
	at org.apache.solr.analytics.expression.ExpressionTest.absoluteValueTest(ExpressionTest.java:143)
	at sun.reflect.NativeMethodAccessorImpl.invoke0(Native Method)
	at sun.reflect.NativeMethodAccessorImpl.invoke(NativeMethodAccessorImpl.java:57)
	at sun.reflect.DelegatingMethodAccessorImpl.invoke(DelegatingMethodAccessorImpl.java:43)
	at java.lang.reflect.Method.invoke(Method.java:606)
	at com.carrotsearch.randomizedtesting.RandomizedRunner.invoke(RandomizedRunner.java:1559)
	at com.carrotsearch.randomizedtesting.RandomizedRunner.access$600(RandomizedRunner.java:79)
	at com.carrotsearch.randomizedtesting.RandomizedRunner$6.evaluate(RandomizedRunner.java:737)
	at com.carrotsearch.randomizedtesting.RandomizedRunner$7.evaluate(RandomizedRunner.java:773)
	at com.carrotsearch.randomizedtesting.RandomizedRunner$8.evaluate(RandomizedRunner.java:787)
	at com.carrotsearch.randomizedtesting.rules.SystemPropertiesRestoreRule$1.evaluate(SystemPropertiesRestoreRule.java:53)
	at org.apache.lucene.util.TestRuleSetupTeardownChained$1.evaluate(TestRuleSetupTeardownChained.java:50)
	at org.apache.lucene.util.TestRuleFieldCacheSanity$1.evaluate(TestRuleFieldCacheSanity.java:51)
	at org.apache.lucene.util.AbstractBeforeAfterRule$1.evaluate(AbstractBeforeAfterRule.java:46)
	at com.carrotsearch.randomizedtesting.rules.SystemPropertiesInvariantRule$1.evaluate(SystemPropertiesInvariantRule.java:55)
	at org.apache.lucene.util.TestRuleThreadAndTestName$1.evaluate(TestRuleThreadAndTestName.java:49)
	at org.apache.lucene.util.TestRuleIgnoreAfterMaxFailures$1.evaluate(TestRuleIgnoreAfterMaxFailures.java:70)
	at org.apache.lucene.util.TestRuleMarkFailure$1.evaluate(TestRuleMarkFailure.java:48)
	at com.carrotsearch.randomizedtesting.rules.StatementAdapter.evaluate(StatementAdapter.java:36)
	at com.carrotsearch.randomizedtesting.ThreadLeakControl$StatementRunner.run(ThreadLeakControl.java:358)
	at com.carrotsearch.randomizedtesting.ThreadLeakControl.forkTimeoutingTask(ThreadLeakControl.java:782)
	at com.carrotsearch.randomizedtesting.ThreadLeakControl$3.evaluate(ThreadLeakControl.java:442)
	at com.carrotsearch.randomizedtesting.RandomizedRunner.runSingleTest(RandomizedRunner.java:746)
	at com.carrotsearch.randomizedtesting.RandomizedRunner$3.evaluate(RandomizedRunner.java:648)
	at com.carrotsearch.randomizedtesting.RandomizedRunner$4.evaluate(RandomizedRunner.java:682)
	at com.carrotsearch.randomizedtesting.RandomizedRunner$5.evaluate(RandomizedRunner.java:693)
	at com.carrotsearch.randomizedtesting.rules.StatementAdapter.evaluate(StatementAdapter.java:36)
	at com.carrotsearch.randomizedtesting.rules.SystemPropertiesRestoreRule$1.evaluate(SystemPropertiesRestoreRule.java:53)
	at org.apache.lucene.util.AbstractBeforeAfterRule$1.evaluate(AbstractBeforeAfterRule.java:46)
	at org.apache.lucene.util.TestRuleStoreClassName$1.evaluate(TestRuleStoreClassName.java:42)
	at com.carrotsearch.randomizedtesting.rules.SystemPropertiesInvariantRule$1.evaluate(SystemPropertiesInvariantRule.java:55)
	at com.carrotsearch.randomizedtesting.rules.NoShadowingOrOverridesOnMethodsRule$1.evaluate(NoShadowingOrOverridesOnMethodsRule.java:39)
	at com.carrotsearch.randomizedtesting.rules.NoShadowingOrOverridesOnMethodsRule$1.evaluate(NoShadowingOrOverridesOnMethodsRule.java:39)
	at com.carrotsearch.randomizedtesting.rules.StatementAdapter.evaluate(StatementAdapter.java:36)
	at org.apache.lucene.util.TestRuleAssertionsRequired$1.evaluate(TestRuleAssertionsRequired.java:43)
	at org.apache.lucene.util.TestRuleMarkFailure$1.evaluate(TestRuleMarkFailure.java:48)
	at org.apache.lucene.util.TestRuleIgnoreAfterMaxFailures$1.evaluate(TestRuleIgnoreAfterMaxFailures.java:70)
	at org.apache.lucene.util.TestRuleIgnoreTestSuites$1.evaluate(TestRuleIgnoreTestSuites.java:55)
	at com.carrotsearch.randomizedtesting.rules.StatementAdapter.evaluate(StatementAdapter.java:36)
	at com.carrotsearch.randomizedtesting.ThreadLeakControl$StatementRunner.run(ThreadLeakControl.java:358)
	at java.lang.Thread.run(Thread.java:744)




Build Log:
[...truncated 10931 lines...]
   [junit4] Suite: org.apache.solr.analytics.expression.ExpressionTest
   [junit4]   2> 916292 T6212 oas.SolrTestCaseJ4.initCore ####initCore
   [junit4]   2> Creating dataDir: /mnt/ssd/jenkins/workspace/Lucene-Solr-trunk-Linux/solr/build/solr-core/test/J0/./solrtest-ExpressionTest-1388236075795
   [junit4]   2> 916293 T6212 oasc.SolrResourceLoader.<init> new SolrResourceLoader for directory: '/mnt/ssd/jenkins/workspace/Lucene-Solr-trunk-Linux/solr/build/solr-core/test-files/solr/collection1/'
   [junit4]   2> 916294 T6212 oasc.SolrResourceLoader.replaceClassLoader Adding 'file:/mnt/ssd/jenkins/workspace/Lucene-Solr-trunk-Linux/solr/build/solr-core/test-files/solr/collection1/lib/classes/' to classloader
   [junit4]   2> 916294 T6212 oasc.SolrResourceLoader.replaceClassLoader Adding 'file:/mnt/ssd/jenkins/workspace/Lucene-Solr-trunk-Linux/solr/build/solr-core/test-files/solr/collection1/lib/README' to classloader
   [junit4]   2> 916320 T6212 oasc.SolrConfig.<init> Using Lucene MatchVersion: LUCENE_50
   [junit4]   2> 916335 T6212 oasc.SolrConfig.<init> Loaded SolrConfig: solrconfig-basic.xml
   [junit4]   2> 916336 T6212 oass.IndexSchema.readSchema Reading Solr Schema from schema-analytics.xml
   [junit4]   2> 916342 T6212 oass.IndexSchema.readSchema [null] Schema name=schema-docValues
   [junit4]   2> 916357 T6212 oass.IndexSchema.readSchema unique key field: id
   [junit4]   2> 916358 T6212 oasc.SolrResourceLoader.locateSolrHome JNDI not configured for solr (NoInitialContextEx)
   [junit4]   2> 916358 T6212 oasc.SolrResourceLoader.locateSolrHome using system property solr.solr.home: /mnt/ssd/jenkins/workspace/Lucene-Solr-trunk-Linux/solr/build/solr-core/test-files/solr
   [junit4]   2> 916359 T6212 oasc.SolrResourceLoader.<init> new SolrResourceLoader for directory: '/mnt/ssd/jenkins/workspace/Lucene-Solr-trunk-Linux/solr/build/solr-core/test-files/solr/'
   [junit4]   2> 916367 T6212 oasc.SolrResourceLoader.locateSolrHome JNDI not configured for solr (NoInitialContextEx)
   [junit4]   2> 916368 T6212 oasc.SolrResourceLoader.locateSolrHome using system property solr.solr.home: /mnt/ssd/jenkins/workspace/Lucene-Solr-trunk-Linux/solr/build/solr-core/test-files/solr
   [junit4]   2> 916368 T6212 oasc.SolrResourceLoader.<init> new SolrResourceLoader for deduced Solr Home: '/mnt/ssd/jenkins/workspace/Lucene-Solr-trunk-Linux/solr/build/solr-core/test-files/solr/'
   [junit4]   2> 916395 T6212 oasc.CoreContainer.<init> New CoreContainer 3534715
   [junit4]   2> 916396 T6212 oasc.CoreContainer.load Loading cores into CoreContainer [instanceDir=/mnt/ssd/jenkins/workspace/Lucene-Solr-trunk-Linux/solr/build/solr-core/test-files/solr/]
   [junit4]   2> 916396 T6212 oashc.HttpShardHandlerFactory.getParameter Setting socketTimeout to: 0
   [junit4]   2> 916397 T6212 oashc.HttpShardHandlerFactory.getParameter Setting urlScheme to: http://
   [junit4]   2> 916397 T6212 oashc.HttpShardHandlerFactory.getParameter Setting connTimeout to: 0
   [junit4]   2> 916397 T6212 oashc.HttpShardHandlerFactory.getParameter Setting maxConnectionsPerHost to: 20
   [junit4]   2> 916397 T6212 oashc.HttpShardHandlerFactory.getParameter Setting corePoolSize to: 0
   [junit4]   2> 916397 T6212 oashc.HttpShardHandlerFactory.getParameter Setting maximumPoolSize to: 2147483647
   [junit4]   2> 916398 T6212 oashc.HttpShardHandlerFactory.getParameter Setting maxThreadIdleTime to: 5
   [junit4]   2> 916398 T6212 oashc.HttpShardHandlerFactory.getParameter Setting sizeOfQueue to: -1
   [junit4]   2> 916398 T6212 oashc.HttpShardHandlerFactory.getParameter Setting fairnessPolicy to: false
   [junit4]   2> 916401 T6212 oasl.LogWatcher.createWatcher SLF4J impl is org.slf4j.impl.Log4jLoggerFactory
   [junit4]   2> 916401 T6212 oasl.LogWatcher.newRegisteredLogWatcher Registering Log Listener [Log4j (org.slf4j.impl.Log4jLoggerFactory)]
   [junit4]   2> 916401 T6212 oasc.CoreContainer.load Host Name: 
   [junit4]   2> 916404 T6213 oasc.CoreContainer.create Creating SolrCore 'collection1' using instanceDir: /mnt/ssd/jenkins/workspace/Lucene-Solr-trunk-Linux/solr/build/solr-core/test-files/solr/collection1
   [junit4]   2> 916404 T6213 oasc.SolrResourceLoader.<init> new SolrResourceLoader for directory: '/mnt/ssd/jenkins/workspace/Lucene-Solr-trunk-Linux/solr/build/solr-core/test-files/solr/collection1/'
   [junit4]   2> 916405 T6213 oasc.SolrResourceLoader.replaceClassLoader Adding 'file:/mnt/ssd/jenkins/workspace/Lucene-Solr-trunk-Linux/solr/build/solr-core/test-files/solr/collection1/lib/classes/' to classloader
   [junit4]   2> 916405 T6213 oasc.SolrResourceLoader.replaceClassLoader Adding 'file:/mnt/ssd/jenkins/workspace/Lucene-Solr-trunk-Linux/solr/build/solr-core/test-files/solr/collection1/lib/README' to classloader
   [junit4]   2> 916430 T6213 oasc.SolrConfig.<init> Using Lucene MatchVersion: LUCENE_50
   [junit4]   2> 916729 T6213 oasc.SolrConfig.<init> Loaded SolrConfig: solrconfig-basic.xml
   [junit4]   2> 916730 T6213 oass.IndexSchema.readSchema Reading Solr Schema from schema-analytics.xml
   [junit4]   2> 916735 T6213 oass.IndexSchema.readSchema [collection1] Schema name=schema-docValues
   [junit4]   2> 916749 T6213 oass.IndexSchema.readSchema unique key field: id
   [junit4]   2> 916750 T6213 oasc.SolrCore.initDirectoryFactory org.apache.solr.core.MockDirectoryFactory
   [junit4]   2> 916750 T6213 oasc.SolrCore.<init> [collection1] Opening new SolrCore at /mnt/ssd/jenkins/workspace/Lucene-Solr-trunk-Linux/solr/build/solr-core/test-files/solr/collection1/, dataDir=/mnt/ssd/jenkins/workspace/Lucene-Solr-trunk-Linux/solr/build/solr-core/test/J0/./solrtest-ExpressionTest-1388236075795/
   [junit4]   2> 916750 T6213 oasc.SolrCore.<init> JMX monitoring not detected for core: collection1
   [junit4]   2> 916751 T6213 oasc.CachingDirectoryFactory.get return new directory for /mnt/ssd/jenkins/workspace/Lucene-Solr-trunk-Linux/solr/build/solr-core/test/J0/./solrtest-ExpressionTest-1388236075795
   [junit4]   2> 916751 T6213 oasc.SolrCore.getNewIndexDir New index directory detected: old=null new=/mnt/ssd/jenkins/workspace/Lucene-Solr-trunk-Linux/solr/build/solr-core/test/J0/./solrtest-ExpressionTest-1388236075795/index/
   [junit4]   2> 916751 T6213 oasc.SolrCore.initIndex WARN [collection1] Solr index directory '/mnt/ssd/jenkins/workspace/Lucene-Solr-trunk-Linux/solr/build/solr-core/test/J0/./solrtest-ExpressionTest-1388236075795/index' doesn't exist. Creating new index...
   [junit4]   2> 916751 T6213 oasc.CachingDirectoryFactory.get return new directory for /mnt/ssd/jenkins/workspace/Lucene-Solr-trunk-Linux/solr/build/solr-core/test/J0/./solrtest-ExpressionTest-1388236075795/index
   [junit4]   2> 916751 T6213 oasu.RandomMergePolicy.<init> RandomMergePolicy wrapping class org.apache.lucene.index.TieredMergePolicy: [TieredMergePolicy: maxMergeAtOnce=17, maxMergeAtOnceExplicit=41, maxMergedSegmentMB=81.9267578125, floorSegmentMB=0.423828125, forceMergeDeletesPctAllowed=9.737404776303782, segmentsPerTier=39.0, maxCFSSegmentSizeMB=8.796093022207999E12, noCFSRatio=0.0
   [junit4]   2> 916752 T6213 oasc.SolrDeletionPolicy.onCommit SolrDeletionPolicy.onCommit: commits: num=1
   [junit4]   2> 		commit{dir=MockDirectoryWrapper(org.apache.lucene.store.RAMDirectory@1b9e353 lockFactory=org.apache.lucene.store.SingleInstanceLockFactory@f17f7a),segFN=segments_1,generation=1}
   [junit4]   2> 916752 T6213 oasc.SolrDeletionPolicy.updateCommits newest commit generation = 1
   [junit4]   2> 916753 T6213 oasc.SolrCore.loadUpdateProcessorChains no updateRequestProcessorChain defined as default, creating implicit default
   [junit4]   2> 916753 T6213 oasc.RequestHandlers.initHandlersFromConfig created standard: solr.StandardRequestHandler
   [junit4]   2> 916754 T6213 oasc.RequestHandlers.initHandlersFromConfig created /update: solr.UpdateRequestHandler
   [junit4]   2> 916756 T6213 oashl.XMLLoader.init xsltCacheLifetimeSeconds=60
   [junit4]   2> 916757 T6213 oasu.CommitTracker.<init> Hard AutoCommit: disabled
   [junit4]   2> 916757 T6213 oasu.CommitTracker.<init> Soft AutoCommit: disabled
   [junit4]   2> 916757 T6213 oasu.RandomMergePolicy.<init> RandomMergePolicy wrapping class org.apache.lucene.index.LogDocMergePolicy: [LogDocMergePolicy: minMergeSize=1000, mergeFactor=31, maxMergeSize=9223372036854775807, maxMergeSizeForForcedMerge=9223372036854775807, calibrateSizeByDeletes=false, maxMergeDocs=2147483647, maxCFSSegmentSizeMB=8.796093022207999E12, noCFSRatio=0.43002712193246184]
   [junit4]   2> 916758 T6213 oasc.SolrDeletionPolicy.onInit SolrDeletionPolicy.onInit: commits: num=1
   [junit4]   2> 		commit{dir=MockDirectoryWrapper(org.apache.lucene.store.RAMDirectory@1b9e353 lockFactory=org.apache.lucene.store.SingleInstanceLockFactory@f17f7a),segFN=segments_1,generation=1}
   [junit4]   2> 916758 T6213 oasc.SolrDeletionPolicy.updateCommits newest commit generation = 1
   [junit4]   2> 916758 T6213 oass.SolrIndexSearcher.<init> Opening Searcher@78f01b main
   [junit4]   2> 916758 T6214 oasc.SolrCore.registerSearcher [collection1] Registered new searcher Searcher@78f01b main{StandardDirectoryReader(segments_1:1:nrt)}
   [junit4]   2> 916758 T6213 oasc.CoreContainer.registerCore registering core: collection1
   [junit4]   2> 916760 T6212 oas.SolrTestCaseJ4.initCore ####initCore end
   [junit4]   2> ASYNC  NEW_CORE C2762 name=collection1 org.apache.solr.core.SolrCore@1c4e8c2
   [junit4]   2> 916762 T6212 C2762 oasu.DirectUpdateHandler2.deleteAll [collection1] REMOVING ALL DOCUMENTS FROM INDEX
   [junit4]   2> 916763 T6212 C2762 oasup.LogUpdateProcessor.finish [collection1] webapp=null path=null params={} {deleteByQuery=*:*} 0 1
   [junit4]   2> 916765 T6212 C2762 oasup.LogUpdateProcessor.finish [collection1] webapp=null path=null params={} {add=[10000]} 0 0
   [junit4]   2> 916771 T6212 C2762 oasup.LogUpdateProcessor.finish [collection1] webapp=null path=null params={} {add=[10001]} 0 1
   [junit4]   2

[...truncated too long message...]

ipHandler.java:301)
   [junit4]    >         at org.eclipse.jetty.server.handler.ContextHandler.doHandle(ContextHandler.java:1077)
   [junit4]    >         at org.eclipse.jetty.servlet.ServletHandler.doScope(ServletHandler.java:384)
   [junit4]    >         at org.eclipse.jetty.server.session.SessionHandler.doScope(SessionHandler.java:193)
   [junit4]    >         at org.eclipse.jetty.server.handler.ContextHandler.doScope(ContextHandler.java:1009)
   [junit4]    >         at org.eclipse.jetty.server.handler.ScopedHandler.handle(ScopedHandler.java:135)
   [junit4]    >         at org.eclipse.jetty.server.handler.HandlerWrapper.handle(HandlerWrapper.java:116)
   [junit4]    >         at org.eclipse.jetty.server.Server.handle(Server.java:368)
   [junit4]    >         at org.eclipse.jetty.server.AbstractHttpConnection.handleRequest(AbstractHttpConnection.java:489)
   [junit4]    >         at org.eclipse.jetty.server.AbstractHttpConnection.content(AbstractHttpConnection.java:953)
   [junit4]    >         at org.eclipse.jetty.server.AbstractHttpConnection$RequestHandler.content(AbstractHttpConnection.java:1014)
   [junit4]    >         at org.eclipse.jetty.http.HttpParser.parseNext(HttpParser.java:861)
   [junit4]    >         at org.eclipse.jetty.http.HttpParser.parseAvailable(HttpParser.java:240)
   [junit4]    >         at org.eclipse.jetty.server.AsyncHttpConnection.handle(AsyncHttpConnection.java:82)
   [junit4]    >         at org.eclipse.jetty.io.nio.SelectChannelEndPoint.handle(SelectChannelEndPoint.java:628)
   [junit4]    >         at org.eclipse.jetty.io.nio.SelectChannelEndPoint$1.run(SelectChannelEndPoint.java:52)
   [junit4]    >         at org.eclipse.jetty.util.thread.QueuedThreadPool.runJob(QueuedThreadPool.java:608)
   [junit4]    >         at org.eclipse.jetty.util.thread.QueuedThreadPool$3.run(QueuedThreadPool.java:543)
   [junit4]    >         at java.lang.Thread.run(Thread.java:744)
   [junit4]    >    2) Thread[id=3381, name=searcherExecutor-2755-thread-1, state=WAITING, group=TGRP-ChaosMonkeyNothingIsSafeTest]
   [junit4]    >         at sun.misc.Unsafe.park(Native Method)
   [junit4]    >         at java.util.concurrent.locks.LockSupport.park(LockSupport.java:186)
   [junit4]    >         at java.util.concurrent.locks.AbstractQueuedSynchronizer$ConditionObject.await(AbstractQueuedSynchronizer.java:2043)
   [junit4]    >         at java.util.concurrent.LinkedBlockingQueue.take(LinkedBlockingQueue.java:442)
   [junit4]    >         at java.util.concurrent.ThreadPoolExecutor.getTask(ThreadPoolExecutor.java:1068)
   [junit4]    >         at java.util.concurrent.ThreadPoolExecutor.runWorker(ThreadPoolExecutor.java:1130)
   [junit4]    >         at java.util.concurrent.ThreadPoolExecutor$Worker.run(ThreadPoolExecutor.java:615)
   [junit4]    >         at java.lang.Thread.run(Thread.java:744)
   [junit4]    > 	at __randomizedtesting.SeedInfo.seed([23A66BE88F72EF6F]:0)Throwable #3: com.carrotsearch.randomizedtesting.ThreadLeakError: There are still zombie threads that couldn't be terminated:
   [junit4]    >    1) Thread[id=3381, name=searcherExecutor-2755-thread-1, state=WAITING, group=TGRP-ChaosMonkeyNothingIsSafeTest]
   [junit4]    >         at sun.misc.Unsafe.park(Native Method)
   [junit4]    >         at java.util.concurrent.locks.LockSupport.park(LockSupport.java:186)
   [junit4]    >         at java.util.concurrent.locks.AbstractQueuedSynchronizer$ConditionObject.await(AbstractQueuedSynchronizer.java:2043)
   [junit4]    >         at java.util.concurrent.LinkedBlockingQueue.take(LinkedBlockingQueue.java:442)
   [junit4]    >         at java.util.concurrent.ThreadPoolExecutor.getTask(ThreadPoolExecutor.java:1068)
   [junit4]    >         at java.util.concurrent.ThreadPoolExecutor.runWorker(ThreadPoolExecutor.java:1130)
   [junit4]    >         at java.util.concurrent.ThreadPoolExecutor$Worker.run(ThreadPoolExecutor.java:615)
   [junit4]    >         at java.lang.Thread.run(Thread.java:744)
   [junit4]    >    2) Thread[id=3373, name=qtp28180100-3373, state=RUNNABLE, group=TGRP-ChaosMonkeyNothingIsSafeTest]
   [junit4]    >         at org.apache.solr.client.solrj.impl.ConcurrentUpdateSolrServer.blockUntilFinished(ConcurrentUpdateSolrServer.java:391)
   [junit4]    >         at org.apache.solr.update.StreamingSolrServers.blockUntilFinished(StreamingSolrServers.java:104)
   [junit4]    >         at org.apache.solr.update.SolrCmdDistributor.doRetriesIfNeeded(SolrCmdDistributor.java:148)
   [junit4]    >         at org.apache.solr.update.SolrCmdDistributor.doRetriesIfNeeded(SolrCmdDistributor.java:149)
   [junit4]    >         at org.apache.solr.update.SolrCmdDistributor.finish(SolrCmdDistributor.java:71)
   [junit4]    >         at org.apache.solr.update.processor.DistributedUpdateProcessor.doFinish(DistributedUpdateProcessor.java:606)
   [junit4]    >         at org.apache.solr.update.processor.DistributedUpdateProcessor.finish(DistributedUpdateProcessor.java:1456)
   [junit4]    >         at org.apache.solr.update.processor.LogUpdateProcessor.finish(LogUpdateProcessorFactory.java:179)
   [junit4]    >         at org.apache.solr.handler.ContentStreamHandlerBase.handleRequestBody(ContentStreamHandlerBase.java:83)
   [junit4]    >         at org.apache.solr.handler.RequestHandlerBase.handleRequest(RequestHandlerBase.java:135)
   [junit4]    >         at org.apache.solr.core.SolrCore.execute(SolrCore.java:1874)
   [junit4]    >         at org.apache.solr.servlet.SolrDispatchFilter.execute(SolrDispatchFilter.java:753)
   [junit4]    >         at org.apache.solr.servlet.SolrDispatchFilter.doFilter(SolrDispatchFilter.java:415)
   [junit4]    >         at org.apache.solr.servlet.SolrDispatchFilter.doFilter(SolrDispatchFilter.java:200)
   [junit4]    >         at org.eclipse.jetty.servlet.ServletHandler$CachedChain.doFilter(ServletHandler.java:1419)
   [junit4]    >         at org.apache.solr.client.solrj.embedded.JettySolrRunner$DebugFilter.doFilter(JettySolrRunner.java:136)
   [junit4]    >         at org.eclipse.jetty.servlet.ServletHandler$CachedChain.doFilter(ServletHandler.java:1419)
   [junit4]    >         at org.eclipse.jetty.servlet.ServletHandler.doHandle(ServletHandler.java:455)
   [junit4]    >         at org.eclipse.jetty.server.session.SessionHandler.doHandle(SessionHandler.java:229)
   [junit4]    >         at org.eclipse.jetty.server.handler.ScopedHandler.handle(ScopedHandler.java:137)
   [junit4]    >         at org.eclipse.jetty.server.handler.GzipHandler.handle(GzipHandler.java:301)
   [junit4]    >         at org.eclipse.jetty.server.handler.ContextHandler.doHandle(ContextHandler.java:1077)
   [junit4]    >         at org.eclipse.jetty.servlet.ServletHandler.doScope(ServletHandler.java:384)
   [junit4]    >         at org.eclipse.jetty.server.session.SessionHandler.doScope(SessionHandler.java:193)
   [junit4]    >         at org.eclipse.jetty.server.handler.ContextHandler.doScope(ContextHandler.java:1009)
   [junit4]    >         at org.eclipse.jetty.server.handler.ScopedHandler.handle(ScopedHandler.java:135)
   [junit4]    >         at org.eclipse.jetty.server.handler.HandlerWrapper.handle(HandlerWrapper.java:116)
   [junit4]    >         at org.eclipse.jetty.server.Server.handle(Server.java:368)
   [junit4]    >         at org.eclipse.jetty.server.AbstractHttpConnection.handleRequest(AbstractHttpConnection.java:489)
   [junit4]    >         at org.eclipse.jetty.server.AbstractHttpConnection.content(AbstractHttpConnection.java:953)
   [junit4]    >         at org.eclipse.jetty.server.AbstractHttpConnection$RequestHandler.content(AbstractHttpConnection.java:1014)
   [junit4]    >         at org.eclipse.jetty.http.HttpParser.parseNext(HttpParser.java:861)
   [junit4]    >         at org.eclipse.jetty.http.HttpParser.parseAvailable(HttpParser.java:240)
   [junit4]    >         at org.eclipse.jetty.server.AsyncHttpConnection.handle(AsyncHttpConnection.java:82)
   [junit4]    >         at org.eclipse.jetty.io.nio.SelectChannelEndPoint.handle(SelectChannelEndPoint.java:628)
   [junit4]    >         at org.eclipse.jetty.io.nio.SelectChannelEndPoint$1.run(SelectChannelEndPoint.java:52)
   [junit4]    >         at org.eclipse.jetty.util.thread.QueuedThreadPool.runJob(QueuedThreadPool.java:608)
   [junit4]    >         at org.eclipse.jetty.util.thread.QueuedThreadPool$3.run(QueuedThreadPool.java:543)
   [junit4]    >         at java.lang.Thread.run(Thread.java:744)
   [junit4]    > 	at __randomizedtesting.SeedInfo.seed([23A66BE88F72EF6F]:0)
   [junit4] Completed on J1 in 267.01s, 1 test, 1 failure, 2 errors <<< FAILURES!

[...truncated 125 lines...]
BUILD FAILED
/mnt/ssd/jenkins/workspace/Lucene-Solr-trunk-Linux/build.xml:453: The following error occurred while executing this line:
/mnt/ssd/jenkins/workspace/Lucene-Solr-trunk-Linux/build.xml:433: The following error occurred while executing this line:
/mnt/ssd/jenkins/workspace/Lucene-Solr-trunk-Linux/build.xml:39: The following error occurred while executing this line:
/mnt/ssd/jenkins/workspace/Lucene-Solr-trunk-Linux/extra-targets.xml:37: The following error occurred while executing this line:
/mnt/ssd/jenkins/workspace/Lucene-Solr-trunk-Linux/solr/build.xml:189: The following error occurred while executing this line:
/mnt/ssd/jenkins/workspace/Lucene-Solr-trunk-Linux/solr/common-build.xml:491: The following error occurred while executing this line:
/mnt/ssd/jenkins/workspace/Lucene-Solr-trunk-Linux/lucene/common-build.xml:1304: The following error occurred while executing this line:
/mnt/ssd/jenkins/workspace/Lucene-Solr-trunk-Linux/lucene/common-build.xml:937: There were test failures: 357 suites, 1573 tests, 3 suite-level errors, 6 failures, 123 ignored (6 assumptions)

Total time: 43 minutes 3 seconds
Build step 'Invoke Ant' marked build as failure
Description set: Java: 32bit/jdk1.7.0_60-ea-b01 -server -XX:+UseParallelGC
Archiving artifacts
Recording test results
Email was triggered for: Failure
Sending email for trigger: Failure



Mime
View raw message