lucene-dev mailing list archives

Site index · List index
Message view « Date » · « Thread »
Top « Date » · « Thread »
From Adrien Grand <jpou...@gmail.com>
Subject Re: [JENKINS] Lucene-Solr-4.x-Linux (32bit/jdk1.7.0_45) - Build # 8086 - Failure!
Date Tue, 05 Nov 2013 08:47:51 GMT
I committed a fix.

On Tue, Nov 5, 2013 at 9:36 AM, Policeman Jenkins Server
<jenkins@thetaphi.de> wrote:
> Build: http://jenkins.thetaphi.de/job/Lucene-Solr-4.x-Linux/8086/
> Java: 32bit/jdk1.7.0_45 -client -XX:+UseG1GC
>
> 1 tests failed.
> REGRESSION:  org.apache.lucene.index.sorter.TestBlockJoinSorter.test
>
> Error Message:
> this codec cannot write docvalues
>
> Stack Trace:
> java.lang.UnsupportedOperationException: this codec cannot write docvalues
>         at __randomizedtesting.SeedInfo.seed([3B9A0C70055DC908:B3CE33AAABA1A4F0]:0)
>         at org.apache.lucene.codecs.lucene3x.Lucene3xCodec$1.fieldsConsumer(Lucene3xCodec.java:73)
>         at org.apache.lucene.index.DocValuesProcessor.flush(DocValuesProcessor.java:77)
>         at org.apache.lucene.index.TwoStoredFieldsConsumers.flush(TwoStoredFieldsConsumers.java:42)
>         at org.apache.lucene.index.DocFieldProcessor.flush(DocFieldProcessor.java:80)
>         at org.apache.lucene.index.DocumentsWriterPerThread.flush(DocumentsWriterPerThread.java:465)
>         at org.apache.lucene.index.DocumentsWriter.doFlush(DocumentsWriter.java:506)
>         at org.apache.lucene.index.DocumentsWriter.postUpdate(DocumentsWriter.java:378)
>         at org.apache.lucene.index.DocumentsWriter.updateDocuments(DocumentsWriter.java:432)
>         at org.apache.lucene.index.IndexWriter.updateDocuments(IndexWriter.java:1286)
>         at org.apache.lucene.index.IndexWriter.addDocuments(IndexWriter.java:1247)
>         at org.apache.lucene.index.IndexWriter.addDocuments(IndexWriter.java:1232)
>         at org.apache.lucene.index.RandomIndexWriter.addDocuments(RandomIndexWriter.java:167)
>         at org.apache.lucene.index.sorter.TestBlockJoinSorter.test(TestBlockJoinSorter.java:83)
>         at sun.reflect.NativeMethodAccessorImpl.invoke0(Native Method)
>         at sun.reflect.NativeMethodAccessorImpl.invoke(NativeMethodAccessorImpl.java:57)
>         at sun.reflect.DelegatingMethodAccessorImpl.invoke(DelegatingMethodAccessorImpl.java:43)
>         at java.lang.reflect.Method.invoke(Method.java:606)
>         at com.carrotsearch.randomizedtesting.RandomizedRunner.invoke(RandomizedRunner.java:1559)
>         at com.carrotsearch.randomizedtesting.RandomizedRunner.access$600(RandomizedRunner.java:79)
>         at com.carrotsearch.randomizedtesting.RandomizedRunner$6.evaluate(RandomizedRunner.java:737)
>         at com.carrotsearch.randomizedtesting.RandomizedRunner$7.evaluate(RandomizedRunner.java:773)
>         at com.carrotsearch.randomizedtesting.RandomizedRunner$8.evaluate(RandomizedRunner.java:787)
>         at org.apache.lucene.util.TestRuleSetupTeardownChained$1.evaluate(TestRuleSetupTeardownChained.java:50)
>         at org.apache.lucene.util.TestRuleFieldCacheSanity$1.evaluate(TestRuleFieldCacheSanity.java:51)
>         at org.apache.lucene.util.AbstractBeforeAfterRule$1.evaluate(AbstractBeforeAfterRule.java:46)
>         at com.carrotsearch.randomizedtesting.rules.SystemPropertiesInvariantRule$1.evaluate(SystemPropertiesInvariantRule.java:55)
>         at org.apache.lucene.util.TestRuleThreadAndTestName$1.evaluate(TestRuleThreadAndTestName.java:49)
>         at org.apache.lucene.util.TestRuleIgnoreAfterMaxFailures$1.evaluate(TestRuleIgnoreAfterMaxFailures.java:70)
>         at org.apache.lucene.util.TestRuleMarkFailure$1.evaluate(TestRuleMarkFailure.java:48)
>         at com.carrotsearch.randomizedtesting.rules.StatementAdapter.evaluate(StatementAdapter.java:36)
>         at com.carrotsearch.randomizedtesting.ThreadLeakControl$StatementRunner.run(ThreadLeakControl.java:358)
>         at com.carrotsearch.randomizedtesting.ThreadLeakControl.forkTimeoutingTask(ThreadLeakControl.java:782)
>         at com.carrotsearch.randomizedtesting.ThreadLeakControl$3.evaluate(ThreadLeakControl.java:442)
>         at com.carrotsearch.randomizedtesting.RandomizedRunner.runSingleTest(RandomizedRunner.java:746)
>         at com.carrotsearch.randomizedtesting.RandomizedRunner$3.evaluate(RandomizedRunner.java:648)
>         at com.carrotsearch.randomizedtesting.RandomizedRunner$4.evaluate(RandomizedRunner.java:682)
>         at com.carrotsearch.randomizedtesting.RandomizedRunner$5.evaluate(RandomizedRunner.java:693)
>         at org.apache.lucene.util.AbstractBeforeAfterRule$1.evaluate(AbstractBeforeAfterRule.java:46)
>         at org.apache.lucene.util.TestRuleStoreClassName$1.evaluate(TestRuleStoreClassName.java:42)
>         at com.carrotsearch.randomizedtesting.rules.SystemPropertiesInvariantRule$1.evaluate(SystemPropertiesInvariantRule.java:55)
>         at com.carrotsearch.randomizedtesting.rules.NoShadowingOrOverridesOnMethodsRule$1.evaluate(NoShadowingOrOverridesOnMethodsRule.java:39)
>         at com.carrotsearch.randomizedtesting.rules.NoShadowingOrOverridesOnMethodsRule$1.evaluate(NoShadowingOrOverridesOnMethodsRule.java:39)
>         at com.carrotsearch.randomizedtesting.rules.StatementAdapter.evaluate(StatementAdapter.java:36)
>         at org.apache.lucene.util.TestRuleAssertionsRequired$1.evaluate(TestRuleAssertionsRequired.java:43)
>         at org.apache.lucene.util.TestRuleMarkFailure$1.evaluate(TestRuleMarkFailure.java:48)
>         at org.apache.lucene.util.TestRuleIgnoreAfterMaxFailures$1.evaluate(TestRuleIgnoreAfterMaxFailures.java:70)
>         at org.apache.lucene.util.TestRuleIgnoreTestSuites$1.evaluate(TestRuleIgnoreTestSuites.java:55)
>         at com.carrotsearch.randomizedtesting.rules.StatementAdapter.evaluate(StatementAdapter.java:36)
>         at com.carrotsearch.randomizedtesting.ThreadLeakControl$StatementRunner.run(ThreadLeakControl.java:358)
>         at java.lang.Thread.run(Thread.java:744)
>
>
>
>
> Build Log:
> [...truncated 8296 lines...]
>    [junit4] Suite: org.apache.lucene.index.sorter.TestBlockJoinSorter
>    [junit4]   2> NOTE: reproduce with: ant test  -Dtestcase=TestBlockJoinSorter -Dtests.method=test
-Dtests.seed=3B9A0C70055DC908 -Dtests.multiplier=3 -Dtests.slow=true -Dtests.locale=lt -Dtests.timezone=Asia/Hebron
-Dtests.file.encoding=ISO-8859-1
>    [junit4] ERROR   0.05s J0 | TestBlockJoinSorter.test <<<
>    [junit4]    > Throwable #1: java.lang.UnsupportedOperationException: this codec
cannot write docvalues
>    [junit4]    >        at __randomizedtesting.SeedInfo.seed([3B9A0C70055DC908:B3CE33AAABA1A4F0]:0)
>    [junit4]    >        at org.apache.lucene.codecs.lucene3x.Lucene3xCodec$1.fieldsConsumer(Lucene3xCodec.java:73)
>    [junit4]    >        at org.apache.lucene.index.DocValuesProcessor.flush(DocValuesProcessor.java:77)
>    [junit4]    >        at org.apache.lucene.index.TwoStoredFieldsConsumers.flush(TwoStoredFieldsConsumers.java:42)
>    [junit4]    >        at org.apache.lucene.index.DocFieldProcessor.flush(DocFieldProcessor.java:80)
>    [junit4]    >        at org.apache.lucene.index.DocumentsWriterPerThread.flush(DocumentsWriterPerThread.java:465)
>    [junit4]    >        at org.apache.lucene.index.DocumentsWriter.doFlush(DocumentsWriter.java:506)
>    [junit4]    >        at org.apache.lucene.index.DocumentsWriter.postUpdate(DocumentsWriter.java:378)
>    [junit4]    >        at org.apache.lucene.index.DocumentsWriter.updateDocuments(DocumentsWriter.java:432)
>    [junit4]    >        at org.apache.lucene.index.IndexWriter.updateDocuments(IndexWriter.java:1286)
>    [junit4]    >        at org.apache.lucene.index.IndexWriter.addDocuments(IndexWriter.java:1247)
>    [junit4]    >        at org.apache.lucene.index.IndexWriter.addDocuments(IndexWriter.java:1232)
>    [junit4]    >        at org.apache.lucene.index.RandomIndexWriter.addDocuments(RandomIndexWriter.java:167)
>    [junit4]    >        at org.apache.lucene.index.sorter.TestBlockJoinSorter.test(TestBlockJoinSorter.java:83)
>    [junit4]    >        at java.lang.Thread.run(Thread.java:744)
>    [junit4]   2> NOTE: test params are: codec=Lucene3x, sim=RandomSimilarityProvider(queryNorm=false,coord=crazy):
{}, locale=lt, timezone=Asia/Hebron
>    [junit4]   2> NOTE: Linux 3.8.0-32-generic i386/Oracle Corporation 1.7.0_45 (32-bit)/cpus=8,threads=1,free=36108056,total=50331648
>    [junit4]   2> NOTE: All tests run in this JVM: [TestSortingMergePolicy, TestBlockJoinSorter]
>    [junit4] Completed on J0 in 0.07s, 1 test, 1 error <<< FAILURES!
>
> [...truncated 31 lines...]
> BUILD FAILED
> /mnt/ssd/jenkins/workspace/Lucene-Solr-4.x-Linux/build.xml:428: The following error occurred
while executing this line:
> /mnt/ssd/jenkins/workspace/Lucene-Solr-4.x-Linux/build.xml:408: The following error occurred
while executing this line:
> /mnt/ssd/jenkins/workspace/Lucene-Solr-4.x-Linux/build.xml:39: The following error occurred
while executing this line:
> /mnt/ssd/jenkins/workspace/Lucene-Solr-4.x-Linux/lucene/build.xml:562: The following
error occurred while executing this line:
> /mnt/ssd/jenkins/workspace/Lucene-Solr-4.x-Linux/lucene/common-build.xml:1919: The following
error occurred while executing this line:
> /mnt/ssd/jenkins/workspace/Lucene-Solr-4.x-Linux/lucene/module-build.xml:60: The following
error occurred while executing this line:
> /mnt/ssd/jenkins/workspace/Lucene-Solr-4.x-Linux/lucene/common-build.xml:1263: The following
error occurred while executing this line:
> /mnt/ssd/jenkins/workspace/Lucene-Solr-4.x-Linux/lucene/common-build.xml:906: There were
test failures: 12 suites, 40 tests, 1 error, 1 ignored (1 assumption)
>
> Total time: 22 minutes 8 seconds
> Build step 'Invoke Ant' marked build as failure
> Description set: Java: 32bit/jdk1.7.0_45 -client -XX:+UseG1GC
> Archiving artifacts
> Recording test results
> Email was triggered for: Failure
> Sending email for trigger: Failure
>
>
>
>
> ---------------------------------------------------------------------
> To unsubscribe, e-mail: dev-unsubscribe@lucene.apache.org
> For additional commands, e-mail: dev-help@lucene.apache.org



-- 
Adrien

---------------------------------------------------------------------
To unsubscribe, e-mail: dev-unsubscribe@lucene.apache.org
For additional commands, e-mail: dev-help@lucene.apache.org


Mime
View raw message