lucene-dev mailing list archives

Site index · List index
Message view « Date » · « Thread »
Top « Date » · « Thread »
From Apache Jenkins Server <jenk...@builds.apache.org>
Subject [JENKINS] Lucene-Solr-NightlyTests-4.x - Build # 430 - Failure
Date Sun, 10 Nov 2013 00:00:51 GMT
Build: https://builds.apache.org/job/Lucene-Solr-NightlyTests-4.x/430/

4 tests failed.
REGRESSION:  org.apache.solr.cloud.DeleteReplicaTest.testDistribSearch

Error Message:
Invalid replica : core_node2 in shard/collection : shard1/delLiveColl

Stack Trace:
org.apache.solr.client.solrj.impl.HttpSolrServer$RemoteSolrException: Invalid replica : core_node2 in shard/collection : shard1/delLiveColl
	at __randomizedtesting.SeedInfo.seed([EA2FAB874C86BAC1:6BC9259F3BD9DAFD]:0)
	at org.apache.solr.client.solrj.impl.HttpSolrServer.request(HttpSolrServer.java:464)
	at org.apache.solr.client.solrj.impl.HttpSolrServer.request(HttpSolrServer.java:181)
	at org.apache.solr.client.solrj.impl.LBHttpSolrServer.request(LBHttpSolrServer.java:268)
	at org.apache.solr.client.solrj.impl.CloudSolrServer.request(CloudSolrServer.java:640)
	at org.apache.solr.cloud.DeleteReplicaTest.removeAndWaitForReplicaGone(DeleteReplicaTest.java:149)
	at org.apache.solr.cloud.DeleteReplicaTest.deleteLiveReplicaTest(DeleteReplicaTest.java:135)
	at org.apache.solr.cloud.DeleteReplicaTest.doTest(DeleteReplicaTest.java:115)
	at org.apache.solr.BaseDistributedSearchTestCase.testDistribSearch(BaseDistributedSearchTestCase.java:835)
	at sun.reflect.NativeMethodAccessorImpl.invoke0(Native Method)
	at sun.reflect.NativeMethodAccessorImpl.invoke(NativeMethodAccessorImpl.java:57)
	at sun.reflect.DelegatingMethodAccessorImpl.invoke(DelegatingMethodAccessorImpl.java:43)
	at java.lang.reflect.Method.invoke(Method.java:616)
	at com.carrotsearch.randomizedtesting.RandomizedRunner.invoke(RandomizedRunner.java:1559)
	at com.carrotsearch.randomizedtesting.RandomizedRunner.access$600(RandomizedRunner.java:79)
	at com.carrotsearch.randomizedtesting.RandomizedRunner$6.evaluate(RandomizedRunner.java:737)
	at com.carrotsearch.randomizedtesting.RandomizedRunner$7.evaluate(RandomizedRunner.java:773)
	at com.carrotsearch.randomizedtesting.RandomizedRunner$8.evaluate(RandomizedRunner.java:787)
	at com.carrotsearch.randomizedtesting.rules.SystemPropertiesRestoreRule$1.evaluate(SystemPropertiesRestoreRule.java:53)
	at org.apache.lucene.util.TestRuleSetupTeardownChained$1.evaluate(TestRuleSetupTeardownChained.java:50)
	at org.apache.lucene.util.TestRuleFieldCacheSanity$1.evaluate(TestRuleFieldCacheSanity.java:51)
	at org.apache.lucene.util.AbstractBeforeAfterRule$1.evaluate(AbstractBeforeAfterRule.java:46)
	at com.carrotsearch.randomizedtesting.rules.SystemPropertiesInvariantRule$1.evaluate(SystemPropertiesInvariantRule.java:55)
	at org.apache.lucene.util.TestRuleThreadAndTestName$1.evaluate(TestRuleThreadAndTestName.java:49)
	at org.apache.lucene.util.TestRuleIgnoreAfterMaxFailures$1.evaluate(TestRuleIgnoreAfterMaxFailures.java:70)
	at org.apache.lucene.util.TestRuleMarkFailure$1.evaluate(TestRuleMarkFailure.java:48)
	at com.carrotsearch.randomizedtesting.rules.StatementAdapter.evaluate(StatementAdapter.java:36)
	at com.carrotsearch.randomizedtesting.ThreadLeakControl$StatementRunner.run(ThreadLeakControl.java:358)
	at com.carrotsearch.randomizedtesting.ThreadLeakControl.forkTimeoutingTask(ThreadLeakControl.java:782)
	at com.carrotsearch.randomizedtesting.ThreadLeakControl$3.evaluate(ThreadLeakControl.java:442)
	at com.carrotsearch.randomizedtesting.RandomizedRunner.runSingleTest(RandomizedRunner.java:746)
	at com.carrotsearch.randomizedtesting.RandomizedRunner$3.evaluate(RandomizedRunner.java:648)
	at com.carrotsearch.randomizedtesting.RandomizedRunner$4.evaluate(RandomizedRunner.java:682)
	at com.carrotsearch.randomizedtesting.RandomizedRunner$5.evaluate(RandomizedRunner.java:693)
	at com.carrotsearch.randomizedtesting.rules.StatementAdapter.evaluate(StatementAdapter.java:36)
	at com.carrotsearch.randomizedtesting.rules.SystemPropertiesRestoreRule$1.evaluate(SystemPropertiesRestoreRule.java:53)
	at org.apache.lucene.util.AbstractBeforeAfterRule$1.evaluate(AbstractBeforeAfterRule.java:46)
	at org.apache.lucene.util.TestRuleStoreClassName$1.evaluate(TestRuleStoreClassName.java:42)
	at com.carrotsearch.randomizedtesting.rules.SystemPropertiesInvariantRule$1.evaluate(SystemPropertiesInvariantRule.java:55)
	at com.carrotsearch.randomizedtesting.rules.NoShadowingOrOverridesOnMethodsRule$1.evaluate(NoShadowingOrOverridesOnMethodsRule.java:39)
	at com.carrotsearch.randomizedtesting.rules.NoShadowingOrOverridesOnMethodsRule$1.evaluate(NoShadowingOrOverridesOnMethodsRule.java:39)
	at com.carrotsearch.randomizedtesting.rules.StatementAdapter.evaluate(StatementAdapter.java:36)
	at org.apache.lucene.util.TestRuleAssertionsRequired$1.evaluate(TestRuleAssertionsRequired.java:43)
	at org.apache.lucene.util.TestRuleMarkFailure$1.evaluate(TestRuleMarkFailure.java:48)
	at org.apache.lucene.util.TestRuleIgnoreAfterMaxFailures$1.evaluate(TestRuleIgnoreAfterMaxFailures.java:70)
	at org.apache.lucene.util.TestRuleIgnoreTestSuites$1.evaluate(TestRuleIgnoreTestSuites.java:55)
	at com.carrotsearch.randomizedtesting.rules.StatementAdapter.evaluate(StatementAdapter.java:36)
	at com.carrotsearch.randomizedtesting.ThreadLeakControl$StatementRunner.run(ThreadLeakControl.java:358)
	at java.lang.Thread.run(Thread.java:679)


FAILED:  junit.framework.TestSuite.org.apache.solr.cloud.DeleteReplicaTest

Error Message:
ERROR: SolrZkClient opens=15 closes=14

Stack Trace:
java.lang.AssertionError: ERROR: SolrZkClient opens=15 closes=14
	at __randomizedtesting.SeedInfo.seed([EA2FAB874C86BAC1]:0)
	at org.junit.Assert.fail(Assert.java:93)
	at org.apache.solr.SolrTestCaseJ4.endTrackingZkClients(SolrTestCaseJ4.java:343)
	at org.apache.solr.SolrTestCaseJ4.afterClass(SolrTestCaseJ4.java:135)
	at sun.reflect.GeneratedMethodAccessor24.invoke(Unknown Source)
	at sun.reflect.DelegatingMethodAccessorImpl.invoke(DelegatingMethodAccessorImpl.java:43)
	at java.lang.reflect.Method.invoke(Method.java:616)
	at com.carrotsearch.randomizedtesting.RandomizedRunner.invoke(RandomizedRunner.java:1559)
	at com.carrotsearch.randomizedtesting.RandomizedRunner.access$600(RandomizedRunner.java:79)
	at com.carrotsearch.randomizedtesting.RandomizedRunner$5.evaluate(RandomizedRunner.java:700)
	at com.carrotsearch.randomizedtesting.rules.StatementAdapter.evaluate(StatementAdapter.java:36)
	at com.carrotsearch.randomizedtesting.rules.SystemPropertiesRestoreRule$1.evaluate(SystemPropertiesRestoreRule.java:53)
	at org.apache.lucene.util.AbstractBeforeAfterRule$1.evaluate(AbstractBeforeAfterRule.java:46)
	at org.apache.lucene.util.TestRuleStoreClassName$1.evaluate(TestRuleStoreClassName.java:42)
	at com.carrotsearch.randomizedtesting.rules.SystemPropertiesInvariantRule$1.evaluate(SystemPropertiesInvariantRule.java:55)
	at com.carrotsearch.randomizedtesting.rules.NoShadowingOrOverridesOnMethodsRule$1.evaluate(NoShadowingOrOverridesOnMethodsRule.java:39)
	at com.carrotsearch.randomizedtesting.rules.NoShadowingOrOverridesOnMethodsRule$1.evaluate(NoShadowingOrOverridesOnMethodsRule.java:39)
	at com.carrotsearch.randomizedtesting.rules.StatementAdapter.evaluate(StatementAdapter.java:36)
	at org.apache.lucene.util.TestRuleAssertionsRequired$1.evaluate(TestRuleAssertionsRequired.java:43)
	at org.apache.lucene.util.TestRuleMarkFailure$1.evaluate(TestRuleMarkFailure.java:48)
	at org.apache.lucene.util.TestRuleIgnoreAfterMaxFailures$1.evaluate(TestRuleIgnoreAfterMaxFailures.java:70)
	at org.apache.lucene.util.TestRuleIgnoreTestSuites$1.evaluate(TestRuleIgnoreTestSuites.java:55)
	at com.carrotsearch.randomizedtesting.rules.StatementAdapter.evaluate(StatementAdapter.java:36)
	at com.carrotsearch.randomizedtesting.ThreadLeakControl$StatementRunner.run(ThreadLeakControl.java:358)
	at java.lang.Thread.run(Thread.java:679)


FAILED:  junit.framework.TestSuite.org.apache.solr.cloud.DeleteReplicaTest

Error Message:
2 threads leaked from SUITE scope at org.apache.solr.cloud.DeleteReplicaTest:     1) Thread[id=1406, name=TEST-DeleteReplicaTest.testDistribSearch-seed#[EA2FAB874C86BAC1]-SendThread(localhost:12965), state=RUNNABLE, group=TGRP-DeleteReplicaTest]         at sun.nio.ch.KqueueArrayWrapper.kevent(Native Method)         at sun.nio.ch.KqueueArrayWrapper.poll(KqueueArrayWrapper.java:146)         at sun.nio.ch.KqueueSelectorImpl.doSelect(KqueueSelectorImpl.java:69)         at sun.nio.ch.SelectorImpl.lockAndDoSelect(SelectorImpl.java:87)         at sun.nio.ch.SelectorImpl.select(SelectorImpl.java:98)         at org.apache.zookeeper.ClientCnxnSocketNIO.doTransport(ClientCnxnSocketNIO.java:338)         at org.apache.zookeeper.ClientCnxn$SendThread.run(ClientCnxn.java:1068)    2) Thread[id=1407, name=TEST-DeleteReplicaTest.testDistribSearch-seed#[EA2FAB874C86BAC1]-EventThread, state=WAITING, group=TGRP-DeleteReplicaTest]         at sun.misc.Unsafe.park(Native Method)         at java.util.concurrent.locks.LockSupport.park(LockSupport.java:186)         at java.util.concurrent.locks.AbstractQueuedSynchronizer$ConditionObject.await(AbstractQueuedSynchronizer.java:2043)         at java.util.concurrent.LinkedBlockingQueue.take(LinkedBlockingQueue.java:386)         at org.apache.zookeeper.ClientCnxn$EventThread.run(ClientCnxn.java:491)

Stack Trace:
com.carrotsearch.randomizedtesting.ThreadLeakError: 2 threads leaked from SUITE scope at org.apache.solr.cloud.DeleteReplicaTest: 
   1) Thread[id=1406, name=TEST-DeleteReplicaTest.testDistribSearch-seed#[EA2FAB874C86BAC1]-SendThread(localhost:12965), state=RUNNABLE, group=TGRP-DeleteReplicaTest]
        at sun.nio.ch.KqueueArrayWrapper.kevent(Native Method)
        at sun.nio.ch.KqueueArrayWrapper.poll(KqueueArrayWrapper.java:146)
        at sun.nio.ch.KqueueSelectorImpl.doSelect(KqueueSelectorImpl.java:69)
        at sun.nio.ch.SelectorImpl.lockAndDoSelect(SelectorImpl.java:87)
        at sun.nio.ch.SelectorImpl.select(SelectorImpl.java:98)
        at org.apache.zookeeper.ClientCnxnSocketNIO.doTransport(ClientCnxnSocketNIO.java:338)
        at org.apache.zookeeper.ClientCnxn$SendThread.run(ClientCnxn.java:1068)
   2) Thread[id=1407, name=TEST-DeleteReplicaTest.testDistribSearch-seed#[EA2FAB874C86BAC1]-EventThread, state=WAITING, group=TGRP-DeleteReplicaTest]
        at sun.misc.Unsafe.park(Native Method)
        at java.util.concurrent.locks.LockSupport.park(LockSupport.java:186)
        at java.util.concurrent.locks.AbstractQueuedSynchronizer$ConditionObject.await(AbstractQueuedSynchronizer.java:2043)
        at java.util.concurrent.LinkedBlockingQueue.take(LinkedBlockingQueue.java:386)
        at org.apache.zookeeper.ClientCnxn$EventThread.run(ClientCnxn.java:491)
	at __randomizedtesting.SeedInfo.seed([EA2FAB874C86BAC1]:0)


FAILED:  junit.framework.TestSuite.org.apache.solr.cloud.DeleteReplicaTest

Error Message:
There are still zombie threads that couldn't be terminated:    1) Thread[id=1406, name=TEST-DeleteReplicaTest.testDistribSearch-seed#[EA2FAB874C86BAC1]-SendThread(localhost:12965), state=RUNNABLE, group=TGRP-DeleteReplicaTest]         at sun.nio.ch.KqueueArrayWrapper.getKeventIdent(Native Method)         at sun.nio.ch.KqueueArrayWrapper.getDescriptor(KqueueArrayWrapper.java:121)         at sun.nio.ch.KqueueSelectorImpl.updateSelectedKeys(KqueueSelectorImpl.java:99)         at sun.nio.ch.KqueueSelectorImpl.doSelect(KqueueSelectorImpl.java:74)         at sun.nio.ch.SelectorImpl.lockAndDoSelect(SelectorImpl.java:87)         at sun.nio.ch.SelectorImpl.select(SelectorImpl.java:98)         at org.apache.zookeeper.ClientCnxnSocketNIO.doTransport(ClientCnxnSocketNIO.java:338)         at org.apache.zookeeper.ClientCnxn$SendThread.run(ClientCnxn.java:1068)

Stack Trace:
com.carrotsearch.randomizedtesting.ThreadLeakError: There are still zombie threads that couldn't be terminated:
   1) Thread[id=1406, name=TEST-DeleteReplicaTest.testDistribSearch-seed#[EA2FAB874C86BAC1]-SendThread(localhost:12965), state=RUNNABLE, group=TGRP-DeleteReplicaTest]
        at sun.nio.ch.KqueueArrayWrapper.getKeventIdent(Native Method)
        at sun.nio.ch.KqueueArrayWrapper.getDescriptor(KqueueArrayWrapper.java:121)
        at sun.nio.ch.KqueueSelectorImpl.updateSelectedKeys(KqueueSelectorImpl.java:99)
        at sun.nio.ch.KqueueSelectorImpl.doSelect(KqueueSelectorImpl.java:74)
        at sun.nio.ch.SelectorImpl.lockAndDoSelect(SelectorImpl.java:87)
        at sun.nio.ch.SelectorImpl.select(SelectorImpl.java:98)
        at org.apache.zookeeper.ClientCnxnSocketNIO.doTransport(ClientCnxnSocketNIO.java:338)
        at org.apache.zookeeper.ClientCnxn$SendThread.run(ClientCnxn.java:1068)
	at __randomizedtesting.SeedInfo.seed([EA2FAB874C86BAC1]:0)




Build Log:
[...truncated 9578 lines...]
   [junit4] Suite: org.apache.solr.cloud.DeleteReplicaTest
   [junit4]   2> 531043 T1320 oas.BaseDistributedSearchTestCase.initHostContext Setting hostContext system property: /
   [junit4]   2> 531049 T1320 oas.SolrTestCaseJ4.setUp ###Starting testDistribSearch
   [junit4]   2> Creating dataDir: /usr/home/hudson/hudson-slave/workspace/Lucene-Solr-NightlyTests-4.x/solr/build/solr-core/test/J0/./solrtest-DeleteReplicaTest-1384040941163
   [junit4]   2> 531051 T1320 oasc.ZkTestServer.run STARTING ZK TEST SERVER
   [junit4]   2> 531051 T1321 oasc.ZkTestServer$ZKServerMain.runFromConfig Starting server
   [junit4]   2> 531152 T1320 oasc.ZkTestServer.run start zk server on port:12965
   [junit4]   2> 531153 T1320 oascc.ConnectionManager.waitForConnected Waiting for client to connect to ZooKeeper
   [junit4]   2> 531157 T1327 oascc.ConnectionManager.process Watcher org.apache.solr.common.cloud.ConnectionManager@6c5645b name:ZooKeeperConnection Watcher:127.0.0.1:12965 got event WatchedEvent state:SyncConnected type:None path:null path:null type:None
   [junit4]   2> 531157 T1320 oascc.ConnectionManager.waitForConnected Client is connected to ZooKeeper
   [junit4]   2> 531158 T1320 oascc.SolrZkClient.makePath makePath: /solr
   [junit4]   2> 531181 T1320 oascc.ConnectionManager.waitForConnected Waiting for client to connect to ZooKeeper
   [junit4]   2> 531184 T1329 oascc.ConnectionManager.process Watcher org.apache.solr.common.cloud.ConnectionManager@1dea3324 name:ZooKeeperConnection Watcher:127.0.0.1:12965/solr got event WatchedEvent state:SyncConnected type:None path:null path:null type:None
   [junit4]   2> 531184 T1320 oascc.ConnectionManager.waitForConnected Client is connected to ZooKeeper
   [junit4]   2> 531185 T1320 oascc.SolrZkClient.makePath makePath: /collections/collection1
   [junit4]   2> 531189 T1320 oascc.SolrZkClient.makePath makePath: /collections/collection1/shards
   [junit4]   2> 531198 T1320 oascc.SolrZkClient.makePath makePath: /collections/control_collection
   [junit4]   2> 531200 T1320 oascc.SolrZkClient.makePath makePath: /collections/control_collection/shards
   [junit4]   2> 531203 T1320 oasc.AbstractZkTestCase.putConfig put /usr/home/hudson/hudson-slave/workspace/Lucene-Solr-NightlyTests-4.x/solr/build/solr-core/test-files/solr/collection1/conf/solrconfig-tlog.xml to /configs/conf1/solrconfig.xml
   [junit4]   2> 531203 T1320 oascc.SolrZkClient.makePath makePath: /configs/conf1/solrconfig.xml
   [junit4]   2> 531209 T1320 oasc.AbstractZkTestCase.putConfig put /usr/home/hudson/hudson-slave/workspace/Lucene-Solr-NightlyTests-4.x/solr/build/solr-core/test-files/solr/collection1/conf/schema.xml to /configs/conf1/schema.xml
   [junit4]   2> 531209 T1320 oascc.SolrZkClient.makePath makePath: /configs/conf1/schema.xml
   [junit4]   2> 531225 T1320 oasc.AbstractZkTestCase.putConfig put /usr/home/hudson/hudson-slave/workspace/Lucene-Solr-NightlyTests-4.x/solr/build/solr-core/test-files/solr/collection1/conf/solrconfig.snippet.randomindexconfig.xml to /configs/conf1/solrconfig.snippet.randomindexconfig.xml
   [junit4]   2> 531225 T1320 oascc.SolrZkClient.makePath makePath: /configs/conf1/solrconfig.snippet.randomindexconfig.xml
   [junit4]   2> 531228 T1320 oasc.AbstractZkTestCase.putConfig put /usr/home/hudson/hudson-slave/workspace/Lucene-Solr-NightlyTests-4.x/solr/build/solr-core/test-files/solr/collection1/conf/stopwords.txt to /configs/conf1/stopwords.txt
   [junit4]   2> 531229 T1320 oascc.SolrZkClient.makePath makePath: /configs/conf1/stopwords.txt
   [junit4]   2> 531232 T1320 oasc.AbstractZkTestCase.putConfig put /usr/home/hudson/hudson-slave/workspace/Lucene-Solr-NightlyTests-4.x/solr/build/solr-core/test-files/solr/collection1/conf/protwords.txt to /configs/conf1/protwords.txt
   [junit4]   2> 531232 T1320 oascc.SolrZkClient.makePath makePath: /configs/conf1/protwords.txt
   [junit4]   2> 531240 T1320 oasc.AbstractZkTestCase.putConfig put /usr/home/hudson/hudson-slave/workspace/Lucene-Solr-NightlyTests-4.x/solr/build/solr-core/test-files/solr/collection1/conf/currency.xml to /configs/conf1/currency.xml
   [junit4]   2> 531241 T1320 oascc.SolrZkClient.makePath makePath: /configs/conf1/currency.xml
   [junit4]   2> 531243 T1320 oasc.AbstractZkTestCase.putConfig put /usr/home/hudson/hudson-slave/workspace/Lucene-Solr-NightlyTests-4.x/solr/build/solr-core/test-files/solr/collection1/conf/enumsConfig.xml to /configs/conf1/enumsConfig.xml
   [junit4]   2> 531244 T1320 oascc.SolrZkClient.makePath makePath: /configs/conf1/enumsConfig.xml
   [junit4]   2> 531247 T1320 oasc.AbstractZkTestCase.putConfig put /usr/home/hudson/hudson-slave/workspace/Lucene-Solr-NightlyTests-4.x/solr/build/solr-core/test-files/solr/collection1/conf/open-exchange-rates.json to /configs/conf1/open-exchange-rates.json
   [junit4]   2> 531247 T1320 oascc.SolrZkClient.makePath makePath: /configs/conf1/open-exchange-rates.json
   [junit4]   2> 531255 T1320 oasc.AbstractZkTestCase.putConfig put /usr/home/hudson/hudson-slave/workspace/Lucene-Solr-NightlyTests-4.x/solr/build/solr-core/test-files/solr/collection1/conf/mapping-ISOLatin1Accent.txt to /configs/conf1/mapping-ISOLatin1Accent.txt
   [junit4]   2> 531255 T1320 oascc.SolrZkClient.makePath makePath: /configs/conf1/mapping-ISOLatin1Accent.txt
   [junit4]   2> 531258 T1320 oasc.AbstractZkTestCase.putConfig put /usr/home/hudson/hudson-slave/workspace/Lucene-Solr-NightlyTests-4.x/solr/build/solr-core/test-files/solr/collection1/conf/old_synonyms.txt to /configs/conf1/old_synonyms.txt
   [junit4]   2> 531259 T1320 oascc.SolrZkClient.makePath makePath: /configs/conf1/old_synonyms.txt
   [junit4]   2> 531262 T1320 oasc.AbstractZkTestCase.putConfig put /usr/home/hudson/hudson-slave/workspace/Lucene-Solr-NightlyTests-4.x/solr/build/solr-core/test-files/solr/collection1/conf/synonyms.txt to /configs/conf1/synonyms.txt
   [junit4]   2> 531262 T1320 oascc.SolrZkClient.makePath makePath: /configs/conf1/synonyms.txt
   [junit4]   2> 531542 T1320 oejs.Server.doStart jetty-8.1.10.v20130312
   [junit4]   2> 531551 T1320 oejs.AbstractConnector.doStart Started SocketConnector@127.0.0.1:12968
   [junit4]   2> 531552 T1320 oass.SolrDispatchFilter.init SolrDispatchFilter.init()
   [junit4]   2> 531553 T1320 oasc.SolrResourceLoader.locateSolrHome JNDI not configured for solr (NoInitialContextEx)
   [junit4]   2> 531553 T1320 oasc.SolrResourceLoader.locateSolrHome using system property solr.solr.home: ../../../../../../../../../../../usr/home/hudson/hudson-slave/workspace/Lucene-Solr-NightlyTests-4.x/solr/build/solr-core/test/J0/./org.apache.solr.cloud.DeleteReplicaTest-controljetty-1384040941379
   [junit4]   2> 531554 T1320 oasc.SolrResourceLoader.<init> new SolrResourceLoader for directory: '../../../../../../../../../../../usr/home/hudson/hudson-slave/workspace/Lucene-Solr-NightlyTests-4.x/solr/build/solr-core/test/J0/./org.apache.solr.cloud.DeleteReplicaTest-controljetty-1384040941379/'
   [junit4]   2> 531591 T1320 oasc.ConfigSolr.fromFile Loading container configuration from /usr/home/hudson/hudson-slave/workspace/Lucene-Solr-NightlyTests-4.x/solr/build/solr-core/test/J0/../../../../../../../../../../../usr/home/hudson/hudson-slave/workspace/Lucene-Solr-NightlyTests-4.x/solr/build/solr-core/test/J0/./org.apache.solr.cloud.DeleteReplicaTest-controljetty-1384040941379/solr.xml
   [junit4]   2> 531663 T1320 oasc.ConfigSolrXml.<init> Config-defined core root directory: 
   [junit4]   2> 531664 T1320 oasc.CoreContainer.<init> New CoreContainer 366235137
   [junit4]   2> 531665 T1320 oasc.CoreContainer.load Loading cores into CoreContainer [instanceDir=../../../../../../../../../../../usr/home/hudson/hudson-slave/workspace/Lucene-Solr-NightlyTests-4.x/solr/build/solr-core/test/J0/./org.apache.solr.cloud.DeleteReplicaTest-controljetty-1384040941379/]
   [junit4]   2> 531667 T1320 oashc.HttpShardHandlerFactory.getParameter Setting socketTimeout to: 90000
   [junit4]   2> 531667 T1320 oashc.HttpShardHandlerFactory.getParameter Setting urlScheme to: http://
   [junit4]   2> 531667 T1320 oashc.HttpShardHandlerFactory.getParameter Setting connTimeout to: 15000
   [junit4]   2> 531668 T1320 oashc.HttpShardHandlerFactory.getParameter Setting maxConnectionsPerHost to: 20
   [junit4]   2> 531668 T1320 oashc.HttpShardHandlerFactory.getParameter Setting corePoolSize to: 0
   [junit4]   2> 531669 T1320 oashc.HttpShardHandlerFactory.getParameter Setting maximumPoolSize to: 2147483647
   [junit4]   2> 531669 T1320 oashc.HttpShardHandlerFactory.getParameter Setting maxThreadIdleTime to: 5
   [junit4]   2> 531670 T1320 oashc.HttpShardHandlerFactory.getParameter Setting sizeOfQueue to: -1
   [junit4]   2> 531670 T1320 oashc.HttpShardHandlerFactory.getParameter Setting fairnessPolicy to: false
   [junit4]   2> 531677 T1320 oasl.LogWatcher.createWatcher SLF4J impl is org.slf4j.impl.Log4jLoggerFactory
   [junit4]   2> 531677 T1320 oasl.LogWatcher.newRegisteredLogWatcher Registering Log Listener [Log4j (org.slf4j.impl.Log4jLoggerFactory)]
   [junit4]   2> 531678 T1320 oasc.ZkContainer.initZooKeeper Zookeeper client=127.0.0.1:12965/solr
   [junit4]   2> 531678 T1320 oasc.ZkController.checkChrootPath zkHost includes chroot
   [junit4]   2> 531679 T1320 oascc.ConnectionManager.waitForConnected Waiting for client to connect to ZooKeeper
   [junit4]   2> 531682 T1340 oascc.ConnectionManager.process Watcher org.apache.solr.common.cloud.ConnectionManager@254d2ed9 name:ZooKeeperConnection Watcher:127.0.0.1:12965 got event WatchedEvent state:SyncConnected type:None path:null path:null type:None
   [junit4]   2> 531683 T1320 oascc.ConnectionManager.waitForConnected Client is connected to ZooKeeper
   [junit4]   2> 531696 T1320 oascc.ConnectionManager.waitForConnected Waiting for client to connect to ZooKeeper
   [junit4]   2> 531698 T1342 oascc.ConnectionManager.process Watcher org.apache.solr.common.cloud.ConnectionManager@1e0d213c name:ZooKeeperConnection Watcher:127.0.0.1:12965/solr got event WatchedEvent state:SyncConnected type:None path:null path:null type:None
   [junit4]   2> 531698 T1320 oascc.ConnectionManager.waitForConnected Client is connected to ZooKeeper
   [junit4]   2> 531705 T1320 oascc.SolrZkClient.makePath makePath: /overseer/queue
   [junit4]   2> 531709 T1320 oascc.SolrZkClient.makePath makePath: /overseer/collection-queue-work
   [junit4]   2> 531719 T1320 oascc.SolrZkClient.makePath makePath: /live_nodes
   [junit4]   2> 531721 T1320 oasc.ZkController.createEphemeralLiveNode Register node as live in ZooKeeper:/live_nodes/127.0.0.1:12968_
   [junit4]   2> 531722 T1320 oascc.SolrZkClient.makePath makePath: /live_nodes/127.0.0.1:12968_
   [junit4]   2> 531725 T1320 oascc.SolrZkClient.makePath makePath: /overseer_elect/election
   [junit4]   2> 531743 T1320 oascc.SolrZkClient.makePath makePath: /overseer_elect/leader
   [junit4]   2> 531746 T1320 oasc.Overseer.start Overseer (id=90704507120517123-127.0.0.1:12968_-n_0000000000) starting
   [junit4]   2> 531756 T1320 oascc.SolrZkClient.makePath makePath: /overseer/queue-work
   [junit4]   2> 531768 T1343 oasc.Overseer$ClusterStateUpdater.run Starting to work on the main queue
   [junit4]   2> 531789 T1344 oasc.OverseerCollectionProcessor.run Process current queue of collection creations
   [junit4]   2> 531789 T1320 oascc.SolrZkClient.makePath makePath: /clusterstate.json
   [junit4]   2> 531792 T1320 oascc.SolrZkClient.makePath makePath: /aliases.json
   [junit4]   2> 531794 T1320 oascc.ZkStateReader.createClusterStateWatchersAndUpdate Updating cluster state from ZooKeeper... 
   [junit4]   2> 531799 T1320 oasc.CorePropertiesLocator.discover Looking for core definitions underneath /usr/home/hudson/hudson-slave/workspace/Lucene-Solr-NightlyTests-4.x/solr/build/solr-core/test/J0/../../../../../../../../../../../usr/home/hudson/hudson-slave/workspace/Lucene-Solr-NightlyTests-4.x/solr/build/solr-core/test/J0/./org.apache.solr.cloud.DeleteReplicaTest-controljetty-1384040941379
   [junit4]   2> 531804 T1320 oasc.CorePropertiesLocator.discoverUnder Found core conf in /usr/home/hudson/hudson-slave/workspace/Lucene-Solr-NightlyTests-4.x/solr/build/solr-core/test/J0/../../../../../../../../../../../usr/home/hudson/hudson-slave/workspace/Lucene-Solr-NightlyTests-4.x/solr/build/solr-core/test/J0/./org.apache.solr.cloud.DeleteReplicaTest-controljetty-1384040941379/conf/
   [junit4]   2> 532066 T1320 oasc.CorePropertiesLocator.discover Found 1 core definitions
   [junit4]   2> 532067 T1320 oass.SolrDispatchFilter.init user.dir=/usr/home/hudson/hudson-slave/workspace/Lucene-Solr-NightlyTests-4.x/solr/build/solr-core/test/J0
   [junit4]   2> 532067 T1320 oass.SolrDispatchFilter.init SolrDispatchFilter.init() done
   [junit4]   2> 532075 T1320 oascc.ConnectionManager.waitForConnected Waiting for client to connect to ZooKeeper
   [junit4]   2> 532078 T1347 oascc.ConnectionManager.process Watcher org.apache.solr.common.cloud.ConnectionManager@6c133d8b name:ZooKeeperConnection Watcher:127.0.0.1:12965/solr got event WatchedEvent state:SyncConnected type:None path:null path:null type:None
   [junit4]   2> 532078 T1320 oascc.ConnectionManager.waitForConnected Client is connected to ZooKeeper
   [junit4]   2> 532080 T1320 oascc.ZkStateReader.createClusterStateWatchersAndUpdate Updating cluster state from ZooKeeper... 
   [junit4]   2> 532082 T1320 oasc.ChaosMonkey.monkeyLog monkey: init - expire sessions:false cause connection loss:false
   [junit4]   2> 532364 T1320 oejs.Server.doStart jetty-8.1.10.v20130312
   [junit4]   2> 532367 T1320 oejs.AbstractConnector.doStart Started SocketConnector@127.0.0.1:12972
   [junit4]   2> 532368 T1320 oass.SolrDispatchFilter.init SolrDispatchFilter.init()
   [junit4]   2> 532368 T1320 oasc.SolrResourceLoader.locateSolrHome JNDI not configured for solr (NoInitialContextEx)
   [junit4]   2> 532369 T1320 oasc.SolrResourceLoader.locateSolrHome using system property solr.solr.home: ../../../../../../../../../../../usr/home/hudson/hudson-slave/workspace/Lucene-Solr-NightlyTests-4.x/solr/build/solr-core/test/J0/./org.apache.solr.cloud.DeleteReplicaTest-jetty1-1384040942195
   [junit4]   2> 532369 T1320 oasc.SolrResourceLoader.<init> new SolrResourceLoader for directory: '../../../../../../../../../../../usr/home/hudson/hudson-slave/workspace/Lucene-Solr-NightlyTests-4.x/solr/build/solr-core/test/J0/./org.apache.solr.cloud.DeleteReplicaTest-jetty1-1384040942195/'
   [junit4]   2> 532408 T1320 oasc.ConfigSolr.fromFile Loading container configuration from /usr/home/hudson/hudson-slave/workspace/Lucene-Solr-NightlyTests-4.x/solr/build/solr-core/test/J0/../../../../../../../../../../../usr/home/hudson/hudson-slave/workspace/Lucene-Solr-NightlyTests-4.x/solr/build/solr-core/test/J0/./org.apache.solr.cloud.DeleteReplicaTest-jetty1-1384040942195/solr.xml
   [junit4]   2> 532485 T1320 oasc.ConfigSolrXml.<init> Config-defined core root directory: 
   [junit4]   2> 532486 T1320 oasc.CoreContainer.<init> New CoreContainer 138657759
   [junit4]   2> 532487 T1320 oasc.CoreContainer.load Loading cores into CoreContainer [instanceDir=../../../../../../../../../../../usr/home/hudson/hudson-slave/workspace/Lucene-Solr-NightlyTests-4.x/solr/build/solr-core/test/J0/./org.apache.solr.cloud.DeleteReplicaTest-jetty1-1384040942195/]
   [junit4]   2> 532489 T1320 oashc.HttpShardHandlerFactory.getParameter Setting socketTimeout to: 90000
   [junit4]   2> 532490 T1320 oashc.HttpShardHandlerFactory.getParameter Setting urlScheme to: http://
   [junit4]   2> 532490 T1320 oashc.HttpShardHandlerFactory.getParameter Setting connTimeout to: 15000
   [junit4]   2> 532490 T1320 oashc.HttpShardHandlerFactory.getParameter Setting maxConnectionsPerHost to: 20
   [junit4]   2> 532491 T1320 oashc.HttpShardHandlerFactory.getParameter Setting corePoolSize to: 0
   [junit4]   2> 532491 T1320 oashc.HttpShardHandlerFactory.getParameter Setting maximumPoolSize to: 2147483647
   [junit4]   2> 532492 T1320 oashc.HttpShardHandlerFactory.getParameter Setting maxThreadIdleTime to: 5
   [junit4]   2> 532492 T1320 oashc.HttpShardHandlerFactory.getParameter Setting sizeOfQueue to: -1
   [junit4]   2> 532493 T1320 oashc.HttpShardHandlerFactory.getParameter Setting fairnessPolicy to: false
   [junit4]   2> 532500 T1320 oasl.LogWatcher.createWatcher SLF4J impl is org.slf4j.impl.Log4jLoggerFactory
   [junit4]   2> 532500 T1320 oasl.LogWatcher.newRegisteredLogWatcher Registering Log Listener [Log4j (org.slf4j.impl.Log4jLoggerFactory)]
   [junit4]   2> 532501 T1320 oasc.ZkContainer.initZooKeeper Zookeeper client=127.0.0.1:12965/solr
   [junit4]   2> 532501 T1320 oasc.ZkController.checkChrootPath zkHost includes chroot
   [junit4]   2> 532502 T1320 oascc.ConnectionManager.waitForConnected Waiting for client to connect to ZooKeeper
   [junit4]   2> 532505 T1358 oascc.ConnectionManager.process Watcher org.apache.solr.common.cloud.ConnectionManager@17e9cdb6 name:ZooKeeperConnection Watcher:127.0.0.1:12965 got event WatchedEvent state:SyncConnected type:None path:null path:null type:None
   [junit4]   2> 532506 T1320 oascc.ConnectionManager.waitForConnected Client is connected to ZooKeeper
   [junit4]   2> 532530 T1320 oascc.ConnectionManager.waitForConnected Waiting for client to connect to ZooKeeper
   [junit4]   2> 532533 T1360 oascc.ConnectionManager.process Watcher org.apache.solr.common.cloud.ConnectionManager@2f504d39 name:ZooKeeperConnection Watcher:127.0.0.1:12965/solr got event WatchedEvent state:SyncConnected type:None path:null path:null type:None
   [junit4]   2> 532533 T1320 oascc.ConnectionManager.waitForConnected Client is connected to ZooKeeper
   [junit4]   2> 532544 T1320 oascc.ZkStateReader.createClusterStateWatchersAndUpdate Updating cluster state from ZooKeeper... 
   [junit4]   2> 533548 T1320 oasc.ZkController.createEphemeralLiveNode Register node as live in ZooKeeper:/live_nodes/127.0.0.1:12972_
   [junit4]   2> 533558 T1320 oascc.SolrZkClient.makePath makePath: /live_nodes/127.0.0.1:12972_
   [junit4]   2> 533562 T1342 oascc.ZkStateReader$3.process Updating live nodes... (2)
   [junit4]   2> 533562 T1360 oascc.ZkStateReader$3.process Updating live nodes... (2)
   [junit4]   2> 533562 T1347 oascc.ZkStateReader$3.process Updating live nodes... (2)
   [junit4]   2> 533579 T1320 oasc.CorePropertiesLocator.discover Looking for core definitions underneath /usr/home/hudson/hudson-slave/workspace/Lucene-Solr-NightlyTests-4.x/solr/build/solr-core/test/J0/../../../../../../../../../../../usr/home/hudson/hudson-slave/workspace/Lucene-Solr-NightlyTests-4.x/solr/build/solr-core/test/J0/./org.apache.solr.cloud.DeleteReplicaTest-jetty1-1384040942195
   [junit4]   2> 533582 T1320 oasc.CorePropertiesLocator.discoverUnder Found core conf in /usr/home/hudson/hudson-slave/workspace/Lucene-Solr-NightlyTests-4.x/solr/build/solr-core/test/J0/../../../../../../../../../../../usr/home/hudson/hudson-slave/workspace/Lucene-Solr-NightlyTests-4.x/solr/build/solr-core/test/J0/./org.apache.solr.cloud.DeleteReplicaTest-jetty1-1384040942195/conf/
   [junit4]   2> 533851 T1320 oasc.CorePropertiesLocator.discover Found 1 core definitions
   [junit4]   2> 533852 T1320 oass.SolrDispatchFilter.init user.dir=/usr/home/hudson/hudson-slave/workspace/Lucene-Solr-NightlyTests-4.x/solr/build/solr-core/test/J0
   [junit4]   2> 533852 T1320 oass.SolrDispatchFilter.init SolrDispatchFilter.init() done
   [junit4]   2> 534137 T1320 oejs.Server.doStart jetty-8.1.10.v20130312
   [junit4]   2> 534140 T1320 oejs.AbstractConnector.doStart Started SocketConnector@127.0.0.1:12975
   [junit4]   2> 534141 T1320 oass.SolrDispatchFilter.init SolrDispatchFilter.init()
   [junit4]   2> 534141 T1320 oasc.SolrResourceLoader.locateSolrHome JNDI not configured for solr (NoInitialContextEx)
   [junit4]   2> 534142 T1320 oasc.SolrResourceLoader.locateSolrHome using system property solr.solr.home: ./org.apache.solr.cloud.DeleteReplicaTest-jetty2-1384040943972
   [junit4]   2> 534142 T1320 oasc.SolrResourceLoader.<init> new SolrResourceLoader for directory: './org.apache.solr.cloud.DeleteReplicaTest-jetty2-1384040943972/'
   [junit4]   2> 534180 T1320 oasc.ConfigSolr.fromFile Loading container configuration from /usr/home/hudson/hudson-slave/workspace/Lucene-Solr-NightlyTests-4.x/solr/build/solr-core/test/J0/./org.apache.solr.cloud.DeleteReplicaTest-jetty2-1384040943972/solr.xml
   [junit4]   2> 534238 T1320 oasc.ConfigSolrXml.<init> Config-defined core root directory: 
   [junit4]   2> 534238 T1320 oasc.CoreContainer.<init> New CoreContainer 568291827
   [junit4]   2> 534239 T1320 oasc.CoreContainer.load Loading cores into CoreContainer [instanceDir=./org.apache.solr.cloud.DeleteReplicaTest-jetty2-1384040943972/]
   [junit4]   2> 534240 T1320 oashc.HttpShardHandlerFactory.getParameter Setting socketTimeout to: 90000
   [junit4]   2> 534240 T1320 oashc.HttpShardHandlerFactory.getParameter Setting urlScheme to: http://
   [junit4]   2> 534241 T1320 oashc.HttpShardHandlerFactory.getParameter Setting connTimeout to: 15000
   [junit4]   2> 534241 T1320 oashc.HttpShardHandlerFactory.getParameter Setting maxConnectionsPerHost to: 20
   [junit4]   2> 534241 T1320 oashc.HttpShardHandlerFactory.getParameter Setting corePoolSize to: 0
   [junit4]   2> 534241 T1320 oashc.HttpShardHandlerFactory.getParameter Setting maximumPoolSize to: 2147483647
   [junit4]   2> 534242 T1320 oashc.HttpShardHandlerFactory.getParameter Setting maxThreadIdleTime to: 5
   [junit4]   2> 534242 T1320 oashc.HttpShardHandlerFactory.getParameter Setting sizeOfQueue to: -1
   [junit4]   2> 534242 T1320 oashc.HttpShardHandlerFactory.getParameter Setting fairnessPolicy to: false
   [junit4]   2> 534247 T1320 oasl.LogWatcher.createWatcher SLF4J impl is org.slf4j.impl.Log4jLoggerFactory
   [junit4]   2> 534247 T1320 oasl.LogWatcher.newRegisteredLogWatcher Registering Log Listener [Log4j (org.slf4j.impl.Log4jLoggerFactory)]
   [junit4]   2> 534247 T1320 oasc.ZkContainer.initZooKeeper Zookeeper client=127.0.0.1:12965/solr
   [junit4]   2> 534248 T1320 oasc.ZkController.checkChrootPath zkHost includes chroot
   [junit4]   2> 534249 T1320 oascc.ConnectionManager.waitForConnected Waiting for client to connect to ZooKeeper
   [junit4]   2> 534251 T1372 oascc.ConnectionManager.process Watcher org.apache.solr.common.cloud.ConnectionManager@54b219e4 name:ZooKeeperConnection Watcher:127.0.0.1:12965 got event WatchedEvent state:SyncConnected type:None path:null path:null type:None
   [junit4]   2> 534251 T1320 oascc.ConnectionManager.waitForConnected Client is connected to ZooKeeper
   [junit4]   2> 534255 T1320 oascc.ConnectionManager.waitForConnected Waiting for client to connect to ZooKeeper
   [junit4]   2> 534265 T1374 oascc.ConnectionManager.process Watcher org.apache.solr.common.cloud.ConnectionManager@50fc1387 name:ZooKeeperConnection Watcher:127.0.0.1:12965/solr got event WatchedEvent state:SyncConnected type:None path:null path:null type:None
   [junit4]   2> 534265 T1320 oascc.ConnectionManager.waitForConnected Client is connected to ZooKeeper
   [junit4]   2> 534275 T1320 oascc.ZkStateReader.createClusterStateWatchersAndUpdate Updating cluster state from ZooKeeper... 
   [junit4]   2> 535278 T1320 oasc.ZkController.createEphemeralLiveNode Register node as live in ZooKeeper:/live_nodes/127.0.0.1:12975_
   [junit4]   2> 535280 T1320 oascc.SolrZkClient.makePath makePath: /live_nodes/127.0.0.1:12975_
   [junit4]   2> 535292 T1342 oascc.ZkStateReader$3.process Updating live nodes... (3)
   [junit4]   2> 535293 T1347 oascc.ZkStateReader$3.process Updating live nodes... (3)
   [junit4]   2> 535293 T1374 oascc.ZkStateReader$3.process Updating live nodes... (3)
   [junit4]   2> 535293 T1360 oascc.ZkStateReader$3.process Updating live nodes... (3)
   [junit4]   2> 535301 T1320 oasc.CorePropertiesLocator.discover Looking for core definitions underneath /usr/home/hudson/hudson-slave/workspace/Lucene-Solr-NightlyTests-4.x/solr/build/solr-core/test/J0/./org.apache.solr.cloud.DeleteReplicaTest-jetty2-1384040943972
   [junit4]   2> 535468 T1320 oasc.CorePropertiesLocator.discoverUnder Found core conf in /usr/home/hudson/hudson-slave/workspace/Lucene-Solr-NightlyTests-4.x/solr/build/solr-core/test/J0/./org.apache.solr.cloud.DeleteReplicaTest-jetty2-1384040943972/conf/
   [junit4]   2> 535469 T1320 oasc.CorePropertiesLocator.discover Found 1 core definitions
   [junit4]   2> 535470 T1320 oass.SolrDispatchFilter.init user.dir=/usr/home/hudson/hudson-slave/workspace/Lucene-Solr-NightlyTests-4.x/solr/build/solr-core/test/J0
   [junit4]   2> 535470 T1320 oass.SolrDispatchFilter.init SolrDispatchFilter.init() done
   [junit4]   2> 535753 T1320 oejs.Server.doStart jetty-8.1.10.v20130312
   [junit4]   2> 535756 T1320 oejs.AbstractConnector.doStart Started SocketConnector@127.0.0.1:12980
   [junit4]   2> 535757 T1320 oass.SolrDispatchFilter.init SolrDispatchFilter.init()
   [junit4]   2> 535757 T1320 oasc.SolrResourceLoader.locateSolrHome JNDI not configured for solr (NoInitialContextEx)
   [junit4]   2> 535758 T1320 oasc.SolrResourceLoader.locateSolrHome using system property solr.solr.home: ./org.apache.solr.cloud.DeleteReplicaTest-jetty3-1384040945590
   [junit4]   2> 535758 T1320 oasc.SolrResourceLoader.<init> new SolrResourceLoader for directory: './org.apache.solr.cloud.DeleteReplicaTest-jetty3-1384040945590/'
   [junit4]   2> 535796 T1320 oasc.ConfigSolr.fromFile Loading container configuration from /usr/home/hudson/hudson-slave/workspace/Lucene-Solr-NightlyTests-4.x/solr/build/solr-core/test/J0/./org.apache.solr.cloud.DeleteReplicaTest-jetty3-1384040945590/solr.xml
   [junit4]   2> 535867 T1320 oasc.ConfigSolrXml.<init> Config-defined core root directory: 
   [junit4]   2> 535868 T1320 oasc.CoreContainer.<init> New CoreContainer 222096135
   [junit4]   2> 535869 T1320 oasc.CoreContainer.load Loading cores into CoreContainer [instanceDir=./org.apache.solr.cloud.DeleteReplicaTest-jetty3-1384040945590/]
   [junit4]   2> 535871 T1320 oashc.HttpShardHandlerFactory.getParameter Setting socketTimeout to: 90000
   [junit4]   2> 535871 T1320 oashc.HttpShardHandlerFactory.getParameter Setting urlScheme to: http://
   [junit4]   2> 535871 T1320 oashc.HttpShardHandlerFactory.getParameter Setting connTimeout to: 15000
   [junit4]   2> 535872 T1320 oashc.HttpShardHandlerFactory.getParameter Setting maxConnectionsPerHost to: 20
   [junit4]   2> 535872 T1320 oashc.HttpShardHandlerFactory.getParameter Setting corePoolSize to: 0
   [junit4]   2> 535873 T1320 oashc.HttpShardHandlerFactory.getParameter Setting maximumPoolSize to: 2147483647
   [junit4]   2> 535873 T1320 oashc.HttpShardHandlerFactory.getParameter Setting maxThreadIdleTime to: 5
   [junit4]   2> 535874 T1320 oashc.HttpShardHandlerFactory.getParameter Setting sizeOfQueue to: -1
   [junit4]   2> 535874 T1320 oashc.HttpShardHandlerFactory.getParameter Setting fairnessPolicy to: false
   [junit4]   2> 535881 T1320 oasl.LogWatcher.createWatcher SLF4J impl is org.slf4j.impl.Log4jLoggerFactory
   [junit4]   2> 535882 T1320 oasl.LogWatcher.newRegisteredLogWatcher Registering Log Listener [Log4j (org.slf4j.impl.Log4jLoggerFactory)]
   [junit4]   2> 535882 T1320 oasc.ZkContainer.initZooKeeper Zookeeper client=127.0.0.1:12965/solr
   [junit4]   2> 535883 T1320 oasc.ZkController.checkChrootPath zkHost includes chroot
   [junit4]   2> 535884 T1320 oascc.ConnectionManager.waitForConnected Waiting for client to connect to ZooKeeper
   [junit4]   2> 535911 T1386 oascc.ConnectionManager.process Watcher org.apache.solr.common.cloud.ConnectionManager@1a6a1f5b name:ZooKeeperConnection Watcher:127.0.0.1:12965 got event WatchedEvent state:SyncConnected type:None path:null path:null type:None
   [junit4]   2> 535912 T1320 oascc.ConnectionManager.waitForConnected Client is connected to ZooKeeper
   [junit4]   2> 535916 T1320 oascc.ConnectionManager.waitForConnected Waiting for client to connect to ZooKeeper
   [junit4]   2> 535931 T1388 oascc.ConnectionManager.process Watcher org.apache.solr.common.cloud.ConnectionManager@103fa2aa name:ZooKeeperConnection Watcher:127.0.0.1:12965/solr got event WatchedEvent state:SyncConnected type:None path:null path:null type:None
   [junit4]   2> 535931 T1320 oascc.ConnectionManager.waitForConnected Client is connected to ZooKeeper
   [junit4]   2> 535936 T1320 oascc.ZkStateReader.createClusterStateWatchersAndUpdate Updating cluster state from ZooKeeper... 
   [junit4]   2> 536940 T1320 oasc.ZkController.createEphemeralLiveNode Register node as live in ZooKeeper:/live_nodes/127.0.0.1:12980_
   [junit4]   2> 536942 T1320 oascc.SolrZkClient.makePath makePath: /live_nodes/127.0.0.1:12980_
   [junit4]   2> 536946 T1342 oascc.ZkStateReader$3.process Updating live nodes... (4)
   [junit4]   2> 536946 T1360 oascc.ZkStateReader$3.process Updating live nodes... (4)
   [junit4]   2> 536946 T1388 oascc.ZkStateReader$3.process Updating live nodes... (4)
   [junit4]   2> 536946 T1347 oascc.ZkStateReader$3.process Updating live nodes... (4)
   [junit4]   2> 536946 T1374 oascc.ZkStateReader$3.process Updating live nodes... (4)
   [junit4]   2> 536958 T1320 oasc.CorePropertiesLocator.discover Looking for core definitions underneath /usr/home/hudson/hudson-slave/workspace/Lucene-Solr-NightlyTests-4.x/solr/build/solr-core/test/J0/./org.apache.solr.cloud.DeleteReplicaTest-jetty3-1384040945590
   [junit4]   2> 537148 T1320 oasc.CorePropertiesLocator.discoverUnder Found core conf in /usr/home/hudson/hudson-slave/workspace/Lucene-Solr-NightlyTests-4.x/solr/build/solr-core/test/J0/./org.apache.solr.cloud.DeleteReplicaTest-jetty3-1384040945590/conf/
   [junit4]   2> 537152 T1320 oasc.CorePropertiesLocator.discover Found 1 core definitions
   [junit4]   2> 537153 T1320 oass.SolrDispatchFilter.init user.dir=/usr/home/hudson/hudson-slave/workspace/Lucene-Solr-NightlyTests-4.x/solr/build/solr-core/test/J0
   [junit4]   2> 537153 T1320 oass.SolrDispatchFilter.init SolrDispatchFilter.init() done
   [junit4]   2> 537435 T1320 oejs.Server.doStart jetty-8.1.10.v20130312
   [junit4]   2> 537438 T1320 oejs.AbstractConnector.doStart Started SocketConnector@127.0.0.1:12984
   [junit4]   2> 537439 T1320 oass.SolrDispatchFilter.init SolrDispatchFilter.init()
   [junit4]   2> 537440 T1320 oasc.SolrResourceLoader.locateSolrHome JNDI not configured for solr (NoInitialContextEx)
   [junit4]   2> 537440 T1320 oasc.SolrResourceLoader.locateSolrHome using system property solr.solr.home: ../../../../../../../../../../../usr/home/hudson/hudson-slave/workspace/Lucene-Solr-NightlyTests-4.x/solr/build/solr-core/test/J0/./org.apache.solr.cloud.DeleteReplicaTest-jetty4-1384040947273
   [junit4]   2> 537440 T1320 oasc.SolrResourceLoader.<init> new SolrResourceLoader for directory: '../../../../../../../../../../../usr/home/hudson/hudson-slave/workspace/Lucene-Solr-NightlyTests-4.x/solr/build/solr-core/test/J0/./org.apache.solr.cloud.DeleteReplicaTest-jetty4-1384040947273/'
   [junit4]   2> 537479 T1320 oasc.ConfigSolr.fromFile Loading container configuration from /usr/home/hudson/hudson-slave/workspace/Lucene-Solr-NightlyTests-4.x/solr/build/solr-core/test/J0/../../../../../../../../../../../usr/home/hudson/hudson-slave/workspace/Lucene-Solr-NightlyTests-4.x/solr/build/solr-core/test/J0/./org.apache.solr.cloud.DeleteReplicaTest-jetty4-1384040947273/solr.xml
   [junit4]   2> 537551 T1320 oasc.ConfigSolrXml.<init> Config-defined core root directory: 
   [junit4]   2> 537552 T1320 oasc.CoreContainer.<init> New CoreContainer 1409998612
   [junit4]   2> 537553 T1320 oasc.CoreContainer.load Loading cores into CoreContainer [instanceDir=../../../../../../../../../../../usr/home/hudson/hudson-slave/workspace/Lucene-Solr-NightlyTests-4.x/solr/build/solr-core/test/J0/./org.apache.solr.cloud.DeleteReplicaTest-jetty4-1384040947273/]
   [junit4]   2> 537554 T1320 oashc.HttpShardHandlerFactory.getParameter Setting socketTimeout to: 90000
   [junit4]   2> 537555 T1320 oashc.HttpShardHandlerFactory.getParameter Setting urlScheme to: http://
   [junit4]   2> 537555 T1320 oashc.HttpShardHandlerFactory.getParameter Setting connTimeout to: 15000
   [junit4]   2> 537556 T1320 oashc.HttpShardHandlerFactory.getParameter Setting maxConnectionsPerHost to: 20
   [junit4]   2> 537556 T1320 oashc.HttpShardHandlerFactory.getParameter Setting corePoolSize to: 0
   [junit4]   2> 537557 T1320 oashc.HttpShardHandlerFactory.getParameter Setting maximumPoolSize to: 2147483647
   [junit4]   2> 537557 T1320 oashc.HttpShardHandlerFactory.getParameter Setting maxThreadIdleTime to: 5
   [junit4]   2> 537558 T1320 oashc.HttpShardHandlerFactory.getParameter Setting sizeOfQueue to: -1
   [junit4]   2> 537558 T1320 oashc.HttpShardHandlerFactory.getParameter Setting fairnessPolicy to: false
   [junit4]   2> 537565 T1320 oasl.LogWatcher.createWatcher SLF4J impl is org.slf4j.impl.Log4jLoggerFactory
   [junit4]   2> 537565 T1320 oasl.LogWatcher.newRegisteredLogWatcher Registering Log Listener [Log4j (org.slf4j.impl.Log4jLoggerFactory)]
   [junit4]   2> 537566 T1320 oasc.ZkContainer.initZooKeeper Zookeeper client=127.0.0.1:12965/solr
   [junit4]   2> 537566 T1320 oasc.ZkController.checkChrootPath zkHost includes chroot
   [junit4]   2> 537567 T1320 oascc.ConnectionManager.waitForConnected Waiting for client to connect to ZooKeeper
   [junit4]   2> 537570 T1400 oascc.ConnectionManager.process Watcher org.apache.solr.common.cloud.ConnectionManager@15bbc527 name:ZooKeeperConnection Watcher:127.0.0.1:12965 got event WatchedEvent state:SyncConnected type:None path:null path:null type:None
   [junit4]   2> 537571 T1320 oascc.ConnectionManager.waitForConnected Client is connected to ZooKeeper
   [junit4]   2> 537575 T1320 oascc.ConnectionManager.waitForConnected Waiting for client to connect to ZooKeeper
   [junit4]   2> 537582 T1402 oascc.ConnectionManager.process Watcher org.apache.solr.common.cloud.ConnectionManager@1aa0c35b name:ZooKeeperConnection Watcher:127.0.0.1:12965/solr got event WatchedEvent state:SyncConnected type:None path:null path:null type:None
   [junit4]   2> 537582 T1320 oascc.ConnectionManager.waitForConnected Client is connected to ZooKeeper
   [junit4]   2> 537587 T1320 oascc.ZkStateReader.createClusterStateWatchersAndUpdate Updating cluster state from ZooKeeper... 
   [junit4]   2> 538590 T1320 oasc.ZkController.createEphemeralLiveNode Register node as live in ZooKeeper:/live_nodes/127.0.0.1:12984_
   [junit4]   2> 538619 T1320 oascc.SolrZkClient.makePath makePath: /live_nodes/127.0.0.1:12984_
   [junit4]   2> 538624 T1347 oascc.ZkStateReader$3.process Updating live nodes... (5)
   [junit4]   2> 538624 T1342 oascc.ZkStateReader$3.process Updating live nodes... (5)
   [junit4]   2> 538624 T1402 oascc.ZkStateReader$3.process Updating live nodes... (5)
   [junit4]   2> 538624 T1360 oascc.ZkStateReader$3.process Updating live nodes... (5)
   [junit4]   2> 538624 T1374 oascc.ZkStateReader$3.process Updating live nodes... (5)
   [junit4]   2> 538624 T1388 oascc.ZkStateReader$3.process Updating live nodes... (5)
   [junit4]   2> 538639 T1320 oasc.CorePropertiesLocator.discover Looking for core definitions underneath /usr/home/hudson/hudson-slave/workspace/Lucene-Solr-NightlyTests-4.x/solr/build/solr-core/test/J0/../../../../../../../../../../../usr/home/hudson/hudson-slave/workspace/Lucene-Solr-NightlyTests-4.x/solr/build/solr-core/test/J0/./org.apache.solr.cloud.DeleteReplicaTest-jetty4-1384040947273
   [junit4]   2> 538643 T1320 oasc.CorePropertiesLocator.discoverUnder Found core conf in /usr/home/hudson/hudson-slave/workspace/Lucene-Solr-NightlyTests-4.x/solr/build/solr-core/test/J0/../../../../../../../../../../../usr/home/hudson/hudson-slave/workspace/Lucene-Solr-NightlyTests-4.x/solr/build/solr-core/test/J0/./org.apache.solr.cloud.DeleteReplicaTest-jetty4-1384040947273/conf/
   [junit4]   2> 538907 T1320 oasc.CorePropertiesLocator.discover Found 1 core definitions
   [junit4]   2> 538908 T1320 oass.SolrDispatchFilter.init user.dir=/usr/home/hudson/hudson-slave/workspace/Lucene-Solr-NightlyTests-4.x/solr/build/solr-core/test/J0
   [junit4]   2> 538909 T1320 oass.SolrDispatchFilter.init SolrDispatchFilter.init() done
   [junit4]   2> 538917 T1320 oascc.ConnectionManager.waitForConnected Waiting for client to connect to ZooKeeper
   [junit4]   2> 538919 T1405 oascc.ConnectionManager.process Watcher org.apache.solr.common.cloud.ConnectionManager@c200022 name:ZooKeeperConnection Watcher:127.0.0.1:12965/solr got event WatchedEvent state:SyncConnected type:None path:null path:null type:None
   [junit4]   2> 538920 T1320 oascc.ConnectionManager.waitForConnected Client is connected to ZooKeeper
   [junit4]   2> 538921 T1320 oascc.ZkStateReader.createClusterStateWatchersAndUpdate Updating cluster state from ZooKeeper... 
   [junit4]   2> 538924 T1320 oascc.ConnectionManager.waitForConnected Waiting for client to connect to ZooKeeper
   [junit4]   2> 538926 T1407 oascc.ConnectionManager.process Watcher org.apache.solr.common.cloud.ConnectionManager@616c4812 name:ZooKeeperConnection Watcher:127.0.0.1:12965/solr got event WatchedEvent state:SyncConnected type:None path:null path:null type:None
   [junit4]   2> 538926 T1320 oascc.ConnectionManager.waitForConnected Client is connected to ZooKeeper
   [junit4]   2> 538928 T1320 oascc.ZkStateReader.createClusterStateWatchersAndUpdate Updating cluster state from ZooKeeper... 
   [junit4]   2> 538931 T1378 oasha.CollectionsHandler.handleCreateAction Creating Collection : numShards=2&maxShardsPerNode=2&name=delLiveColl&replicationFactor=2&action=CREATE&wt=javabin&version=2
   [junit4]   2> 538933 T1342 oasc.DistributedQueue$LatchChildWatcher.process Watcher fired on path: /overseer/collection-queue-work state: SyncConnected type NodeChildrenChanged
   [junit4]   2> 538934 T1344 oasc.OverseerCollectionProcessor.run Overseer Collection Processor: Get the message id:/overseer/collection-queue-work/qn-0000000000 message:{
   [junit4]   2> 	  "operation":"createcollection",
   [junit4]   2> 	  "fromApi":"true",
   [junit4]   2> 	  "name":"delLiveColl",
   [junit4]   2> 	  "replicationFactor":"2",
   [junit4]   2> 	  "numShards":"2",
   [junit4]   2> 	  "maxShardsPerNode":"2"}
   [junit4]   2> 538934 T1344 oasc.OverseerCollectionProcessor.processMessage WARN OverseerCollectionProcessor.processMessage : createcollection , {
   [junit4]   2> 	  "operation":"createcollection",
   [junit4]   2> 	  "fromApi":"true",
   [junit4]   2> 	  "name":"delLiveColl",
   [junit4]   2> 	  "replicationFactor":"2",
   [junit4]   2> 	  "numShards":"2",
   [junit4]   2> 	  "maxShardsPerNode":"2"}
   [junit4]   2> 539280 T1343 oascc.ZkStateReader.updateClusterState Updating cloud state from ZooKeeper... 
   [junit4]   2> 539281 T1343 oasc.Overseer$ClusterStateUpdater.buildCollection building a new collection: delLiveColl
   [junit4]   2> 539281 T1343 oasc.Overseer$ClusterStateUpdater.createCollection Create collection delLiveColl with shards [shard1, shard2]
   [junit4]   2> 539294 T1388 oascc.ZkStateReader$2.process A cluster state change: WatchedEvent state:SyncConnected type:NodeDataChanged path:/clusterstate.json, has occurred - updating... (live nodes size: 5)
   [junit4]   2> 539294 T1407 oascc.ZkStateReader$2.process A cluster state change: WatchedEvent state:SyncConnected type:NodeDataChanged path:/clusterstate.json, has occurred - updating... (live nodes size: 5)
   [junit4]   2> 539294 T1347 oascc.ZkStateReader$2.process A cluster state change: WatchedEvent state:SyncConnected type:NodeDataChanged path:/clusterstate.json, has occurred - updating... (live nodes size: 5)
   [junit4]   2> 539294 T1360 oascc.ZkStateReader$2.process A cluster state change: WatchedEvent state:SyncConnected type:NodeDataChanged path:/clusterstate.json, has occurred - updating... (live nodes size: 5)
   [junit4]   2> 539294 T1402 oascc.ZkStateReader$2.process A cluster state change: WatchedEvent state:SyncConnected type:NodeDataChanged path:/clusterstate.json, has occurred - updating... (live nodes size: 5)
   [junit4]   2> 539294 T1342 oascc.ZkStateReader$2.process A cluster state change: WatchedEvent state:SyncConnected type:NodeDataChanged path:/clusterstate.json, has occurred - updating... (live nodes size: 5)
   [junit4]   2> 539294 T1374 oascc.ZkStateReader$2.process A cluster state change: WatchedEvent state:SyncConnected type:NodeDataChanged path:/clusterstate.json, has occurred - updating... (live nodes size: 5)
   [junit4]   2> 539294 T1405 oascc.ZkStateReader$2.process A cluster state change: WatchedEvent state:SyncConnected type:NodeDataChanged path:/clusterstate.json, has occurred - updating... (live nodes size: 5)
   [junit4]   2> 539349 T1344 oasc.OverseerCollectionProcessor.createCollection going to create cores replicas shardNames [shard1, shard2] , repFactor : 2
   [junit4]   2> 539349 T1344 oasc.OverseerCollectionProcessor.createCollection Creating shard delLiveColl_shard1_replica1 as part of slice shard1 of collection delLiveColl on 127.0.0.1:12968_
   [junit4]   2> 539349 T1344 oasc.OverseerCollectionProcessor.createCollection Creating shard delLiveColl_shard1_replica2 as part of slice shard1 of collection delLiveColl on 127.0.0.1:12980_
   [junit4]   2> 539350 T1344 oasc.OverseerCollectionProcessor.createCollection Creating shard delLiveColl_shard2_replica1 as part of slice shard2 of collection delLiveColl on 127.0.0.1:12984_
   [junit4]   2> 539350 T1344 oasc.OverseerCollectionProcessor.createCollection Creating shard delLiveColl_shard2_replica2 as part of slice shard2 of collection delLiveColl on 127.0.0.1:12972_
   [junit4]   2> 539354 T1379 oasc.ZkController.publish publishing core=delLiveColl_shard1_replica2 state=down
   [junit4]   2> 539354 T1332 oasc.ZkController.publish publishing core=delLiveColl_shard1_replica1 state=down
   [junit4]   2> 539355 T1350 oasc.ZkController.publish publishing core=delLiveColl_shard2_replica2 state=down
   [junit4]   2> 539355 T1392 oasc.ZkController.publish publishing core=delLiveColl_shard2_replica1 state=down
   [junit4]   2> 539356 T1332 oasc.ZkController.waitForCoreNodeName look for our core node name
   [junit4]   2> 539355 T1379 oasc.ZkController.waitForCoreNodeName look for our core node name
   [junit4]   2> 539367 T1350 oasc.ZkController.waitForCoreNodeName look for our core node name
   [junit4]   2> 539367 T1392 oasc.ZkController.waitForCoreNodeName look for our core node name
   [junit4]   2> 540799 T1343 oascc.ZkStateReader.updateClusterState Updating cloud state from ZooKeeper... 
   [junit4]   2> 540800 T1343 oasc.Overseer$ClusterStateUpdater.updateState Update state numShards=2 message={
   [junit4]   2> 	  "operation":"state",
   [junit4]   2> 	  "state":"down",
   [junit4]   2> 	  "base_url":"http://127.0.0.1:12980",
   [junit4]   2> 	  "core":"delLiveColl_shard1_replica2",
   [junit4]   2> 	  "roles":null,
   [junit4]   2> 	  "node_name":"127.0.0.1:12980_",
   [junit4]   2> 	  "shard":"shard1",
   [junit4]   2> 	  "shard_range":null,
   [junit4]   2> 	  "shard_state":"active",
   [junit4]   2> 	  "shard_parent":null,
   [junit4]   2> 	  "collection":"delLiveColl",
   [junit4]   2> 	  "numShards":"2",
   [junit4]   2> 	  "core_node_name":null}
   [junit4]   2> 540805 T1343 oasc.Overseer$ClusterStateUpdater.updateState Update state numShards=2 message={
   [junit4]   2> 	  "operation":"state",
   [junit4]   2> 	  "state":"down",
   [junit4]   2> 	  "base_url":"http://127.0.0.1:12968",
   [junit4]   2> 	  "core":"delLiveColl_shard1_replica1",
   [junit4]   2> 	  "roles":null,
   [junit4]   2> 	  "node_name":"127.0.0.1:12968_",
   [junit4]   2> 	  "shard":"shard1",
   [junit4]   2> 	  "shard_range":null,
   [junit4]   2> 	  "shard_state":"active",
   [junit4]   2> 	  "shard_parent":null,
   [junit4]   2> 	  "collection":"delLiveColl",
   [junit4]   2> 	  "numShards":"2",
   [junit4]   2> 	  "core_node_name":null}
   [junit4]   2> 540820 T1343 oasc.Overseer$ClusterStateUpdater.updateState Update state numShards=2 message={
   [junit4]   2> 	  "operation":"state",
   [junit4]   2> 	  "state":"down",
   [junit4]   2> 	  "base_url":"http://127.0.0.1:12972",
   [junit4]   2> 	  "core":"delLiveColl_shard2_replica2",
   [junit4]   2> 	  "roles":null,
   [junit4]   2> 	  "node_name":"127.0.0.1:12972_",
   [junit4]   2> 	  "shard":"shard2",
   [junit4]   2> 	  "shard_range":null,
   [junit4]   2> 	  "shard_state":"active",
   [junit4]   2> 	  "shard_parent":null,
   [junit4]   2> 	  "collection":"delLiveColl",
   [junit4]   2> 	  "numShards":"2",
   [junit4]   2> 	  "core_node_name":null}
   [junit4]   2> 540830 T1343 oasc.Overseer$ClusterStateUpdater.updateState Update state numShards=2 message={
   [junit4]   2> 	  "operation":"state",
   [junit4]   2> 	  "state":"down",
   [junit4]   2> 	  "base_url":"http://127.0.0.1:12984",
   [junit4]   2> 	  "core":"delLiveColl_shard2_replica1",
   [junit4]   2> 	  "roles":null,
   [junit4]   2> 	  "node_name":"127.0.0.1:12984_",
   [junit4]   2> 	  "shard":"shard2",
   [junit4]   2> 	  "shard_range":null,
   [junit4]   2> 	  "shard_state":"active",
   [junit4]   2> 	  "shard_parent":null,
   [junit4]   2> 	  "collection":"delLiveColl",
   [junit4]   2> 	  "numShards":"2",
   [junit4]   2> 	  "core_node_name":null}
   [junit4]   2> 540843 T1342 oascc.ZkStateReader$2.process A cluster state change: WatchedEvent state:SyncConnected type:NodeDataChanged path:/clusterstate.json, has occurred - updating... (live nodes size: 5)
   [junit4]   2> 540843 T1347 oascc.ZkStateReader$2.process A cluster state change: WatchedEvent state:SyncConnected type:NodeDataChanged path:/clusterstate.json, has occurred - updating... (live nodes size: 5)
   [junit4]   2> 540843 T1407 oascc.ZkStateReader$2.process A cluster state change: WatchedEvent state:SyncConnected type:NodeDataChanged path:/clusterstate.json, has occurred - updating... (live nodes size: 5)
   [junit4]   2> 540843 T1388 oascc.ZkStateReader$2.process A cluster state change: WatchedEvent state:SyncConnected type:NodeDataChanged path:/clusterstate.json, has occurred - updating... (live nodes size: 5)
   [junit4]   2> 540843 T1360 oascc.ZkStateReader$2.process A cluster state change: WatchedEvent state:SyncConnected type:NodeDataChanged path:/clusterstate.json, has occurred - updating... (live nodes size: 5)
   [junit4]   2> 540843 T1405 oascc.ZkStateReader$2.process A cluster state change: WatchedEvent state:SyncConnected type:NodeDataChanged path:/clusterstate.json, has occurred - updating... (live nodes size: 5)
   [junit4]   2> 540843 T1374 oascc.ZkStateReader$2.process A cluster state change: WatchedEvent state:SyncConnected type:NodeDataChanged path:/clusterstate.json, has occurred - updating... (live nodes size: 5)
   [junit4]   2> 540843 T1402 oascc.ZkStateReader$2.process A cluster state change: WatchedEvent state:SyncConnected type:NodeDataChanged path:/clusterstate.json, has occurred - updating... (live nodes size: 5)
   [junit4]   2> 541358 T1332 oasc.ZkController.waitForShardId waiting to find shard id in clusterstate for delLiveColl_shard1_replica1
   [junit4]   2> 541359 T1379 oasc.ZkController.waitForShardId waiting to find shard id in clusterstate for delLiveColl_shard1_replica2
   [junit4]   2> 541361 T1332 oasc.CoreContainer.create Creating SolrCore 'delLiveColl_shard1_replica1' using instanceDir: ../../../../../../../../../../../usr/home/hudson/hudson-slave/workspace/Lucene-Solr-NightlyTests-4.x/solr/build/solr-core/test/J0/./org.apache.solr.cloud.DeleteReplicaTest-controljetty-1384040941379/delLiveColl_shard1_replica1
   [junit4]   2> 541361 T1379 oasc.CoreContainer.create Creating SolrCore 'delLiveColl_shard1_replica2' using instanceDir: ./org.apache.solr.cloud.DeleteReplicaTest-jetty3-1384040945590/delLiveColl_shard1_replica2
   [junit4]   2> 541362 T1379 oasc.ZkController.createCollectionZkNode Check for collection zkNode:delLiveColl
   [junit4]   2> 541361 T1332 oasc.ZkController.createCollectionZkNode Check for collection zkNode:delLiveColl
   [junit4]   2> 541363 T1379 oasc.ZkController.createCollectionZkNode Creating collection in ZooKeeper:delLiveColl
   [junit4]   2> 541363 T1332 oasc.ZkController.createCollectionZkNode Creating collection in ZooKeeper:delLiveColl
   [junit4]   2> 541363 T1379 oasc.ZkController.getConfName Looking for collection configName
   [junit4]   2> 541363 T1332 oasc.ZkController.getConfName Looking for collection configName
   [junit4]   2> 541364 T1379 oasc.ZkController.getConfName Only one config set found in zk - using it:conf1
   [junit4]   2> 541365 T1332 oasc.ZkController.getConfName Only one config set found in zk - using it:conf1
   [junit4]   2> 541365 T1379 oascc.SolrZkClient.makePath makePath: /collections/delLiveColl
   [junit4]   2> 541365 T1332 oascc.SolrZkClient.makePath makePath: /collections/delLiveColl
   [junit4]   2> 541367 T1379 oasc.ZkController.readConfigName Load collection config from:/collections/delLiveColl
   [junit4]   2> 541368 T1332 oasc.ZkController.readConfigName Load collection config from:/collections/delLiveColl
   [junit4]   2> 541369 T1379 oasc.SolrResourceLoader.<init> new SolrResourceLoader for directory: './org.apache.solr.cloud.DeleteReplicaTest-jetty3-1384040945590/delLiveColl_shard1_replica2/'
   [junit4]   2> 541369 T1350 oasc.ZkController.waitForShardId waiting to find shard id in clusterstate for delLiveColl_shard2_replica2
   [junit4]   2> 541369 T1332 oasc.SolrResourceLoader.<init> new SolrResourceLoader for directory: '../../../../../../../../../../../usr/home/hudson/hudson-slave/workspace/Lucene-Solr-NightlyTests-4.x/solr/build/solr-core/test/J0/./org.apache.solr.cloud.DeleteReplicaTest-controljetty-1384040941379/delLiveColl_shard1_replica1/'
   [junit4]   2> 541370 T1392 oasc.ZkController.waitForShardId waiting to find shard id in clusterstate for delLiveColl_shard2_replica1
   [junit4]   2> 541373 T1350 oasc.CoreContainer.create Creating SolrCore 'delLiveColl_shard2_replica2' using instanceDir: ../../../../../../../../../../../usr/home/hudson/hudson-slave/workspace/Lucene-Solr-NightlyTests-4.x/solr/build/solr-core/test/J0/./org.apache.solr.cloud.DeleteReplicaTest-jetty1-1384040942195/delLiveColl_shard2_replica2
   [junit4]   2> 541373 T1350 oasc.ZkController.createCollectionZkNode Check for collection zkNode:delLiveColl
   [junit4]   2> 541374 T1392 oasc.CoreContainer.create Creating SolrCore 'delLiveColl_shard2_replica1' using instanceDir: ../../../../../../../../../../../usr/home/hudson/hudson-slave/workspace/Lucene-Solr-NightlyTests-4.x/solr/build/solr-core/test/J0/./org.apache.solr.cloud.DeleteReplicaTest-jetty4-1384040947273/delLiveColl_shard2_replica1
   [junit4]   2> 541374 T1350 oasc.ZkController.createCollectionZkNode Collection zkNode exists
   [junit4]   2> 541374 T1392 oasc.ZkController.createCollectionZkNode Check for collection zkNode:delLiveColl
   [junit4]   2> 541374 T1350 oasc.ZkController.readConfigName Load collection config from:/collections/delLiveColl
   [junit4]   2> 541375 T1392 oasc.ZkController.createCollectionZkNode Collection zkNode exists
   [junit4]   2> 541376 T1392 oasc.ZkController.readConfigName Load collection config from:/collections/delLiveColl
   [junit4]   2> 541376 T1350 oasc.SolrResourceLoader.<init> new SolrResourceLoader for directory: '../../../../../../../../../../../usr/home/hudson/hudson-slave/workspace/Lucene-Solr-NightlyTests-4.x/solr/build/solr-core/test/J0/./org.apache.solr.cloud.DeleteReplicaTest-jetty1-1384040942195/delLiveColl_shard2_replica2/'
   [junit4]   2> 541377 T1392 oasc.SolrResourceLoader.<init> new SolrResourceLoader for directory: '../../../../../../../../../../../usr/home/hudson/hudson-slave/workspace/Lucene-Solr-NightlyTests-4.x/solr/build/solr-core/test/J0/./org.apache.solr.cloud.DeleteReplicaTest-jetty4-1384040947273/delLiveColl_shard2_replica1/'
   [junit4]   2> 541501 T1332 oasc.SolrConfig.<init> Using Lucene MatchVersion: LUCENE_46
   [junit4]   2> 541502 T1350 oasc.SolrConfig.<init> Using Lucene MatchVersion: LUCENE_46
   [junit4]   2> 541504 T1392 oasc.SolrConfig.<init> Using Lucene MatchVersion: LUCENE_46
   [junit4]   2> 541504 T1379 oasc.SolrConfig.<init> Using Lucene MatchVersion: LUCENE_46
   [junit4]   2> 541577 T1332 oasc.SolrConfig.<init> Loaded SolrConfig: solrconfig.xml
   [junit4]   2> 541577 T1350 oasc.SolrConfig.<init> Loaded SolrConfig: solrconfig.xml
   [junit4]   2> 541579 T1332 oass.IndexSchema.readSchema Reading Solr Schema from schema.xml
   [junit4]   2> 541579 T1350 oass.IndexSchema.readSchema Reading Solr Schema from schema.xml
   [junit4]   2> 541579 T1392 oasc.SolrConfig.<init> Loaded SolrConfig: solrconfig.xml
   [junit4]   2> 541580 T1379 oasc.SolrConfig.<init> Loaded SolrConfig: solrconfig.xml
   [junit4]   2> 541581 T1392 oass.IndexSchema.readSchema Reading Solr Schema from schema.xml
   [junit4]   2> 541581 T1379 oass.IndexSchema.readSchema Reading Solr Schema from schema.xml
   [junit4]   2> 541590 T1332 oass.IndexSchema.readSchema [delLiveColl_shard1_replica1] Schema name=test
   [junit4]   2> 541590 T1350 oass.IndexSchema.readSchema [delLiveColl_shard2_replica2] Schema name=test
   [junit4]   2> 541592 T1379 oass.IndexSchema.readSchema [delLiveColl_shard1_replica2] Schema name=test
   [junit4]   2> 541592 T1392 oass.IndexSchema.readSchema [delLiveColl_shard2_replica1] Schema name=test
   [junit4]   2> 542338 T1379 oass.ByteField.init WARN ByteField is deprecated and will be removed in 5.0. You should use TrieIntField instead.
   [junit4]   2> 542338 T1332 oass.ByteField.init WARN ByteField is deprecated and will be removed in 5.0. You should use TrieIntField instead.
   [junit4]   2> 542340 T1379 oass.ShortField.init WARN ShortField is deprecated and will be removed in 5.0. You should use TrieIntField instead.
   [junit4]   2> 542340 T1332 oass.ShortField.init WARN ShortField is deprecated and will be removed in 5.0. You should use TrieIntField instead.
   [junit4]   2> 542341 T1379 oass.OpenExchangeRatesOrgProvider.init Initialized with rates=open-exchange-rates.json, refreshInterval=1440.
   [junit4]   2> 542341 T1332 oass.OpenExchangeRatesOrgProvider.init Initialized with rates=open-exchange-rates.json, refreshInterval=1440.
   [junit4]   2> 542350 T1379 oass.IndexSchema.readSchema default search field in schema is text
   [junit4]   2> 542352 T1332 oass.IndexSchema.readSchema default search field in schema is text
   [junit4]   2> 542353 T1379 oass.IndexSchema.readSchema unique key field: id
   [junit4]   2> 542357 T1332 oass.IndexSchema.readSchema unique key field: id
   [junit4]   2> 542363 T1379 oass.FileExchangeRateProvider.reload Reloading exchange rates from file currency.xml
   [junit4]   2> 542367 T1379 oass.FileExchangeRateProvider.reload Reloading exchange rates from file currency.xml
   [junit4]   2> 542367 T1332 oass.FileExchangeRateProvider.reload Reloading exchange rates from file currency.xml
   [junit4]   2> 542371 T1379 oass.OpenExchangeRatesOrgProvider.reload Reloading exchange rates from open-exchange-rates.json
   [junit4]   2> 542372 T1379 oass.OpenExchangeRatesOrgProvider$OpenExchangeRates.<init> WARN Unknown key IMPORTANT NOTE
   [junit4]   2> 542372 T1379 oass.OpenExchangeRatesOrgProvider$OpenExchangeRates.<init> WARN Expected key, got STRING
   [junit4]   2> 542372 T1379 oass.OpenExchangeRatesOrgProvider.reload Reloading exchange rates from open-exchange-rates.json
   [junit4]   2> 542372 T1332 oass.FileExchangeRateProvider.reload Reloading exchange rates from file currency.xml
   [junit4]   2> 542373 T1379 oass.OpenExchangeRatesOrgProvider$OpenExchangeRates.<init> WARN Unknown key IMPORTANT NOTE
   [junit4]   2> 542373 T1379 oass.OpenExchangeRatesOrgProvider$OpenExchangeRates.<init> WARN Expected key, got STRING
   [junit4]   2> 542374 T1392 oass.ByteField.init WARN ByteField is deprecated and will be removed in 5.0. You should use TrieIntField instead.
   [junit4]   2> 542374 T1379 oasc.SolrCore.initDirectoryFactory org.apache.solr.core.MockDirectoryFactory
   [junit4]   2> 542374 T1392 oass.ShortField.init WARN ShortField is deprecated and will be removed in 5.0. You should use TrieIntField instead.
   [junit4]   2> 542374 T1379 oasc.SolrCore.<init> [delLiveColl_shard1_replica2] Opening new SolrCore at ./org.apache.solr.cloud.DeleteReplicaTest-jetty3-1384040945590/delLiveColl_shard1_replica2/, dataDir=./org.apache.solr.cloud.DeleteReplicaTest-jetty3-1384040945590/delLiveColl_shard1_replica2/data/
   [junit4]   2> 542375 T1379 oasc.JmxMonitoredMap.<init> JMX monitoring is enabled. Adding Solr mbeans to JMX Server: com.sun.jmx.mbeanserver.JmxMBeanServer@307b4703
   [junit4]   2> 542375 T1392 oass.OpenExchangeRatesOrgProvider.init Initialized with rates=open-exchange-rates.json, refreshInterval=1440.
   [junit4]   2> 542376 T1379 oasc.CachingDirectoryFactory.get return new directory for ./org.apache.solr.cloud.DeleteReplicaTest-jetty3-1384040945590/delLiveColl_shard1_replica2/data
   [junit4]   2> 542376 T1379 oasc.SolrCore.getNewIndexDir New index directory detected: old=null new=./org.apache.solr.cloud.DeleteReplicaTest-jetty3-1384040945590/delLiveColl_shard1_replica2/data/index/
   [junit4]   2> 542376 T1379 oasc.SolrCore.initIndex WARN [delLiveColl_shard1_replica2] Solr index directory './org.apache.solr.cloud.DeleteReplicaTest-jetty3-1384040945590/delLiveColl_shard1_replica2/data/index' doesn't exist. Creating new index...
   [junit4]   2> 542377 T1379 oasc.CachingDirectoryFactory.get return new directory for ./org.apache.solr.cloud.DeleteReplicaTest-jetty3-1384040945590/delLiveColl_shard1_replica2/data/index
   [junit4]   2> 542377 T1332 oass.OpenExchangeRatesOrgProvider.reload Reloading exchange rates from open-exchange-rates.json
   [junit4]   2> 542377 T1350 oass.ByteField.init WARN ByteField is deprecated and will be removed in 5.0. You should use TrieIntField instead.
   [junit4]   2> 542377 T1379 oasu.RandomMergePolicy.<init> RandomMergePolicy wrapping class org.apache.lucene.index.TieredMergePolicy: [TieredMergePolicy: maxMergeAtOnce=4, maxMergeAtOnceExplicit=4, maxMergedSegmentMB=99.8701171875, floorSegmentMB=1.3896484375, forceMergeDeletesPctAllowed=18.532459426534405, segmentsPerTier=17.0, maxCFSSegmentSizeMB=8.796093022207999E12, noCFSRatio=0.8593108586728143
   [junit4]   2> 542378 T1332 oass.OpenExchangeRatesOrgProvider$OpenExchangeRates.<init> WARN Unknown key IMPORTANT NOTE
   [junit4]   2> 542379 T1332 oass.OpenExchangeRatesOrgProvider$OpenExchangeRates.<init> WARN Expected key, got STRING
   [junit4]   2> 542378 T1350 oass.ShortField.init WARN ShortField is deprecated and will be removed in 5.0. You should use TrieIntField instead.
   [junit4]   2> 542379 T1332 oass.OpenExchangeRatesOrgProvider.reload Reloading exchange rates from open-exchange-rates.json
   [junit4]   2> 542379 T1379 oasc.SolrDeletionPolicy.onCommit SolrDeletionPolicy.onCommit: commits: num=1
   [junit4]   2> 		commit{dir=MockDirectoryWrapper(org.apache.lucene.store.RAMDirectory@2204a796 lockFactory=org.apache.lucene.store.SingleInstanceLockFactory@1c79246e),segFN=segments_1,generation=1}
   [junit4]   2> 542380 T1350 oass.OpenExchangeRatesOrgProvider.init Initialized with rates=open-exchange-rates.json, refreshInterval=1440.
   [junit4]   2> 542380 T1332 oass.OpenExchangeRatesOrgProvider$OpenExchangeRates.<init> WARN Unknown key IMPORTANT NOTE
   [junit4]   2> 542380 T1379 oasc.SolrDeletionPolicy.updateCommits newest commit generation = 1
   [junit4]   2> 542381 T1332 oass.OpenExchangeRatesOrgProvider$OpenExchangeRates.<init> WARN Expected key, got STRING
   [junit4]   2> 542382 T1332 oasc.SolrCore.initDirectoryFactory org.apache.solr.core.MockDirectoryFactory
   [junit4]   2> 542382 T1332 oasc.SolrCore.<init> [delLiveColl_shard1_replica1] Opening new SolrCore at ../../../../../../../../../../../usr/home/hudson/hudson-slave/workspace/Lucene-Solr-NightlyTests-4.x/solr/build/solr-core/test/J0/./org.apache.solr.cloud.DeleteReplicaTest-controljetty-1384040941379/delLiveColl_shard1_replica1/, dataDir=../../../../../../../../../../../usr/home/hudson/hudson-slave/workspace/Lucene-Solr-NightlyTests-4.x/solr/build/solr-core/test/J0/./org.apache.solr.cloud.DeleteReplicaTest-controljetty-1384040941379/delLiveColl_shard1_replica1/data/
   [junit4]   2> 542383 T1332 oasc.JmxMonitoredMap.<init> JMX monitoring is enabled. Adding Solr mbeans to JMX Server: com.sun.jmx.mbeanserver.JmxMBeanServer@307b4703
   [junit4]   2> 542383 T1392 oass.IndexSchema.readSchema default search field in schema is text
   [junit4]   2> 542384 T1332 oasc.CachingDirectoryFactory.get return new directory for ../../../../../../../../../../../usr/home/hudson/hudson-slave/workspace/Lucene-Solr-NightlyTests-4.x/solr/build/solr-core/test/J0/./org.apache.solr.cloud.DeleteReplicaTest-controljetty-1384040941379/delLiveColl_shard1_replica1/data
   [junit4]   2> 542383 T1379 oasup.UpdateRequestProcessorChain.init creating updateRequestProcessorChain "nodistrib"
   [junit4]   2> 542384 T1332 oasc.SolrCore.getNewIndexDir New index directory detected: old=null new=../../../../../../../../../../../usr/home/hudson/hudson-slave/workspace/Lucene-Solr-NightlyTests-4.x/solr/build/solr-core/test/J0/./org.apache.solr.cloud.DeleteReplicaTest-controljetty-1384040941379/delLiveColl_shard1_replica1/data/index/
   [junit4]   2> 542385 T1379 oasup.UpdateRequestProcessorChain.init creating updateRequestProcessorChain "dedupe"
   [junit4]   2> 542385 T1332 oasc.SolrCore.initIndex WARN [delLiveColl_shard1_replica1] Solr index directory '../../../../../../../../../../../usr/home/hudson/hudson-slave/workspace/Lucene-Solr-NightlyTests-4.x/solr/build/solr-core/test/J0/./org.apache.solr.cloud.DeleteReplicaTest-controljetty-1384040941379/delLiveColl_shard1_replica1/data/index' doesn't exist. Creating new index...
   [junit4]   2> 542385 T1379 oasup.UpdateRequestProcessorChain.init inserting DistributedUpdateProcessorFactory into updateRequestProcessorChain "dedupe"
   [junit4]   2> 542386 T1332 oasc.CachingDirectoryFactory.get return new directory for ../../../../../../../../../../../usr/home/hudson/hudson-slave/workspace/Lucene-Solr-NightlyTests-4.x/solr/build/solr-core/test/J0/./org.apache.solr.cloud.DeleteReplicaTest-controljetty-1384040941379/delLiveColl_shard1_replica1/data/index
   [junit4]   2> 542386 T1379 oasup.UpdateRequestProcessorChain.init creating updateRequestProcessorChain "stored_sig"
   [junit4]   2> 542386 T1332 oasu.RandomMergePolicy.<init> RandomMergePolicy wrapping class org.apache.lucene.index.TieredMergePolicy: [TieredMergePolicy: maxMergeAtOnce=4, maxMergeAtOnceExplicit=4, maxMergedSegmentMB=99.8701171875, floorSegmentMB=1.3896484375, forceMergeDeletesPctAllowed=18.532459426534405, segmentsPerTier=17.0, maxCFSSegmentSizeMB=8.796093022207999E12, noCFSRatio=0.8593108586728143
   [junit4]   2> 542387 T1379 oasup.UpdateRequestProcessorChain.init inserting DistributedUpdateProcessorFactory into updateRequestProcessorChain "stored_sig"
   [junit4]   2> 542387 T1379 oasup.UpdateRequestProcessorChain.init creating updateRequestProcessorChain "distrib-dup-test-chain-explicit"
   [junit4]   2> 542388 T1332 oasc.SolrDeletionPolicy.onCommit SolrDeletionPolicy.onCommit: commits: num=1
   [junit4]   2> 		commit{dir=MockDirectoryWrapper(org.apache.lucene.store.RAMDirectory@fee5806 lockFactory=org.apache.lucene.store.SingleInstanceLockFactory@5c80435f),segFN=segments_1,generation=1}
   [junit4]   2> 542388 T1379 oasup.UpdateRequestProcessorChain.init creating updateRequestProcessorChain "distrib-dup-test-chain-implicit"
   [junit4]   2> 542388 T1350 oass.IndexSchema.readSchema default search field in schema is text
   [junit4]   2> 542388 T1392 oass.IndexSchema.readSchema unique key field: id
   [junit4]   2> 542388 T1379 oasup.UpdateRequestProcessorChain.init inserting DistributedUpdateProcessorFactory into updateRequestProcessorChain "distrib-dup-test-chain-implicit"
   [junit4]   2> 542388 T1332 oasc.SolrDeletionPolicy.updateCommits newest commit generation = 1
   [junit4]   2> 542389 T1379 oasc.SolrCore.loadUpdateProcessorChains no updateRequestProcessorChain defined as default, creating implicit default
   [junit4]   2> 542390 T1379 oasc.RequestHandlers.initHandlersFromConfig created standard: solr.StandardRequestHandler
   [junit4]   2> 542391 T1379 oasc.RequestHandlers.initHandlersFromConfig created /get: solr.RealTimeGetHandler
   [junit4]   2> 542391 T1379 oasc.RequestHandlers.initHandlersFromConfig adding lazy requestHandler: solr.ReplicationHandler
   [junit4]   2> 542391 T1379 oasc.RequestHandlers.initHandlersFromConfig created /replication: solr.ReplicationHandler
   [junit4]   2> 542392 T1379 oasc.RequestHandlers.initHandlersFromConfig created /update: solr.UpdateRequestHandler
   [junit4]   2> 542392 T1379 oasc.RequestHandlers.initHandlersFromConfig created /admin/: org.apache.solr.handler.admin.AdminHandlers
   [junit4]   2> 542393 T1350 oass.IndexSchema.readSchema unique key field: id
   [junit4]   2> 542393 T1332 oasup.UpdateRequestProcessorChain.init creating updateRequestProcessorChain "nodistrib"
   [junit4]   2> 542394 T1332 oasup.UpdateRequestProcessorChain.init creating updateRequestProcessorChain "dedupe"
   [junit4]   2> 542394 T1332 oasup.UpdateRequestProcessorChain.init inserting DistributedUpdateProcessorFactory into updateRequestProcessorChain "dedupe"
   [junit4]   2> 542394 T1332 oasup.UpdateRequestProcessorChain.init creating updateRequestProcessorChain "stored_sig"
   [junit4]   2> 542395 T1332 oasup.UpdateRequestProcessorChain.init inserting DistributedUpdateProcessorFactory into updateRequestProcessorChain "stored_sig"
   [junit4]   2> 542395 T1332 oasup.UpdateRequestProcessorChain.init creating updateRequestProcessorChain "distrib-dup-test-chain-explicit"
   [junit4]   2> 542396 T1332 oasup.UpdateRequestProcessorChain.init creating updateRequestProcessorChain "distrib-dup-test-chain-implicit"
   [junit4]   2> 542396 T1332 oasup.UpdateRequestProcessorChain.init inserting DistributedUpdateProcessorFactory into updateRequestProcessorChain "distrib-dup-test-chain-implicit"
   [junit4]   2> 542397 T1332 oasc.SolrCore.loadUpdateProcessorChains no updateRequestProcessorChain defined as default, creating implicit default
   [junit4]   2> 542397 T1332 oasc.RequestHandlers.initHandlersFromConfig created standard: solr.StandardRequestHandler
   [junit4]   2> 542398 T1332 oasc.RequestHandlers.initHandlersFromConfig created /get: solr.RealTimeGetHandler
   [junit4]   2> 542398 T1332 oasc.RequestHandlers.initHandlersFromConfig adding lazy requestHandler: solr.ReplicationHandler
   [junit4]   2> 542399 T1379 oashl.XMLLoader.init xsltCacheLifetimeSeconds=60
   [junit4]   2> 542399 T1332 oasc.RequestHandlers.initHandlersFromConfig created /replication: solr.ReplicationHandler
   [junit4]   2> 542399 T1392 oass.FileExchangeRateProvider.reload Reloading exchange rates from file currency.xml
   [junit4]   2> 542400 T1332 oasc.RequestHandlers.initHandlersFromConfig created /update: solr.UpdateRequestHandler
   [junit4]   2> 542400 T1332 oasc.RequestHandlers.initHandlersFromConfig created /admin/: org.apache.solr.handler.admin.AdminHandlers
   [junit4]   2> 542403 T1332 oashl.XMLLoader.init xsltCacheLifetimeSeconds=60
   [junit4]   2> 542403 T1379 oasu.CommitTracker.<init> Hard AutoCommit: disabled
   [junit4]   2> 542403 T1350 oass.FileExchangeRateProvider.reload Reloading exchange rates from file currency.xml
   [junit4]   2> 542403 T1379 oasu.CommitTracker.<init> Soft AutoCommit: disabled
   [junit4]   2> 542404 T1379 oasu.RandomMergePolicy.<init> RandomMergePolicy wrapping class org.apache.lucene.index.LogByteSizeMergePolicy: [LogByteSizeMergePolicy: minMergeSize=1677721, mergeFactor=20, maxMergeSize=2147483648, maxMergeSizeForForcedMerge=9223372036854775807, calibrateSizeByDeletes=false, maxMergeDocs=2147483647, maxCFSSegmentSizeMB=0.6357421875, noCFSRatio=0.5587512380297738]
   [junit4]   2> 542404 T1392 oass.FileExchangeRateProvider.reload Reloading exchange rates from file currency.xml
   [junit4]   2> 542405 T1379 oasc.SolrDeletionPolicy.onInit SolrDeletionPolicy.onInit: commits: num=1
   [junit4]   2> 		commit{dir=MockDirectoryWrapper(org.apache.lucene.store.RAMDirectory@2204a796 lockFactory=org.apache.lucene.store.SingleInstanceLockFactory@1c79246e),segFN=segments_1,generation=1}
   [junit4]   2> 542405 T1379 oasc.SolrDeletionPolicy.updateCommits newest commit generation = 1
   [junit4]   2> 542406 T1379 oass.SolrIndexSearcher.<init> Opening Searcher@430ee101 main
   [junit4]   2> 542408 T1350 oass.FileExchangeRateProvider.reload Reloading exchange rates from file currency.xml
   [junit4]   2> 542408 T1412 oasc.SolrCore.registerSearcher [delLiveColl_shard1_replica2] Registered new searcher Searcher@430ee101 main{StandardDirectoryReader(segments_1:1:nrt)}
   [junit4]   2> 542409 T1332 oasu.CommitTracker.<init> Hard AutoCommit: disabled
   [junit4]   2> 542409 T1392 oass.OpenExchangeRatesOrgProvider.reload Reloading exchange rates from open-exchange-rates.json
   [junit4]   2> 542409 T1332 oasu.CommitTracker.<init> Soft AutoCommit: disabled
   [junit4]   2> 542410 T1379 oasc.CoreContainer.registerCore registering core: delLiveColl_shard1_replica2
   [junit4]   2> 542410 T1392 oass.OpenExchangeRatesOrgProvider$OpenExchangeRates.<init> WARN Unknown key IMPORTANT NOTE
   [junit4]   2> 542410 T1332 oasu.RandomMergePolicy.<init> RandomMergePolicy wrapping class org.apache.lucene.index.LogByteSizeMergePolicy: [LogByteSizeMergePolicy: minMergeSize=1677721, mergeFactor=20, maxMergeSize=2147483648, maxMergeSizeForForcedMerge=9223372036854775807, calibrateSizeByDeletes=false, maxMergeDocs=2147483647, maxCFSSegmentSizeMB=0.6357421875, noCFSRatio=0.5587512380297738]
   [junit4]   2> 542410 T1379 oasc.ZkController.register Register replica - core:delLiveColl_shard1_replica2 address:http://127.0.0.1:12980 collection:delLiveColl shard:shard1
   [junit4]   2> 542411 T1392 oass.OpenExchangeRatesOrgProvider$OpenExchangeRates.<init> WARN Expected key, got STRING
   [junit4]   2> 542411 T1332 oasc.SolrDeletionPolicy.onInit SolrDeletionPolicy.onInit: commits: num=1
   [junit4]   2> 		commit{dir=MockDirectoryWrapper(org.apache.lucene.store.RAMDirectory@fee5806 lockFactory=org.apache.lucene.store.SingleInstanceLockFactory@5c80435f),segFN=segments_1,generation=1}
   [junit4]   2> 542412 T1350 oass.OpenExchangeRatesOrgProvider.reload Reloading exchange rates from open-exchange-rates.json
   [junit4]   2> 542412 T1392 oass.OpenExchangeRatesOrgProvider.reload Reloading exchange rates from open-exchange-rates.json
   [junit4]   2> 542412 T1379 oascc.SolrZkClient.makePath makePath: /collections/delLiveColl/leader_elect/shard1/election
   [junit4]   2> 542413 T1350 oass.OpenExchangeRatesOrgProvider$OpenExchangeRates.<init> WARN Unknown key IMPORTANT NOTE
   [junit4]   2> 542412 T1332 oasc.SolrDeletionPolicy.updateCommits newest commit generation = 1
   [junit4]   2> 542414 T1392 oass.OpenExchangeRatesOrgProvider$OpenExchangeRates.<init> WARN Unknown key IMPORTANT NOTE
   [junit4]   2> 542413 T1350 oass.OpenExchangeRatesOrgProvider$OpenExchangeRates.<init> WARN Expected key, got STRING
   [junit4]   2> 542414 T1392 oass.OpenExchangeRatesOrgProvider$OpenExchangeRates.<init> WARN Expected key, got STRING
   [junit4]   2> 542414 T1332 oass.SolrIndexSearcher.<init> Opening Searcher@605bfca9 main
   [junit4]   2> 542415 T1392 oasc.SolrCore.initDirectoryFactory org.apache.solr.core.MockDirectoryFactory
   [junit4]   2> 542415 T1350 oass.OpenExchangeRatesOrgProvider.reload Reloading exchange rates from open-exchange-rates.json
   [junit4]   2> 542416 T1392 oasc.SolrCore.<init> [delLiveColl_shard2_replica1] Opening new SolrCore at ../../../../../../../../../../../usr/home/hudson/hudson-slave/workspace/Lucene-Solr-NightlyTests-4.x/solr/build/solr-core/test/J0/./org.apache.solr.cloud.DeleteReplicaTest-jetty4-1384040947273/delLiveColl_shard2_replica1/, dataDir=../../../../../../../../../../../usr/home/hudson/hudson-slave/workspace/Lucene-Solr-NightlyTests-4.x/solr/build/solr-core/test/J0/./org.apache.solr.cloud.DeleteReplicaTest-jetty4-1384040947273/delLiveColl_shard2_replica1/data/
   [junit4]   2> 542417 T1392 oasc.JmxMonitoredMap.<init> JMX monitoring is enabled. Adding Solr mbeans to JMX Server: com.sun.jmx.mbeanserver.JmxMBeanServer@307b4703
   [junit4]   2> 542418 T1392 oasc.CachingDirectoryFactory.get return new directory for ../../../../../../../../../../../usr/home/hudson/hudson-slave/workspace/Lucene-Solr-NightlyTests-4.x/solr/build/solr-core/test/J0/./org.apache.solr.cloud.DeleteReplicaTest-jetty4-1384040947273/delLiveColl_shard2_replica1/data
   [junit4]   2> 542418 T1392 oasc.SolrCore.getNewIndexDir New index directory detected: old=null new=../../../../../../../../../../../usr/home/hudson/hudson-slave/workspace/Lucene-Solr-NightlyTests-4.x/solr/build/solr-core/test/J0/./org.apache.solr.cloud.DeleteReplicaTest-jetty4-1384040947273/delLiveColl_shard2_replica1/data/index/
   [junit4]   2> 542418 T1413 oasc.SolrCore.registerSearcher [delLiveColl_shard1_replica1] Registered new searcher Searcher@605bfca9 main{StandardDirectoryReader(segments_1:1:nrt)}
   [junit4]   2> 542418 T1392 oasc.SolrCore.initIndex WARN [delLiveColl_shard2_replica1] Solr index directory '../../../../../../../../../../../usr/home/hudson/hudson-slave/workspace/Lucene-Solr-NightlyTests-4.x/solr/build/solr-core/test/J0/./org.apache.solr.cloud.DeleteReplicaTest-jetty4-1384040947273/delLiveColl_shard2_replica1/data/index' doesn't exist. Creating new index...
   [junit4]   2> 542419 T1332 oasc.CoreContainer.registerCore registering core: delLiveColl_shard1_replica1
   [junit4]   2> 542419 T1392 oasc.CachingDirectoryFactory.get return new directory for ../../../../../../../../../../../usr/home/hudson/hudson-slave/workspace/Lucene-Solr-NightlyTests-4.x/solr/build/solr-core/test/J0/./org.apache.solr.cloud.DeleteReplicaTest-jetty4-1384040947273/delLiveColl_shard2_replica1/data/index
   [junit4]   2> 542419 T1332 oasc.ZkController.register Register replica - core:delLiveColl_shard1_replica1 address:http://127.0.0.1:12968 collection:delLiveColl shard:shard1
   [junit4]   2> 542420 T1392 oasu.RandomMergePolicy.<init> RandomMergePolicy wrapping class org.apache.lucene.index.TieredMergePolicy: [TieredMergePolicy: maxMergeAtOnce=4, maxMergeAtOnceExplicit=4, maxMergedSegmentMB=99.8701171875, floorSegmentMB=1.3896484375, forceMergeDeletesPctAllowed=18.532459426534405, segmentsPerTier=17.0, maxCFSSegmentSizeMB=8.796093022207999E12, noCFSRatio=0.8593108586728143
   [junit4]   2> 542421 T1392 oasc.SolrDeletionPolicy.onCommit SolrDeletionPolicy.onCommit: commits: num=1
   [junit4]   2> 		commit{dir=MockDirectoryWrapper(org.apache.lucene.store.RAMDirectory@3aa368a4 lockFactory=org.apache.lucene.store.SingleInstanceLockFactory@785c964d),segFN=segments_1,generation=1}
   [junit4]   2> 542421 T1392 oasc.SolrDeletionPolicy.updateCommits newest commit generation = 1
   [junit4]   2> 542425 T1392 oasup.UpdateRequestProcessorChain.init creating updateRequestProcessorChain "nodistrib"
   [junit4]   2> 542425 T1392 oasup.UpdateRequestProcessorChain.init creating updateRequestProcessorChain "dedupe"
   [junit4]   2> 542426 T1392 oasup.UpdateRequestProcessorChain.init inserting DistributedUpdateProcessorFactory into updateRequestProcessorChain "dedupe"
   [junit4]   2> 542426 T1392 oasup.UpdateRequestProcessorChain.init creating updateRequestProcessorChain "stored_sig"
   [junit4]   2> 542427 T1392 oasup.UpdateRequestProcessorChain.init inserting DistributedUpdateProcessorFactory into updateRequestProcessorChain "stored_sig"
   [junit4]   2> 542427 T1392 oasup.UpdateRequestProcessorChain.init creating updateRequestProcessorChain "distrib-dup-test-chain-explicit"
   [junit4]   2> 542428 T1392 oasup.UpdateRequestProcessorChain.init creating updateRequestProcessorChain "distrib-dup-test-chain-implicit"
   [junit4]   2> 542428 T1392 oasup.UpdateRequestProcessorChain.init inserting DistributedUpdateProcessorFactory into updateRequestProcessorChain "distrib-dup-test-chain-implicit"
   [junit4]   2> 542428 T1392 oasc.SolrCore.loadUpdateProcessorChains no updateRequestProcessorChain defined as default, creating implicit default
   [junit4]   2> 542429 T1392 oasc.RequestHandlers.initHandlersFromConfig created standard: solr.StandardRequestHandler
   [junit4]   2> 542430 T1392 oasc.RequestHandlers.initHandlersFromConfig created /get: solr.RealTimeGetHandler
   [junit4]   2> 542430 T1392 oasc.RequestHandlers.initHandlersFromConfig adding lazy requestHandler: solr.ReplicationHandler
   [junit4]   2> 542430 T1392 oasc.RequestHandlers.initHandlersFromConfig created /replication: solr.ReplicationHandler
   [junit4]   2> 542431 T1392 oasc.RequestHandlers.initHandlersFromConfig created /update: solr.UpdateRequestHandler
   [junit4]   2> 542431 T1392 oasc.RequestHandlers.initHandlersFromConfig created /admin/: org.apache.solr.handler.admin.AdminHandlers
   [junit4]   2> 542433 T1392 oashl.XMLLoader.init xsltCacheLifetimeSeconds=60
   [junit4]   2> 542439 T1392 oasu.CommitTracker.<init> Hard AutoCommit: disabled
   [junit4]   2> 542439 T1392 oasu.CommitTracker.<init> Soft AutoCommit: disabled
   [junit4]   2> 542440 T1392 oasu.RandomMergePolicy.<init> RandomMergePolicy wrapping class org.apache.lucene.index.LogByteSizeMergePolicy: [LogByteSizeMergePolicy: minMergeSize=1677721, mergeFactor=20, maxMergeSize=2147483648, maxMergeSizeForForcedMerge=9223372036854775807, calibrateSizeByDeletes=false, maxMergeDocs=2147483647, maxCFSSegmentSizeMB=0.6357421875, noCFSRatio=0.5587512380297738]
   [junit4]   2> 542441 T1392 oa

[...truncated too long message...]

Transport(ClientCnxnSocketNIO.java:338)
   [junit4]   2> 	        at org.apache.zookeeper.ClientCnxn$SendThread.run(ClientCnxn.java:1068)
   [junit4]   2> 	   2) Thread[id=1407, name=TEST-DeleteReplicaTest.testDistribSearch-seed#[EA2FAB874C86BAC1]-EventThread, state=WAITING, group=TGRP-DeleteReplicaTest]
   [junit4]   2> 	        at sun.misc.Unsafe.park(Native Method)
   [junit4]   2> 	        at java.util.concurrent.locks.LockSupport.park(LockSupport.java:186)
   [junit4]   2> 	        at java.util.concurrent.locks.AbstractQueuedSynchronizer$ConditionObject.await(AbstractQueuedSynchronizer.java:2043)
   [junit4]   2> 	        at java.util.concurrent.LinkedBlockingQueue.take(LinkedBlockingQueue.java:386)
   [junit4]   2> 	        at org.apache.zookeeper.ClientCnxn$EventThread.run(ClientCnxn.java:491)
   [junit4]   2> 114072 T1319 ccr.ThreadLeakControl.tryToInterruptAll Starting to interrupt leaked threads:
   [junit4]   2> 	   1) Thread[id=1406, name=TEST-DeleteReplicaTest.testDistribSearch-seed#[EA2FAB874C86BAC1]-SendThread(localhost:12965), state=RUNNABLE, group=TGRP-DeleteReplicaTest]
   [junit4]   2> 	   2) Thread[id=1407, name=TEST-DeleteReplicaTest.testDistribSearch-seed#[EA2FAB874C86BAC1]-EventThread, state=WAITING, group=TGRP-DeleteReplicaTest]
   [junit4]   2> 645116 T1407 oaz.ClientCnxn$EventThread.run ERROR Event thread exiting due to interruption java.lang.InterruptedException
   [junit4]   2> 	at java.util.concurrent.locks.AbstractQueuedSynchronizer$ConditionObject.reportInterruptAfterWait(AbstractQueuedSynchronizer.java:2017)
   [junit4]   2> 	at java.util.concurrent.locks.AbstractQueuedSynchronizer$ConditionObject.await(AbstractQueuedSynchronizer.java:2052)
   [junit4]   2> 	at java.util.concurrent.LinkedBlockingQueue.take(LinkedBlockingQueue.java:386)
   [junit4]   2> 	at org.apache.zookeeper.ClientCnxn$EventThread.run(ClientCnxn.java:491)
   [junit4]   2> 
   [junit4]   2> 645617 T1406 oaz.ClientCnxn$SendThread.run WARN Unexpected exception java.lang.InterruptedException: sleep interrupted
   [junit4]   2> 	at java.lang.Thread.sleep(Native Method)
   [junit4]   2> 	at org.apache.zookeeper.ClientCnxn$SendThread.run(ClientCnxn.java:984)
   [junit4]   2> 
   [junit4]   2> 646118 T1406 oazc.StaticHostProvider.next WARN Unexpected exception java.lang.InterruptedException: sleep interrupted
   [junit4]   2> 	at java.lang.Thread.sleep(Native Method)
   [junit4]   2> 	at org.apache.zookeeper.client.StaticHostProvider.next(StaticHostProvider.java:86)
   [junit4]   2> 	at org.apache.zookeeper.ClientCnxn$SendThread.startConnect(ClientCnxn.java:937)
   [junit4]   2> 	at org.apache.zookeeper.ClientCnxn$SendThread.run(ClientCnxn.java:993)
   [junit4]   2> 
   [junit4]   2> 117080 T1319 ccr.ThreadLeakControl.tryToInterruptAll SEVERE There are still zombie threads that couldn't be terminated:
   [junit4]   2> 	   1) Thread[id=1406, name=TEST-DeleteReplicaTest.testDistribSearch-seed#[EA2FAB874C86BAC1]-SendThread(localhost:12965), state=RUNNABLE, group=TGRP-DeleteReplicaTest]
   [junit4]   2> 	        at sun.nio.ch.KqueueArrayWrapper.getKeventIdent(Native Method)
   [junit4]   2> 	        at sun.nio.ch.KqueueArrayWrapper.getDescriptor(KqueueArrayWrapper.java:121)
   [junit4]   2> 	        at sun.nio.ch.KqueueSelectorImpl.updateSelectedKeys(KqueueSelectorImpl.java:99)
   [junit4]   2> 	        at sun.nio.ch.KqueueSelectorImpl.doSelect(KqueueSelectorImpl.java:74)
   [junit4]   2> 	        at sun.nio.ch.SelectorImpl.lockAndDoSelect(SelectorImpl.java:87)
   [junit4]   2> 	        at sun.nio.ch.SelectorImpl.select(SelectorImpl.java:98)
   [junit4]   2> 	        at org.apache.zookeeper.ClientCnxnSocketNIO.doTransport(ClientCnxnSocketNIO.java:338)
   [junit4]   2> 	        at org.apache.zookeeper.ClientCnxn$SendThread.run(ClientCnxn.java:1068)
   [junit4]   2> NOTE: test params are: codec=Lucene41, sim=RandomSimilarityProvider(queryNorm=true,coord=crazy): {}, locale=ar_QA, timezone=Asia/Ust-Nera
   [junit4]   2> NOTE: FreeBSD 9.1-RELEASE-p3 amd64/Sun Microsystems Inc. 1.6.0_32 (64-bit)/cpus=16,threads=3,free=29694712,total=419889152
   [junit4]   2> NOTE: All tests run in this JVM: [ZkControllerTest, DistributedTermsComponentTest, ParsingFieldUpdateProcessorsTest, QueryElevationComponentTest, SolrCoreTest, SystemInfoHandlerTest, BlockDirectoryTest, TestMergePolicyConfig, TestCharFilters, HdfsUnloadDistributedZkTest, CircularListTest, DocValuesTest, SolrIndexSplitterTest, BadComponentTest, TestBM25SimilarityFactory, ClusterStateUpdateTest, CustomCollectionTest, OverseerCollectionProcessorTest, SpellPossibilityIteratorTest, QueryParsingTest, TestValueSourceCache, TestSolrQueryParser, UUIDFieldTest, DocumentBuilderTest, SolrInfoMBeanTest, TestMaxScoreQueryParser, SyncSliceTest, TestSolrDeletionPolicy1, DeleteReplicaTest]
   [junit4]   2> NOTE: download the large Jenkins line-docs file by running 'ant get-jenkins-line-docs' in the lucene directory.
   [junit4]   2> NOTE: reproduce with: ant test  -Dtestcase=DeleteReplicaTest -Dtests.seed=EA2FAB874C86BAC1 -Dtests.multiplier=2 -Dtests.nightly=true -Dtests.slow=true -Dtests.linedocsfile=/home/hudson/lucene-data/enwiki.random.lines.txt -Dtests.locale=ar_QA -Dtests.timezone=Asia/Ust-Nera -Dtests.file.encoding=ISO-8859-1
   [junit4] ERROR   0.00s J0 | DeleteReplicaTest (suite) <<<
   [junit4]    > Throwable #1: java.lang.AssertionError: ERROR: SolrZkClient opens=15 closes=14
   [junit4]    > 	at __randomizedtesting.SeedInfo.seed([EA2FAB874C86BAC1]:0)
   [junit4]    > 	at org.apache.solr.SolrTestCaseJ4.endTrackingZkClients(SolrTestCaseJ4.java:343)
   [junit4]    > 	at org.apache.solr.SolrTestCaseJ4.afterClass(SolrTestCaseJ4.java:135)
   [junit4]    > 	at java.lang.Thread.run(Thread.java:679)Throwable #2: com.carrotsearch.randomizedtesting.ThreadLeakError: 2 threads leaked from SUITE scope at org.apache.solr.cloud.DeleteReplicaTest: 
   [junit4]    >    1) Thread[id=1406, name=TEST-DeleteReplicaTest.testDistribSearch-seed#[EA2FAB874C86BAC1]-SendThread(localhost:12965), state=RUNNABLE, group=TGRP-DeleteReplicaTest]
   [junit4]    >         at sun.nio.ch.KqueueArrayWrapper.kevent(Native Method)
   [junit4]    >         at sun.nio.ch.KqueueArrayWrapper.poll(KqueueArrayWrapper.java:146)
   [junit4]    >         at sun.nio.ch.KqueueSelectorImpl.doSelect(KqueueSelectorImpl.java:69)
   [junit4]    >         at sun.nio.ch.SelectorImpl.lockAndDoSelect(SelectorImpl.java:87)
   [junit4]    >         at sun.nio.ch.SelectorImpl.select(SelectorImpl.java:98)
   [junit4]    >         at org.apache.zookeeper.ClientCnxnSocketNIO.doTransport(ClientCnxnSocketNIO.java:338)
   [junit4]    >         at org.apache.zookeeper.ClientCnxn$SendThread.run(ClientCnxn.java:1068)
   [junit4]    >    2) Thread[id=1407, name=TEST-DeleteReplicaTest.testDistribSearch-seed#[EA2FAB874C86BAC1]-EventThread, state=WAITING, group=TGRP-DeleteReplicaTest]
   [junit4]    >         at sun.misc.Unsafe.park(Native Method)
   [junit4]    >         at java.util.concurrent.locks.LockSupport.park(LockSupport.java:186)
   [junit4]    >         at java.util.concurrent.locks.AbstractQueuedSynchronizer$ConditionObject.await(AbstractQueuedSynchronizer.java:2043)
   [junit4]    >         at java.util.concurrent.LinkedBlockingQueue.take(LinkedBlockingQueue.java:386)
   [junit4]    >         at org.apache.zookeeper.ClientCnxn$EventThread.run(ClientCnxn.java:491)
   [junit4]    > 	at __randomizedtesting.SeedInfo.seed([EA2FAB874C86BAC1]:0)Throwable #3: com.carrotsearch.randomizedtesting.ThreadLeakError: There are still zombie threads that couldn't be terminated:
   [junit4]    >    1) Thread[id=1406, name=TEST-DeleteReplicaTest.testDistribSearch-seed#[EA2FAB874C86BAC1]-SendThread(localhost:12965), state=RUNNABLE, group=TGRP-DeleteReplicaTest]
   [junit4]    >         at sun.nio.ch.KqueueArrayWrapper.getKeventIdent(Native Method)
   [junit4]    >         at sun.nio.ch.KqueueArrayWrapper.getDescriptor(KqueueArrayWrapper.java:121)
   [junit4]    >         at sun.nio.ch.KqueueSelectorImpl.updateSelectedKeys(KqueueSelectorImpl.java:99)
   [junit4]    >         at sun.nio.ch.KqueueSelectorImpl.doSelect(KqueueSelectorImpl.java:74)
   [junit4]    >         at sun.nio.ch.SelectorImpl.lockAndDoSelect(SelectorImpl.java:87)
   [junit4]    >         at sun.nio.ch.SelectorImpl.select(SelectorImpl.java:98)
   [junit4]    >         at org.apache.zookeeper.ClientCnxnSocketNIO.doTransport(ClientCnxnSocketNIO.java:338)
   [junit4]    >         at org.apache.zookeeper.ClientCnxn$SendThread.run(ClientCnxn.java:1068)
   [junit4]    > 	at __randomizedtesting.SeedInfo.seed([EA2FAB874C86BAC1]:0)
   [junit4] Completed on J0 in 117.12s, 1 test, 1 failure, 3 errors <<< FAILURES!

[...truncated 838 lines...]
BUILD FAILED
/usr/home/hudson/hudson-slave/workspace/Lucene-Solr-NightlyTests-4.x/build.xml:435: The following error occurred while executing this line:
/usr/home/hudson/hudson-slave/workspace/Lucene-Solr-NightlyTests-4.x/build.xml:408: The following error occurred while executing this line:
/usr/home/hudson/hudson-slave/workspace/Lucene-Solr-NightlyTests-4.x/build.xml:39: The following error occurred while executing this line:
/usr/home/hudson/hudson-slave/workspace/Lucene-Solr-NightlyTests-4.x/solr/build.xml:189: The following error occurred while executing this line:
/usr/home/hudson/hudson-slave/workspace/Lucene-Solr-NightlyTests-4.x/solr/common-build.xml:483: The following error occurred while executing this line:
/usr/home/hudson/hudson-slave/workspace/Lucene-Solr-NightlyTests-4.x/lucene/common-build.xml:1275: The following error occurred while executing this line:
/usr/home/hudson/hudson-slave/workspace/Lucene-Solr-NightlyTests-4.x/lucene/common-build.xml:911: There were test failures: 335 suites, 1475 tests, 3 suite-level errors, 1 error, 910 ignored (1 assumption)

Total time: 95 minutes 50 seconds
Build step 'Invoke Ant' marked build as failure
Archiving artifacts
Recording test results
Email was triggered for: Failure
Sending email for trigger: Failure



Mime
View raw message