lucene-dev mailing list archives

Site index · List index
Message view « Date » · « Thread »
Top « Date » · « Thread »
From Mark Miller <markrmil...@gmail.com>
Subject Re: [JENKINS-MAVEN] Lucene-Solr-Maven-4.x #496: POMs out of sync
Date Sun, 03 Nov 2013 15:16:33 GMT
See the recent JIRA.

I’m currently collecting logging data from the fails.

- Mark

On Nov 3, 2013, at 9:53 AM, Uwe Schindler <uwe@thetaphi.de> wrote:

> The chaotic monkey strikes back, although it was attempted to be silenced by raising some timeouts! :( What did originally change so this test was failing so often in the last few days?
> 
> Uwe
> 
> -----
> Uwe Schindler
> H.-H.-Meier-Allee 63, D-28213 Bremen
> http://www.thetaphi.de
> eMail: uwe@thetaphi.de
> 
> 
>> -----Original Message-----
>> From: Apache Jenkins Server [mailto:jenkins@builds.apache.org]
>> Sent: Sunday, November 03, 2013 3:13 PM
>> To: dev@lucene.apache.org
>> Subject: [JENKINS-MAVEN] Lucene-Solr-Maven-4.x #496: POMs out of sync
>> 
>> Build: https://builds.apache.org/job/Lucene-Solr-Maven-4.x/496/
>> 
>> 3 tests failed.
>> FAILED:
>> org.apache.solr.cloud.ChaosMonkeyNothingIsSafeTest.org.apache.solr.cloud
>> .ChaosMonkeyNothingIsSafeTest
>> 
>> Error Message:
>> ERROR: SolrIndexSearcher opens=28 closes=27
>> 
>> Stack Trace:
>> java.lang.AssertionError: ERROR: SolrIndexSearcher opens=28 closes=27
>> 	at __randomizedtesting.SeedInfo.seed([73F997B05BF6CC1E]:0)
>> 	at org.junit.Assert.fail(Assert.java:93)
>> 	at
>> org.apache.solr.SolrTestCaseJ4.endTrackingSearchers(SolrTestCaseJ4.java:32
>> 8)
>> 	at org.apache.solr.SolrTestCaseJ4.afterClass(SolrTestCaseJ4.java:134)
>> 	at sun.reflect.GeneratedMethodAccessor10.invoke(Unknown
>> Source)
>> 	at
>> sun.reflect.DelegatingMethodAccessorImpl.invoke(DelegatingMethodAcces
>> sorImpl.java:43)
>> 	at java.lang.reflect.Method.invoke(Method.java:616)
>> 	at
>> com.carrotsearch.randomizedtesting.RandomizedRunner.invoke(Randomize
>> dRunner.java:1559)
>> 	at
>> com.carrotsearch.randomizedtesting.RandomizedRunner.access$600(Rando
>> mizedRunner.java:79)
>> 	at
>> com.carrotsearch.randomizedtesting.RandomizedRunner$5.evaluate(Rando
>> mizedRunner.java:700)
>> 	at
>> com.carrotsearch.randomizedtesting.rules.StatementAdapter.evaluate(Stat
>> ementAdapter.java:36)
>> 	at
>> com.carrotsearch.randomizedtesting.rules.SystemPropertiesRestoreRule$1.
>> evaluate(SystemPropertiesRestoreRule.java:53)
>> 	at
>> org.apache.lucene.util.AbstractBeforeAfterRule$1.evaluate(AbstractBeforeA
>> fterRule.java:46)
>> 	at
>> org.apache.lucene.util.TestRuleStoreClassName$1.evaluate(TestRuleStoreCl
>> assName.java:42)
>> 	at
>> com.carrotsearch.randomizedtesting.rules.SystemPropertiesInvariantRule$1
>> .evaluate(SystemPropertiesInvariantRule.java:55)
>> 	at
>> com.carrotsearch.randomizedtesting.rules.NoShadowingOrOverridesOnMet
>> hodsRule$1.evaluate(NoShadowingOrOverridesOnMethodsRule.java:39)
>> 	at
>> com.carrotsearch.randomizedtesting.rules.NoShadowingOrOverridesOnMet
>> hodsRule$1.evaluate(NoShadowingOrOverridesOnMethodsRule.java:39)
>> 	at
>> com.carrotsearch.randomizedtesting.rules.StatementAdapter.evaluate(Stat
>> ementAdapter.java:36)
>> 	at
>> org.apache.lucene.util.TestRuleAssertionsRequired$1.evaluate(TestRuleAss
>> ertionsRequired.java:43)
>> 	at
>> org.apache.lucene.util.TestRuleMarkFailure$1.evaluate(TestRuleMarkFailure
>> .java:48)
>> 	at
>> org.apache.lucene.util.TestRuleIgnoreAfterMaxFailures$1.evaluate(TestRule
>> IgnoreAfterMaxFailures.java:70)
>> 	at
>> org.apache.lucene.util.TestRuleIgnoreTestSuites$1.evaluate(TestRuleIgnore
>> TestSuites.java:55)
>> 	at
>> com.carrotsearch.randomizedtesting.rules.StatementAdapter.evaluate(Stat
>> ementAdapter.java:36)
>> 	at
>> com.carrotsearch.randomizedtesting.ThreadLeakControl$StatementRunner.
>> run(ThreadLeakControl.java:358)
>> 	at java.lang.Thread.run(Thread.java:679)
>> 
>> 
>> FAILED:
>> org.apache.solr.cloud.ChaosMonkeyNothingIsSafeTest.org.apache.solr.cloud
>> .ChaosMonkeyNothingIsSafeTest
>> 
>> Error Message:
>> 1 thread leaked from SUITE scope at
>> org.apache.solr.cloud.ChaosMonkeyNothingIsSafeTest:
>>   1) Thread[id=5371, name=searcherExecutor-3548-thread-1,
>> state=WAITING, group=TGRP-ChaosMonkeyNothingIsSafeTest]
>>        at sun.misc.Unsafe.park(Native Method)
>>        at java.util.concurrent.locks.LockSupport.park(LockSupport.java:186)
>>        at
>> java.util.concurrent.locks.AbstractQueuedSynchronizer$ConditionObject.aw
>> ait(AbstractQueuedSynchronizer.java:2043)
>>        at
>> java.util.concurrent.LinkedBlockingQueue.take(LinkedBlockingQueue.java:38
>> 6)
>>        at
>> java.util.concurrent.ThreadPoolExecutor.getTask(ThreadPoolExecutor.java:1
>> 069)
>>        at
>> java.util.concurrent.ThreadPoolExecutor.runWorker(ThreadPoolExecutor.jav
>> a:1131)
>>        at
>> java.util.concurrent.ThreadPoolExecutor$Worker.run(ThreadPoolExecutor.ja
>> va:615)
>>        at java.lang.Thread.run(Thread.java:679)
>> 
>> Stack Trace:
>> com.carrotsearch.randomizedtesting.ThreadLeakError: 1 thread leaked from
>> SUITE scope at org.apache.solr.cloud.ChaosMonkeyNothingIsSafeTest:
>>   1) Thread[id=5371, name=searcherExecutor-3548-thread-1,
>> state=WAITING, group=TGRP-ChaosMonkeyNothingIsSafeTest]
>>        at sun.misc.Unsafe.park(Native Method)
>>        at java.util.concurrent.locks.LockSupport.park(LockSupport.java:186)
>>        at
>> java.util.concurrent.locks.AbstractQueuedSynchronizer$ConditionObject.aw
>> ait(AbstractQueuedSynchronizer.java:2043)
>>        at
>> java.util.concurrent.LinkedBlockingQueue.take(LinkedBlockingQueue.java:38
>> 6)
>>        at
>> java.util.concurrent.ThreadPoolExecutor.getTask(ThreadPoolExecutor.java:1
>> 069)
>>        at
>> java.util.concurrent.ThreadPoolExecutor.runWorker(ThreadPoolExecutor.jav
>> a:1131)
>>        at
>> java.util.concurrent.ThreadPoolExecutor$Worker.run(ThreadPoolExecutor.ja
>> va:615)
>>        at java.lang.Thread.run(Thread.java:679)
>> 	at __randomizedtesting.SeedInfo.seed([73F997B05BF6CC1E]:0)
>> 
>> 
>> FAILED:
>> org.apache.solr.cloud.ChaosMonkeyNothingIsSafeTest.org.apache.solr.cloud
>> .ChaosMonkeyNothingIsSafeTest
>> 
>> Error Message:
>> There are still zombie threads that couldn't be terminated:
>>   1) Thread[id=5371, name=searcherExecutor-3548-thread-1,
>> state=WAITING, group=TGRP-ChaosMonkeyNothingIsSafeTest]
>>        at sun.misc.Unsafe.park(Native Method)
>>        at java.util.concurrent.locks.LockSupport.park(LockSupport.java:186)
>>        at
>> java.util.concurrent.locks.AbstractQueuedSynchronizer$ConditionObject.aw
>> ait(AbstractQueuedSynchronizer.java:2043)
>>        at
>> java.util.concurrent.LinkedBlockingQueue.take(LinkedBlockingQueue.java:38
>> 6)
>>        at
>> java.util.concurrent.ThreadPoolExecutor.getTask(ThreadPoolExecutor.java:1
>> 069)
>>        at
>> java.util.concurrent.ThreadPoolExecutor.runWorker(ThreadPoolExecutor.jav
>> a:1131)
>>        at
>> java.util.concurrent.ThreadPoolExecutor$Worker.run(ThreadPoolExecutor.ja
>> va:615)
>>        at java.lang.Thread.run(Thread.java:679)
>> 
>> Stack Trace:
>> com.carrotsearch.randomizedtesting.ThreadLeakError: There are still zombie
>> threads that couldn't be terminated:
>>   1) Thread[id=5371, name=searcherExecutor-3548-thread-1,
>> state=WAITING, group=TGRP-ChaosMonkeyNothingIsSafeTest]
>>        at sun.misc.Unsafe.park(Native Method)
>>        at java.util.concurrent.locks.LockSupport.park(LockSupport.java:186)
>>        at
>> java.util.concurrent.locks.AbstractQueuedSynchronizer$ConditionObject.aw
>> ait(AbstractQueuedSynchronizer.java:2043)
>>        at
>> java.util.concurrent.LinkedBlockingQueue.take(LinkedBlockingQueue.java:38
>> 6)
>>        at
>> java.util.concurrent.ThreadPoolExecutor.getTask(ThreadPoolExecutor.java:1
>> 069)
>>        at
>> java.util.concurrent.ThreadPoolExecutor.runWorker(ThreadPoolExecutor.jav
>> a:1131)
>>        at
>> java.util.concurrent.ThreadPoolExecutor$Worker.run(ThreadPoolExecutor.ja
>> va:615)
>>        at java.lang.Thread.run(Thread.java:679)
>> 	at __randomizedtesting.SeedInfo.seed([73F997B05BF6CC1E]:0)
>> 
>> 
>> 
>> 
>> Build Log:
>> [...truncated 34842 lines...]
>>      [mvn] java.lang.AssertionError: ERROR: SolrIndexSearcher opens=28
>> closes=27
>>      [mvn] 	at
>> __randomizedtesting.SeedInfo.seed([73F997B05BF6CC1E]:0)
>>      [mvn] 	at org.junit.Assert.fail(Assert.java:93)
>>      [mvn] 	at
>> org.apache.solr.SolrTestCaseJ4.endTrackingSearchers(SolrTestCaseJ4.java:32
>> 8)
>>      [mvn] 	at
>> org.apache.solr.SolrTestCaseJ4.afterClass(SolrTestCaseJ4.java:134)
>>      [mvn] 	at
>> sun.reflect.GeneratedMethodAccessor10.invoke(Unknown Source)
>>      [mvn] 	at
>> sun.reflect.DelegatingMethodAccessorImpl.invoke(DelegatingMethodAcces
>> sorImpl.java:43)
>>      [mvn] 	at java.lang.reflect.Method.invoke(Method.java:616)
>>      [mvn] 	at
>> com.carrotsearch.randomizedtesting.RandomizedRunner.invoke(Randomize
>> dRunner.java:1559)
>>      [mvn] 	at
>> com.carrotsearch.randomizedtesting.RandomizedRunner.access$600(Rando
>> mizedRunner.java:79)
>>      [mvn] 	at
>> com.carrotsearch.randomizedtesting.RandomizedRunner$5.evaluate(Rando
>> mizedRunner.java:700)
>>      [mvn] 	at
>> com.carrotsearch.randomizedtesting.rules.StatementAdapter.evaluate(Stat
>> ementAdapter.java:36)
>>      [mvn] 	at
>> com.carrotsearch.randomizedtesting.rules.SystemPropertiesRestoreRule$1.
>> evaluate(SystemPropertiesRestoreRule.java:53)
>>      [mvn] 	at
>> org.apache.lucene.util.AbstractBeforeAfterRule$1.evaluate(AbstractBeforeA
>> fterRule.java:46)
>>      [mvn] 	at
>> org.apache.lucene.util.TestRuleStoreClassName$1.evaluate(TestRuleStoreCl
>> assName.java:42)
>>      [mvn] 	at
>> com.carrotsearch.randomizedtesting.rules.SystemPropertiesInvariantRule$1
>> .evaluate(SystemPropertiesInvariantRule.java:55)
>>      [mvn] 	at
>> com.carrotsearch.randomizedtesting.rules.NoShadowingOrOverridesOnMet
>> hodsRule$1.evaluate(NoShadowingOrOverridesOnMethodsRule.java:39)
>>      [mvn] 	at
>> com.carrotsearch.randomizedtesting.rules.NoShadowingOrOverridesOnMet
>> hodsRule$1.evaluate(NoShadowingOrOverridesOnMethodsRule.java:39)
>>      [mvn] 	at
>> com.carrotsearch.randomizedtesting.rules.StatementAdapter.evaluate(Stat
>> ementAdapter.java:36)
>>      [mvn] 	at
>> org.apache.lucene.util.TestRuleAssertionsRequired$1.evaluate(TestRuleAss
>> ertionsRequired.java:43)
>>      [mvn] 	at
>> org.apache.lucene.util.TestRuleMarkFailure$1.evaluate(TestRuleMarkFailure
>> .java:48)
>>      [mvn] 	at
>> org.apache.lucene.util.TestRuleIgnoreAfterMaxFailures$1.evaluate(TestRule
>> IgnoreAfterMaxFailures.java:70)
>>      [mvn] 	at
>> org.apache.lucene.util.TestRuleIgnoreTestSuites$1.evaluate(TestRuleIgnore
>> TestSuites.java:55)
>>      [mvn] 	at
>> com.carrotsearch.randomizedtesting.rules.StatementAdapter.evaluate(Stat
>> ementAdapter.java:36)
>>      [mvn] 	at
>> com.carrotsearch.randomizedtesting.ThreadLeakControl$StatementRunner.
>> run(ThreadLeakControl.java:358)
>>      [mvn] 	at java.lang.Thread.run(Thread.java:679)
>>      [mvn]
>>      [mvn] org.apache.solr.cloud.ChaosMonkeyNothingIsSafeTest  Time
>> elapsed: 426.828 sec  <<< ERROR!
>>      [mvn] com.carrotsearch.randomizedtesting.ThreadLeakError: 1 thread
>> leaked from SUITE scope at
>> org.apache.solr.cloud.ChaosMonkeyNothingIsSafeTest:
>>      [mvn]    1) Thread[id=5371, name=searcherExecutor-3548-thread-1,
>> state=WAITING, group=TGRP-ChaosMonkeyNothingIsSafeTest]
>>      [mvn]         at sun.misc.Unsafe.park(Native Method)
>>      [mvn]         at
>> java.util.concurrent.locks.LockSupport.park(LockSupport.java:186)
>>      [mvn]         at
>> java.util.concurrent.locks.AbstractQueuedSynchronizer$ConditionObject.aw
>> ait(AbstractQueuedSynchronizer.java:2043)
>>      [mvn]         at
>> java.util.concurrent.LinkedBlockingQueue.take(LinkedBlockingQueue.java:38
>> 6)
>>      [mvn]         at
>> java.util.concurrent.ThreadPoolExecutor.getTask(ThreadPoolExecutor.java:1
>> 069)
>>      [mvn]         at
>> java.util.concurrent.ThreadPoolExecutor.runWorker(ThreadPoolExecutor.jav
>> a:1131)
>>      [mvn]         at
>> java.util.concurrent.ThreadPoolExecutor$Worker.run(ThreadPoolExecutor.ja
>> va:615)
>>      [mvn]         at java.lang.Thread.run(Thread.java:679)
>>      [mvn] 	at
>> __randomizedtesting.SeedInfo.seed([73F997B05BF6CC1E]:0)
>>      [mvn]
>>      [mvn] org.apache.solr.cloud.ChaosMonkeyNothingIsSafeTest  Time
>> elapsed: 426.829 sec  <<< ERROR!
>>      [mvn] com.carrotsearch.randomizedtesting.ThreadLeakError: There are
>> still zombie threads that couldn't be terminated:
>>      [mvn]    1) Thread[id=5371, name=searcherExecutor-3548-thread-1,
>> state=WAITING, group=TGRP-ChaosMonkeyNothingIsSafeTest]
>>      [mvn]         at sun.misc.Unsafe.park(Native Method)
>>      [mvn]         at
>> java.util.concurrent.locks.LockSupport.park(LockSupport.java:186)
>>      [mvn]         at
>> java.util.concurrent.locks.AbstractQueuedSynchronizer$ConditionObject.aw
>> ait(AbstractQueuedSynchronizer.java:2043)
>>      [mvn]         at
>> java.util.concurrent.LinkedBlockingQueue.take(LinkedBlockingQueue.java:38
>> 6)
>>      [mvn]         at
>> java.util.concurrent.ThreadPoolExecutor.getTask(ThreadPoolExecutor.java:1
>> 069)
>>      [mvn]         at
>> java.util.concurrent.ThreadPoolExecutor.runWorker(ThreadPoolExecutor.jav
>> a:1131)
>>      [mvn]         at
>> java.util.concurrent.ThreadPoolExecutor$Worker.run(ThreadPoolExecutor.ja
>> va:615)
>>      [mvn]         at java.lang.Thread.run(Thread.java:679)
>>      [mvn] 	at
>> __randomizedtesting.SeedInfo.seed([73F997B05BF6CC1E]:0)
>>      [mvn]
>>      [mvn] Running org.apache.solr.update.PeerSyncTest
>>      [mvn] Tests run: 2, Failures: 0, Errors: 0, Skipped: 2, Time elapsed: 0.001
>> sec - in org.apache.solr.update.PeerSyncTest
>>      [mvn] org.apache.solr.update.PeerSyncTest skipped
>>      [mvn] testDistribSearch(org.apache.solr.update.PeerSyncTest) skipped
>>      [mvn] Running org.apache.solr.core.TestCoreDiscovery
>>      [mvn] Tests run: 5, Failures: 0, Errors: 0, Skipped: 5, Time elapsed: 0 sec - in
>> org.apache.solr.core.TestCoreDiscovery
>>      [mvn] org.apache.solr.core.TestCoreDiscovery skipped
>>      [mvn] testNoCoreDir(org.apache.solr.core.TestCoreDiscovery) skipped
>>      [mvn] testDuplicateNames(org.apache.solr.core.TestCoreDiscovery)
>> skipped
>>      [mvn] testDiscovery(org.apache.solr.core.TestCoreDiscovery) skipped
>>      [mvn] testAlternateCoreDir(org.apache.solr.core.TestCoreDiscovery)
>> skipped
>>      [mvn] Running org.apache.solr.cloud.ZkCLITest
>>      [mvn] Tests run: 9, Failures: 0, Errors: 0, Skipped: 9, Time elapsed: 0.001
>> sec - in org.apache.solr.cloud.ZkCLITest
>>      [mvn] org.apache.solr.cloud.ZkCLITest skipped
>>      [mvn] testPut(org.apache.solr.cloud.ZkCLITest) skipped
>>      [mvn] testBootstrapWithChroot(org.apache.solr.cloud.ZkCLITest) skipped
>>      [mvn] testUpConfigLinkConfigClearZk(org.apache.solr.cloud.ZkCLITest)
>> skipped
>>      [mvn] testBootstrap(org.apache.solr.cloud.ZkCLITest) skipped
>>      [mvn] testMakePath(org.apache.solr.cloud.ZkCLITest) skipped
>>      [mvn] testPutFileNotExists(org.apache.solr.cloud.ZkCLITest) skipped
>>      [mvn] testList(org.apache.solr.cloud.ZkCLITest) skipped
>>      [mvn] testPutFile(org.apache.solr.cloud.ZkCLITest) skipped
>>      [mvn] Running org.apache.solr.schema.SynonymTokenizerTest
>>      [mvn] Tests run: 2, Failures: 0, Errors: 0, Skipped: 2, Time elapsed: 0 sec - in
>> org.apache.solr.schema.SynonymTokenizerTest
>>      [mvn] org.apache.solr.schema.SynonymTokenizerTest skipped
>>      [mvn]
>> testSchemaLoading(org.apache.solr.schema.SynonymTokenizerTest)
>> skipped
>>      [mvn] Running org.apache.solr.search.TestSurroundQueryParser
>>      [mvn] Tests run: 2, Failures: 0, Errors: 0, Skipped: 2, Time elapsed: 0 sec - in
>> org.apache.solr.search.TestSurroundQueryParser
>>      [mvn] org.apache.solr.search.TestSurroundQueryParser skipped
>>      [mvn]
>> testQueryParser(org.apache.solr.search.TestSurroundQueryParser) skipped
>>      [mvn] Running org.apache.solr.core.TestSolrDeletionPolicy2
>>      [mvn] Tests run: 2, Failures: 0, Errors: 0, Skipped: 2, Time elapsed: 0 sec - in
>> org.apache.solr.core.TestSolrDeletionPolicy2
>>      [mvn] org.apache.solr.core.TestSolrDeletionPolicy2 skipped
>>      [mvn]
>> testFakeDeletionPolicyClass(org.apache.solr.core.TestSolrDeletionPolicy2)
>> skipped
>>      [mvn] Running org.apache.solr.util.SimplePostToolTest
>>      [mvn] Tests run: 12, Failures: 0, Errors: 0, Skipped: 12, Time elapsed: 0 sec -
>> in org.apache.solr.util.SimplePostToolTest
>>      [mvn] org.apache.solr.util.SimplePostToolTest skipped
>>      [mvn] testComputeFullUrl(org.apache.solr.util.SimplePostToolTest)
>> skipped
>>      [mvn] testAppendUrlPath(org.apache.solr.util.SimplePostToolTest)
>> skipped
>>      [mvn] testAppendParam(org.apache.solr.util.SimplePostToolTest)
>> skipped
>>      [mvn] testDoFilesMode(org.apache.solr.util.SimplePostToolTest) skipped
>>      [mvn] testTypeSupported(org.apache.solr.util.SimplePostToolTest)
>> skipped
>>      [mvn] testRobotsExclusion(org.apache.solr.util.SimplePostToolTest)
>> skipped
>>      [mvn] testGuessType(org.apache.solr.util.SimplePostToolTest) skipped
>>      [mvn] testParseArgsAndInit(org.apache.solr.util.SimplePostToolTest)
>> skipped
>>      [mvn] testIsOn(org.apache.solr.util.SimplePostToolTest) skipped
>>      [mvn] testNormalizeUrlEnding(org.apache.solr.util.SimplePostToolTest)
>> skipped
>>      [mvn] testDoWebMode(org.apache.solr.util.SimplePostToolTest) skipped
>>      [mvn] Running org.apache.solr.cloud.hdfs.HdfsBasicDistributedZk2Test
>>      [mvn] Tests run: 2, Failures: 0, Errors: 0, Skipped: 2, Time elapsed: 0 sec - in
>> org.apache.solr.cloud.hdfs.HdfsBasicDistributedZk2Test
>>      [mvn] org.apache.solr.cloud.hdfs.HdfsBasicDistributedZk2Test skipped
>>      [mvn]
>> testDistribSearch(org.apache.solr.cloud.hdfs.HdfsBasicDistributedZk2Test)
>> skipped
>>      [mvn] Running org.apache.solr.search.TestReload
>>      [mvn] Tests run: 2, Failures: 0, Errors: 0, Skipped: 2, Time elapsed: 0 sec - in
>> org.apache.solr.search.TestReload
>>      [mvn] org.apache.solr.search.TestReload skipped
>>      [mvn] testGetRealtimeReload(org.apache.solr.search.TestReload)
>> skipped
>>      [mvn] Running
>> org.apache.solr.handler.admin.ShowFileRequestHandlerTest
>>      [mvn] Tests run: 5, Failures: 0, Errors: 0, Skipped: 5, Time elapsed: 0.001
>> sec - in org.apache.solr.handler.admin.ShowFileRequestHandlerTest
>>      [mvn] org.apache.solr.handler.admin.ShowFileRequestHandlerTest
>> skipped
>>      [mvn]
>> testGetRawFile(org.apache.solr.handler.admin.ShowFileRequestHandlerTest
>> ) skipped
>>      [mvn]
>> testDirList(org.apache.solr.handler.admin.ShowFileRequestHandlerTest)
>> skipped
>>      [mvn]
>> test404ViaHttp(org.apache.solr.handler.admin.ShowFileRequestHandlerTest
>> ) skipped
>>      [mvn]
>> test404Locally(org.apache.solr.handler.admin.ShowFileRequestHandlerTest)
>> skipped
>>      [mvn] Running
>> org.apache.solr.update.processor.ParsingFieldUpdateProcessorsTest
>>      [mvn] Tests run: 34, Failures: 0, Errors: 0, Skipped: 34, Time elapsed: 0.001
>> sec - in org.apache.solr.update.processor.ParsingFieldUpdateProcessorsTest
>>      [mvn]
>> org.apache.solr.update.processor.ParsingFieldUpdateProcessorsTest
>> skipped
>>      [mvn]
>> testFailedParseMixedLong(org.apache.solr.update.processor.ParsingFieldUp
>> dateProcessorsTest) skipped
>>      [mvn]
>> testIntOverflow(org.apache.solr.update.processor.ParsingFieldUpdateProce
>> ssorsTest) skipped
>>      [mvn]
>> testCascadingParsers(org.apache.solr.update.processor.ParsingFieldUpdate
>> ProcessorsTest) skipped
>>      [mvn]
>> testParseTrieFloatRoundTrip(org.apache.solr.update.processor.ParsingField
>> UpdateProcessorsTest) skipped
>>      [mvn]
>> testParseDoubleRoundTrip(org.apache.solr.update.processor.ParsingFieldU
>> pdateProcessorsTest) skipped
>>      [mvn]
>> testFailedParseMixedDouble(org.apache.solr.update.processor.ParsingField
>> UpdateProcessorsTest) skipped
>>      [mvn]
>> testParseTrieDateRoundTrip(org.apache.solr.update.processor.ParsingField
>> UpdateProcessorsTest) skipped
>>      [mvn]
>> testParseAlternateValueBooleans(org.apache.solr.update.processor.Parsing
>> FieldUpdateProcessorsTest) skipped
>>      [mvn]
>> testParseAlternateSingleValuesBooleans(org.apache.solr.update.processor.
>> ParsingFieldUpdateProcessorsTest) skipped
>>      [mvn]
>> testParseIntNonRootLocale(org.apache.solr.update.processor.ParsingFieldU
>> pdateProcessorsTest) skipped
>>      [mvn]
>> testMixedFloats(org.apache.solr.update.processor.ParsingFieldUpdateProce
>> ssorsTest) skipped
>>      [mvn]
>> testParseTrieIntRoundTrip(org.apache.solr.update.processor.ParsingFieldUp
>> dateProcessorsTest) skipped
>>      [mvn]
>> testParseTrieLongRoundTrip(org.apache.solr.update.processor.ParsingField
>> UpdateProcessorsTest) skipped
>>      [mvn]
>> testParseFloatRoundTrip(org.apache.solr.update.processor.ParsingFieldUpd
>> ateProcessorsTest) skipped
>>      [mvn]
>> testFailedParseMixedBoolean(org.apache.solr.update.processor.ParsingFiel
>> dUpdateProcessorsTest) skipped
>>      [mvn]
>> testFailedParseMixedFloat(org.apache.solr.update.processor.ParsingFieldUp
>> dateProcessorsTest) skipped
>>      [mvn]
>> testParseDateFormats(org.apache.solr.update.processor.ParsingFieldUpdat
>> eProcessorsTest) skipped
>>      [mvn]
>> testFailedParseMixedDate(org.apache.solr.update.processor.ParsingFieldUp
>> dateProcessorsTest) skipped
>>      [mvn]
>> testParseLongNonRootLocale(org.apache.solr.update.processor.ParsingField
>> UpdateProcessorsTest) skipped
>>      [mvn]
>> testParseTrieDoubleRoundTrip(org.apache.solr.update.processor.ParsingFiel
>> dUpdateProcessorsTest) skipped
>>      [mvn]
>> testParseDateExplicitNotInSchemaSelector(org.apache.solr.update.processo
>> r.ParsingFieldUpdateProcessorsTest) skipped
>>      [mvn]
>> testParseDateExplicitTypeClassSelector(org.apache.solr.update.processor.Pa
>> rsingFieldUpdateProcessorsTest) skipped
>>      [mvn]
>> testParseUSPacificDate(org.apache.solr.update.processor.ParsingFieldUpdat
>> eProcessorsTest) skipped
>>      [mvn]
>> testParseDoubleNonRootLocale(org.apache.solr.update.processor.ParsingFi
>> eldUpdateProcessorsTest) skipped
>>      [mvn]
>> testParseLongRoundTrip(org.apache.solr.update.processor.ParsingFieldUpd
>> ateProcessorsTest) skipped
>>      [mvn]
>> testParseDateFieldNotInSchema(org.apache.solr.update.processor.ParsingFi
>> eldUpdateProcessorsTest) skipped
>>      [mvn]
>> testParseDateNonUTCdefaultTimeZoneRoundTrip(org.apache.solr.update.pr
>> ocessor.ParsingFieldUpdateProcessorsTest) skipped
>>      [mvn]
>> testParseFloatNonRootLocale(org.apache.solr.update.processor.ParsingField
>> UpdateProcessorsTest) skipped
>>      [mvn]
>> testParseIntRoundTrip(org.apache.solr.update.processor.ParsingFieldUpdat
>> eProcessorsTest) skipped
>>      [mvn]
>> testParseFrenchDate(org.apache.solr.update.processor.ParsingFieldUpdate
>> ProcessorsTest) skipped
>>      [mvn]
>> testParseDateRoundTrip(org.apache.solr.update.processor.ParsingFieldUpd
>> ateProcessorsTest) skipped
>>      [mvn]
>> testFailedParseMixedInt(org.apache.solr.update.processor.ParsingFieldUpd
>> ateProcessorsTest) skipped
>>      [mvn]
>> testParseBooleanRoundTrip(org.apache.solr.update.processor.ParsingFieldU
>> pdateProcessorsTest) skipped
>>      [mvn] Running org.apache.solr.update.TestIndexingPerformance
>>      [mvn] Tests run: 2, Failures: 0, Errors: 0, Skipped: 2, Time elapsed: 0.009
>> sec - in org.apache.solr.update.TestIndexingPerformance
>>      [mvn] org.apache.solr.update.TestIndexingPerformance skipped
>>      [mvn]
>> testIndexingPerf(org.apache.solr.update.TestIndexingPerformance) skipped
>>      [mvn] Running org.apache.solr.highlight.TestPostingsSolrHighlighter
>>      [mvn] Tests run: 13, Failures: 0, Errors: 0, Skipped: 13, Time elapsed: 0.008
>> sec - in org.apache.solr.highlight.TestPostingsSolrHighlighter
>>      [mvn] org.apache.solr.highlight.TestPostingsSolrHighlighter skipped
>>      [mvn]
>> testEmptySnippet(org.apache.solr.highlight.TestPostingsSolrHighlighter)
>> skipped
>>      [mvn]
>> testDifferentField(org.apache.solr.highlight.TestPostingsSolrHighlighter)
>> skipped
>>      [mvn] testSimple(org.apache.solr.highlight.TestPostingsSolrHighlighter)
>> skipped
>>      [mvn] testEncoder(org.apache.solr.highlight.TestPostingsSolrHighlighter)
>> skipped
>>      [mvn]
>> testDefaultSummary(org.apache.solr.highlight.TestPostingsSolrHighlighter)
>> skipped
>>      [mvn] testTags(org.apache.solr.highlight.TestPostingsSolrHighlighter)
>> skipped
>>      [mvn]
>> testTwoFields(org.apache.solr.highlight.TestPostingsSolrHighlighter) skipped
>>      [mvn]
>> testBreakIterator2(org.apache.solr.highlight.TestPostingsSolrHighlighter)
>> skipped
>>      [mvn]
>> testTagsPerField(org.apache.solr.highlight.TestPostingsSolrHighlighter)
>> skipped
>>      [mvn]
>> testBreakIterator(org.apache.solr.highlight.TestPostingsSolrHighlighter)
>> skipped
>>      [mvn]
>> testMisconfiguredField(org.apache.solr.highlight.TestPostingsSolrHighlighter
>> ) skipped
>>      [mvn]
>> testPagination(org.apache.solr.highlight.TestPostingsSolrHighlighter) skipped
>>      [mvn] Running org.apache.solr.analysis.LegacyHTMLStripCharFilterTest
>>      [mvn] Tests run: 14, Failures: 0, Errors: 0, Skipped: 14, Time elapsed: 0.006
>> sec - in org.apache.solr.analysis.LegacyHTMLStripCharFilterTest
>>      [mvn] org.apache.solr.analysis.LegacyHTMLStripCharFilterTest skipped
>>      [mvn]
>> testComment(org.apache.solr.analysis.LegacyHTMLStripCharFilterTest)
>> skipped
>>      [mvn]
>> testOffsets(org.apache.solr.analysis.LegacyHTMLStripCharFilterTest) skipped
>>      [mvn]
>> testEntities(org.apache.solr.analysis.LegacyHTMLStripCharFilterTest) skipped
>>      [mvn] testHTML(org.apache.solr.analysis.LegacyHTMLStripCharFilterTest)
>> skipped
>>      [mvn]
>> testBufferOverflow(org.apache.solr.analysis.LegacyHTMLStripCharFilterTest)
>> skipped
>>      [mvn]
>> testMalformedHTML(org.apache.solr.analysis.LegacyHTMLStripCharFilterTes
>> t) skipped
>>      [mvn]
>> testRandom(org.apache.solr.analysis.LegacyHTMLStripCharFilterTest)
>> skipped
>>      [mvn]
>> testReserved(org.apache.solr.analysis.LegacyHTMLStripCharFilterTest)
>> skipped
>>      [mvn] test(org.apache.solr.analysis.LegacyHTMLStripCharFilterTest)
>> skipped
>>      [mvn]
>> testMoreEntities(org.apache.solr.analysis.LegacyHTMLStripCharFilterTest)
>> skipped
>>      [mvn]
>> testRandomBrokenHTML(org.apache.solr.analysis.LegacyHTMLStripCharFilte
>> rTest) skipped
>>      [mvn]
>> testRandomText(org.apache.solr.analysis.LegacyHTMLStripCharFilterTest)
>> skipped
>>      [mvn]
>> testGamma(org.apache.solr.analysis.LegacyHTMLStripCharFilterTest)
>> skipped
>>      [mvn] Running
>> org.apache.solr.search.similarities.TestLMDirichletSimilarityFactory
>>      [mvn] Tests run: 3, Failures: 0, Errors: 0, Skipped: 3, Time elapsed: 0.006
>> sec - in org.apache.solr.search.similarities.TestLMDirichletSimilarityFactory
>>      [mvn] org.apache.solr.search.similarities.TestLMDirichletSimilarityFactory
>> skipped
>>      [mvn]
>> testParameters(org.apache.solr.search.similarities.TestLMDirichletSimilarityF
>> actory) skipped
>>      [mvn]
>> test(org.apache.solr.search.similarities.TestLMDirichletSimilarityFactory)
>> skipped
>>      [mvn] Running org.apache.solr.cloud.DeleteShardTest
>>      [mvn] Tests run: 2, Failures: 0, Errors: 0, Skipped: 2, Time elapsed: 0.01 sec
>> - in org.apache.solr.cloud.DeleteShardTest
>>      [mvn] org.apache.solr.cloud.DeleteShardTest skipped
>>      [mvn] testDistribSearch(org.apache.solr.cloud.DeleteShardTest) skipped
>>      [mvn] Running org.apache.solr.cloud.BasicZkTest
>>      [mvn] Tests run: 2, Failures: 0, Errors: 0, Skipped: 2, Time elapsed: 0.006
>> sec - in org.apache.solr.cloud.BasicZkTest
>>      [mvn] org.apache.solr.cloud.BasicZkTest skipped
>>      [mvn] testBasic(org.apache.solr.cloud.BasicZkTest) skipped
>>      [mvn] Running org.apache.solr.cloud.RecoveryZkTest
>>      [mvn] Tests run: 2, Failures: 0, Errors: 0, Skipped: 2, Time elapsed: 0.011
>> sec - in org.apache.solr.cloud.RecoveryZkTest
>>      [mvn] org.apache.solr.cloud.RecoveryZkTest skipped
>>      [mvn] testDistribSearch(org.apache.solr.cloud.RecoveryZkTest) skipped
>>      [mvn] Running org.apache.solr.cloud.hdfs.HdfsRecoveryZkTest
>>      [mvn] Tests run: 2, Failures: 0, Errors: 0, Skipped: 2, Time elapsed: 0.011
>> sec - in org.apache.solr.cloud.hdfs.HdfsRecoveryZkTest
>>      [mvn] org.apache.solr.cloud.hdfs.HdfsRecoveryZkTest skipped
>>      [mvn] testDistribSearch(org.apache.solr.cloud.hdfs.HdfsRecoveryZkTest)
>> skipped
>>      [mvn] Running org.apache.solr.highlight.HighlighterConfigTest
>>      [mvn] Tests run: 2, Failures: 0, Errors: 0, Skipped: 2, Time elapsed: 0.007
>> sec - in org.apache.solr.highlight.HighlighterConfigTest
>>      [mvn] org.apache.solr.highlight.HighlighterConfigTest skipped
>>      [mvn] testConfig(org.apache.solr.highlight.HighlighterConfigTest) skipped
>>      [mvn] Running org.apache.solr.search.TestMaxScoreQueryParser
>>      [mvn] Tests run: 7, Failures: 0, Errors: 0, Skipped: 7, Time elapsed: 0.008
>> sec - in org.apache.solr.search.TestMaxScoreQueryParser
>>      [mvn] org.apache.solr.search.TestMaxScoreQueryParser skipped
>>      [mvn] testPureMax(org.apache.solr.search.TestMaxScoreQueryParser)
>> skipped
>>      [mvn]
>> testNoShouldClauses(org.apache.solr.search.TestMaxScoreQueryParser)
>> skipped
>>      [mvn] testBoost(org.apache.solr.search.TestMaxScoreQueryParser)
>> skipped
>>      [mvn]
>> testFallbackToLucene(org.apache.solr.search.TestMaxScoreQueryParser)
>> skipped
>>      [mvn]
>> testMaxAndProhibited(org.apache.solr.search.TestMaxScoreQueryParser)
>> skipped
>>      [mvn] testTie(org.apache.solr.search.TestMaxScoreQueryParser) skipped
>>      [mvn] Running org.apache.solr.core.SolrCoreTest
>>      [mvn] Tests run: 7, Failures: 0, Errors: 0, Skipped: 7, Time elapsed: 0.007
>> sec - in org.apache.solr.core.SolrCoreTest
>>      [mvn] org.apache.solr.core.SolrCoreTest skipped
>>      [mvn] testRequestHandlerRegistry(org.apache.solr.core.SolrCoreTest)
>> skipped
>>      [mvn]
>> testRemoveThenAddDefaultCore(org.apache.solr.core.SolrCoreTest)
>> skipped
>>      [mvn] testClose(org.apache.solr.core.SolrCoreTest) skipped
>>      [mvn] testRefCount(org.apache.solr.core.SolrCoreTest) skipped
>>      [mvn] testRefCountMT(org.apache.solr.core.SolrCoreTest) skipped
>>      [mvn] testInfoRegistry(org.apache.solr.core.SolrCoreTest) skipped
>>      [mvn] Running
>> org.apache.solr.handler.component.SpellCheckComponentTest
>>      [mvn] Tests run: 10, Failures: 0, Errors: 0, Skipped: 10, Time elapsed: 0.007
>> sec - in org.apache.solr.handler.component.SpellCheckComponentTest
>>      [mvn] org.apache.solr.handler.component.SpellCheckComponentTest
>> skipped
>>      [mvn]
>> testReloadOnStart(org.apache.solr.handler.component.SpellCheckCompone
>> ntTest) skipped
>>      [mvn]
>> test(org.apache.solr.handler.component.SpellCheckComponentTest)
>> skipped
>>      [mvn]
>> testPerDictionary(org.apache.solr.handler.component.SpellCheckComponen
>> tTest) skipped
>>      [mvn]
>> testCollate(org.apache.solr.handler.component.SpellCheckComponentTest)
>> skipped
>>      [mvn]
>> testCorrectSpelling(org.apache.solr.handler.component.SpellCheckCompon
>> entTest) skipped
>>      [mvn]
>> testExtendedResultsCount(org.apache.solr.handler.component.SpellCheckC
>> omponentTest) skipped
>>      [mvn]
>> testThresholdTokenFrequency(org.apache.solr.handler.component.SpellChe
>> ckComponentTest) skipped
>>      [mvn]
>> testRebuildOnCommit(org.apache.solr.handler.component.SpellCheckComp
>> onentTest) skipped
>>      [mvn]
>> testRelativeIndexDirLocation(org.apache.solr.handler.component.SpellChec
>> kComponentTest) skipped
>>      [mvn] Running org.apache.solr.handler.MoreLikeThisHandlerTest
>>      [mvn] Tests run: 2, Failures: 0, Errors: 0, Skipped: 2, Time elapsed: 0.006
>> sec - in org.apache.solr.handler.MoreLikeThisHandlerTest
>>      [mvn] org.apache.solr.handler.MoreLikeThisHandlerTest skipped
>>      [mvn] testInterface(org.apache.solr.handler.MoreLikeThisHandlerTest)
>> skipped
>>      [mvn] Running org.apache.solr.update.HardAutoCommitTest
>>      [mvn] Tests run: 2, Failures: 0, Errors: 0, Skipped: 2, Time elapsed: 0.006
>> sec - in org.apache.solr.update.HardAutoCommitTest
>>      [mvn] org.apache.solr.update.HardAutoCommitTest skipped
>>      [mvn] testCommitWithin(org.apache.solr.update.HardAutoCommitTest)
>> skipped
>>      [mvn] Running org.apache.solr.TestDocumentBuilder
>>      [mvn] Tests run: 2, Failures: 0, Errors: 0, Skipped: 2, Time elapsed: 0.003
>> sec - in org.apache.solr.TestDocumentBuilder
>>      [mvn] org.apache.solr.TestDocumentBuilder skipped
>>      [mvn] testDeepCopy(org.apache.solr.TestDocumentBuilder) skipped
>>      [mvn] Running org.apache.solr.core.RequestHandlersTest
>>      [mvn] Tests run: 5, Failures: 0, Errors: 0, Skipped: 5, Time elapsed: 0.006
>> sec - in org.apache.solr.core.RequestHandlersTest
>>      [mvn] org.apache.solr.core.RequestHandlersTest skipped
>>      [mvn] testLazyLoading(org.apache.solr.core.RequestHandlersTest)
>> skipped
>>      [mvn] testPathNormalization(org.apache.solr.core.RequestHandlersTest)
>> skipped
>>      [mvn] testInitCount(org.apache.solr.core.RequestHandlersTest) skipped
>>      [mvn] testStatistics(org.apache.solr.core.RequestHandlersTest) skipped
>>      [mvn] Running org.apache.solr.cloud.CollectionsAPIDistributedZkTest
>>      [mvn] Tests run: 2, Failures: 0, Errors: 0, Skipped: 2, Time elapsed: 0.018
>> sec - in org.apache.solr.cloud.CollectionsAPIDistributedZkTest
>>      [mvn] org.apache.solr.cloud.CollectionsAPIDistributedZkTest skipped
>>      [mvn]
>> testDistribSearch(org.apache.solr.cloud.CollectionsAPIDistributedZkTest)
>> skipped
>>      [mvn] Running org.apache.solr.schema.PolyFieldTest
>>      [mvn] Tests run: 5, Failures: 0, Errors: 0, Skipped: 5, Time elapsed: 0.006
>> sec - in org.apache.solr.schema.PolyFieldTest
>>      [mvn] org.apache.solr.schema.PolyFieldTest skipped
>>      [mvn] testSchemaBasics(org.apache.solr.schema.PolyFieldTest) skipped
>>      [mvn] testSearchDetails(org.apache.solr.schema.PolyFieldTest) skipped
>>      [mvn] testSearching(org.apache.solr.schema.PolyFieldTest) skipped
>>      [mvn] testPointFieldType(org.apache.solr.schema.PolyFieldTest) skipped
>>      [mvn] Running org.apache.solr.request.TestBinaryResponseWriter
>>      [mvn] Tests run: 3, Failures: 0, Errors: 0, Skipped: 3, Time elapsed: 0.006
>> sec - in org.apache.solr.request.TestBinaryResponseWriter
>>      [mvn] org.apache.solr.request.TestBinaryResponseWriter skipped
>>      [mvn] testUUID(org.apache.solr.request.TestBinaryResponseWriter)
>> skipped
>>      [mvn]
>> testResolverSolrDocumentPartialFields(org.apache.solr.request.TestBinaryR
>> esponseWriter) skipped
>>      [mvn] Running org.apache.solr.rest.schema.TestSchemaResource
>>      [mvn] Tests run: 4, Failures: 0, Errors: 0, Skipped: 4, Time elapsed: 0.007
>> sec - in org.apache.solr.rest.schema.TestSchemaResource
>>      [mvn] org.apache.solr.rest.schema.TestSchemaResource skipped
>>      [mvn]
>> testXMLResponse(org.apache.solr.rest.schema.TestSchemaResource)
>> skipped
>>      [mvn]
>> testSchemaXmlResponse(org.apache.solr.rest.schema.TestSchemaResource
>> ) skipped
>>      [mvn]
>> testJSONResponse(org.apache.solr.rest.schema.TestSchemaResource)
>> skipped
>>      [mvn] Running org.apache.solr.spelling.suggest.SuggesterTSTTest
>>      [mvn] Tests run: 5, Failures: 0, Errors: 0, Skipped: 5, Time elapsed: 0.006
>> sec - in org.apache.solr.spelling.suggest.SuggesterTSTTest
>>      [mvn] org.apache.solr.spelling.suggest.SuggesterTSTTest skipped
>>      [mvn] testRebuild(org.apache.solr.spelling.suggest.SuggesterTSTTest)
>> skipped
>>      [mvn]
>> testSuggestions(org.apache.solr.spelling.suggest.SuggesterTSTTest) skipped
>>      [mvn] testReload(org.apache.solr.spelling.suggest.SuggesterTSTTest)
>> skipped
>>      [mvn] testAnalyzer(org.apache.solr.spelling.suggest.SuggesterTSTTest)
>> skipped
>>      [mvn] Running org.apache.solr.internal.csv.writer.CSVWriterTest
>>      [mvn] Tests run: 2, Failures: 0, Errors: 0, Skipped: 0, Time elapsed: 0.001
>> sec - in org.apache.solr.internal.csv.writer.CSVWriterTest
>>      [mvn] testCSVConfig(org.apache.solr.internal.csv.writer.CSVWriterTest)
>> Time elapsed: 0 sec
>>      [mvn] testWriter(org.apache.solr.internal.csv.writer.CSVWriterTest)  Time
>> elapsed: 0.001 sec
>>      [mvn] Running org.apache.solr.core.RAMDirectoryFactoryTest
>>      [mvn] Tests run: 2, Failures: 0, Errors: 0, Skipped: 2, Time elapsed: 0.004
>> sec - in org.apache.solr.core.RAMDirectoryFactoryTest
>>      [mvn] org.apache.solr.core.RAMDirectoryFactoryTest skipped
>>      [mvn] test(org.apache.solr.core.RAMDirectoryFactoryTest) skipped
>>      [mvn] Running org.apache.solr.core.CachingDirectoryFactoryTest
>>      [mvn] Tests run: 2, Failures: 0, Errors: 0, Skipped: 2, Time elapsed: 0.008
>> sec - in org.apache.solr.core.CachingDirectoryFactoryTest
>>      [mvn] org.apache.solr.core.CachingDirectoryFactoryTest skipped
>>      [mvn] stressTest(org.apache.solr.core.CachingDirectoryFactoryTest)
>> skipped
>>      [mvn] Running org.apache.solr.SampleTest
>>      [mvn] Tests run: 3, Failures: 0, Errors: 0, Skipped: 3, Time elapsed: 0.007
>> sec - in org.apache.solr.SampleTest
>>      [mvn] org.apache.solr.SampleTest skipped
>>      [mvn] testAdvanced(org.apache.solr.SampleTest) skipped
>>      [mvn] testSimple(org.apache.solr.SampleTest) skipped
>>      [mvn] Running org.apache.solr.search.TestRealTimeGet
>>      [mvn] Tests run: 5, Failures: 0, Errors: 0, Skipped: 5, Time elapsed: 0.007
>> sec - in org.apache.solr.search.TestRealTimeGet
>>      [mvn] org.apache.solr.search.TestRealTimeGet skipped
>>      [mvn] testStressGetRealtime(org.apache.solr.search.TestRealTimeGet)
>> skipped
>>      [mvn] testOptimisticLocking(org.apache.solr.search.TestRealTimeGet)
>> skipped
>>      [mvn] testGetRealtime(org.apache.solr.search.TestRealTimeGet) skipped
>>      [mvn] testVersions(org.apache.solr.search.TestRealTimeGet) skipped
>>      [mvn] Running org.apache.solr.internal.csv.writer.CSVFieldTest
>>      [mvn] Tests run: 2, Failures: 0, Errors: 0, Skipped: 0, Time elapsed: 0 sec - in
>> org.apache.solr.internal.csv.writer.CSVFieldTest
>>      [mvn] testCSVField(org.apache.solr.internal.csv.writer.CSVFieldTest)
>> Time elapsed: 0 sec
>>      [mvn] testFill(org.apache.solr.internal.csv.writer.CSVFieldTest)  Time
>> elapsed: 0 sec
>>      [mvn] Running
>> org.apache.solr.handler.component.TermVectorComponentTest
>>      [mvn] Tests run: 4, Failures: 0, Errors: 0, Skipped: 4, Time elapsed: 0.006
>> sec - in org.apache.solr.handler.component.TermVectorComponentTest
>>      [mvn] org.apache.solr.handler.component.TermVectorComponentTest
>> skipped
>>      [mvn]
>> testBasics(org.apache.solr.handler.component.TermVectorComponentTest)
>> skipped
>>      [mvn]
>> testOptions(org.apache.solr.handler.component.TermVectorComponentTes
>> t) skipped
>>      [mvn]
>> testPerField(org.apache.solr.handler.component.TermVectorComponentTes
>> t) skipped
>>      [mvn] Running org.apache.solr.core.TestNonNRTOpen
>>      [mvn] Tests run: 3, Failures: 0, Errors: 0, Skipped: 3, Time elapsed: 0.007
>> sec - in org.apache.solr.core.TestNonNRTOpen
>>      [mvn] org.apache.solr.core.TestNonNRTOpen skipped
>>      [mvn] testReaderIsNotNRT(org.apache.solr.core.TestNonNRTOpen)
>> skipped
>>      [mvn] testSharedCores(org.apache.solr.core.TestNonNRTOpen) skipped
>>      [mvn] Running org.apache.solr.schema.DocValuesMultiTest
>>      [mvn] Tests run: 5, Failures: 0, Errors: 0, Skipped: 5, Time elapsed: 0.006
>> sec - in org.apache.solr.schema.DocValuesMultiTest
>>      [mvn] org.apache.solr.schema.DocValuesMultiTest skipped
>>      [mvn]
>> testFloatDocValuesMatch(org.apache.solr.schema.DocValuesMultiTest)
>> skipped
>>      [mvn]
>> testDocValuesFacetingSimple(org.apache.solr.schema.DocValuesMultiTest)
>> skipped
>>      [mvn]
>> testStringDocValuesMatch(org.apache.solr.schema.DocValuesMultiTest)
>> skipped
>>      [mvn] testDocValues(org.apache.solr.schema.DocValuesMultiTest)
>> skipped
>>      [mvn] Running org.apache.solr.cloud.hdfs.HdfsUnloadDistributedZkTest
>>      [mvn] Tests run: 2, Failures: 0, Errors: 0, Skipped: 2, Time elapsed: 0.012
>> sec - in org.apache.solr.cloud.hdfs.HdfsUnloadDistributedZkTest
>>      [mvn] org.apache.solr.cloud.hdfs.HdfsUnloadDistributedZkTest skipped
>>      [mvn]
>> testDistribSearch(org.apache.solr.cloud.hdfs.HdfsUnloadDistributedZkTest)
>> skipped
>>      [mvn] Running org.apache.solr.request.SimpleFacetsTest
>>      [mvn] Tests run: 33, Failures: 0, Errors: 0, Skipped: 33, Time elapsed: 0.012
>> sec - in org.apache.solr.request.SimpleFacetsTest
>>      [mvn] org.apache.solr.request.SimpleFacetsTest skipped
>>      [mvn]
>> testFacetPrefixSingleValued(org.apache.solr.request.SimpleFacetsTest)
>> skipped
>>      [mvn]
>> testNumericRangeFacetsOverflowTrieDouble(org.apache.solr.request.Simpl
>> eFacetsTest) skipped
>>      [mvn] testEmptyFacetCounts(org.apache.solr.request.SimpleFacetsTest)
>> skipped
>>      [mvn] testDateFacetsWithTz(org.apache.solr.request.SimpleFacetsTest)
>> skipped
>>      [mvn]
>> testNumericRangeFacetsOverflowSortableDouble(org.apache.solr.request.Si
>> mpleFacetsTest) skipped
>>      [mvn] testDateFacets(org.apache.solr.request.SimpleFacetsTest) skipped
>>      [mvn]
>> testFacetPrefixSingleValuedFcs(org.apache.solr.request.SimpleFacetsTest)
>> skipped
>>      [mvn]
>> testNumericRangeFacetsOverflowTrieLong(org.apache.solr.request.SimpleF
>> acetsTest) skipped
>>      [mvn]
>> testNumericRangeFacetsSortableFloat(org.apache.solr.request.SimpleFacets
>> Test) skipped
>>      [mvn]
>> testSimpleGroupedFacets(org.apache.solr.request.SimpleFacetsTest)
>> skipped
>>      [mvn]
>> testNumericRangeFacetsTrieLong(org.apache.solr.request.SimpleFacetsTest
>> ) skipped
>>      [mvn]
>> testTrieDateRangeFacetsWithIncludeOption(org.apache.solr.request.Simple
>> FacetsTest) skipped
>>      [mvn]
>> testDateFacetsWithIncludeOption(org.apache.solr.request.SimpleFacetsTest
>> ) skipped
>>      [mvn]
>> testTrieDateRangeFacets(org.apache.solr.request.SimpleFacetsTest) skipped
>>      [mvn]
>> testNumericRangeFacetsTrieInt(org.apache.solr.request.SimpleFacetsTest)
>> skipped
>>      [mvn]
>> testRangeFacetInfiniteLoopDetection(org.apache.solr.request.SimpleFacets
>> Test) skipped
>>      [mvn]
>> testNumericRangeFacetsTrieDouble(org.apache.solr.request.SimpleFacetsTe
>> st) skipped
>>      [mvn] testFacetSingleValued(org.apache.solr.request.SimpleFacetsTest)
>> skipped
>>      [mvn]
>> testNumericRangeFacetsOverflowSortableLong(org.apache.solr.request.Sim
>> pleFacetsTest) skipped
>>      [mvn]
>> testDateRangeFacetsWithIncludeOption(org.apache.solr.request.SimpleFace
>> tsTest) skipped
>>      [mvn] testCachingBigTerms(org.apache.solr.request.SimpleFacetsTest)
>> skipped
>>      [mvn] testSimpleFacetCounts(org.apache.solr.request.SimpleFacetsTest)
>> skipped
>>      [mvn]
>> testNumericRangeFacetsTrieFloat(org.apache.solr.request.SimpleFacetsTest
>> ) skipped
>>      [mvn]
>> testFacetSingleValuedFcs(org.apache.solr.request.SimpleFacetsTest)
>> skipped
>>      [mvn]
>> testFacetPrefixMultiValued(org.apache.solr.request.SimpleFacetsTest)
>> skipped
>>      [mvn] testDateRangeFacets(org.apache.solr.request.SimpleFacetsTest)
>> skipped
>>      [mvn]
>> testTrieDateFacetsWithIncludeOption(org.apache.solr.request.SimpleFacets
>> Test) skipped
>>      [mvn]
>> testNumericRangeFacetsSortableInt(org.apache.solr.request.SimpleFacetsT
>> est) skipped
>>      [mvn] testTrieDateFacets(org.apache.solr.request.SimpleFacetsTest)
>> skipped
>>      [mvn]
>> testNumericRangeFacetsSortableDouble(org.apache.solr.request.SimpleFac
>> etsTest) skipped
>>      [mvn]
>> testSimpleGroupedQueryRangeFacets(org.apache.solr.request.SimpleFacets
>> Test) skipped
>>      [mvn]
>> testNumericRangeFacetsSortableLong(org.apache.solr.request.SimpleFacets
>> Test) skipped
>>      [mvn] Running org.apache.solr.handler.CSVRequestHandlerTest
>>      [mvn] Tests run: 2, Failures: 0, Errors: 0, Skipped: 2, Time elapsed: 0.005
>> sec - in org.apache.solr.handler.CSVRequestHandlerTest
>>      [mvn] org.apache.solr.handler.CSVRequestHandlerTest skipped
>>      [mvn]
>> testCommitWithin(org.apache.solr.handler.CSVRequestHandlerTest)
>> skipped
>>      [mvn] Running org.apache.solr.core.TestMergePolicyConfig
>>      [mvn] Tests run: 5, Failures: 0, Errors: 0, Skipped: 5, Time elapsed: 0.006
>> sec - in org.apache.solr.core.TestMergePolicyConfig
>>      [mvn] org.apache.solr.core.TestMergePolicyConfig skipped
>>      [mvn]
>> testLegacyMergePolicyConfig(org.apache.solr.core.TestMergePolicyConfig)
>> skipped
>>      [mvn]
>> testDefaultMergePolicyConfig(org.apache.solr.core.TestMergePolicyConfig)
>> skipped
>>      [mvn]
>> testTieredMergePolicyConfig(org.apache.solr.core.TestMergePolicyConfig)
>> skipped
>>      [mvn]
>> testLogMergePolicyConfig(org.apache.solr.core.TestMergePolicyConfig)
>> skipped
>>      [mvn] Running org.apache.solr.spelling.suggest.SuggesterTest
>>      [mvn] Tests run: 5, Failures: 0, Errors: 0, Skipped: 5, Time elapsed: 0.006
>> sec - in org.apache.solr.spelling.suggest.SuggesterTest
>>      [mvn] org.apache.solr.spelling.suggest.SuggesterTest skipped
>>      [mvn] testAnalyzer(org.apache.solr.spelling.suggest.SuggesterTest)
>> skipped
>>      [mvn] testSuggestions(org.apache.solr.spelling.suggest.SuggesterTest)
>> skipped
>>      [mvn] testRebuild(org.apache.solr.spelling.suggest.SuggesterTest)
>> skipped
>>      [mvn] testReload(org.apache.solr.spelling.suggest.SuggesterTest)
>> skipped
>>      [mvn] Running
>> org.apache.solr.schema.OpenExchangeRatesOrgProviderTest
>>      [mvn] Tests run: 6, Failures: 0, Errors: 0, Skipped: 6, Time elapsed: 0.007
>> sec - in org.apache.solr.schema.OpenExchangeRatesOrgProviderTest
>>      [mvn] org.apache.solr.schema.OpenExchangeRatesOrgProviderTest
>> skipped
>>      [mvn]
>> testReload(org.apache.solr.schema.OpenExchangeRatesOrgProviderTest)
>> skipped
>>      [mvn]
>> testInit(org.apache.solr.schema.OpenExchangeRatesOrgProviderTest)
>> skipped
>>      [mvn]
>> testGetExchangeRate(org.apache.solr.schema.OpenExchangeRatesOrgProvi
>> derTest) skipped
>>      [mvn]
>> testList(org.apache.solr.schema.OpenExchangeRatesOrgProviderTest)
>> skipped
>>      [mvn]
>> testNoInit(org.apache.solr.schema.OpenExchangeRatesOrgProviderTest)
>> skipped
>>      [mvn] Running org.apache.solr.update.TestDocBasedVersionConstraints
>>      [mvn] Tests run: 7, Failures: 0, Errors: 0, Skipped: 7, Time elapsed: 0.006
>> sec - in org.apache.solr.update.TestDocBasedVersionConstraints
>>      [mvn] org.apache.solr.update.TestDocBasedVersionConstraints skipped
>>      [mvn]
>> testSimpleDeletes(org.apache.solr.update.TestDocBasedVersionConstraints)
>> skipped
>>      [mvn]
>> testConcurrentAdds(org.apache.solr.update.TestDocBasedVersionConstrain
>> ts) skipped
>>      [mvn]
>> testManagingDeletes(org.apache.solr.update.TestDocBasedVersionConstrai
>> nts) skipped
>>      [mvn]
>> testFloatVersionField(org.apache.solr.update.TestDocBasedVersionConstrai
>> nts) skipped
>>      [mvn]
>> testFailOnOldVersion(org.apache.solr.update.TestDocBasedVersionConstrai
>> nts) skipped
>>      [mvn]
>> testSimpleUpdates(org.apache.solr.update.TestDocBasedVersionConstraints
>> ) skipped
>>      [mvn] Running
>> org.apache.solr.handler.component.DistributedSpellCheckComponentTest
>>      [mvn] Tests run: 2, Failures: 0, Errors: 0, Skipped: 2, Time elapsed: 0.008
>> sec - in
>> org.apache.solr.handler.component.DistributedSpellCheckComponentTest
>>      [mvn]
>> org.apache.solr.handler.component.DistributedSpellCheckComponentTest
>> skipped
>>      [mvn]
>> testDistribSearch(org.apache.solr.handler.component.DistributedSpellCheck
>> ComponentTest) skipped
>>      [mvn] Running org.apache.solr.core.TestSolrIndexConfig
>>      [mvn] Tests run: 3, Failures: 0, Errors: 0, Skipped: 3, Time elapsed: 0.006
>> sec - in org.apache.solr.core.TestSolrIndexConfig
>>      [mvn] org.apache.solr.core.TestSolrIndexConfig skipped
>>      [mvn] testIndexConfigParsing(org.apache.solr.core.TestSolrIndexConfig)
>> skipped
>>      [mvn] testLiveWriter(org.apache.solr.core.TestSolrIndexConfig) skipped
>>      [mvn] Running org.apache.solr.cloud.hdfs.HdfsSyncSliceTest
>>      [mvn] Tests run: 2, Failures: 0, Errors: 0, Skipped: 2, Time elapsed: 0.011
>> sec - in org.apache.solr.cloud.hdfs.HdfsSyncSliceTest
>>      [mvn] org.apache.solr.cloud.hdfs.HdfsSyncSliceTest skipped
>>      [mvn] testDistribSearch(org.apache.solr.cloud.hdfs.HdfsSyncSliceTest)
>> skipped
>>      [mvn] Running org.apache.solr.search.TestLFUCache
>>      [mvn] Tests run: 6, Failures: 0, Errors: 0, Skipped: 6, Time elapsed: 0.013
>> sec - in org.apache.solr.search.TestLFUCache
>>      [mvn] org.apache.solr.search.TestLFUCache skipped
>>      [mvn] testTimeDecayParams(org.apache.solr.search.TestLFUCache)
>> skipped
>>      [mvn] testItemOrdering(org.apache.solr.search.TestLFUCache) skipped
>>      [mvn] testTimeDecay(org.apache.solr.search.TestLFUCache) skipped
>>      [mvn] testTimeNoDecay(org.apache.solr.search.TestLFUCache) skipped
>>      [mvn] testSimple(org.apache.solr.search.TestLFUCache) skipped
>>      [mvn] Running org.apache.solr.cloud.hdfs.HdfsBasicDistributedZkTest
>>      [mvn] Tests run: 2, Failures: 0, Errors: 0, Skipped: 2, Time elapsed: 0.011
>> sec - in org.apache.solr.cloud.hdfs.HdfsBasicDistributedZkTest
>>      [mvn] org.apache.solr.cloud.hdfs.HdfsBasicDistributedZkTest skipped
>>      [mvn]
>> testDistribSearch(org.apache.solr.cloud.hdfs.HdfsBasicDistributedZkTest)
>> skipped
>>      [mvn] Running org.apache.solr.update.AddBlockUpdateTest
>>      [mvn] Tests run: 7, Failures: 0, Errors: 0, Skipped: 7, Time elapsed: 0.011
>> sec - in org.apache.solr.update.AddBlockUpdateTest
>>      [mvn] org.apache.solr.update.AddBlockUpdateTest skipped
>>      [mvn] testXML(org.apache.solr.update.AddBlockUpdateTest) skipped
>>      [mvn]
>> testExceptionThrown(org.apache.solr.update.AddBlockUpdateTest) skipped
>>      [mvn] testJavaBinCodec(org.apache.solr.update.AddBlockUpdateTest)
>> skipped
>>      [mvn] testSolrJXML(org.apache.solr.update.AddBlockUpdateTest)
>> skipped
>>      [mvn] testBasics(org.apache.solr.update.AddBlockUpdateTest) skipped
>>      [mvn] testOverwrite(org.apache.solr.update.AddBlockUpdateTest)
>> skipped
>>      [mvn] Running org.apache.solr.cloud.DeleteInactiveReplicaTest
>>      [mvn] Tests run: 2, Failures: 0, Errors: 0, Skipped: 2, Time elapsed: 0.011
>> sec - in org.apache.solr.cloud.DeleteInactiveReplicaTest
>>      [mvn] org.apache.solr.cloud.DeleteInactiveReplicaTest skipped
>>      [mvn] testDistribSearch(org.apache.solr.cloud.DeleteInactiveReplicaTest)
>> skipped
>>      [mvn] Running org.apache.solr.schema.PrimitiveFieldTypeTest
>>      [mvn] Tests run: 2, Failures: 0, Errors: 0, Skipped: 2, Time elapsed: 0.006
>> sec - in org.apache.solr.schema.PrimitiveFieldTypeTest
>>      [mvn] org.apache.solr.schema.PrimitiveFieldTypeTest skipped
>>      [mvn]
>> testDefaultOmitNorms(org.apache.solr.schema.PrimitiveFieldTypeTest)
>> skipped
>>      [mvn] Running org.apache.solr.schema.TestManagedSchema
>>      [mvn] Tests run: 15, Failures: 0, Errors: 0, Skipped: 15, Time elapsed: 0.009
>> sec - in org.apache.solr.schema.TestManagedSchema
>>      [mvn] org.apache.solr.schema.TestManagedSchema skipped
>>      [mvn]
>> testAddFieldWhenItAlreadyExists(org.apache.solr.schema.TestManagedSch
>> ema) skipped
>>      [mvn] testUpgrade(org.apache.solr.schema.TestManagedSchema)
>> skipped
>>      [mvn]
>> testUpgradeThenRestartNonManaged(org.apache.solr.schema.TestManage
>> dSchema) skipped
>>      [mvn]
>> testAddedFieldIndexableAndQueryable(org.apache.solr.schema.TestManag
>> edSchema) skipped
>>      [mvn]
>> testPersistUniqueKey(org.apache.solr.schema.TestManagedSchema)
>> skipped
>>      [mvn]
>> testAddSameFieldTwice(org.apache.solr.schema.TestManagedSchema)
>> skipped
>>      [mvn]
>> testUpgradeThenRestart(org.apache.solr.schema.TestManagedSchema)
>> skipped
>>      [mvn]
>> testAddFieldPersistence(org.apache.solr.schema.TestManagedSchema)
>> skipped
>>      [mvn]
>> testAddFieldThenReload(org.apache.solr.schema.TestManagedSchema)
>> skipped
>>      [mvn]
>> testAddDynamicField(org.apache.solr.schema.TestManagedSchema)
>> skipped
>>      [mvn]
>> testUpgradeThenRestartNonManagedAfterPuttingBackNonManagedSchem
>> a(org.apache.solr.schema.TestManagedSchema) skipped
>>      [mvn]
>> testAddWithSchemaSimilarityFactory(org.apache.solr.schema.TestManaged
>> Schema) skipped
>>      [mvn]
>> testAddFieldWhenNotMutable(org.apache.solr.schema.TestManagedSchem
>> a) skipped
>>      [mvn]
>> testAddWithSchemaCodecFactory(org.apache.solr.schema.TestManagedSch
>> ema) skipped
>>      [mvn] Running org.apache.solr.request.JSONWriterTest
>>      [mvn] Tests run: 4, Failures: 0, Errors: 0, Skipped: 4, Time elapsed: 0.009
>> sec - in org.apache.solr.request.JSONWriterTest
>>      [mvn] org.apache.solr.request.JSONWriterTest skipped
>>      [mvn] testJSONSolrDocument(org.apache.solr.request.JSONWriterTest)
>> skipped
>>      [mvn] testTypes(org.apache.solr.request.JSONWriterTest) skipped
>>      [mvn] testJSON(org.apache.solr.request.JSONWriterTest) skipped
>>      [mvn] Running org.apache.solr.core.TestSolrXml
>>      [mvn] Tests run: 3, Failures: 0, Errors: 0, Skipped: 3, Time elapsed: 0.005
>> sec - in org.apache.solr.core.TestSolrXml
>>      [mvn] org.apache.solr.core.TestSolrXml skipped
>>      [mvn] testPropertySub(org.apache.solr.core.TestSolrXml) skipped
>>      [mvn] testAllInfoPresent(org.apache.solr.core.TestSolrXml) skipped
>>      [mvn] Running org.apache.solr.cloud.DeleteReplicaTest
>>      [mvn] Tests run: 2, Failures: 0, Errors: 0, Skipped: 2, Time elapsed: 0.01 sec
>> - in org.apache.solr.cloud.DeleteReplicaTest
>>      [mvn] org.apache.solr.cloud.DeleteReplicaTest skipped
>>      [mvn] testDistribSearch(org.apache.solr.cloud.DeleteReplicaTest) skipped
>>      [mvn] Running org.apache.solr.store.blockcache.BlockCacheTest
>>      [mvn] Tests run: 3, Failures: 0, Errors: 0, Skipped: 3, Time elapsed: 0.004
>> sec - in org.apache.solr.store.blockcache.BlockCacheTest
>>      [mvn] org.apache.solr.store.blockcache.BlockCacheTest skipped
>>      [mvn] testLongBuffer(org.apache.solr.store.blockcache.BlockCacheTest)
>> skipped
>>      [mvn] testBlockCache(org.apache.solr.store.blockcache.BlockCacheTest)
>> skipped
>>      [mvn] Running org.apache.solr.servlet.SolrRequestParserTest
>>      [mvn] Tests run: 10, Failures: 0, Errors: 0, Skipped: 10, Time elapsed: 0.007
>> sec - in org.apache.solr.servlet.SolrRequestParserTest
>>      [mvn] org.apache.solr.servlet.SolrRequestParserTest skipped
>>      [mvn]
>> testUrlParamParsing(org.apache.solr.servlet.SolrRequestParserTest) skipped
>>      [mvn] testStreamBody(org.apache.solr.servlet.SolrRequestParserTest)
>> skipped
>>      [mvn] testStreamURL(org.apache.solr.servlet.SolrRequestParserTest)
>> skipped
>>      [mvn]
>> testStandardFormdataUploadLimit(org.apache.solr.servlet.SolrRequestParse
>> rTest) skipped
>>      [mvn]
>> testStandardParseParamsAndFillStreamsISO88591(org.apache.solr.servlet.So
>> lrRequestParserTest) skipped
>>      [mvn]
>> testAddHttpRequestToContext(org.apache.solr.servlet.SolrRequestParserTe
>> st) skipped
>>      [mvn]
>> testParameterIncompatibilityException2(org.apache.solr.servlet.SolrRequest
>> ParserTest) skipped
>>      [mvn]
>> testStandardParseParamsAndFillStreams(org.apache.solr.servlet.SolrReques
>> tParserTest) skipped
>>      [mvn]
>> testParameterIncompatibilityException1(org.apache.solr.servlet.SolrRequest
>> ParserTest) skipped
>>      [mvn] Running org.apache.solr.schema.DocValuesMissingTest
>>      [mvn] Tests run: 59, Failures: 0, Errors: 0, Skipped: 59, Time elapsed: 0.011
>> sec - in org.apache.solr.schema.DocValuesMissingTest
>>      [mvn] org.apache.solr.schema.DocValuesMissingTest skipped
>>      [mvn]
>> testDateMissingFunction(org.apache.solr.schema.DocValuesMissingTest)
>> skipped
>>      [mvn]
>> testDynDoubleMissingFunction(org.apache.solr.schema.DocValuesMissingTe
>> st) skipped
>>      [mvn]
>> testDynDateMissingFunction(org.apache.solr.schema.DocValuesMissingTest
>> ) skipped
>>      [mvn]
>> testDynDateMissingFacet(org.apache.solr.schema.DocValuesMissingTest)
>> skipped
>>      [mvn]
>> testDateSortMissingLast(org.apache.solr.schema.DocValuesMissingTest)
>> skipped
>>      [mvn] testDoubleSort(org.apache.solr.schema.DocValuesMissingTest)
>> skipped
>>      [mvn]
>> testDynLongMissingFacet(org.apache.solr.schema.DocValuesMissingTest)
>> skipped
>>      [mvn]
>> testDynStringSortMissingFirst(org.apache.solr.schema.DocValuesMissingTest
>> ) skipped
>>      [mvn] testLongSort(org.apache.solr.schema.DocValuesMissingTest)
>> skipped
>>      [mvn]
>> testIntMissingFunction(org.apache.solr.schema.DocValuesMissingTest)
>> skipped
>>      [mvn]
>> testDynDoubleSortMissingLast(org.apache.solr.schema.DocValuesMissingTe
>> st) skipped
>>      [mvn]
>> testLongSortMissingFirst(org.apache.solr.schema.DocValuesMissingTest)
>> skipped
>>      [mvn]
>> testDateSortMissingFirst(org.apache.solr.schema.DocValuesMissingTest)
>> skipped
>>      [mvn]
>> testStringSortMissingFirst(org.apache.solr.schema.DocValuesMissingTest)
>> skipped
>>      [mvn] testDynDateSort(org.apache.solr.schema.DocValuesMissingTest)
>> skipped
>>      [mvn] testDynDoubleSort(org.apache.solr.schema.DocValuesMissingTest)
>> skipped
>>      [mvn]
>> testIntSortMissingLast(org.apache.solr.schema.DocValuesMissingTest)
>> skipped
>>      [mvn]
>> testDoubleMissingFunction(org.apache.solr.schema.DocValuesMissingTest)
>> skipped
>>      [mvn]
>> testStringSortMissingLast(org.apache.solr.schema.DocValuesMissingTest)
>> skipped
>>      [mvn]
>> testDynFloatMissingFacet(org.apache.solr.schema.DocValuesMissingTest)
>> skipped
>>      [mvn]
>> testDynDateSortMissingFirst(org.apache.solr.schema.DocValuesMissingTest)
>> skipped
>>      [mvn]
>> testDoubleMissingFacet(org.apache.solr.schema.DocValuesMissingTest)
>> skipped
>>      [mvn]
>> testIntSortMissingFirst(org.apache.solr.schema.DocValuesMissingTest)
>> skipped
>>      [mvn]
>> testDynIntSortMissingLast(org.apache.solr.schema.DocValuesMissingTest)
>> skipped
>>      [mvn] testFloatSort(org.apache.solr.schema.DocValuesMissingTest)
>> skipped
>>      [mvn]
>> testLongMissingFunction(org.apache.solr.schema.DocValuesMissingTest)
>> skipped
>>      [mvn] testDynFloatSort(org.apache.solr.schema.DocValuesMissingTest)
>> skipped
>>      [mvn]
>> testDoubleSortMissingLast(org.apache.solr.schema.DocValuesMissingTest)
>> skipped
>>      [mvn]
>> testDoubleSortMissingFirst(org.apache.solr.schema.DocValuesMissingTest)
>> skipped
>>      [mvn]
>> testLongMissingFacet(org.apache.solr.schema.DocValuesMissingTest)
>> skipped
>>      [mvn]
>> testFloatSortMissingLast(org.apache.solr.schema.DocValuesMissingTest)
>> skipped
>>      [mvn] testStringSort(org.apache.solr.schema.DocValuesMissingTest)
>> skipped
>>      [mvn]
>> testStringMissingFacet(org.apache.solr.schema.DocValuesMissingTest)
>> skipped
>>      [mvn]
>> testDynDoubleMissingFacet(org.apache.solr.schema.DocValuesMissingTest)
>> skipped
>>      [mvn]
>> testDynFloatMissingFunction(org.apache.solr.schema.DocValuesMissingTest
>> ) skipped
>>      [mvn]
>> testDynLongMissingFunction(org.apache.solr.schema.DocValuesMissingTest
>> ) skipped
>>      [mvn]
>> testDynFloatSortMissingLast(org.apache.solr.schema.DocValuesMissingTest)
>> skipped
>>      [mvn]
>> testDynLongSortMissingLast(org.apache.solr.schema.DocValuesMissingTest)
>> skipped
>>      [mvn]
>> testDynIntMissingFunction(org.apache.solr.schema.DocValuesMissingTest)
>> skipped
>>      [mvn]
>> testStringMissingFunction(org.apache.solr.schema.DocValuesMissingTest)
>> skipped
>>      [mvn]
>> testDateMissingFacet(org.apache.solr.schema.DocValuesMissingTest)
>> skipped
>>      [mvn]
>> testIntMissingFacet(org.apache.solr.schema.DocValuesMissingTest) skipped
>>      [mvn]
>> testDynDoubleSortMissingFirst(org.apache.solr.schema.DocValuesMissingTe
>> st) skipped
>>      [mvn]
>> testFloatSortMissingFirst(org.apache.solr.schema.DocValuesMissingTest)
>> skipped
>>      [mvn]
>> testDynIntMissingFacet(org.apache.solr.schema.DocValuesMissingTest)
>> skipped
>>      [mvn] testDateSort(org.apache.solr.schema.DocValuesMissingTest)
>> skipped
>>      [mvn]
>> testDynDateSortMissingLast(org.apache.solr.schema.DocValuesMissingTest)
>> skipped
>>      [mvn] testDynIntSort(org.apache.solr.schema.DocValuesMissingTest)
>> skipped
>>      [mvn]
>> testDynLongSortMissingFirst(org.apache.solr.schema.DocValuesMissingTest)
>> skipped
>>      [mvn]
>> testDynStringMissingFunction(org.apache.solr.schema.DocValuesMissingTes
>> t) skipped
>>      [mvn]
>> testDynStringSortMissingLast(org.apache.solr.schema.DocValuesMissingTest
>> ) skipped
>>      [mvn]
>> testFloatMissingFacet(org.apache.solr.schema.DocValuesMissingTest)
>> skipped
>>      [mvn] testDynLongSort(org.apache.solr.schema.DocValuesMissingTest)
>> skipped
>>      [mvn]
>> testDynIntSortMissingFirst(org.apache.solr.schema.DocValuesMissingTest)
>> skipped
>>      [mvn]
>> testFloatMissingFunction(org.apache.solr.schema.DocValuesMissingTest)
>> skipped
>>      [mvn]
>> testLongSortMissingLast(org.apache.solr.schema.DocValuesMissingTest)
>> skipped
>>      [mvn] testIntSort(org.apache.solr.schema.DocValuesMissingTest) skipped
>>      [mvn]
>> testDynFloatSortMissingFirst(org.apache.solr.schema.DocValuesMissingTest)
>> skipped
>>      [mvn] Running org.apache.solr.spelling.suggest.SuggesterFSTTest
>>      [mvn] Tests run: 5, Failures: 0, Errors: 0, Skipped: 5, Time elapsed: 0.006
>> sec - in org.apache.solr.spelling.suggest.SuggesterFSTTest
>>      [mvn] org.apache.solr.spelling.suggest.SuggesterFSTTest skipped
>>      [mvn] testReload(org.apache.solr.spelling.suggest.SuggesterFSTTest)
>> skipped
>>      [mvn]
>> testSuggestions(org.apache.solr.spelling.suggest.SuggesterFSTTest) skipped
>>      [mvn] testAnalyzer(org.apache.solr.spelling.suggest.SuggesterFSTTest)
>> skipped
>>      [mvn] testRebuild(org.apache.solr.spelling.suggest.SuggesterFSTTest)
>> skipped
>>      [mvn] Running org.apache.solr.cloud.SolrXmlInZkTest
>>      [mvn] Tests run: 9, Failures: 0, Errors: 0, Skipped: 9, Time elapsed: 0.007
>> sec - in org.apache.solr.cloud.SolrXmlInZkTest
>>      [mvn] org.apache.solr.cloud.SolrXmlInZkTest skipped
>>      [mvn] testXmlInZkOnly(org.apache.solr.cloud.SolrXmlInZkTest) skipped
>>      [mvn] testNotInZkAndShouldBe(org.apache.solr.cloud.SolrXmlInZkTest)
>> skipped
>>      [mvn] testZkHostDiscovery(org.apache.solr.cloud.SolrXmlInZkTest)
>> skipped
>>      [mvn] testHardCodedSolrXml(org.apache.solr.cloud.SolrXmlInZkTest)
>> skipped
>>      [mvn] testOnDiskOnly(org.apache.solr.cloud.SolrXmlInZkTest) skipped
>>      [mvn] testXmlOnBoth(org.apache.solr.cloud.SolrXmlInZkTest) skipped
>>      [mvn] testNotInZkOrOnDisk(org.apache.solr.cloud.SolrXmlInZkTest)
>> skipped
>>      [mvn] testBadSysProp(org.apache.solr.cloud.SolrXmlInZkTest) skipped
>>      [mvn] Running org.apache.solr.handler.TestCSVLoader
>>      [mvn] Tests run: 7, Failures: 0, Errors: 0, Skipped: 7, Time elapsed: 0.007
>> sec - in org.apache.solr.handler.TestCSVLoader
>>      [mvn] org.apache.solr.handler.TestCSVLoader skipped
>>      [mvn] testLiteral(org.apache.solr.handler.TestCSVLoader) skipped
>>      [mvn] testCSVLoad(org.apache.solr.handler.TestCSVLoader) skipped
>>      [mvn] testCommitFalse(org.apache.solr.handler.TestCSVLoader) skipped
>>      [mvn] testCSV(org.apache.solr.handler.TestCSVLoader) skipped
>>      [mvn] testCommitTrue(org.apache.solr.handler.TestCSVLoader) skipped
>>      [mvn] testCSVRowId(org.apache.solr.handler.TestCSVLoader) skipped
>>      [mvn] Running
>> org.apache.solr.rest.schema.TestFieldTypeCollectionResource
>>      [mvn] Tests run: 3, Failures: 0, Errors: 0, Skipped: 3, Time elapsed: 0.007
>> sec - in org.apache.solr.rest.schema.TestFieldTypeCollectionResource
>>      [mvn] org.apache.solr.rest.schema.TestFieldTypeCollectionResource
>> skipped
>>      [mvn]
>> testGetAllFieldTypes(org.apache.solr.rest.schema.TestFieldTypeCollectionRe
>> source) skipped
>>      [mvn]
>> testJsonGetAllFieldTypes(org.apache.solr.rest.schema.TestFieldTypeCollecti
>> onResource) skipped
>>      [mvn] Running org.apache.solr.core.TestImplicitCoreProperties
>>      [mvn] Tests run: 2, Failures: 0, Errors: 0, Skipped: 2, Time elapsed: 0.006
>> sec - in org.apache.solr.core.TestImplicitCoreProperties
>>      [mvn] org.apache.solr.core.TestImplicitCoreProperties skipped
>>      [mvn]
>> testImplicitPropertiesAreSubstitutedInSolrConfig(org.apache.solr.core.TestI
>> mplicitCoreProperties) skipped
>>      [mvn] Running org.apache.solr.internal.csv.ExtendedBufferedReaderTest
>>      [mvn] Tests run: 8, Failures: 0, Errors: 0, Skipped: 0, Time elapsed: 0.001
>> sec - in org.apache.solr.internal.csv.ExtendedBufferedReaderTest
>>      [mvn]
>> testConstructors(org.apache.solr.internal.csv.ExtendedBufferedReaderTest)
>> Time elapsed: 0 sec
>>      [mvn]
>> testReadLookahead1(org.apache.solr.internal.csv.ExtendedBufferedReader
>> Test)  Time elapsed: 0 sec
>>      [mvn]
>> testReadLookahead2(org.apache.solr.internal.csv.ExtendedBufferedReader
>> Test)  Time elapsed: 0 sec
>>      [mvn]
>> testMarkSupported(org.apache.solr.internal.csv.ExtendedBufferedReaderT
>> est)  Time elapsed: 0 sec
>>      [mvn]
>> testReadLine(org.apache.solr.internal.csv.ExtendedBufferedReaderTest)
>> Time elapsed: 0.001 sec
>>      [mvn]
>> testSkip0(org.apache.solr.internal.csv.ExtendedBufferedReaderTest)  Time
>> elapsed: 0 sec
>>      [mvn]
>> testSkipUntil(org.apache.solr.internal.csv.ExtendedBufferedReaderTest)
>> Time elapsed: 0 sec
>>      [mvn]
>> testReadUntil(org.apache.solr.internal.csv.ExtendedBufferedReaderTest)
>> Time elapsed: 0 sec
>>      [mvn] Running
>> org.apache.solr.handler.component.DistributedTermsComponentTest
>>      [mvn] Tests run: 2, Failures: 0, Errors: 0, Skipped: 2, Time elapsed: 0.011
>> sec - in
>> org.apache.solr.handler.component.DistributedTermsComponentTest
>>      [mvn]
>> org.apache.solr.handler.component.DistributedTermsComponentTest
>> skipped
>>      [mvn]
>> testDistribSearch(org.apache.solr.handler.component.DistributedTermsCom
>> ponentTest) skipped
>>      [mvn] Running org.apache.solr.TestDistributedGrouping
>>      [mvn] Tests run: 2, Failures: 0, Errors: 0, Skipped: 2, Time elapsed: 0.011
>> sec - in org.apache.solr.TestDistributedGrouping
>>      [mvn] org.apache.solr.TestDistributedGrouping skipped
>>      [mvn] testDistribSearch(org.apache.solr.TestDistributedGrouping)
>> skipped
>>      [mvn] Running org.apache.solr.util.TestRandomMergePolicy
>>      [mvn] Tests run: 3, Failures: 0, Errors: 0, Skipped: 3, Time elapsed: 0.005
>> sec - in org.apache.solr.util.TestRandomMergePolicy
>>      [mvn] org.apache.solr.util.TestRandomMergePolicy skipped
>>      [mvn] testGetters(org.apache.solr.util.TestRandomMergePolicy) skipped
>>      [mvn] testMethodOverride(org.apache.solr.util.TestRandomMergePolicy)
>> skipped
>>      [mvn] Running org.apache.solr.core.TestNRTOpen
>>      [mvn] Tests run: 3, Failures: 0, Errors: 0, Skipped: 3, Time elapsed: 0.006
>> sec - in org.apache.solr.core.TestNRTOpen
>>      [mvn] org.apache.solr.core.TestNRTOpen skipped
>>      [mvn] testSharedCores(org.apache.solr.core.TestNRTOpen) skipped
>>      [mvn] testReaderIsNRT(org.apache.solr.core.TestNRTOpen) skipped
>>      [mvn] Running
>> org.apache.solr.handler.component.DistributedQueryElevationComponentT
>> est
>>      [mvn] Tests run: 2, Failures: 0, Errors: 0, Skipped: 2, Time elapsed: 0.008
>> sec - in
>> org.apache.solr.handler.component.DistributedQueryElevationComponentT
>> est
>>      [mvn]
>> org.apache.solr.handler.component.DistributedQueryElevationComponentT
>> est skipped
>>      [mvn]
>> testDistribSearch(org.apache.solr.handler.component.DistributedQueryElev
>> ationComponentTest) skipped
>>      [mvn] Running org.apache.solr.core.TestLazyCores
>>      [mvn] Tests run: 8, Failures: 0, Errors: 0, Skipped: 8, Time elapsed: 0.028
>> sec - in org.apache.solr.core.TestLazyCores
>>      [mvn] org.apache.solr.core.TestLazyCores skipped
>>      [mvn] testLazySearch(org.apache.solr.core.TestLazyCores) skipped
>>      [mvn] testPersistence(org.apache.solr.core.TestLazyCores) skipped
>>      [mvn]
>> testBadConfigsGenerateErrors(org.apache.solr.core.TestLazyCores) skipped
>>      [mvn] testCachingLimit(org.apache.solr.core.TestLazyCores) skipped
>>      [mvn] testRace(org.apache.solr.core.TestLazyCores) skipped
>>      [mvn] testCreateSame(org.apache.solr.core.TestLazyCores) skipped
>>      [mvn] testLazyLoad(org.apache.solr.core.TestLazyCores) skipped
>>      [mvn] Running org.apache.solr.schema.CurrencyFieldOpenExchangeTest
>>      [mvn] Tests run: 11, Failures: 0, Errors: 0, Skipped: 11, Time elapsed: 0.007
>> sec - in org.apache.solr.schema.CurrencyFieldOpenExchangeTest
>>      [mvn] org.apache.solr.schema.CurrencyFieldOpenExchangeTest skipped
>>      [mvn]
>> testCurrencySchema(org.apache.solr.schema.CurrencyFieldOpenExchangeT
>> est) skipped
>>      [mvn]
>> testCurrencySort(org.apache.solr.schema.CurrencyFieldOpenExchangeTest)
>> skipped
>>      [mvn]
>> testMockExchangeRateProvider(org.apache.solr.schema.CurrencyFieldOpen
>> ExchangeTest) skipped
>>      [mvn]
>> testBogusCurrency(org.apache.solr.schema.CurrencyFieldOpenExchangeTes
>> t) skipped
>>      [mvn]
>> testCurrencyPointQuery(org.apache.solr.schema.CurrencyFieldOpenExchan
>> geTest) skipped
>>      [mvn]
>> testCurrencyFieldType(org.apache.solr.schema.CurrencyFieldOpenExchange
>> Test) skipped
>>      [mvn]
>> testFunctionUsage(org.apache.solr.schema.CurrencyFieldOpenExchangeTes
>> t) skipped
>>      [mvn]
>> testPerformance(org.apache.solr.schema.CurrencyFieldOpenExchangeTest)
>> skipped
>>      [mvn]
>> testMockFieldType(org.apache.solr.schema.CurrencyFieldOpenExchangeTes
>> t) skipped
>>      [mvn]
>> testCurrencyRangeSearch(org.apache.solr.schema.CurrencyFieldOpenExcha
>> ngeTest) skipped
>>      [mvn] Running org.apache.solr.search.SpatialFilterTest
>>      [mvn] Tests run: 4, Failures: 0, Errors: 0, Skipped: 4, Time elapsed: 0.006
>> sec - in org.apache.solr.search.SpatialFilterTest
>>      [mvn] org.apache.solr.search.SpatialFilterTest skipped
>>      [mvn] testPoints(org.apache.solr.search.SpatialFilterTest) skipped
>>      [mvn] testGeoHash(org.apache.solr.search.SpatialFilterTest) skipped
>>      [mvn] testLatLonType(org.apache.solr.search.SpatialFilterTest) skipped
>>      [mvn] Running
>> org.apache.solr.rest.schema.TestSerializedLuceneMatchVersion
>>      [mvn] Tests run: 3, Failures: 0, Errors: 0, Skipped: 3, Time elapsed: 0.007
>> sec - in org.apache.solr.rest.schema.TestSerializedLuceneMatchVersion
>>      [mvn] org.apache.solr.rest.schema.TestSerializedLuceneMatchVersion
>> skipped
>>      [mvn]
>> testExplicitLuceneMatchVersions(org.apache.solr.rest.schema.TestSerialized
>> LuceneMatchVersion) skipped
>>      [mvn]
>> testNoLuceneMatchVersions(org.apache.solr.rest.schema.TestSerializedLuc
>> eneMatchVersion) skipped
>>      [mvn] Running org.apache.solr.update.UpdateParamsTest
>>      [mvn] Tests run: 2, Failures: 0, Errors: 0, Skipped: 2, Time elapsed: 0.006
>> sec - in org.apache.solr.update.UpdateParamsTest
>>      [mvn] org.apache.solr.update.UpdateParamsTest skipped
>>      [mvn]
>> testUpdateProcessorParamDeprecationRemoved(org.apache.solr.update.U
>> pdateParamsTest) skipped
>>      [mvn] Running org.apache.solr.core.TestQuerySenderNoQuery
>>      [mvn] Tests run: 4, Failures: 0, Errors: 0, Skipped: 4, Time elapsed: 0.006
>> sec - in org.apache.solr.core.TestQuerySenderNoQuery
>>      [mvn] org.apache.solr.core.TestQuerySenderNoQuery skipped
>>      [mvn]
>> testSearcherEvents(org.apache.solr.core.TestQuerySenderNoQuery)
>> skipped
>>      [mvn]
>> testRequestHandlerRegistry(org.apache.solr.core.TestQuerySenderNoQuery
>> ) skipped
>>      [mvn]
>> testListenerCreationCounts(org.apache.solr.core.TestQuerySenderNoQuery
>> ) skipped
>>      [mvn] Running org.apache.solr.search.QueryParsingTest
>>      [mvn] Tests run: 5, Failures: 0, Errors: 0, Skipped: 5, Time elapsed: 0.007
>> sec - in org.apache.solr.search.QueryParsingTest
>>      [mvn] org.apache.solr.search.QueryParsingTest skipped
>>      [mvn] testQParserEmptyInput(org.apache.solr.search.QueryParsingTest)
>> skipped
>>      [mvn] testLiteralFunction(org.apache.solr.search.QueryParsingTest)
>> skipped
>>      [mvn] testSort(org.apache.solr.search.QueryParsingTest) skipped
>>      [mvn] testBad(org.apache.solr.search.QueryParsingTest) skipped
>>      [mvn] Running org.apache.solr.schema.CurrencyFieldXmlFileTest
>>      [mvn] Tests run: 12, Failures: 0, Errors: 0, Skipped: 12, Time elapsed: 0.007
>> sec - in org.apache.solr.schema.CurrencyFieldXmlFileTest
>>      [mvn] org.apache.solr.schema.CurrencyFieldXmlFileTest skipped
>>      [mvn]
>> testCurrencySort(org.apache.solr.schema.CurrencyFieldXmlFileTest) skipped
>>      [mvn]
>> testCurrencySchema(org.apache.solr.schema.CurrencyFieldXmlFileTest)
>> skipped
>>      [mvn]
>> testCurrencyPointQuery(org.apache.solr.schema.CurrencyFieldXmlFileTest)
>> skipped
>>      [mvn]
>> testFunctionUsage(org.apache.solr.schema.CurrencyFieldXmlFileTest)
>> skipped
>>      [mvn]
>> testMockFieldType(org.apache.solr.schema.CurrencyFieldXmlFileTest)
>> skipped
>>      [mvn]
>> testMockExchangeRateProvider(org.apache.solr.schema.CurrencyFieldXmlFil
>> eTest) skipped
>>      [mvn]
>> testCurrencyFieldType(org.apache.solr.schema.CurrencyFieldXmlFileTest)
>> skipped
>>      [mvn]
>> testAsymetricPointQuery(org.apache.solr.schema.CurrencyFieldXmlFileTest)
>> skipped
>>      [mvn]
>> testPerformance(org.apache.solr.schema.CurrencyFieldXmlFileTest) skipped
>>      [mvn]
>> testCurrencyRangeSearch(org.apache.solr.schema.CurrencyFieldXmlFileTest
>> ) skipped
>>      [mvn]
>> testBogusCurrency(org.apache.solr.schema.CurrencyFieldXmlFileTest)
>> skipped
>>      [mvn] Running org.apache.solr.cloud.BasicDistributedZk2Test
>>      [mvn] Tests run: 2, Failures: 0, Errors: 0, Skipped: 2, Time elapsed: 0.009
>> sec - in org.apache.solr.cloud.BasicDistributedZk2Test
>>      [mvn] org.apache.solr.cloud.BasicDistributedZk2Test skipped
>>      [mvn] testDistribSearch(org.apache.solr.cloud.BasicDistributedZk2Test)
>> skipped
>>      [mvn] Running org.apache.solr.analysis.TestLuceneMatchVersion
>>      [mvn] Tests run: 2, Failures: 0, Errors: 0, Skipped: 2, Time elapsed: 0.005
>> sec - in org.apache.solr.analysis.TestLuceneMatchVersion
>>      [mvn] org.apache.solr.analysis.TestLuceneMatchVersion skipped
>>      [mvn]
>> testStandardTokenizerVersions(org.apache.solr.analysis.TestLuceneMatchV
>> ersion) skipped
>>      [mvn] Running
>> org.apache.solr.search.function.distance.DistanceFunctionTest
>>      [mvn] Tests run: 4, Failures: 0, Errors: 0, Skipped: 4, Time elapsed: 0.007
>> sec - in org.apache.solr.search.function.distance.DistanceFunctionTest
>>      [mvn] org.apache.solr.search.function.distance.DistanceFunctionTest
>> skipped
>>      [mvn]
>> testHaversine(org.apache.solr.search.function.distance.DistanceFunctionTes
>> t) skipped
>>      [mvn]
>> testLatLon(org.apache.solr.search.function.distance.DistanceFunctionTest)
>> skipped
>>      [mvn]
>> testVector(org.apache.solr.search.function.distance.DistanceFunctionTest)
>> skipped
>>      [mvn] Running org.apache.solr.schema.TestBinaryField
>>      [mvn] Tests run: 2, Failures: 0, Errors: 0, Skipped: 2, Time elapsed: 0.006
>> sec - in org.apache.solr.schema.TestBinaryField
>>      [mvn] org.apache.solr.schema.TestBinaryField skipped
>>      [mvn] testSimple(org.apache.solr.schema.TestBinaryField) skipped
>>      [mvn] Running org.apache.solr.rest.schema.TestDynamicFieldResource
>>      [mvn] Tests run: 4, Failures: 0, Errors: 0, Skipped: 4, Time elapsed: 0.007
>> sec - in org.apache.solr.rest.schema.TestDynamicFieldResource
>>      [mvn] org.apache.solr.rest.schema.TestDynamicFieldResource skipped
>>      [mvn]
>> testJsonGetDynamicField(org.apache.solr.rest.schema.TestDynamicFieldRes
>> ource) skipped
>>      [mvn]
>> testGetDynamicField(org.apache.solr.rest.schema.TestDynamicFieldResourc
>> e) skipped
>>      [mvn]
>> testGetNotFoundDynamicField(org.apache.solr.rest.schema.TestDynamicFie
>> ldResource) skipped
>>      [mvn] Running org.apache.solr.TestJoin
>>      [mvn] Tests run: 3, Failures: 0, Errors: 0, Skipped: 3, Time elapsed: 0.006
>> sec - in org.apache.solr.TestJoin
>>      [mvn] org.apache.solr.TestJoin skipped
>>      [mvn] testJoin(org.apache.solr.TestJoin) skipped
>>      [mvn] testRandomJoin(org.apache.solr.TestJoin) skipped
>>      [mvn] Running org.apache.solr.search.ReturnFieldsTest
>>      [mvn] Tests run: 13, Failures: 0, Errors: 0, Skipped: 13, Time elapsed: 0.007
>> sec - in org.apache.solr.search.ReturnFieldsTest
>>      [mvn] org.apache.solr.search.ReturnFieldsTest skipped
>>      [mvn] testFunkyFieldNames(org.apache.solr.search.ReturnFieldsTest)
>> skipped
>>      [mvn] testAliases(org.apache.solr.search.ReturnFieldsTest) skipped
>>      [mvn]
>> testTrailingDollarInFieldName(org.apache.solr.search.ReturnFieldsTest)
>> skipped
>>      [mvn] testCopyRename(org.apache.solr.search.ReturnFieldsTest) skipped
>>      [mvn] testManyParameters(org.apache.solr.search.ReturnFieldsTest)
>> skipped
>>      [mvn] testHyphenInFieldName(org.apache.solr.search.ReturnFieldsTest)
>> skipped
>>      [mvn] testSeparators(org.apache.solr.search.ReturnFieldsTest) skipped
>>      [mvn] testFunctions(org.apache.solr.search.ReturnFieldsTest) skipped
>>      [mvn] testWilcards(org.apache.solr.search.ReturnFieldsTest) skipped
>>      [mvn] testWhitespace(org.apache.solr.search.ReturnFieldsTest) skipped
>>      [mvn] testTransformers(org.apache.solr.search.ReturnFieldsTest) skipped
>>      [mvn]
>> testTrailingDotInFieldName(org.apache.solr.search.ReturnFieldsTest)
>> skipped
>>      [mvn] Running org.apache.solr.spelling.FileBasedSpellCheckerTest
>>      [mvn] Tests run: 4, Failures: 0, Errors: 0, Skipped: 4, Time elapsed: 0.006
>> sec - in org.apache.solr.spelling.FileBasedSpellCheckerTest
>>      [mvn] org.apache.solr.spelling.FileBasedSpellCheckerTest skipped
>>      [mvn] testFieldType(org.apache.solr.spelling.FileBasedSpellCheckerTest)
>> skipped
>>      [mvn]
>> testRAMDirectory(org.apache.solr.spelling.FileBasedSpellCheckerTest)
>> skipped
>>      [mvn] test(org.apache.solr.spelling.FileBasedSpellCheckerTest) skipped
>>      [mvn] Running org.apache.solr.rest.schema.TestFieldTypeResource
>>      [mvn] Tests run: 5, Failures: 0, Errors: 0, Skipped: 5, Time elapsed: 0.007
>> sec - in org.apache.solr.rest.schema.TestFieldTypeResource
>>      [mvn] org.apache.solr.rest.schema.TestFieldTypeResource skipped
>>      [mvn]
>> testGetFieldTypeDontShowDefaults(org.apache.solr.rest.schema.TestFieldT
>> ypeResource) skipped
>>      [mvn]
>> testGetFieldType(org.apache.solr.rest.schema.TestFieldTypeResource)
>> skipped
>>      [mvn]
>> testJsonGetFieldType(org.apache.solr.rest.schema.TestFieldTypeResource)
>> skipped
>>      [mvn]
>> testGetNotFoundFieldType(org.apache.solr.rest.schema.TestFieldTypeReso
>> urce) skipped
>>      [mvn] Running org.apache.solr.internal.csv.CSVUtilsTest
>>      [mvn] Tests run: 14, Failures: 0, Errors: 0, Skipped: 0, Time elapsed: 0.003
>> sec - in org.apache.solr.internal.csv.CSVUtilsTest
>>      [mvn] testParse1(org.apache.solr.internal.csv.CSVUtilsTest)  Time
>> elapsed: 0.001 sec
>>      [mvn] testParse2(org.apache.solr.internal.csv.CSVUtilsTest)  Time
>> elapsed: 0 sec
>>      [mvn] testParse3(org.apache.solr.internal.csv.CSVUtilsTest)  Time
>> elapsed: 0 sec
>>      [mvn] testParse4(org.apache.solr.internal.csv.CSVUtilsTest)  Time
>> elapsed: 0 sec
>>      [mvn] testParse5(org.apache.solr.internal.csv.CSVUtilsTest)  Time
>> elapsed: 0 sec
>>      [mvn] testParse6(org.apache.solr.internal.csv.CSVUtilsTest)  Time
>> elapsed: 0 sec
>>      [mvn] testParse7(org.apache.solr.internal.csv.CSVUtilsTest)  Time
>> elapsed: 0 sec
>>      [mvn] testParseLine1(org.apache.solr.internal.csv.CSVUtilsTest)  Time
>> elapsed: 0 sec
>>      [mvn] testParseLine2(org.apache.solr.internal.csv.CSVUtilsTest)  Time
>> elapsed: 0.001 sec
>>      [mvn] testParseLine3(org.apache.solr.internal.csv.CSVUtilsTest)  Time
>> elapsed: 0 sec
>>      [mvn] testParseLine4(org.apache.solr.internal.csv.CSVUtilsTest)  Time
>> elapsed: 0 sec
>>      [mvn] testParseLine5(org.apache.solr.internal.csv.CSVUtilsTest)  Time
>> elapsed: 0 sec
>>      [mvn] testParseLine6(org.apache.solr.internal.csv.CSVUtilsTest)  Time
>> elapsed: 0 sec
>>      [mvn] testParseLine7(org.apache.solr.internal.csv.CSVUtilsTest)  Time
>> elapsed: 0 sec
>>      [mvn] Running org.apache.solr.schema.DocValuesTest
>>      [mvn] Tests run: 7, Failures: 0, Errors: 0, Skipped: 7, Time elapsed: 0.006
>> sec - in org.apache.solr.schema.DocValuesTest
>>      [mvn] org.apache.solr.schema.DocValuesTest skipped
>>      [mvn] testDocValuesSorting(org.apache.solr.schema.DocValuesTest)
>> skipped
>>      [mvn] testDocValuesMatch(org.apache.solr.schema.DocValuesTest)
>> skipped
>>      [mvn] testDocValuesSorting2(org.apache.solr.schema.DocValuesTest)
>> skipped
>>      [mvn] testDocValuesStats(org.apache.solr.schema.DocValuesTest)
>> skipped
>>      [mvn] testDocValues(org.apache.solr.schema.DocValuesTest) skipped
>>      [mvn] testDocValuesFaceting(org.apache.solr.schema.DocValuesTest)
>> skipped
>>      [mvn] Running org.apache.solr.spelling.SpellingQueryConverterTest
>>      [mvn] Tests run: 6, Failures: 0, Errors: 0, Skipped: 6, Time elapsed: 0.005
>> sec - in org.apache.solr.spelling.SpellingQueryConverterTest
>>      [mvn] org.apache.solr.spelling.SpellingQueryConverterTest skipped
>>      [mvn] testUnicode(org.apache.solr.spelling.SpellingQueryConverterTest)
>> skipped
>>      [mvn] test(org.apache.solr.spelling.SpellingQueryConverterTest) skipped
>>      [mvn]
>> testRequiredOrProhibitedFlags(org.apache.solr.spelling.SpellingQueryConve
>> rterTest) skipped
>>      [mvn]
>> testMultipleClauses(org.apache.solr.spelling.SpellingQueryConverterTest)
>> skipped
>>      [mvn]
>> testSpecialChars(org.apache.solr.spelling.SpellingQueryConverterTest)
>> skipped
>>      [mvn] Running org.apache.solr.core.TestReloadAndDeleteDocs
>>      [mvn] Tests run: 3, Failures: 0, Errors: 0, Skipped: 3, Time elapsed: 0.006
>> sec - in org.apache.solr.core.TestReloadAndDeleteDocs
>>      [mvn] org.apache.solr.core.TestReloadAndDeleteDocs skipped
>>      [mvn]
>> testReloadAndDeleteDocsWithUpdateLog(org.apache.solr.core.TestReloadA
>> ndDeleteDocs) skipped
>>      [mvn]
>> testReloadAndDeleteDocsNoUpdateLog(org.apache.solr.core.TestReloadAn
>> dDeleteDocs) skipped
>>      [mvn] Running org.apache.solr.schema.IndexSchemaTest
>>      [mvn] Tests run: 4, Failures: 0, Errors: 0, Skipped: 4, Time elapsed: 0.006
>> sec - in org.apache.solr.schema.IndexSchemaTest
>>      [mvn] org.apache.solr.schema.IndexSchemaTest skipped
>>      [mvn] testIsDynamicField(org.apache.solr.schema.IndexSchemaTest)
>> skipped
>>      [mvn] testProperties(org.apache.solr.schema.IndexSchemaTest) skipped
>>      [mvn] testDynamicCopy(org.apache.solr.schema.IndexSchemaTest)
>> skipped
>>      [mvn] Running org.apache.solr.handler.XsltUpdateRequestHandlerTest
>>      [mvn] Tests run: 3, Failures: 0, Errors: 0, Skipped: 3, Time elapsed: 0.006
>> sec - in org.apache.solr.handler.XsltUpdateRequestHandlerTest
>>      [mvn] org.apache.solr.handler.XsltUpdateRequestHandlerTest skipped
>>      [mvn]
>> testEntities(org.apache.solr.handler.XsltUpdateRequestHandlerTest)
>> skipped
>>      [mvn]
>> testUpdate(org.apache.solr.handler.XsltUpdateRequestHandlerTest)
>> skipped
>>      [mvn] Running
>> org.apache.solr.analysis.PathHierarchyTokenizerFactoryTest
>>      [mvn] Tests run: 3, Failures: 0, Errors: 0, Skipped: 3, Time elapsed: 0.006
>> sec - in org.apache.solr.analysis.PathHierarchyTokenizerFactoryTest
>>      [mvn] org.apache.solr.analysis.PathHierarchyTokenizerFactoryTest
>> skipped
>>      [mvn]
>> testAncestors(org.apache.solr.analysis.PathHierarchyTokenizerFactoryTest)
>> skipped
>>      [mvn]
>> testDescendents(org.apache.solr.analysis.PathHierarchyTokenizerFactoryTes
>> t) skipped
>>      [mvn] Running org.apache.solr.search.TestQueryUtils
>>      [mvn] Tests run: 2, Failures: 0, Errors: 0, Skipped: 2, Time elapsed: 0.006
>> sec - in org.apache.solr.search.TestQueryUtils
>>      [mvn] org.apache.solr.search.TestQueryUtils skipped
>>      [mvn] testNegativeQueries(org.apache.solr.search.TestQueryUtils)
>> skipped
>>      [mvn] Running org.apache.solr.update.DirectUpdateHandlerTest
>>      [mvn] Tests run: 7, Failures: 0, Errors: 0, Skipped: 7, Time elapsed: 0.007
>> sec - in org.apache.solr.update.DirectUpdateHandlerTest
>>      [mvn] org.apache.solr.update.DirectUpdateHandlerTest skipped
>>      [mvn]
>> testPrepareCommit(org.apache.solr.update.DirectUpdateHandlerTest)
>> skipped
>>      [mvn]
>> testRequireUniqueKey(org.apache.solr.update.DirectUpdateHandlerTest)
>> skipped
>>      [mvn]
>> testDeleteRollback(org.apache.solr.update.DirectUpdateHandlerTest)
>> skipped
>>      [mvn] testBasics(org.apache.solr.update.DirectUpdateHandlerTest)
>> skipped
>>      [mvn] testAddRollback(org.apache.solr.update.DirectUpdateHandlerTest)
>> skipped
>>      [mvn]
>> testExpungeDeletes(org.apache.solr.update.DirectUpdateHandlerTest)
>> skipped
>>      [mvn] Running
>> org.apache.solr.update.processor.AddSchemaFieldsUpdateProcessorFactory
>> Test
>>      [mvn] Tests run: 7, Failures: 0, Errors: 0, Skipped: 7, Time elapsed: 0.006
>> sec - in
>> org.apache.solr.update.processor.AddSchemaFieldsUpdateProcessorFactory
>> Test
>>      [mvn]
>> org.apache.solr.update.processor.AddSchemaFieldsUpdateProcessorFactory
>> Test skipped
>>      [mvn]
>> testParseAndAddMultipleFieldsRoundTrip(org.apache.solr.update.processor
>> .AddSchemaFieldsUpdateProcessorFactoryTest) skipped
>>      [mvn]
>> testSingleFieldRoundTrip(org.apache.solr.update.processor.AddSchemaField
>> sUpdateProcessorFactoryTest) skipped
>>      [mvn]
>> testMultipleFieldsRoundTrip(org.apache.solr.update.processor.AddSchemaF
>> ieldsUpdateProcessorFactoryTest) skipped
>>      [mvn]
>> testSingleField(org.apache.solr.update.processor.AddSchemaFieldsUpdateP
>> rocessorFactoryTest) skipped
>>      [mvn]
>> testSingleFieldMixedFieldTypesRoundTrip(org.apache.solr.update.processor
>> .AddSchemaFieldsUpdateProcessorFactoryTest) skipped
>>      [mvn]
>> testSingleFieldDefaultFieldTypeRoundTrip(org.apache.solr.update.processor
>> .AddSchemaFieldsUpdateProcessorFactoryTest) skipped
>>      [mvn] Running
>> org.apache.solr.cloud.hdfs.HdfsCollectionsAPIDistributedZkTest
>>      [mvn] Tests run: 2, Failures: 0, Errors: 0, Skipped: 2, Time elapsed: 0.022
>> sec - in org.apache.solr.cloud.hdfs.HdfsCollectionsAPIDistributedZkTest
>>      [mvn] org.apache.solr.cloud.hdfs.HdfsCollectionsAPIDistributedZkTest
>> skipped
>>      [mvn]
>> testDistribSearch(org.apache.solr.cloud.hdfs.HdfsCollectionsAPIDistributedZ
>> kTest) skipped
>>      [mvn] Running org.apache.solr.response.TestCSVResponseWriter
>>      [mvn] Tests run: 3, Failures: 0, Errors: 0, Skipped: 3, Time elapsed: 0.006
>> sec - in org.apache.solr.response.TestCSVResponseWriter
>>      [mvn] org.apache.solr.response.TestCSVResponseWriter skipped
>>      [mvn]
>> testPseudoFields(org.apache.solr.response.TestCSVResponseWriter)
>> skipped
>>      [mvn] testCSVOutput(org.apache.solr.response.TestCSVResponseWriter)
>> skipped
>>      [mvn] Running org.apache.solr.util.PrimUtilsTest
>>      [mvn] Tests run: 3, Failures: 0, Errors: 0, Skipped: 3, Time elapsed: 0.004
>> sec - in org.apache.solr.util.PrimUtilsTest
>>      [mvn] org.apache.solr.util.PrimUtilsTest skipped
>>      [mvn] testLongPriorityQueue(org.apache.solr.util.PrimUtilsTest) skipped
>>      [mvn] testSort(org.apache.solr.util.PrimUtilsTest) skipped
>>      [mvn] Running
>> org.apache.solr.rest.schema.TestDynamicFieldCollectionResource
>>      [mvn] Tests run: 6, Failures: 0, Errors: 0, Skipped: 6, Time elapsed: 0.008
>> sec - in org.apache.solr.rest.schema.TestDynamicFieldCollectionResource
>>      [mvn] org.apache.solr.rest.schema.TestDynamicFieldCollectionResource
>> skipped
>>      [mvn]
>> testJsonGetAllDynamicFields(org.apache.solr.rest.schema.TestDynamicField
>> CollectionResource) skipped
>>      [mvn]
>> testGetTwoDynamicFields(org.apache.solr.rest.schema.TestDynamicFieldCol
>> lectionResource) skipped
>>      [mvn]
>> testGetAllDynamicFields(org.apache.solr.rest.schema.TestDynamicFieldColle
>> ctionResource) skipped
>>      [mvn]
>> testJsonGetTwoDynamicFields(org.apache.solr.rest.schema.TestDynamicFiel
>> dCollectionResource) skipped
>>      [mvn]
>> testNotFoundDynamicFields(org.apache.solr.rest.schema.TestDynamicFieldC
>> ollectionResource) skipped
>>      [mvn] Running org.apache.solr.search.TestAddFieldRealTimeGet
>>      [mvn] Tests run: 2, Failures: 0, Errors: 0, Skipped: 2, Time elapsed: 0.006
>> sec - in org.apache.solr.search.TestAddFieldRealTimeGet
>>      [mvn] org.apache.solr.search.TestAddFieldRealTimeGet skipped
>>      [mvn] test(org.apache.solr.search.TestAddFieldRealTimeGet) skipped
>>      [mvn] Running org.apache.solr.util.DateMathParserTest
>>      [mvn] Tests run: 9, Failures: 0, Errors: 0, Skipped: 9, Time elapsed: 0.004
>> sec - in org.apache.solr.util.DateMathParserTest
>>      [mvn] org.apache.solr.util.DateMathParserTest skipped
>>      [mvn]
>> testParseMathExceptions(org.apache.solr.util.DateMathParserTest) skipped
>>      [mvn] testRound(org.apache.solr.util.DateMathParserTest) skipped
>>      [mvn] testParseStatelessness(org.apache.solr.util.DateMathParserTest)
>> skipped
>>      [mvn] testAdd(org.apache.solr.util.DateMathParserTest) skipped
>>      [mvn]
>> testCalendarUnitsConsistency(org.apache.solr.util.DateMathParserTest)
>> skipped
>>      [mvn] testParseMathTz(org.apache.solr.util.DateMathParserTest)
>> skipped
>>      [mvn] testParseMath(org.apache.solr.util.DateMathParserTest) skipped
>>      [mvn] testAddZero(org.apache.solr.util.DateMathParserTest) skipped
>>      [mvn] Running org.apache.solr.core.TestJmxIntegration
>>      [mvn] Tests run: 4, Failures: 0, Errors: 0, Skipped: 4, Time elapsed: 0.007
>> sec - in org.apache.solr.core.TestJmxIntegration
>>      [mvn] org.apache.solr.core.TestJmxIntegration skipped
>>      [mvn] testJmxOnCoreReload(org.apache.solr.core.TestJmxIntegration)
>> skipped
>>      [mvn] testJmxRegistration(org.apache.solr.core.TestJmxIntegration)
>> skipped
>>      [mvn] testJmxUpdate(org.apache.solr.core.TestJmxIntegration) skipped
>>      [mvn] Running org.apache.solr.search.TestRTGBase
>>      [mvn] Tests run: 0, Failures: 0, Errors: 0, Skipped: 0, Time elapsed: 0.005
>> sec - in org.apache.solr.search.TestRTGBase
>>      [mvn] Running org.apache.solr.schema.BadCopyFieldTest
>>      [mvn] Tests run: 6, Failures: 0, Errors: 0, Skipped: 6, Time elapsed: 0.006
>> sec - in org.apache.solr.schema.BadCopyFieldTest
>>      [mvn] org.apache.solr.schema.BadCopyFieldTest skipped
>>      [mvn]
>> testMultipleAsteriskCopyFieldSourceShouldFail(org.apache.solr.schema.Bad
>> CopyFieldTest) skipped
>>      [mvn]
>> testMisplacedAsteriskCopyFieldSourceShouldFail(org.apache.solr.schema.Ba
>> dCopyFieldTest) skipped
>>      [mvn]
>> testMisplacedAsteriskCopyFieldDestShouldFail(org.apache.solr.schema.BadC
>> opyFieldTest) skipped
>>      [mvn]
>> testMultipleAsteriskCopyFieldDestShouldFail(org.apache.solr.schema.BadCo
>> pyFieldTest) skipped
>>      [mvn]
>> testNonGlobCopyFieldSourceMatchingNothingShouldFail(org.apache.solr.sc
>> hema.BadCopyFieldTest) skipped
>>      [mvn] Running org.apache.solr.cloud.ShardSplitTest
>>      [mvn] Tests run: 2, Failures: 0, Errors: 0, Skipped: 2, Time elapsed: 0.011
>> sec - in org.apache.solr.cloud.ShardSplitTest
>>      [mvn] org.apache.solr.cloud.ShardSplitTest skipped
>>      [mvn] testDistribSearch(org.apache.solr.cloud.ShardSplitTest) skipped
>>      [mvn] Running
>> org.apache.solr.spelling.suggest.TestFuzzyAnalyzedSuggestions
>>      [mvn] Tests run: 5, Failures: 0, Errors: 0, Skipped: 5, Time elapsed: 0.006
>> sec - in org.apache.solr.spelling.suggest.TestFuzzyAnalyzedSuggestions
>>      [mvn] org.apache.solr.spelling.suggest.TestFuzzyAnalyzedSuggestions
>> skipped
>>      [mvn]
>> testWithMinFuzzyLength2(org.apache.solr.spelling.suggest.TestFuzzyAnalyz
>> edSuggestions) skipped
>>      [mvn]
>> testDefault(org.apache.solr.spelling.suggest.TestFuzzyAnalyzedSuggestions)
>> skipped
>>      [mvn]
>> testWithMaxEdit2(org.apache.solr.spelling.suggest.TestFuzzyAnalyzedSugge
>> stions) skipped
>>      [mvn]
>> testWithNonFuzzyPrefix4(org.apache.solr.spelling.suggest.TestFuzzyAnalyze
>> dSuggestions) skipped
>>      [mvn] Running org.apache.solr.core.TestJmxMonitoredMap
>>      [mvn] Tests run: 3, Failures: 0, Errors: 0, Skipped: 3, Time elapsed: 0.004
>> sec - in org.apache.solr.core.TestJmxMonitoredMap
>>      [mvn] org.apache.solr.core.TestJmxMonitoredMap skipped
>>      [mvn] testPutRemoveClear(org.apache.solr.core.TestJmxMonitoredMap)
>> skipped
>>      [mvn] testTypeName(org.apache.solr.core.TestJmxMonitoredMap)
>> skipped
>>      [mvn] Running org.apache.solr.schema.PreAnalyzedFieldTest
>>      [mvn] Tests run: 4, Failures: 0, Errors: 0, Skipped: 4, Time elapsed: 0.006
>> sec - in org.apache.solr.schema.PreAnalyzedFieldTest
>>      [mvn] org.apache.solr.schema.PreAnalyzedFieldTest skipped
>>      [mvn] testInvalidSimple(org.apache.solr.schema.PreAnalyzedFieldTest)
>> skipped
>>      [mvn] testValidSimple(org.apache.solr.schema.PreAnalyzedFieldTest)
>> skipped
>>      [mvn] testParsers(org.apache.solr.schema.PreAnalyzedFieldTest) skipped
>>      [mvn] Running org.apache.solr.store.hdfs.HdfsLockFactoryTest
>>      [mvn] Tests run: 2, Failures: 0, Errors: 0, Skipped: 2, Time elapsed: 0.006
>> sec - in org.apache.solr.store.hdfs.HdfsLockFactoryTest
>>      [mvn] org.apache.solr.store.hdfs.HdfsLockFactoryTest skipped
>>      [mvn] testBasic(org.apache.solr.store.hdfs.HdfsLockFactoryTest) skipped
>>      [mvn] Running org.apache.solr.update.DocumentBuilderTest
>>      [mvn] Tests run: 14, Failures: 0, Errors: 0, Skipped: 14, Time elapsed: 0.007
>> sec - in org.apache.solr.update.DocumentBuilderTest
>>      [mvn] org.apache.solr.update.DocumentBuilderTest skipped
>>      [mvn] testBuildDocument(org.apache.solr.update.DocumentBuilderTest)
>> skipped
>>      [mvn]
>> testCopyFieldWithFieldBoost(org.apache.solr.update.DocumentBuilderTest)
>> skipped
>>      [mvn]
>> testBoostOmitNorms(org.apache.solr.update.DocumentBuilderTest) skipped
>>      [mvn]
>> testCopyFieldWithDocumentBoost(org.apache.solr.update.DocumentBuilder
>> Test) skipped
>>      [mvn]
>> testCopyFieldsAndFieldBoostsAndDocBoosts(org.apache.solr.update.Docum
>> entBuilderTest) skipped
>>      [mvn]
>> testMultiValuedFieldAndDocBoosts(org.apache.solr.update.DocumentBuilde
>> rTest) skipped
>>      [mvn]
>> testWithPolyFieldsAndFieldBoost(org.apache.solr.update.DocumentBuilderT
>> est) skipped
>>      [mvn]
>> testDocumentBoostOmitNorms(org.apache.solr.update.DocumentBuilderTe
>> st) skipped
>>      [mvn] testMultiField(org.apache.solr.update.DocumentBuilderTest)
>> skipped
>>      [mvn] testExceptions(org.apache.solr.update.DocumentBuilderTest)
>> skipped
>>      [mvn] testNullField(org.apache.solr.update.DocumentBuilderTest)
>> skipped
>>      [mvn]
>> testWithPolyFieldsAndDocumentBoost(org.apache.solr.update.DocumentBu
>> ilderTest) skipped
>>      [mvn] testBoost(org.apache.solr.update.DocumentBuilderTest) skipped
>>      [mvn] Running org.apache.solr.core.SOLR749Test
>>      [mvn] Tests run: 2, Failures: 0, Errors: 0, Skipped: 2, Time elapsed: 0.005
>> sec - in org.apache.solr.core.SOLR749Test
>>      [mvn] org.apache.solr.core.SOLR749Test skipped
>>      [mvn] testConstruction(org.apache.solr.core.SOLR749Test) skipped
>>      [mvn] Running org.apache.solr.handler.component.SearchHandlerTest
>>      [mvn] Tests run: 2, Failures: 0, Errors: 0, Skipped: 2, Time elapsed: 0.006
>> sec - in org.apache.solr.handler.component.SearchHandlerTest
>>      [mvn] org.apache.solr.handler.component.Se
>> 
>> [...truncated too long message...]
>> 
>> ty.VelocityResponseWriterTest)  Time elapsed: 0.009 sec
>>      [mvn]
>>      [mvn] Results :
>>      [mvn]
>>      [mvn] Tests run: 3, Failures: 0, Errors: 0, Skipped: 0
>>      [mvn]
>>      [mvn] [INFO] [jar:jar {execution: default-jar}]
>>      [mvn] [INFO] Building jar: /usr/home/hudson/hudson-
>> slave/workspace/Lucene-Solr-Maven-4.x/maven-
>> build/solr/contrib/velocity/target/solr-velocity-4.6-SNAPSHOT.jar
>>      [mvn] [INFO] [install:install {execution: default-install}]
>>      [mvn] [INFO] Installing /usr/home/hudson/hudson-
>> slave/workspace/Lucene-Solr-Maven-4.x/maven-
>> build/solr/contrib/velocity/target/solr-velocity-4.6-SNAPSHOT.jar to
>> /home/hudson/.m2/repository/org/apache/solr/solr-velocity/4.6-
>> SNAPSHOT/solr-velocity-4.6-SNAPSHOT.jar
>>      [mvn] [INFO] ------------------------------------------------------------------------
>>      [mvn] [INFO] Building Apache Solr Contrib aggregator POM
>>      [mvn] [INFO]    task-segment: [install]
>>      [mvn] [INFO] ------------------------------------------------------------------------
>>      [mvn] [INFO] [groovy:execute {execution: generate-timestamps-and-get-
>> top-level-basedir}]
>>      [mvn] [INFO] [buildnumber:create {execution: default}]
>>      [mvn] [INFO] [enforcer:enforce {execution: enforce-java-compat-
>> version-and-maven-2.2.1}]
>>      [mvn] [INFO] [remote-resources:process {execution: default}]
>>      [mvn] [INFO] [bundle:manifest {execution: bundle-manifest}]
>>      [mvn] [WARNING] Ignoring project type pom - supportedProjectTypes =
>> [jar, bundle]
>>      [mvn] [INFO] [forbiddenapis:check {execution: solr-shared-check-
>> forbidden-apis}]
>>      [mvn] [INFO] Reading bundled API signatures: jdk-unsafe
>>      [mvn] [INFO] Reading bundled API signatures: jdk-deprecated
>>      [mvn] [INFO] Reading API signatures: /usr/home/hudson/hudson-
>> slave/workspace/Lucene-Solr-Maven-
>> 4.x/lucene/tools/forbiddenApis/base.txt
>>      [mvn] [INFO] Loading classes to check...
>>      [mvn] [WARNING] Classes directory does not exist, forbiddenapis check
>> skipped: /usr/home/hudson/hudson-slave/workspace/Lucene-Solr-Maven-
>> 4.x/maven-build/solr/contrib/target/classes
>>      [mvn] [INFO] [forbiddenapis:testCheck {execution: solr-shared-test-
>> check-forbidden-apis}]
>>      [mvn] [INFO] Reading bundled API signatures: jdk-unsafe
>>      [mvn] [INFO] Reading bundled API signatures: jdk-deprecated
>>      [mvn] [INFO] Reading API signatures: /usr/home/hudson/hudson-
>> slave/workspace/Lucene-Solr-Maven-
>> 4.x/lucene/tools/forbiddenApis/tests.txt
>>      [mvn] [INFO] Reading API signatures: /usr/home/hudson/hudson-
>> slave/workspace/Lucene-Solr-Maven-
>> 4.x/lucene/tools/forbiddenApis/base.txt
>>      [mvn] [INFO] Loading classes to check...
>>      [mvn] [WARNING] Classes directory does not exist, forbiddenapis check
>> skipped: /usr/home/hudson/hudson-slave/workspace/Lucene-Solr-Maven-
>> 4.x/maven-build/solr/contrib/target/test-classes
>>      [mvn] [INFO] [site:attach-descriptor {execution: default-attach-
>> descriptor}]
>>      [mvn] [INFO] [install:install {execution: default-install}]
>>      [mvn] [INFO] Installing /usr/home/hudson/hudson-
>> slave/workspace/Lucene-Solr-Maven-4.x/maven-
>> build/solr/contrib/pom.xml to
>> /home/hudson/.m2/repository/org/apache/solr/solr-contrib-
>> aggregator/4.6-SNAPSHOT/solr-contrib-aggregator-4.6-SNAPSHOT.pom
>>      [mvn] [INFO]
>>      [mvn] [INFO]
>>      [mvn] [INFO] ------------------------------------------------------------------------
>>      [mvn] [INFO] Reactor Summary:
>>      [mvn] [INFO] ------------------------------------------------------------------------
>>      [mvn] [INFO] Grandparent POM for Apache Lucene Core and Apache Solr
>> SUCCESS [9.567s]
>>      [mvn] [INFO] Lucene parent POM ..................................... SUCCESS
>> [0.254s]
>>      [mvn] [INFO] Lucene Core ........................................... SUCCESS [17.496s]
>>      [mvn] [INFO] Lucene codecs ......................................... SUCCESS [3.036s]
>>      [mvn] [INFO] Lucene Test Framework ................................. SUCCESS
>> [5.130s]
>>      [mvn] [INFO] Lucene Core tests ..................................... SUCCESS
>> [7:19.777s]
>>      [mvn] [INFO] Lucene Core aggregator POM ............................ SUCCESS
>> [0.189s]
>>      [mvn] [INFO] Lucene codecs tests ................................... SUCCESS
>> [46.583s]
>>      [mvn] [INFO] Lucene codecs aggregator POM .......................... SUCCESS
>> [0.125s]
>>      [mvn] [INFO] Lucene Common Analyzers ............................... SUCCESS
>> [2:35.144s]
>>      [mvn] [INFO] Lucene ICU Analysis Components ........................ SUCCESS
>> [11.702s]
>>      [mvn] [INFO] Lucene Kuromoji Japanese Morphological Analyzer .......
>> SUCCESS [25.778s]
>>      [mvn] [INFO] Lucene Morfologik Polish Lemmatizer ................... SUCCESS
>> [3.922s]
>>      [mvn] [INFO] Lucene Phonetic Filters ............................... SUCCESS
>> [11.045s]
>>      [mvn] [INFO] Lucene Smart Chinese Analyzer ......................... SUCCESS
>> [8.578s]
>>      [mvn] [INFO] Lucene Stempel Analyzer ............................... SUCCESS
>> [4.387s]
>>      [mvn] [INFO] Lucene UIMA Analysis Components .......................
>> SUCCESS [18.424s]
>>      [mvn] [INFO] Lucene Analysis Modules aggregator POM ................
>> SUCCESS [0.179s]
>>      [mvn] [INFO] Lucene Queries ........................................ SUCCESS
>> [13.140s]
>>      [mvn] [INFO] Lucene Sandbox ........................................ SUCCESS
>> [7.956s]
>>      [mvn] [INFO] Lucene QueryParsers ................................... SUCCESS
>> [12.378s]
>>      [mvn] [INFO] Lucene Memory ......................................... SUCCESS
>> [9.284s]
>>      [mvn] [INFO] Lucene Highlighter .................................... SUCCESS
>> [20.126s]
>>      [mvn] [INFO] Lucene Facets ......................................... SUCCESS
>> [1:44.353s]
>>      [mvn] [INFO] Lucene Spatial ........................................ SUCCESS [16.424s]
>>      [mvn] [INFO] Lucene Benchmark ...................................... SUCCESS
>> [29.055s]
>>      [mvn] [INFO] Lucene Classification ................................. SUCCESS [7.773s]
>>      [mvn] [INFO] Lucene Demo ........................................... SUCCESS [4.566s]
>>      [mvn] [INFO] Lucene Expressions .................................... SUCCESS
>> [12.923s]
>>      [mvn] [INFO] Lucene Grouping ....................................... SUCCESS
>> [16.365s]
>>      [mvn] [INFO] Lucene Join ........................................... SUCCESS [16.930s]
>>      [mvn] [INFO] Lucene Miscellaneous .................................. SUCCESS
>> [12.753s]
>>      [mvn] [INFO] Lucene Replicator ..................................... SUCCESS
>> [15.564s]
>>      [mvn] [INFO] Lucene Suggest ........................................ SUCCESS
>> [28.292s]
>>      [mvn] [INFO] Apache Solr parent POM ................................ SUCCESS
>> [0.210s]
>>      [mvn] [INFO] Apache Solr Solrj ..................................... SUCCESS [3.739s]
>>      [mvn] [INFO] Apache Solr Core ...................................... SUCCESS
>> [11.998s]
>>      [mvn] [INFO] Apache Solr Test Framework ............................ SUCCESS
>> [3.417s]
>>      [mvn] [INFO] Apache Solr Core tests ................................ FAILED
>> [31:45.666s]
>>      [mvn] [INFO] Apache Solr Core aggregator POM ....................... SUCCESS
>> [0.172s]
>>      [mvn] [INFO] Apache Solr Solrj tests ............................... SUCCESS
>> [3:06.885s]
>>      [mvn] [INFO] Apache Solr Solrj aggregator POM ...................... SUCCESS
>> [0.184s]
>>      [mvn] [INFO] Apache Solr Search Server ............................. SUCCESS
>> [5.356s]
>>      [mvn] [INFO] Apache Solr Analysis Extras ........................... SUCCESS
>> [10.007s]
>>      [mvn] [INFO] Apache Solr Clustering ................................ SUCCESS
>> [17.077s]
>>      [mvn] [INFO] Apache Solr DataImportHandler ......................... SUCCESS
>> [3:20.235s]
>>      [mvn] [INFO] Apache Solr DataImportHandler Extras .................. SUCCESS
>> [8.231s]
>>      [mvn] [INFO] Apache Solr Content Extraction Library ................ SUCCESS
>> [10.978s]
>>      [mvn] [INFO] Apache Solr Language Identifier ....................... SUCCESS
>> [8.919s]
>>      [mvn] [INFO] Apache Solr UIMA integration .......................... SUCCESS
>> [30.639s]
>>      [mvn] [INFO] Apache Solr Velocity .................................. SUCCESS
>> [5.976s]
>>      [mvn] [INFO] Apache Solr Contrib aggregator POM .................... SUCCESS
>> [0.173s]
>>      [mvn] [INFO] ------------------------------------------------------------------------
>>      [mvn] [INFO] Error for project: Apache Solr Core tests (during install)
>>      [mvn] [INFO] ------------------------------------------------------------------------
>>      [mvn] [INFO] There are test failures.
>>      [mvn]
>>      [mvn] Please refer to /usr/home/hudson/hudson-
>> slave/workspace/Lucene-Solr-Maven-4.x/maven-
>> build/solr/core/src/test/target/surefire-reports for the individual test
>> results.
>>      [mvn] [INFO] ------------------------------------------------------------------------
>>      [mvn] [INFO] For more information, run Maven with the -e switch
>>      [mvn] [INFO] ------------------------------------------------------------------------
>>      [mvn] [INFO] BUILD ERRORS
>>      [mvn] [INFO] ------------------------------------------------------------------------
>>      [mvn] [INFO] Total time: 58 minutes 20 seconds
>>      [mvn] [INFO] Finished at: Sun Nov 03 14:12:59 GMT 2013
>>      [mvn] [INFO] Final Memory: 293M/2846M
>>      [mvn] [INFO] ------------------------------------------------------------------------
>> 
>> BUILD FAILED
>> /usr/home/hudson/hudson-slave/workspace/Lucene-Solr-Maven-
>> 4.x/build.xml:451: The following error occurred while executing this line:
>> /usr/home/hudson/hudson-slave/workspace/Lucene-Solr-Maven-
>> 4.x/build.xml:178: The following error occurred while executing this line:
>> /usr/home/hudson/hudson-slave/workspace/Lucene-Solr-Maven-
>> 4.x/extra-targets.xml:56: Java returned: 1
>> 
>> Total time: 81 minutes 16 seconds
>> Build step 'Invoke Ant' marked build as failure
>> Recording test results
>> Email was triggered for: Failure
>> Sending email for trigger: Failure
>> 
>> 
> 
> 
> 
> ---------------------------------------------------------------------
> To unsubscribe, e-mail: dev-unsubscribe@lucene.apache.org
> For additional commands, e-mail: dev-help@lucene.apache.org
> 


---------------------------------------------------------------------
To unsubscribe, e-mail: dev-unsubscribe@lucene.apache.org
For additional commands, e-mail: dev-help@lucene.apache.org


Mime
View raw message