lucene-dev mailing list archives

Site index · List index
Message view « Date » · « Thread »
Top « Date » · « Thread »
From Policeman Jenkins Server <jenk...@thetaphi.de>
Subject [JENKINS] Lucene-Solr-trunk-Windows (32bit/jdk1.7.0_45) - Build # 3463 - Still Failing!
Date Thu, 14 Nov 2013 05:45:25 GMT
Build: http://jenkins.thetaphi.de/job/Lucene-Solr-trunk-Windows/3463/
Java: 32bit/jdk1.7.0_45 -server -XX:+UseParallelGC

1 tests failed.
FAILED:  junit.framework.TestSuite.org.apache.solr.handler.component.DistributedDebugComponentTest

Error Message:
Unable to delete file: .\org.apache.solr.handler.component.DistributedDebugComponentTest\collection2\data\tlog\tlog.0000000000000000000

Stack Trace:
java.io.IOException: Unable to delete file: .\org.apache.solr.handler.component.DistributedDebugComponentTest\collection2\data\tlog\tlog.0000000000000000000
	at __randomizedtesting.SeedInfo.seed([AEBB37B5497E9C8C]:0)
	at org.apache.commons.io.FileUtils.forceDelete(FileUtils.java:1919)
	at org.apache.commons.io.FileUtils.cleanDirectory(FileUtils.java:1399)
	at org.apache.commons.io.FileUtils.deleteDirectory(FileUtils.java:1331)
	at org.apache.commons.io.FileUtils.forceDelete(FileUtils.java:1910)
	at org.apache.commons.io.FileUtils.cleanDirectory(FileUtils.java:1399)
	at org.apache.commons.io.FileUtils.deleteDirectory(FileUtils.java:1331)
	at org.apache.commons.io.FileUtils.forceDelete(FileUtils.java:1910)
	at org.apache.commons.io.FileUtils.cleanDirectory(FileUtils.java:1399)
	at org.apache.commons.io.FileUtils.deleteDirectory(FileUtils.java:1331)
	at org.apache.commons.io.FileUtils.forceDelete(FileUtils.java:1910)
	at org.apache.commons.io.FileUtils.cleanDirectory(FileUtils.java:1399)
	at org.apache.commons.io.FileUtils.deleteDirectory(FileUtils.java:1331)
	at org.apache.solr.SolrJettyTestBase.cleanUpJettyHome(SolrJettyTestBase.java:189)
	at org.apache.solr.handler.component.DistributedDebugComponentTest.afterTest(DistributedDebugComponentTest.java:74)
	at sun.reflect.NativeMethodAccessorImpl.invoke0(Native Method)
	at sun.reflect.NativeMethodAccessorImpl.invoke(NativeMethodAccessorImpl.java:57)
	at sun.reflect.DelegatingMethodAccessorImpl.invoke(DelegatingMethodAccessorImpl.java:43)
	at java.lang.reflect.Method.invoke(Method.java:606)
	at com.carrotsearch.randomizedtesting.RandomizedRunner.invoke(RandomizedRunner.java:1559)
	at com.carrotsearch.randomizedtesting.RandomizedRunner.access$600(RandomizedRunner.java:79)
	at com.carrotsearch.randomizedtesting.RandomizedRunner$5.evaluate(RandomizedRunner.java:700)
	at com.carrotsearch.randomizedtesting.rules.StatementAdapter.evaluate(StatementAdapter.java:36)
	at com.carrotsearch.randomizedtesting.rules.SystemPropertiesRestoreRule$1.evaluate(SystemPropertiesRestoreRule.java:53)
	at org.apache.lucene.util.AbstractBeforeAfterRule$1.evaluate(AbstractBeforeAfterRule.java:46)
	at org.apache.lucene.util.TestRuleStoreClassName$1.evaluate(TestRuleStoreClassName.java:42)
	at com.carrotsearch.randomizedtesting.rules.SystemPropertiesInvariantRule$1.evaluate(SystemPropertiesInvariantRule.java:55)
	at com.carrotsearch.randomizedtesting.rules.NoShadowingOrOverridesOnMethodsRule$1.evaluate(NoShadowingOrOverridesOnMethodsRule.java:39)
	at com.carrotsearch.randomizedtesting.rules.NoShadowingOrOverridesOnMethodsRule$1.evaluate(NoShadowingOrOverridesOnMethodsRule.java:39)
	at com.carrotsearch.randomizedtesting.rules.StatementAdapter.evaluate(StatementAdapter.java:36)
	at org.apache.lucene.util.TestRuleAssertionsRequired$1.evaluate(TestRuleAssertionsRequired.java:43)
	at org.apache.lucene.util.TestRuleMarkFailure$1.evaluate(TestRuleMarkFailure.java:48)
	at org.apache.lucene.util.TestRuleIgnoreAfterMaxFailures$1.evaluate(TestRuleIgnoreAfterMaxFailures.java:70)
	at org.apache.lucene.util.TestRuleIgnoreTestSuites$1.evaluate(TestRuleIgnoreTestSuites.java:55)
	at com.carrotsearch.randomizedtesting.rules.StatementAdapter.evaluate(StatementAdapter.java:36)
	at com.carrotsearch.randomizedtesting.ThreadLeakControl$StatementRunner.run(ThreadLeakControl.java:358)
	at java.lang.Thread.run(Thread.java:744)




Build Log:
[...truncated 10816 lines...]
   [junit4] Suite: org.apache.solr.handler.component.DistributedDebugComponentTest
   [junit4]   2> 3205260 T8343 oas.SolrTestCaseJ4.initCore ####initCore
   [junit4]   2> Creating dataDir: C:\Users\JenkinsSlave\workspace\Lucene-Solr-trunk-Windows\solr\build\solr-core\test\J0\.\solrtest-DistributedDebugComponentTest-1384407779800
   [junit4]   2> 3205262 T8343 oas.SolrTestCaseJ4.initCore ####initCore end
   [junit4]   2> 3205262 T8343 oas.SolrJettyTestBase.getSSLConfig Randomized ssl (false) and clientAuth (false)
   [junit4]   2> 3205262 T8343 oejs.Server.doStart jetty-8.1.10.v20130312
   [junit4]   2> 3205266 T8343 oejs.AbstractConnector.doStart Started SelectChannelConnector@127.0.0.1:62140
   [junit4]   2> 3205267 T8343 oass.SolrDispatchFilter.init SolrDispatchFilter.init()
   [junit4]   2> 3205267 T8343 oasc.SolrResourceLoader.locateSolrHome JNDI not configured for solr (NoInitialContextEx)
   [junit4]   2> 3205267 T8343 oasc.SolrResourceLoader.locateSolrHome using system property solr.solr.home: C:\Users\JenkinsSlave\workspace\Lucene-Solr-trunk-Windows\solr\build\solr-core\test\J0\.\org.apache.solr.handler.component.DistributedDebugComponentTest
   [junit4]   2> 3205267 T8343 oasc.SolrResourceLoader.<init> new SolrResourceLoader for directory: 'C:\Users\JenkinsSlave\workspace\Lucene-Solr-trunk-Windows\solr\build\solr-core\test\J0\.\org.apache.solr.handler.component.DistributedDebugComponentTest\'
   [junit4]   2> 3205299 T8343 oasc.ConfigSolr.fromFile Loading container configuration from C:\Users\JenkinsSlave\workspace\Lucene-Solr-trunk-Windows\solr\build\solr-core\test\J0\.\org.apache.solr.handler.component.DistributedDebugComponentTest\solr.xml
   [junit4]   2> 3205374 T8343 oasc.CoreContainer.<init> New CoreContainer 26375935
   [junit4]   2> 3205374 T8343 oasc.CoreContainer.load Loading cores into CoreContainer [instanceDir=C:\Users\JenkinsSlave\workspace\Lucene-Solr-trunk-Windows\solr\build\solr-core\test\J0\.\org.apache.solr.handler.component.DistributedDebugComponentTest\]
   [junit4]   2> 3205376 T8343 oashc.HttpShardHandlerFactory.getParameter Setting socketTimeout to: 90000
   [junit4]   2> 3205376 T8343 oashc.HttpShardHandlerFactory.getParameter Setting urlScheme to: http://
   [junit4]   2> 3205376 T8343 oashc.HttpShardHandlerFactory.getParameter Setting connTimeout to: 15000
   [junit4]   2> 3205376 T8343 oashc.HttpShardHandlerFactory.getParameter Setting maxConnectionsPerHost to: 20
   [junit4]   2> 3205376 T8343 oashc.HttpShardHandlerFactory.getParameter Setting corePoolSize to: 0
   [junit4]   2> 3205376 T8343 oashc.HttpShardHandlerFactory.getParameter Setting maximumPoolSize to: 2147483647
   [junit4]   2> 3205376 T8343 oashc.HttpShardHandlerFactory.getParameter Setting maxThreadIdleTime to: 5
   [junit4]   2> 3205379 T8343 oashc.HttpShardHandlerFactory.getParameter Setting sizeOfQueue to: -1
   [junit4]   2> 3205379 T8343 oashc.HttpShardHandlerFactory.getParameter Setting fairnessPolicy to: false
   [junit4]   2> 3205382 T8343 oasl.LogWatcher.createWatcher SLF4J impl is org.slf4j.impl.Log4jLoggerFactory
   [junit4]   2> 3205382 T8343 oasl.LogWatcher.newRegisteredLogWatcher Registering Log Listener [Log4j (org.slf4j.impl.Log4jLoggerFactory)]
   [junit4]   2> 3205382 T8343 oasc.CoreContainer.load Host Name: 127.0.0.1
   [junit4]   2> 3205390 T8353 oasc.CoreContainer.create Creating SolrCore 'collection1' using instanceDir: C:\Users\JenkinsSlave\workspace\Lucene-Solr-trunk-Windows\solr\build\solr-core\test\J0\.\org.apache.solr.handler.component.DistributedDebugComponentTest\collection1
   [junit4]   2> 3205390 T8353 oasc.SolrResourceLoader.<init> new SolrResourceLoader for directory: 'C:\Users\JenkinsSlave\workspace\Lucene-Solr-trunk-Windows\solr\build\solr-core\test\J0\.\org.apache.solr.handler.component.DistributedDebugComponentTest\collection1\'
   [junit4]   2> 3205463 T8353 oasc.SolrConfig.<init> Using Lucene MatchVersion: LUCENE_50
   [junit4]   2> 3205542 T8353 oasc.SolrConfig.<init> Loaded SolrConfig: solrconfig.xml
   [junit4]   2> 3205543 T8353 oass.IndexSchema.readSchema Reading Solr Schema from schema.xml
   [junit4]   2> 3205552 T8353 oass.IndexSchema.readSchema [collection1] Schema name=test
   [junit4]   2> 3206255 T8353 oass.OpenExchangeRatesOrgProvider.init Initialized with rates=open-exchange-rates.json, refreshInterval=1440.
   [junit4]   2> 3206264 T8353 oass.IndexSchema.readSchema default search field in schema is text
   [junit4]   2> 3206268 T8353 oass.IndexSchema.readSchema unique key field: id
   [junit4]   2> 3206278 T8353 oass.FileExchangeRateProvider.reload Reloading exchange rates from file currency.xml
   [junit4]   2> 3206283 T8353 oass.FileExchangeRateProvider.reload Reloading exchange rates from file currency.xml
   [junit4]   2> 3206287 T8353 oass.OpenExchangeRatesOrgProvider.reload Reloading exchange rates from open-exchange-rates.json
   [junit4]   2> 3206287 T8353 oass.OpenExchangeRatesOrgProvider$OpenExchangeRates.<init> WARN Unknown key IMPORTANT NOTE
   [junit4]   2> 3206287 T8353 oass.OpenExchangeRatesOrgProvider$OpenExchangeRates.<init> WARN Expected key, got STRING
   [junit4]   2> 3206287 T8353 oass.OpenExchangeRatesOrgProvider.reload Reloading exchange rates from open-exchange-rates.json
   [junit4]   2> 3206287 T8353 oass.OpenExchangeRatesOrgProvider$OpenExchangeRates.<init> WARN Unknown key IMPORTANT NOTE
   [junit4]   2> 3206287 T8353 oass.OpenExchangeRatesOrgProvider$OpenExchangeRates.<init> WARN Expected key, got STRING
   [junit4]   2> 3206287 T8353 oasc.SolrCore.initDirectoryFactory org.apache.solr.core.MockDirectoryFactory
   [junit4]   2> 3206289 T8353 oasc.SolrCore.<init> [collection1] Opening new SolrCore at C:\Users\JenkinsSlave\workspace\Lucene-Solr-trunk-Windows\solr\build\solr-core\test\J0\.\org.apache.solr.handler.component.DistributedDebugComponentTest\collection1\, dataDir=C:\Users\JenkinsSlave\workspace\Lucene-Solr-trunk-Windows\solr\build\solr-core\test\J0\solrtest-DistributedDebugComponentTest-1384407779800\
   [junit4]   2> 3206289 T8353 oasc.JmxMonitoredMap.<init> JMX monitoring is enabled. Adding Solr mbeans to JMX Server: com.sun.jmx.mbeanserver.JmxMBeanServer@256be1
   [junit4]   2> 3206289 T8353 oasc.CachingDirectoryFactory.get return new directory for C:\Users\JenkinsSlave\workspace\Lucene-Solr-trunk-Windows\solr\build\solr-core\test\J0\solrtest-DistributedDebugComponentTest-1384407779800\
   [junit4]   2> 3206289 T8353 oasc.SolrCore.getNewIndexDir New index directory detected: old=null new=C:\Users\JenkinsSlave\workspace\Lucene-Solr-trunk-Windows\solr\build\solr-core\test\J0\solrtest-DistributedDebugComponentTest-1384407779800\index/
   [junit4]   2> 3206289 T8353 oasc.SolrCore.initIndex WARN [collection1] Solr index directory 'C:\Users\JenkinsSlave\workspace\Lucene-Solr-trunk-Windows\solr\build\solr-core\test\J0\solrtest-DistributedDebugComponentTest-1384407779800\index' doesn't exist. Creating new index...
   [junit4]   2> 3206290 T8353 oasc.CachingDirectoryFactory.get return new directory for C:\Users\JenkinsSlave\workspace\Lucene-Solr-trunk-Windows\solr\build\solr-core\test\J0\solrtest-DistributedDebugComponentTest-1384407779800\index
   [junit4]   2> 3206291 T8353 oasu.RandomMergePolicy.<init> RandomMergePolicy wrapping class org.apache.lucene.index.LogDocMergePolicy: [LogDocMergePolicy: minMergeSize=1000, mergeFactor=34, maxMergeSize=9223372036854775807, maxMergeSizeForForcedMerge=9223372036854775807, calibrateSizeByDeletes=false, maxMergeDocs=2147483647, maxCFSSegmentSizeMB=8.796093022207999E12, noCFSRatio=0.6660681392436625]
   [junit4]   2> 3206291 T8353 oasc.SolrDeletionPolicy.onCommit SolrDeletionPolicy.onCommit: commits: num=1
   [junit4]   2> 		commit{dir=RateLimitedDirectoryWrapper(MockDirectoryWrapper(org.apache.lucene.store.RAMDirectory@15f456e lockFactory=org.apache.lucene.store.SingleInstanceLockFactory@1a1150)),segFN=segments_1,generation=1}
   [junit4]   2> 3206291 T8353 oasc.SolrDeletionPolicy.updateCommits newest commit generation = 1
   [junit4]   2> 3206292 T8353 oasc.SolrCore.initWriters created xml: solr.XMLResponseWriter
   [junit4]   2> 3206295 T8353 oasup.UpdateRequestProcessorChain.init creating updateRequestProcessorChain "dedupe"
   [junit4]   2> 3206296 T8353 oasup.UpdateRequestProcessorChain.init inserting DistributedUpdateProcessorFactory into updateRequestProcessorChain "dedupe"
   [junit4]   2> 3206296 T8353 oasup.UpdateRequestProcessorChain.init creating updateRequestProcessorChain "dedupe-allfields"
   [junit4]   2> 3206296 T8353 oasup.UpdateRequestProcessorChain.init inserting DistributedUpdateProcessorFactory into updateRequestProcessorChain "dedupe-allfields"
   [junit4]   2> 3206296 T8353 oasup.UpdateRequestProcessorChain.init creating updateRequestProcessorChain "stored_sig"
   [junit4]   2> 3206297 T8353 oasup.UpdateRequestProcessorChain.init inserting DistributedUpdateProcessorFactory into updateRequestProcessorChain "stored_sig"
   [junit4]   2> 3206297 T8353 oasup.UpdateRequestProcessorChain.init creating updateRequestProcessorChain "uniq-fields"
   [junit4]   2> 3206297 T8353 oasup.UpdateRequestProcessorChain.init inserting DistributedUpdateProcessorFactory into updateRequestProcessorChain "uniq-fields"
   [junit4]   2> 3206297 T8353 oasup.UpdateRequestProcessorChain.init creating updateRequestProcessorChain "distrib-dup-test-chain-explicit"
   [junit4]   2> 3206298 T8353 oasup.UpdateRequestProcessorChain.init creating updateRequestProcessorChain "distrib-dup-test-chain-implicit"
   [junit4]   2> 3206298 T8353 oasup.UpdateRequestProcessorChain.init inserting DistributedUpdateProcessorFactory into updateRequestProcessorChain "distrib-dup-test-chain-implicit"
   [junit4]   2> 3206298 T8353 oasc.SolrCore.loadUpdateProcessorChains no updateRequestProcessorChain defined as default, creating implicit default
   [junit4]   2> 3206298 T8353 oasc.RequestHandlers.initHandlersFromConfig adding lazy requestHandler: solr.ReplicationHandler
   [junit4]   2> 3206298 T8353 oasc.RequestHandlers.initHandlersFromConfig created /replication: solr.ReplicationHandler
   [junit4]   2> 3206300 T8353 oasc.RequestHandlers.initHandlersFromConfig created standard: solr.StandardRequestHandler
   [junit4]   2> 3206300 T8353 oasc.RequestHandlers.initHandlersFromConfig created /get: solr.RealTimeGetHandler
   [junit4]   2> 3206301 T8353 oasc.RequestHandlers.initHandlersFromConfig created dismax: solr.SearchHandler
   [junit4]   2> 3206301 T8353 oasc.RequestHandlers.initHandlersFromConfig created mock: org.apache.solr.core.MockQuerySenderListenerReqHandler
   [junit4]   2> 3206302 T8353 oasc.RequestHandlers.initHandlersFromConfig created /admin/: org.apache.solr.handler.admin.AdminHandlers
   [junit4]   2> 3206302 T8353 oasc.RequestHandlers.initHandlersFromConfig created defaults: solr.StandardRequestHandler
   [junit4]   2> 3206302 T8353 oasc.RequestHandlers.initHandlersFromConfig adding lazy requestHandler: solr.StandardRequestHandler
   [junit4]   2> 3206302 T8353 oasc.RequestHandlers.initHandlersFromConfig created lazy: solr.StandardRequestHandler
   [junit4]   2> 3206303 T8353 oasc.RequestHandlers.initHandlersFromConfig created /update: solr.UpdateRequestHandler
   [junit4]   2> 3206303 T8353 oasc.RequestHandlers.initHandlersFromConfig created /terms: org.apache.solr.handler.component.SearchHandler
   [junit4]   2> 3206303 T8353 oasc.RequestHandlers.initHandlersFromConfig created spellCheckCompRH: org.apache.solr.handler.component.SearchHandler
   [junit4]   2> 3206305 T8353 oasc.RequestHandlers.initHandlersFromConfig created spellCheckCompRH_Direct: org.apache.solr.handler.component.SearchHandler
   [junit4]   2> 3206305 T8353 oasc.RequestHandlers.initHandlersFromConfig created spellCheckWithWordbreak: org.apache.solr.handler.component.SearchHandler
   [junit4]   2> 3206305 T8353 oasc.RequestHandlers.initHandlersFromConfig created spellCheckWithWordbreak_Direct: org.apache.solr.handler.component.SearchHandler
   [junit4]   2> 3206306 T8353 oasc.RequestHandlers.initHandlersFromConfig created spellCheckCompRH1: org.apache.solr.handler.component.SearchHandler
   [junit4]   2> 3206306 T8353 oasc.RequestHandlers.initHandlersFromConfig created mltrh: org.apache.solr.handler.component.SearchHandler
   [junit4]   2> 3206307 T8353 oasc.RequestHandlers.initHandlersFromConfig created tvrh: org.apache.solr.handler.component.SearchHandler
   [junit4]   2> 3206307 T8353 oasc.RequestHandlers.initHandlersFromConfig created /mlt: solr.MoreLikeThisHandler
   [junit4]   2> 3206307 T8353 oasc.RequestHandlers.initHandlersFromConfig created /debug/dump: solr.DumpRequestHandler
   [junit4]   2> 3206314 T8353 oashl.XMLLoader.init xsltCacheLifetimeSeconds=60
   [junit4]   2> 3206317 T8353 oasc.SolrCore.initDeprecatedSupport WARN solrconfig.xml uses deprecated <admin/gettableFiles>, Please update your config to use the ShowFileRequestHandler.
   [junit4]   2> 3206318 T8353 oasc.SolrCore.initDeprecatedSupport WARN adding ShowFileRequestHandler with hidden files: [OLD_SYNONYMS.TXT, STOPWORDS.TXT, PROTWORDS.TXT, OPEN-EXCHANGE-RATES.JSON, SYNONYMS.TXT, MAPPING-ISOLATIN1ACCENT.TXT, CURRENCY.XML, SOLRCONFIG.SNIPPET.RANDOMINDEXCONFIG.XML]
   [junit4]   2> 3206322 T8353 oasu.CommitTracker.<init> Hard AutoCommit: disabled
   [junit4]   2> 3206322 T8353 oasu.CommitTracker.<init> Soft AutoCommit: disabled
   [junit4]   2> 3206323 T8353 oasu.RandomMergePolicy.<init> RandomMergePolicy wrapping class org.apache.lucene.index.LogDocMergePolicy: [LogDocMergePolicy: minMergeSize=1000, mergeFactor=12, maxMergeSize=9223372036854775807, maxMergeSizeForForcedMerge=9223372036854775807, calibrateSizeByDeletes=true, maxMergeDocs=2147483647, maxCFSSegmentSizeMB=8.796093022207999E12, noCFSRatio=0.0]
   [junit4]   2> 3206323 T8353 oasc.SolrDeletionPolicy.onInit SolrDeletionPolicy.onInit: commits: num=1
   [junit4]   2> 		commit{dir=RateLimitedDirectoryWrapper(MockDirectoryWrapper(org.apache.lucene.store.RAMDirectory@15f456e lockFactory=org.apache.lucene.store.SingleInstanceLockFactory@1a1150)),segFN=segments_1,generation=1}
   [junit4]   2> 3206323 T8353 oasc.SolrDeletionPolicy.updateCommits newest commit generation = 1
   [junit4]   2> 3206323 T8353 oass.SolrIndexSearcher.<init> Opening Searcher@ec2668 main
   [junit4]   2> 3206323 T8353 oashc.SpellCheckComponent.inform Initializing spell checkers
   [junit4]   2> 3206333 T8353 oass.DirectSolrSpellChecker.init init: {name=direct,classname=DirectSolrSpellChecker,field=lowerfilt,minQueryLength=3}
   [junit4]   2> 3206381 T8354 oasc.SolrCore.registerSearcher [collection1] Registered new searcher Searcher@ec2668 main{StandardDirectoryReader(segments_1:1:nrt)}
   [junit4]   2> 3206384 T8353 oasc.CoreContainer.registerCore registering core: collection1
   [junit4]   2> 3206386 T8343 oass.SolrDispatchFilter.init user.dir=C:\Users\JenkinsSlave\workspace\Lucene-Solr-trunk-Windows\solr\build\solr-core\test\J0
   [junit4]   2> 3206386 T8343 oass.SolrDispatchFilter.init SolrDispatchFilter.init() done
   [junit4]   2> 3206387 T8343 oas.SolrJettyTestBase.createJetty Jetty Assigned Port#62140
   [junit4]   2> 3206395 T8349 oasc.CoreContainer.create Creating SolrCore 'collection2' using instanceDir: C:\Users\JenkinsSlave\workspace\Lucene-Solr-trunk-Windows\solr\build\solr-core\test\J0\.\org.apache.solr.handler.component.DistributedDebugComponentTest\collection2
   [junit4]   2> 3206395 T8349 oasc.SolrResourceLoader.<init> new SolrResourceLoader for directory: 'C:\Users\JenkinsSlave\workspace\Lucene-Solr-trunk-Windows\solr\build\solr-core\test\J0\.\org.apache.solr.handler.component.DistributedDebugComponentTest\collection2\'
   [junit4]   2> 3206493 T8349 oasc.SolrConfig.<init> Using Lucene MatchVersion: LUCENE_50
   [junit4]   2> 3206576 T8349 oasc.SolrConfig.<init> Loaded SolrConfig: solrconfig.xml
   [junit4]   2> 3206576 T8349 oass.IndexSchema.readSchema Reading Solr Schema from schema.xml
   [junit4]   2> 3206587 T8349 oass.IndexSchema.readSchema [collection2] Schema name=test
   [junit4]   2> 3207251 T8349 oass.OpenExchangeRatesOrgProvider.init Initialized with rates=open-exchange-rates.json, refreshInterval=1440.
   [junit4]   2> 3207261 T8349 oass.IndexSchema.readSchema default search field in schema is text
   [junit4]   2> 3207265 T8349 oass.IndexSchema.readSchema unique key field: id
   [junit4]   2> 3207276 T8349 oass.FileExchangeRateProvider.reload Reloading exchange rates from file currency.xml
   [junit4]   2> 3207281 T8349 oass.FileExchangeRateProvider.reload Reloading exchange rates from file currency.xml
   [junit4]   2> 3207285 T8349 oass.OpenExchangeRatesOrgProvider.reload Reloading exchange rates from open-exchange-rates.json
   [junit4]   2> 3207285 T8349 oass.OpenExchangeRatesOrgProvider$OpenExchangeRates.<init> WARN Unknown key IMPORTANT NOTE
   [junit4]   2> 3207287 T8349 oass.OpenExchangeRatesOrgProvider$OpenExchangeRates.<init> WARN Expected key, got STRING
   [junit4]   2> 3207287 T8349 oass.OpenExchangeRatesOrgProvider.reload Reloading exchange rates from open-exchange-rates.json
   [junit4]   2> 3207287 T8349 oass.OpenExchangeRatesOrgProvider$OpenExchangeRates.<init> WARN Unknown key IMPORTANT NOTE
   [junit4]   2> 3207287 T8349 oass.OpenExchangeRatesOrgProvider$OpenExchangeRates.<init> WARN Expected key, got STRING
   [junit4]   2> 3207287 T8349 oasc.SolrCore.initDirectoryFactory org.apache.solr.core.MockDirectoryFactory
   [junit4]   2> 3207289 T8349 oasc.SolrCore.<init> [collection2] Opening new SolrCore at C:\Users\JenkinsSlave\workspace\Lucene-Solr-trunk-Windows\solr\build\solr-core\test\J0\.\org.apache.solr.handler.component.DistributedDebugComponentTest\collection2\, dataDir=C:\Users\JenkinsSlave\workspace\Lucene-Solr-trunk-Windows\solr\build\solr-core\test\J0\.\org.apache.solr.handler.component.DistributedDebugComponentTest\collection2\data\
   [junit4]   2> 3207289 T8349 oasc.JmxMonitoredMap.<init> JMX monitoring is enabled. Adding Solr mbeans to JMX Server: com.sun.jmx.mbeanserver.JmxMBeanServer@256be1
   [junit4]   2> 3207290 T8349 oasc.CachingDirectoryFactory.get return new directory for C:\Users\JenkinsSlave\workspace\Lucene-Solr-trunk-Windows\solr\build\solr-core\test\J0\.\org.apache.solr.handler.component.DistributedDebugComponentTest\collection2\data\
   [junit4]   2> 3207290 T8349 oasc.SolrCore.getNewIndexDir New index directory detected: old=null new=C:\Users\JenkinsSlave\workspace\Lucene-Solr-trunk-Windows\solr\build\solr-core\test\J0\.\org.apache.solr.handler.component.DistributedDebugComponentTest\collection2\data\index/
   [junit4]   2> 3207290 T8349 oasc.SolrCore.initIndex WARN [collection2] Solr index directory 'C:\Users\JenkinsSlave\workspace\Lucene-Solr-trunk-Windows\solr\build\solr-core\test\J0\.\org.apache.solr.handler.component.DistributedDebugComponentTest\collection2\data\index' doesn't exist. Creating new index...
   [junit4]   2> 3207291 T8349 oasc.CachingDirectoryFactory.get return new directory for C:\Users\JenkinsSlave\workspace\Lucene-Solr-trunk-Windows\solr\build\solr-core\test\J0\.\org.apache.solr.handler.component.DistributedDebugComponentTest\collection2\data\index
   [junit4]   2> 3207291 T8349 oasu.RandomMergePolicy.<init> RandomMergePolicy wrapping class org.apache.lucene.index.LogDocMergePolicy: [LogDocMergePolicy: minMergeSize=1000, mergeFactor=34, maxMergeSize=9223372036854775807, maxMergeSizeForForcedMerge=9223372036854775807, calibrateSizeByDeletes=false, maxMergeDocs=2147483647, maxCFSSegmentSizeMB=8.796093022207999E12, noCFSRatio=0.6660681392436625]
   [junit4]   2> 3207293 T8349 oasc.SolrDeletionPolicy.onCommit SolrDeletionPolicy.onCommit: commits: num=1
   [junit4]   2> 		commit{dir=RateLimitedDirectoryWrapper(MockDirectoryWrapper(org.apache.lucene.store.RAMDirectory@117f17b lockFactory=org.apache.lucene.store.SingleInstanceLockFactory@1eb9353)),segFN=segments_1,generation=1}
   [junit4]   2> 3207293 T8349 oasc.SolrDeletionPolicy.updateCommits newest commit generation = 1
   [junit4]   2> 3207294 T8349 oasc.SolrCore.initWriters created xml: solr.XMLResponseWriter
   [junit4]   2> 3207298 T8349 oasup.UpdateRequestProcessorChain.init creating updateRequestProcessorChain "dedupe"
   [junit4]   2> 3207298 T8349 oasup.UpdateRequestProcessorChain.init inserting DistributedUpdateProcessorFactory into updateRequestProcessorChain "dedupe"
   [junit4]   2> 3207298 T8349 oasup.UpdateRequestProcessorChain.init creating updateRequestProcessorChain "dedupe-allfields"
   [junit4]   2> 3207299 T8349 oasup.UpdateRequestProcessorChain.init inserting DistributedUpdateProcessorFactory into updateRequestProcessorChain "dedupe-allfields"
   [junit4]   2> 3207299 T8349 oasup.UpdateRequestProcessorChain.init creating updateRequestProcessorChain "stored_sig"
   [junit4]   2> 3207299 T8349 oasup.UpdateRequestProcessorChain.init inserting DistributedUpdateProcessorFactory into updateRequestProcessorChain "stored_sig"
   [junit4]   2> 3207299 T8349 oasup.UpdateRequestProcessorChain.init creating updateRequestProcessorChain "uniq-fields"
   [junit4]   2> 3207300 T8349 oasup.UpdateRequestProcessorChain.init inserting DistributedUpdateProcessorFactory into updateRequestProcessorChain "uniq-fields"
   [junit4]   2> 3207300 T8349 oasup.UpdateRequestProcessorChain.init creating updateRequestProcessorChain "distrib-dup-test-chain-explicit"
   [junit4]   2> 3207301 T8349 oasup.UpdateRequestProcessorChain.init creating updateRequestProcessorChain "distrib-dup-test-chain-implicit"
   [junit4]   2> 3207301 T8349 oasup.UpdateRequestProcessorChain.init inserting DistributedUpdateProcessorFactory into updateRequestProcessorChain "distrib-dup-test-chain-implicit"
   [junit4]   2> 3207301 T8349 oasc.SolrCore.loadUpdateProcessorChains no updateRequestProcessorChain defined as default, creating implicit default
   [junit4]   2> 3207301 T8349 oasc.RequestHandlers.initHandlersFromConfig adding lazy requestHandler: solr.ReplicationHandler
   [junit4]   2> 3207301 T8349 oasc.RequestHandlers.initHandlersFromConfig created /replication: solr.ReplicationHandler
   [junit4]   2> 3207303 T8349 oasc.RequestHandlers.initHandlersFromConfig created standard: solr.StandardRequestHandler
   [junit4]   2> 3207304 T8349 oasc.RequestHandlers.initHandlersFromConfig created /get: solr.RealTimeGetHandler
   [junit4]   2> 3207304 T8349 oasc.RequestHandlers.initHandlersFromConfig created dismax: solr.SearchHandler
   [junit4]   2> 3207305 T8349 oasc.RequestHandlers.initHandlersFromConfig created mock: org.apache.solr.core.MockQuerySenderListenerReqHandler
   [junit4]   2> 3207305 T8349 oasc.RequestHandlers.initHandlersFromConfig created /admin/: org.apache.solr.handler.admin.AdminHandlers
   [junit4]   2> 3207306 T8349 oasc.RequestHandlers.initHandlersFromConfig created defaults: solr.StandardRequestHandler
   [junit4]   2> 3207306 T8349 oasc.RequestHandlers.initHandlersFromConfig adding lazy requestHandler: solr.StandardRequestHandler
   [junit4]   2> 3207306 T8349 oasc.RequestHandlers.initHandlersFromConfig created lazy: solr.StandardRequestHandler
   [junit4]   2> 3207307 T8349 oasc.RequestHandlers.initHandlersFromConfig created /update: solr.UpdateRequestHandler
   [junit4]   2> 3207307 T8349 oasc.RequestHandlers.initHandlersFromConfig created /terms: org.apache.solr.handler.component.SearchHandler
   [junit4]   2> 3207308 T8349 oasc.RequestHandlers.initHandlersFromConfig created spellCheckCompRH: org.apache.solr.handler.component.SearchHandler
   [junit4]   2> 3207309 T8349 oasc.RequestHandlers.initHandlersFromConfig created spellCheckCompRH_Direct: org.apache.solr.handler.component.SearchHandler
   [junit4]   2> 3207309 T8349 oasc.RequestHandlers.initHandlersFromConfig created spellCheckWithWordbreak: org.apache.solr.handler.component.SearchHandler
   [junit4]   2> 3207310 T8349 oasc.RequestHandlers.initHandlersFromConfig created spellCheckWithWordbreak_Direct: org.apache.solr.handler.component.SearchHandler
   [junit4]   2> 3207310 T8349 oasc.RequestHandlers.initHandlersFromConfig created spellCheckCompRH1: org.apache.solr.handler.component.SearchHandler
   [junit4]   2> 3207311 T8349 oasc.RequestHandlers.initHandlersFromConfig created mltrh: org.apache.solr.handler.component.SearchHandler
   [junit4]   2> 3207311 T8349 oasc.RequestHandlers.initHandlersFromConfig created tvrh: org.apache.solr.handler.component.SearchHandler
   [junit4]   2> 3207312 T8349 oasc.RequestHandlers.initHandlersFromConfig created /mlt: solr.MoreLikeThisHandler
   [junit4]   2> 3207312 T8349 oasc.RequestHandlers.initHandlersFromConfig created /debug/dump: solr.DumpRequestHandler
   [junit4]   2> 3207318 T8349 oashl.XMLLoader.init xsltCacheLifetimeSeconds=60
   [junit4]   2> 3207322 T8349 oasc.SolrCore.initDeprecatedSupport WARN solrconfig.xml uses deprecated <admin/gettableFiles>, Please update your config to use the ShowFileRequestHandler.
   [junit4]   2> 3207325 T8349 oasc.SolrCore.initDeprecatedSupport WARN adding ShowFileRequestHandler with hidden files: [OLD_SYNONYMS.TXT, STOPWORDS.TXT, PROTWORDS.TXT, OPEN-EXCHANGE-RATES.JSON, SYNONYMS.TXT, MAPPING-ISOLATIN1ACCENT.TXT, CURRENCY.XML, SOLRCONFIG.SNIPPET.RANDOMINDEXCONFIG.XML]
   [junit4]   2> 3207330 T8349 oasu.CommitTracker.<init> Hard AutoCommit: disabled
   [junit4]   2> 3207330 T8349 oasu.CommitTracker.<init> Soft AutoCommit: disabled
   [junit4]   2> 3207330 T8349 oasu.RandomMergePolicy.<init> RandomMergePolicy wrapping class org.apache.lucene.index.LogDocMergePolicy: [LogDocMergePolicy: minMergeSize=1000, mergeFactor=12, maxMergeSize=9223372036854775807, maxMergeSizeForForcedMerge=9223372036854775807, calibrateSizeByDeletes=true, maxMergeDocs=2147483647, maxCFSSegmentSizeMB=8.796093022207999E12, noCFSRatio=0.0]
   [junit4]   2> 3207331 T8349 oasc.SolrDeletionPolicy.onInit SolrDeletionPolicy.onInit: commits: num=1
   [junit4]   2> 		commit{dir=RateLimitedDirectoryWrapper(MockDirectoryWrapper(org.apache.lucene.store.RAMDirectory@117f17b lockFactory=org.apache.lucene.store.SingleInstanceLockFactory@1eb9353)),segFN=segments_1,generation=1}
   [junit4]   2> 3207331 T8349 oasc.SolrDeletionPolicy.updateCommits newest commit generation = 1
   [junit4]   2> 3207331 T8349 oass.SolrIndexSearcher.<init> Opening Searcher@3f7104 main
   [junit4]   2> 3207331 T8349 oashc.SpellCheckComponent.inform Initializing spell checkers
   [junit4]   2> 3207343 T8349 oass.DirectSolrSpellChecker.init init: {name=direct,classname=DirectSolrSpellChecker,field=lowerfilt,minQueryLength=3}
   [junit4]   2> 3207399 T8356 oasc.SolrCore.registerSearcher [collection2] Registered new searcher Searcher@3f7104 main{StandardDirectoryReader(segments_1:1:nrt)}
   [junit4]   2> 3207403 T8349 oasc.CoreContainer.registerCore registering core: collection2
   [junit4]   2> 3207403 T8349 oass.SolrDispatchFilter.handleAdminRequest [admin] webapp=null path=/admin/cores params={name=collection2&action=CREATE&wt=javabin&version=2} status=0 QTime=1009 
   [junit4]   2> 3207414 T8343 oas.SolrTestCaseJ4.setUp ###Starting testSimpleSearch
   [junit4]   2> ASYNC  NEW_CORE C2478 name=collection1 org.apache.solr.core.SolrCore@ee19aa
   [junit4]   2> 3207436 T8352 C2478 oasup.LogUpdateProcessor.finish [collection1] webapp=/solr path=/update params={wt=javabin&version=2} {add=[1 (1451656774389071872)]} 0 7
   [junit4]   2> 3207439 T8347 C2478 oasu.DirectUpdateHandler2.commit start commit{,optimize=false,openSearcher=true,waitSearcher=true,expungeDeletes=false,softCommit=false,prepareCommit=false}
   [junit4]   2> 3207443 T8347 C2478 oasc.SolrDeletionPolicy.onCommit SolrDeletionPolicy.onCommit: commits: num=2
   [junit4]   2> 		commit{dir=RateLimitedDirectoryWrapper(MockDirectoryWrapper(org.apache.lucene.store.RAMDirectory@15f456e lockFactory=org.apache.lucene.store.SingleInstanceLockFactory@1a1150)),segFN=segments_1,generation=1}
   [junit4]   2> 		commit{dir=RateLimitedDirectoryWrapper(MockDirectoryWrapper(org.apache.lucene.store.RAMDirectory@15f456e lockFactory=org.apache.lucene.store.SingleInstanceLockFactory@1a1150)),segFN=segments_2,generation=2}
   [junit4]   2> 3207444 T8347 C2478 oasc.SolrDeletionPolicy.updateCommits newest commit generation = 2
   [junit4]   2> 3207444 T8347 C2478 oass.SolrIndexSearcher.<init> Opening Searcher@c3e0e2 main
   [junit4]   2> 3207445 T8347 C2478 oasu.DirectUpdateHandler2.commit end_commit_flush
   [junit4]   2> 3207446 T8354 oasc.SolrCore.registerSearcher [collection1] Registered new searcher Searcher@c3e0e2 main{StandardDirectoryReader(segments_2:3:nrt _0(5.0):c1)}
   [junit4]   2> 3207447 T8347 C2478 oasup.LogUpdateProcessor.finish [collection1] webapp=/solr path=/update params={waitSearcher=true&commit=true&wt=javabin&version=2&softCommit=false} {commit=} 0 8
   [junit4]   2> ASYNC  NEW_CORE C2479 name=collection2 org.apache.solr.core.SolrCore@16c179a
   [junit4]   2> 3207465 T8348 C2479 oasup.LogUpdateProcessor.finish [collection2] webapp=/solr path=/update params={wt=javabin&version=2} {add=[2 (1451656774419480576)]} 0 5
   [junit4]   2> 3207469 T8350 C2479 oasu.DirectUpdateHandler2.commit start commit{,optimize=false,openSearcher=true,waitSearcher=true,expungeDeletes=false,softCommit=false,prepareCommit=false}
   [junit4]   2> 3207472 T8350 C2479 oasc.SolrDeletionPolicy.onCommit SolrDeletionPolicy.onCommit: commits: num=2
   [junit4]   2> 		commit{dir=RateLimitedDirectoryWrapper(MockDirectoryWrapper(org.apache.lucene.store.RAMDirectory@117f17b lockFactory=org.apache.lucene.store.SingleInstanceLockFactory@1eb9353)),segFN=segments_1,generation=1}
   [junit4]   2> 		commit{dir=RateLimitedDirectoryWrapper(MockDirectoryWrapper(org.apache.lucene.store.RAMDirectory@117f17b lockFactory=org.apache.lucene.store.SingleInstanceLockFactory@1eb9353)),segFN=segments_2,generation=2}
   [junit4]   2> 3207473 T8350 C2479 oasc.SolrDeletionPolicy.updateCommits newest commit generation = 2
   [junit4]   2> 3207473 T8350 C2479 oass.SolrIndexSearcher.<init> Opening Searcher@12b9599 main
   [junit4]   2> 3207475 T8350 C2479 oasu.DirectUpdateHandler2.commit end_commit_flush
   [junit4]   2> 3207475 T8356 oasc.SolrCore.registerSearcher [collection2] Registered new searcher Searcher@12b9599 main{StandardDirectoryReader(segments_2:3:nrt _0(5.0):c1)}
   [junit4]   2> 3207477 T8350 C2479 oasup.LogUpdateProcessor.finish [collection2] webapp=/solr path=/update params={waitSearcher=true&commit=true&wt=javabin&version=2&softCommit=false} {commit=} 0 8
   [junit4]   2> 3207485 T8349 C2479 oasc.SolrCore.execute [collection2] webapp=/solr path=/select params={distrib=false&debug=track&debug=track&wt=javabin&requestPurpose=GET_TOP_IDS&version=2&rows=10&NOW=1384407782019&fl=id,score&debugQuery=false&shard.url=127.0.0.1:62140/solr/collection2&rid=127.0.0.1-collection1-1384407782019-20&start=0&q=*:*&isShard=true&fsv=true} hits=1 status=0 QTime=0 
   [junit4]   2> 3207485 T8352 C2478 oasc.SolrCore.execute [collection1] webapp=/solr path=/select params={distrib=false&debug=track&debug=track&wt=javabin&requestPurpose=GET_TOP_IDS&version=2&rows=10&NOW=1384407782019&fl=id,score&debugQuery=false&shard.url=127.0.0.1:62140/solr/collection1&rid=127.0.0.1-collection1-1384407782019-20&start=0&q=*:*&isShard=true&fsv=true} hits=1 status=0 QTime=0 
   [junit4]   2> 3207490 T8348 C2479 oasc.SolrCore.execute [collection2] webapp=/solr path=/select params={NOW=1384407782019&shard.url=127.0.0.1:62140/solr/collection2&fl=id,text&rid=127.0.0.1-collection1-1384407782019-20&ids=2&q=*:*&distrib=false&debug=track&debug=track&wt=javabin&isShard=true&requestPurpose=GET_FIELDS,GET_DEBUG&version=2} status=0 QTime=0 
   [junit4]   2> 3207490 T8347 C2478 oasc.SolrCore.execute [collection1] webapp=/solr path=/select params={NOW=1384407782019&shard.url=127.0.0.1:62140/solr/collection1&fl=id,text&rid=127.0.0.1-collection1-1384407782019-20&ids=1&q=*:*&distrib=false&debug=track&debug=track&wt=javabin&isShard=true&requestPurpose=GET_FIELDS,GET_DEBUG&version=2} status=0 QTime=0 
   [junit4]   2> 3207492 T8351 C2478 oasc.SolrCore.execute [collection1] webapp=/solr path=/select params={shards=127.0.0.1:62140/solr/collection1,127.0.0.1:62140/solr/collection2&fl=id,text&q=*:*&distrib=true&debug=track&wt=javabin&version=2} rid=127.0.0.1-collection1-1384407782019-20 hits=2 status=0 QTime=13 
   [junit4]   2> 3207497 T8349 C2478 oasc.SolrCore.execute [collection1] webapp=/solr path=/select params={distrib=false&debug=track&debug=track&wt=javabin&requestPurpose=GET_TOP_IDS&version=2&rows=10&omitHeader=true&NOW=1384407782034&shard.url=127.0.0.1:62140/solr/collection1&fl=id,score&debugQuery=false&rid=127.0.0.1-collection1-1384407782034-21&start=0&q=*:*&isShard=true&fsv=true} hits=1 status=0 QTime=0 
   [junit4]   2> 3207497 T8352 C2479 oasc.SolrCore.execute [collection2] webapp=/solr path=/select params={distrib=false&debug=track&debug=track&wt=javabin&requestPurpose=GET_TOP_IDS&version=2&rows=10&omitHeader=true&NOW=1384407782034&shard.url=127.0.0.1:62140/solr/collection2&fl=id,score&debugQuery=false&rid=127.0.0.1-collection1-1384407782034-21&start=0&q=*:*&isShard=true&fsv=true} hits=1 status=0 QTime=0 
   [junit4]   2> 3207501 T8348 C2479 oasc.SolrCore.execute [collection2] webapp=/solr path=/select params={omitHeader=true&NOW=1384407782034&shard.url=127.0.0.1:62140/solr/collection2&fl=id,text&rid=127.0.0.1-collection1-1384407782034-21&ids=2&q=*:*&distrib=false&debug=track&debug=track&wt=javabin&isShard=true&requestPurpose=GET_FIELDS,GET_DEBUG&version=2} status=0 QTime=0 
   [junit4]   2> 3207501 T8347 C2478 oasc.SolrCore.execute [collection1] webapp=/solr path=/select params={omitHeader=true&NOW=1384407782034&shard.url=127.0.0.1:62140/solr/collection1&fl=id,text&rid=127.0.0.1-collection1-1384407782034-21&ids=1&q=*:*&distrib=false&debug=track&debug=track&wt=javabin&isShard=true&requestPurpose=GET_FIELDS,GET_DEBUG&version=2} status=0 QTime=0 
   [junit4]   2> 3207502 T8350 C2478 oasc.SolrCore.execute [collection1] webapp=/solr path=/select params={omitHeader=true&shards=127.0.0.1:62140/solr/collection1,127.0.0.1:62140/solr/collection2&fl=id,text&q=*:*&distrib=true&debug=track&wt=javabin&version=2} rid=127.0.0.1-collection1-1384407782034-21 hits=2 status=0 QTime=8 
   [junit4]   2> 3207508 T8349 C2478 oasc.SolrCore.execute [collection1] webapp=/solr path=/select params={distrib=false&debug=track&debug=track&wt=javabin&requestPurpose=GET_TOP_IDS&version=2&rows=10&omitHeader=true&NOW=1384407782046&shard.url=127.0.0.1:62140/solr/collection1&fl=id,score&debugQuery=false&rid=127.0.0.1-collection1-1384407782046-22&start=0&q=id:1&isShard=true&fsv=true} hits=1 status=0 QTime=0 
   [junit4]   2> 3207508 T8352 C2479 oasc.SolrCore.execute [collection2] webapp=/solr path=/select params={distrib=false&debug=track&debug=track&wt=javabin&requestPurpose=GET_TOP_IDS&version=2&rows=10&omitHeader=true&NOW=1384407782046&shard.url=127.0.0.1:62140/solr/collection2&fl=id,score&debugQuery=false&rid=127.0.0.1-collection1-1384407782046-22&start=0&q=id:1&isShard=true&fsv=true} hits=0 status=0 QTime=0 
   [junit4]   2> 3207512 T8348 C2478 oasc.SolrCore.execute [collection1] webapp=/solr path=/select params={omitHeader=true&NOW=1384407782046&shard.url=127.0.0.1:62140/solr/collection1&fl=id,text&rid=127.0.0.1-collection1-1384407782046-22&ids=1&q=id:1&distrib=false&debug=track&debug=track&wt=javabin&isShard=true&requestPurpose=GET_FIELDS,GET_DEBUG&version=2} status=0 QTime=0 
   [junit4]   2> 3207514 T8351 C2478 oasc.SolrCore.execute [collection1] webapp=/solr path=/select params={omitHeader=true&shards=127.0.0.1:62140/solr/collection1,127.0.0.1:62140/solr/collection2&fl=id,text&q=id:1&distrib=true&debug=track&wt=javabin&version=2} rid=127.0.0.1-collection1-1384407782046-22 hits=1 status=0 QTime=8 
   [junit4]   2> 3207514 T8343 oas.SolrTestCaseJ4.tearDown ###Ending testSimpleSearch
   [junit4]   2> 3207615 T8343 oasc.CoreContainer.shutdown Shutting down CoreContainer instance=26375935
   [junit4]   2> 3207616 T8343 oasc.SolrCore.close [collection1]  CLOSING SolrCore org.apache.solr.core.SolrCore@ee19aa
   [junit4]   2> 3207638 T8343 oasu.DirectUpdateHandler2.close closing DirectUpdateHandler2{commits=1,autocommits=0,soft autocommits=0,optimizes=0,rollbacks=0,expungeDeletes=0,docsPending=0,adds=0,deletesById=0,deletesByQuery=0,errors=0,cumulative_adds=1,cumulative_deletesById=0,cumulative_deletesByQuery=0,cumulative_errors=0}
   [junit4]   2> 3207639 T8343 oasu.SolrCoreState.decrefSolrCoreState Closing SolrCoreState
   [junit4]   2> 3207639 T8343 oasu.DefaultSolrCoreState.closeIndexWriter SolrCoreState ref count has reached 0 - closing IndexWriter
   [junit4]   2> 3207639 T8343 oasu.DefaultSolrCoreState.closeIndexWriter closing IndexWriter with IndexWriterCloser
   [junit4]   2> 3207642 T8343 oasc.SolrCore.closeSearcher [collection1] Closing main searcher on request.
   [junit4]   2> 3207642 T8343 oasc.CachingDirectoryFactory.close Closing MockDirectoryFactory - 2 directories currently being tracked
   [junit4]   2> 3207642 T8343 oasc.CachingDirectoryFactory.closeCacheValue looking to close C:\Users\JenkinsSlave\workspace\Lucene-Solr-trunk-Windows\solr\build\solr-core\test\J0\solrtest-DistributedDebugComponentTest-1384407779800\index [CachedDir<<refCount=0;path=C:\Users\JenkinsSlave\workspace\Lucene-Solr-trunk-Windows\solr\build\solr-core\test\J0\solrtest-DistributedDebugComponentTest-1384407779800\index;done=false>>]
   [junit4]   2> 3207642 T8343 oasc.CachingDirectoryFactory.close Closing directory: C:\Users\JenkinsSlave\workspace\Lucene-Solr-trunk-Windows\solr\build\solr-core\test\J0\solrtest-DistributedDebugComponentTest-1384407779800\index
   [junit4]   2> 3207642 T8343 oasc.CachingDirectoryFactory.closeCacheValue looking to close C:\Users\JenkinsSlave\workspace\Lucene-Solr-trunk-Windows\solr\build\solr-core\test\J0\solrtest-DistributedDebugComponentTest-1384407779800\ [CachedDir<<refCount=0;path=C:\Users\JenkinsSlave\workspace\Lucene-Solr-trunk-Windows\solr\build\solr-core\test\J0\solrtest-DistributedDebugComponentTest-1384407779800\;done=false>>]
   [junit4]   2> 3207642 T8343 oasc.CachingDirectoryFactory.close Closing directory: C:\Users\JenkinsSlave\workspace\Lucene-Solr-trunk-Windows\solr\build\solr-core\test\J0\solrtest-DistributedDebugComponentTest-1384407779800\
   [junit4]   2> 3207642 T8343 oasc.SolrCore.close [collection2]  CLOSING SolrCore org.apache.solr.core.SolrCore@16c179a
   [junit4]   2> 3207656 T8343 oasu.DirectUpdateHandler2.close closing DirectUpdateHandler2{commits=1,autocommits=0,soft autocommits=0,optimizes=0,rollbacks=0,expungeDeletes=0,docsPending=0,adds=0,deletesById=0,deletesByQuery=0,errors=0,cumulative_adds=1,cumulative_deletesById=0,cumulative_deletesByQuery=0,cumulative_errors=0}
   [junit4]   2> 3207657 T8343 oasu.SolrCoreState.decrefSolrCoreState Closing SolrCoreState
   [junit4]   2> 3207657 T8343 oasu.DefaultSolrCoreState.closeIndexWriter SolrCoreState ref count has reached 0 - closing IndexWriter
   [junit4]   2> 3207657 T8343 oasu.DefaultSolrCoreState.closeIndexWriter closing IndexWriter with IndexWriterCloser
   [junit4]   2> 3207661 T8343 oasc.SolrCore.closeSearcher [collection2] Closing main searcher on request.
   [junit4]   2> 3207661 T8343 oasc.CachingDirectoryFactory.close Closing MockDirectoryFactory - 2 directories currently being tracked
   [junit4]   2> 3207661 T8343 oasc.CachingDirectoryFactory.closeCacheValue looking to close C:\Users\JenkinsSlave\workspace\Lucene-Solr-trunk-Windows\solr\build\solr-core\test\J0\.\org.apache.solr.handler.component.DistributedDebugComponentTest\collection2\data\index [CachedDir<<refCount=0;path=C:\Users\JenkinsSlave\workspace\Lucene-Solr-trunk-Windows\solr\build\solr-core\test\J0\.\org.apache.solr.handler.component.DistributedDebugComponentTest\collection2\data\index;done=false>>]
   [junit4]   2> 3207661 T8343 oasc.CachingDirectoryFactory.close Closing directory: C:\Users\JenkinsSlave\workspace\Lucene-Solr-trunk-Windows\solr\build\solr-core\test\J0\.\org.apache.solr.handler.component.DistributedDebugComponentTest\collection2\data\index
   [junit4]   2> 3207661 T8343 oasc.CachingDirectoryFactory.closeCacheValue looking to close C:\Users\JenkinsSlave\workspace\Lucene-Solr-trunk-Windows\solr\build\solr-core\test\J0\.\org.apache.solr.handler.component.DistributedDebugComponentTest\collection2\data\ [CachedDir<<refCount=0;path=C:\Users\JenkinsSlave\workspace\Lucene-Solr-trunk-Windows\solr\build\solr-core\test\J0\.\org.apache.solr.handler.component.DistributedDebugComponentTest\collection2\data\;done=false>>]
   [junit4]   2> 3207661 T8343 oasc.CachingDirectoryFactory.close Closing directory: C:\Users\JenkinsSlave\workspace\Lucene-Solr-trunk-Windows\solr\build\solr-core\test\J0\.\org.apache.solr.handler.component.DistributedDebugComponentTest\collection2\data\
   [junit4]   2> 3207664 T8343 oejsh.ContextHandler.doStop stopped o.e.j.s.ServletContextHandler{/solr,null}
   [junit4]   2> 3207720 T8343 oas.SolrTestCaseJ4.deleteCore ###deleteCore
   [junit4]   2> NOTE: test params are: codec=Asserting, sim=DefaultSimilarity, locale=in, timezone=America/Guatemala
   [junit4]   2> NOTE: Windows 7 6.1 x86/Oracle Corporation 1.7.0_45 (32-bit)/cpus=2,threads=1,free=239419008,total=408944640
   [junit4]   2> NOTE: All tests run in this JVM: [PingRequestHandlerTest, CoreContainerCoreInitFailuresTest, ParsingFieldUpdateProcessorsTest, TestCoreContainer, ZkSolrClientTest, RAMDirectoryFactoryTest, ExternalFileFieldSortTest, TestRecoveryHdfs, TestSolrJ, TestBadConfig, TestSolrXmlPersistor, TestDefaultSimilarityFactory, AddSchemaFieldsUpdateProcessorFactoryTest, SolrInfoMBeanTest, SuggesterTSTTest, TestStressRecovery, TestLMJelinekMercerSimilarityFactory, TestSystemIdResolver, DateFieldTest, BlockDirectoryTest, SliceStateTest, BinaryUpdateRequestHandlerTest, BadComponentTest, TestExtendedDismaxParser, CustomCollectionTest, BasicDistributedZkTest, HighlighterTest, SimpleFacetsTest, TestFieldResource, EnumFieldTest, DocValuesTest, TestSort, RecoveryZkTest, TestSolrXml, TestQuerySenderNoQuery, CoreAdminHandlerTest, SuggesterTest, TestSweetSpotSimilarityFactory, TestLazyCores, InfoHandlerTest, StatelessScriptUpdateProcessorFactoryTest, FieldMutatingUpdateProcessorTest, WordBreakSolrSpellCheckerTest, HdfsBasicDistributedZk2Test, TestPerFieldSimilarity, TestDocBasedVersionConstraints, TestPseudoReturnFields, ClusterStateTest, TestLRUCache, SampleTest, TestPHPSerializedResponseWriter, TermsComponentTest, TestPostingsSolrHighlighter, DeleteInactiveReplicaTest, ShardRoutingCustomTest, OpenExchangeRatesOrgProviderTest, TestManagedSchema, TestOmitPositions, HighlighterConfigTest, SystemInfoHandlerTest, TestCollationField, TestFastLRUCache, BadIndexSchemaTest, CopyFieldTest, TestRecovery, OverseerTest, MinimalSchemaTest, UniqFieldsUpdateProcessorFactoryTest, SolrCoreCheckLockOnStartupTest, TestPhraseSuggestions, TestDistributedSearch, CachingDirectoryFactoryTest, TestMergePolicyConfig, TestCoreDiscovery, TestRealTimeGet, TestLMDirichletSimilarityFactory, TestDocSet, TestHashPartitioner, PreAnalyzedUpdateProcessorTest, TestDynamicFieldCollectionResource, TestReplicationHandler, SoftAutoCommitTest, TestJmxMonitoredMap, BadCopyFieldTest, TestRandomDVFaceting, TestDocumentBuilder, QueryParsingTest, JSONWriterTest, CurrencyFieldOpenExchangeTest, TestFiltering, TestNonNRTOpen, TestSolrQueryParserResource, PluginInfoTest, TestCharFilters, BasicZkTest, DistributedQueryElevationComponentTest, TestSearchPerf, PolyFieldTest, ReturnFieldsTest, TestJmxIntegration, TestAnalyzeInfixSuggestions, IndexSchemaRuntimeFieldTest, TestShardHandlerFactory, IndexBasedSpellCheckerTest, TestDistributedGrouping, SynonymTokenizerTest, ShowFileRequestHandlerTest, SliceStateUpdateTest, TestSolrQueryParser, TestPartialUpdateDeduplication, BasicDistributedZk2Test, TestMultiCoreConfBootstrap, TestClassNameShortening, TestZkChroot, PathHierarchyTokenizerFactoryTest, SearchHandlerTest, HdfsCollectionsAPIDistributedZkTest, CollectionsAPIDistributedZkTest, SchemaVersionSpecificBehaviorTest, TestDynamicFieldResource, TestAddFieldRealTimeGet, UpdateParamsTest, TestUpdate, ResponseLogComponentTest, TestNoOpRegenerator, SolrXmlInZkTest, TestIndexingPerformance, DocumentBuilderTest, FieldAnalysisRequestHandlerTest, ConvertedLegacyTest, TestCloudManagedSchemaAddField, TestRandomFaceting, ResourceLoaderTest, BlockCacheTest, TestFuzzyAnalyzedSuggestions, TestCSVResponseWriter, StressHdfsTest, DateMathParserTest, LegacyHTMLStripCharFilterTest, DocValuesMultiTest, TestDefaultSearchFieldResource, OverseerCollectionProcessorTest, TestFunctionQuery, TestRTGBase, SignatureUpdateProcessorFactoryTest, URLClassifyProcessorTest, AddBlockUpdateTest, TestCSVLoader, IndexSchemaTest, CircularListTest, TestDFRSimilarityFactory, SpellCheckComponentTest, SolrPluginUtilsTest, CurrencyFieldXmlFileTest, SolrIndexSplitterTest, TestMaxScoreQueryParser, TestImplicitCoreProperties, ChaosMonkeySafeLeaderTest, UnloadDistributedZkTest, SyncSliceTest, OpenCloseCoreStressTest, LeaderElectionIntegrationTest, ShardRoutingTest, FullSolrCloudDistribCmdsTest, ClusterStateUpdateTest, LeaderElectionTest, ZkCLITest, AutoCommitTest, TestFaceting, DistributedSpellCheckComponentTest, TermVectorComponentDistributedTest, ZkControllerTest, TestStressReorder, TestJoin, TestReload, TestStressVersions, HardAutoCommitTest, DistributedTermsComponentTest, TestRangeQuery, TestSolr4Spatial, SolrCoreTest, StatsComponentTest, TestGroupingSearch, SolrCmdDistributorTest, QueryElevationComponentTest, PeerSyncTest, BasicFunctionalityTest, DirectUpdateHandlerTest, TestIndexSearcher, SimplePostToolTest, AnalysisAfterCoreReloadTest, SpellCheckCollatorTest, SuggesterFSTTest, SolrRequestParserTest, TestFoldingMultitermQuery, TestStressLucene, TestTrie, SpatialFilterTest, SuggesterWFSTTest, NoCacheHeaderTest, TestAtomicUpdateErrorCases, TestWordDelimiterFilterFactory, QueryEqualityTest, DirectUpdateHandlerOptimizeTest, DefaultValueUpdateProcessorTest, SortByFunctionTest, TestRemoteStreaming, DistanceFunctionTest, TestSolrDeletionPolicy1, XsltUpdateRequestHandlerTest, DebugComponentTest, CacheHeaderTest, TestSurroundQueryParser, LukeRequestHandlerTest, DisMaxRequestHandlerTest, TestQueryUtils, StandardRequestHandlerTest, TestWriterPerf, DirectSolrSpellCheckerTest, TestReversedWildcardFilterFactory, DocumentAnalysisRequestHandlerTest, TestQueryTypes, PrimitiveFieldTypeTest, FileBasedSpellCheckerTest, XmlUpdateRequestHandlerTest, RequestHandlersTest, TestValueSourceCache, TermVectorComponentTest, MoreLikeThisHandlerTest, RequiredFieldsTest, TestArbitraryIndexDir, FastVectorHighlighterTest, LoggingHandlerTest, RegexBoostProcessorTest, UpdateRequestProcessorFactoryTest, MBeansHandlerTest, TestAnalyzedSuggestions, JsonLoaderTest, CSVRequestHandlerTest, TestComponentsName, TestBinaryResponseWriter, TestLFUCache, SOLR749Test, TestQuerySenderListener, AlternateDirectoryTest, TestSolrIndexConfig, SolrIndexConfigTest, TestSolrDeletionPolicy2, MultiTermTest, TestBinaryField, NumericFieldsTest, TestElisionMultitermQuery, TestConfig, OutputWriterTest, TestSolrCoreProperties, DirectSolrConnectionTest, NotRequiredUniqueKeyTest, TestLuceneMatchVersion, SpellPossibilityIteratorTest, TestCodecSupport, TestXIncludeConfig, EchoParamsTest, TestNumberUtils, TestIBSimilarityFactory, TestBM25SimilarityFactory, TestFastWriter, TimeZoneUtilsTest, TestFastOutputStream, ScriptEngineTest, TestSolrXMLSerializer, PreAnalyzedFieldTest, PrimUtilsTest, TestSuggestSpellingConverter, SpellingQueryConverterTest, DOMUtilTest, TestUtils, ZkNodePropsTest, UUIDFieldTest, FileUtilsTest, SolrTestCaseJ4Test, AliasIntegrationTest, AssignTest, DeleteReplicaTest, DeleteShardTest, ShardSplitTest, TestDistribDocBasedVersion, HdfsBasicDistributedZkTest, HdfsChaosMonkeySafeLeaderTest, HdfsRecoveryZkTest, HdfsSyncSliceTest, HdfsUnloadDistributedZkTest, QueryResultKeyTest, TestInfoStreamLogging, TestNRTOpen, TestReloadAndDeleteDocs, TestSolrXmlPersistence, CoreAdminCreateDiscoverTest, CoreMergeIndexesAdminHandlerTest, DistributedDebugComponentTest]
   [junit4]   2> NOTE: reproduce with: ant test  -Dtestcase=DistributedDebugComponentTest -Dtests.seed=AEBB37B5497E9C8C -Dtests.slow=true -Dtests.locale=in -Dtests.timezone=America/Guatemala -Dtests.file.encoding=US-ASCII
   [junit4] ERROR   0.00s | DistributedDebugComponentTest (suite) <<<
   [junit4]    > Throwable #1: java.io.IOException: Unable to delete file: .\org.apache.solr.handler.component.DistributedDebugComponentTest\collection2\data\tlog\tlog.0000000000000000000
   [junit4]    > 	at __randomizedtesting.SeedInfo.seed([AEBB37B5497E9C8C]:0)
   [junit4]    > 	at org.apache.commons.io.FileUtils.forceDelete(FileUtils.java:1919)
   [junit4]    > 	at org.apache.commons.io.FileUtils.cleanDirectory(FileUtils.java:1399)
   [junit4]    > 	at org.apache.commons.io.FileUtils.deleteDirectory(FileUtils.java:1331)
   [junit4]    > 	at org.apache.commons.io.FileUtils.forceDelete(FileUtils.java:1910)
   [junit4]    > 	at org.apache.commons.io.FileUtils.cleanDirectory(FileUtils.java:1399)
   [junit4]    > 	at org.apache.commons.io.FileUtils.deleteDirectory(FileUtils.java:1331)
   [junit4]    > 	at org.apache.commons.io.FileUtils.forceDelete(FileUtils.java:1910)
   [junit4]    > 	at org.apache.commons.io.FileUtils.cleanDirectory(FileUtils.java:1399)
   [junit4]    > 	at org.apache.commons.io.FileUtils.deleteDirectory(FileUtils.java:1331)
   [junit4]    > 	at org.apache.commons.io.FileUtils.forceDelete(FileUtils.java:1910)
   [junit4]    > 	at org.apache.commons.io.FileUtils.cleanDirectory(FileUtils.java:1399)
   [junit4]    > 	at org.apache.commons.io.FileUtils.deleteDirectory(FileUtils.java:1331)
   [junit4]    > 	at org.apache.solr.SolrJettyTestBase.cleanUpJettyHome(SolrJettyTestBase.java:189)
   [junit4]    > 	at org.apache.solr.handler.component.DistributedDebugComponentTest.afterTest(DistributedDebugComponentTest.java:74)
   [junit4]    > 	at java.lang.Thread.run(Thread.java:744)
   [junit4] Completed in 2.89s, 1 test, 1 error <<< FAILURES!

[...truncated 75 lines...]
BUILD FAILED
C:\Users\JenkinsSlave\workspace\Lucene-Solr-trunk-Windows\build.xml:423: The following error occurred while executing this line:
C:\Users\JenkinsSlave\workspace\Lucene-Solr-trunk-Windows\build.xml:403: The following error occurred while executing this line:
C:\Users\JenkinsSlave\workspace\Lucene-Solr-trunk-Windows\build.xml:39: The following error occurred while executing this line:
C:\Users\JenkinsSlave\workspace\Lucene-Solr-trunk-Windows\solr\build.xml:189: The following error occurred while executing this line:
C:\Users\JenkinsSlave\workspace\Lucene-Solr-trunk-Windows\solr\common-build.xml:489: The following error occurred while executing this line:
C:\Users\JenkinsSlave\workspace\Lucene-Solr-trunk-Windows\lucene\common-build.xml:1272: The following error occurred while executing this line:
C:\Users\JenkinsSlave\workspace\Lucene-Solr-trunk-Windows\lucene\common-build.xml:908: There were test failures: 335 suites, 1473 tests, 1 suite-level error, 40 ignored (11 assumptions)

Total time: 83 minutes 16 seconds
Build step 'Invoke Ant' marked build as failure
Description set: Java: 32bit/jdk1.7.0_45 -server -XX:+UseParallelGC
Archiving artifacts
Recording test results
Email was triggered for: Failure
Sending email for trigger: Failure



Mime
View raw message