lucene-dev mailing list archives

Site index · List index
Message view « Date » · « Thread »
Top « Date » · « Thread »
From Policeman Jenkins Server <jenk...@thetaphi.de>
Subject [JENKINS] Lucene-Solr-trunk-Windows (32bit/jdk1.8.0-ea-b116) - Build # 3503 - Still Failing!
Date Mon, 25 Nov 2013 02:05:19 GMT
Build: http://jenkins.thetaphi.de/job/Lucene-Solr-trunk-Windows/3503/
Java: 32bit/jdk1.8.0-ea-b116 -server -XX:+UseSerialGC

3 tests failed.
REGRESSION:  org.apache.solr.cloud.OverseerTest.testOverseerFailure

Error Message:
KeeperErrorCode = NodeExists for /collections/collection1/leaders/shard1

Stack Trace:
org.apache.zookeeper.KeeperException$NodeExistsException: KeeperErrorCode = NodeExists for /collections/collection1/leaders/shard1
	at __randomizedtesting.SeedInfo.seed([D516CCFD887BECE1:D11E430E9ADE03C0]:0)
	at org.apache.zookeeper.KeeperException.create(KeeperException.java:119)
	at org.apache.zookeeper.KeeperException.create(KeeperException.java:51)
	at org.apache.zookeeper.ZooKeeper.create(ZooKeeper.java:783)
	at org.apache.solr.common.cloud.SolrZkClient$10.execute(SolrZkClient.java:424)
	at org.apache.solr.common.cloud.ZkCmdExecutor.retryOperation(ZkCmdExecutor.java:65)
	at org.apache.solr.common.cloud.SolrZkClient.makePath(SolrZkClient.java:421)
	at org.apache.solr.common.cloud.SolrZkClient.makePath(SolrZkClient.java:378)
	at org.apache.solr.common.cloud.SolrZkClient.makePath(SolrZkClient.java:365)
	at org.apache.solr.cloud.ShardLeaderElectionContextBase.runLeaderProcess(ElectionContext.java:102)
	at org.apache.solr.cloud.LeaderElector.runIamLeaderProcess(LeaderElector.java:165)
	at org.apache.solr.cloud.LeaderElector.checkIfIamLeader(LeaderElector.java:109)
	at org.apache.solr.cloud.LeaderElector.checkIfIamLeader(LeaderElector.java:157)
	at org.apache.solr.cloud.LeaderElector.joinElection(LeaderElector.java:277)
	at org.apache.solr.cloud.OverseerTest$MockZKController.publishState(OverseerTest.java:153)
	at org.apache.solr.cloud.OverseerTest.testOverseerFailure(OverseerTest.java:584)
	at sun.reflect.NativeMethodAccessorImpl.invoke0(Native Method)
	at sun.reflect.NativeMethodAccessorImpl.invoke(NativeMethodAccessorImpl.java:57)
	at sun.reflect.DelegatingMethodAccessorImpl.invoke(DelegatingMethodAccessorImpl.java:43)
	at java.lang.reflect.Method.invoke(Method.java:483)
	at com.carrotsearch.randomizedtesting.RandomizedRunner.invoke(RandomizedRunner.java:1559)
	at com.carrotsearch.randomizedtesting.RandomizedRunner.access$600(RandomizedRunner.java:79)
	at com.carrotsearch.randomizedtesting.RandomizedRunner$6.evaluate(RandomizedRunner.java:737)
	at com.carrotsearch.randomizedtesting.RandomizedRunner$7.evaluate(RandomizedRunner.java:773)
	at com.carrotsearch.randomizedtesting.RandomizedRunner$8.evaluate(RandomizedRunner.java:787)
	at com.carrotsearch.randomizedtesting.rules.SystemPropertiesRestoreRule$1.evaluate(SystemPropertiesRestoreRule.java:53)
	at org.apache.lucene.util.TestRuleSetupTeardownChained$1.evaluate(TestRuleSetupTeardownChained.java:50)
	at org.apache.lucene.util.TestRuleFieldCacheSanity$1.evaluate(TestRuleFieldCacheSanity.java:51)
	at org.apache.lucene.util.AbstractBeforeAfterRule$1.evaluate(AbstractBeforeAfterRule.java:46)
	at com.carrotsearch.randomizedtesting.rules.SystemPropertiesInvariantRule$1.evaluate(SystemPropertiesInvariantRule.java:55)
	at org.apache.lucene.util.TestRuleThreadAndTestName$1.evaluate(TestRuleThreadAndTestName.java:49)
	at org.apache.lucene.util.TestRuleIgnoreAfterMaxFailures$1.evaluate(TestRuleIgnoreAfterMaxFailures.java:70)
	at org.apache.lucene.util.TestRuleMarkFailure$1.evaluate(TestRuleMarkFailure.java:48)
	at com.carrotsearch.randomizedtesting.rules.StatementAdapter.evaluate(StatementAdapter.java:36)
	at com.carrotsearch.randomizedtesting.ThreadLeakControl$StatementRunner.run(ThreadLeakControl.java:358)
	at com.carrotsearch.randomizedtesting.ThreadLeakControl.forkTimeoutingTask(ThreadLeakControl.java:782)
	at com.carrotsearch.randomizedtesting.ThreadLeakControl$3.evaluate(ThreadLeakControl.java:442)
	at com.carrotsearch.randomizedtesting.RandomizedRunner.runSingleTest(RandomizedRunner.java:746)
	at com.carrotsearch.randomizedtesting.RandomizedRunner$3.evaluate(RandomizedRunner.java:648)
	at com.carrotsearch.randomizedtesting.RandomizedRunner$4.evaluate(RandomizedRunner.java:682)
	at com.carrotsearch.randomizedtesting.RandomizedRunner$5.evaluate(RandomizedRunner.java:693)
	at com.carrotsearch.randomizedtesting.rules.StatementAdapter.evaluate(StatementAdapter.java:36)
	at com.carrotsearch.randomizedtesting.rules.SystemPropertiesRestoreRule$1.evaluate(SystemPropertiesRestoreRule.java:53)
	at org.apache.lucene.util.AbstractBeforeAfterRule$1.evaluate(AbstractBeforeAfterRule.java:46)
	at org.apache.lucene.util.TestRuleStoreClassName$1.evaluate(TestRuleStoreClassName.java:42)
	at com.carrotsearch.randomizedtesting.rules.SystemPropertiesInvariantRule$1.evaluate(SystemPropertiesInvariantRule.java:55)
	at com.carrotsearch.randomizedtesting.rules.NoShadowingOrOverridesOnMethodsRule$1.evaluate(NoShadowingOrOverridesOnMethodsRule.java:39)
	at com.carrotsearch.randomizedtesting.rules.NoShadowingOrOverridesOnMethodsRule$1.evaluate(NoShadowingOrOverridesOnMethodsRule.java:39)
	at com.carrotsearch.randomizedtesting.rules.StatementAdapter.evaluate(StatementAdapter.java:36)
	at org.apache.lucene.util.TestRuleAssertionsRequired$1.evaluate(TestRuleAssertionsRequired.java:43)
	at org.apache.lucene.util.TestRuleMarkFailure$1.evaluate(TestRuleMarkFailure.java:48)
	at org.apache.lucene.util.TestRuleIgnoreAfterMaxFailures$1.evaluate(TestRuleIgnoreAfterMaxFailures.java:70)
	at org.apache.lucene.util.TestRuleIgnoreTestSuites$1.evaluate(TestRuleIgnoreTestSuites.java:55)
	at com.carrotsearch.randomizedtesting.rules.StatementAdapter.evaluate(StatementAdapter.java:36)
	at com.carrotsearch.randomizedtesting.ThreadLeakControl$StatementRunner.run(ThreadLeakControl.java:358)
	at java.lang.Thread.run(Thread.java:744)


REGRESSION:  org.apache.solr.handler.TestReplicationHandler.doTestIndexAndConfigReplication

Error Message:
[C:\Users\JenkinsSlave\workspace\Lucene-Solr-trunk-Windows\solr\build\solr-core\test\J0\.\org.apache.solr.handler.TestReplicationHandler$SolrInstance-1385344435314\slave\collection1\data\, C:\Users\JenkinsSlave\workspace\Lucene-Solr-trunk-Windows\solr\build\solr-core\test\J0\.\org.apache.solr.handler.TestReplicationHandler$SolrInstance-1385344435314\slave\collection1\data\index.20131125095357895, C:\Users\JenkinsSlave\workspace\Lucene-Solr-trunk-Windows\solr\build\solr-core\test\J0\.\org.apache.solr.handler.TestReplicationHandler$SolrInstance-1385344435314\slave\collection1\data\index] expected:<2> but was:<3>

Stack Trace:
java.lang.AssertionError: [C:\Users\JenkinsSlave\workspace\Lucene-Solr-trunk-Windows\solr\build\solr-core\test\J0\.\org.apache.solr.handler.TestReplicationHandler$SolrInstance-1385344435314\slave\collection1\data\, C:\Users\JenkinsSlave\workspace\Lucene-Solr-trunk-Windows\solr\build\solr-core\test\J0\.\org.apache.solr.handler.TestReplicationHandler$SolrInstance-1385344435314\slave\collection1\data\index.20131125095357895, C:\Users\JenkinsSlave\workspace\Lucene-Solr-trunk-Windows\solr\build\solr-core\test\J0\.\org.apache.solr.handler.TestReplicationHandler$SolrInstance-1385344435314\slave\collection1\data\index] expected:<2> but was:<3>
	at __randomizedtesting.SeedInfo.seed([D516CCFD887BECE1:C15E97A8AB7C51FF]:0)
	at org.junit.Assert.fail(Assert.java:93)
	at org.junit.Assert.failNotEquals(Assert.java:647)
	at org.junit.Assert.assertEquals(Assert.java:128)
	at org.junit.Assert.assertEquals(Assert.java:472)
	at org.apache.solr.handler.TestReplicationHandler.checkForSingleIndex(TestReplicationHandler.java:863)
	at org.apache.solr.handler.TestReplicationHandler.doTestIndexAndConfigReplication(TestReplicationHandler.java:569)
	at sun.reflect.NativeMethodAccessorImpl.invoke0(Native Method)
	at sun.reflect.NativeMethodAccessorImpl.invoke(NativeMethodAccessorImpl.java:57)
	at sun.reflect.DelegatingMethodAccessorImpl.invoke(DelegatingMethodAccessorImpl.java:43)
	at java.lang.reflect.Method.invoke(Method.java:483)
	at com.carrotsearch.randomizedtesting.RandomizedRunner.invoke(RandomizedRunner.java:1559)
	at com.carrotsearch.randomizedtesting.RandomizedRunner.access$600(RandomizedRunner.java:79)
	at com.carrotsearch.randomizedtesting.RandomizedRunner$6.evaluate(RandomizedRunner.java:737)
	at com.carrotsearch.randomizedtesting.RandomizedRunner$7.evaluate(RandomizedRunner.java:773)
	at com.carrotsearch.randomizedtesting.RandomizedRunner$8.evaluate(RandomizedRunner.java:787)
	at com.carrotsearch.randomizedtesting.rules.SystemPropertiesRestoreRule$1.evaluate(SystemPropertiesRestoreRule.java:53)
	at org.apache.lucene.util.TestRuleSetupTeardownChained$1.evaluate(TestRuleSetupTeardownChained.java:50)
	at org.apache.lucene.util.TestRuleFieldCacheSanity$1.evaluate(TestRuleFieldCacheSanity.java:51)
	at org.apache.lucene.util.AbstractBeforeAfterRule$1.evaluate(AbstractBeforeAfterRule.java:46)
	at com.carrotsearch.randomizedtesting.rules.SystemPropertiesInvariantRule$1.evaluate(SystemPropertiesInvariantRule.java:55)
	at org.apache.lucene.util.TestRuleThreadAndTestName$1.evaluate(TestRuleThreadAndTestName.java:49)
	at org.apache.lucene.util.TestRuleIgnoreAfterMaxFailures$1.evaluate(TestRuleIgnoreAfterMaxFailures.java:70)
	at org.apache.lucene.util.TestRuleMarkFailure$1.evaluate(TestRuleMarkFailure.java:48)
	at com.carrotsearch.randomizedtesting.rules.StatementAdapter.evaluate(StatementAdapter.java:36)
	at com.carrotsearch.randomizedtesting.ThreadLeakControl$StatementRunner.run(ThreadLeakControl.java:358)
	at com.carrotsearch.randomizedtesting.ThreadLeakControl.forkTimeoutingTask(ThreadLeakControl.java:782)
	at com.carrotsearch.randomizedtesting.ThreadLeakControl$3.evaluate(ThreadLeakControl.java:442)
	at com.carrotsearch.randomizedtesting.RandomizedRunner.runSingleTest(RandomizedRunner.java:746)
	at com.carrotsearch.randomizedtesting.RandomizedRunner$3.evaluate(RandomizedRunner.java:648)
	at com.carrotsearch.randomizedtesting.RandomizedRunner$4.evaluate(RandomizedRunner.java:682)
	at com.carrotsearch.randomizedtesting.RandomizedRunner$5.evaluate(RandomizedRunner.java:693)
	at com.carrotsearch.randomizedtesting.rules.StatementAdapter.evaluate(StatementAdapter.java:36)
	at com.carrotsearch.randomizedtesting.rules.SystemPropertiesRestoreRule$1.evaluate(SystemPropertiesRestoreRule.java:53)
	at org.apache.lucene.util.AbstractBeforeAfterRule$1.evaluate(AbstractBeforeAfterRule.java:46)
	at org.apache.lucene.util.TestRuleStoreClassName$1.evaluate(TestRuleStoreClassName.java:42)
	at com.carrotsearch.randomizedtesting.rules.SystemPropertiesInvariantRule$1.evaluate(SystemPropertiesInvariantRule.java:55)
	at com.carrotsearch.randomizedtesting.rules.NoShadowingOrOverridesOnMethodsRule$1.evaluate(NoShadowingOrOverridesOnMethodsRule.java:39)
	at com.carrotsearch.randomizedtesting.rules.NoShadowingOrOverridesOnMethodsRule$1.evaluate(NoShadowingOrOverridesOnMethodsRule.java:39)
	at com.carrotsearch.randomizedtesting.rules.StatementAdapter.evaluate(StatementAdapter.java:36)
	at org.apache.lucene.util.TestRuleAssertionsRequired$1.evaluate(TestRuleAssertionsRequired.java:43)
	at org.apache.lucene.util.TestRuleMarkFailure$1.evaluate(TestRuleMarkFailure.java:48)
	at org.apache.lucene.util.TestRuleIgnoreAfterMaxFailures$1.evaluate(TestRuleIgnoreAfterMaxFailures.java:70)
	at org.apache.lucene.util.TestRuleIgnoreTestSuites$1.evaluate(TestRuleIgnoreTestSuites.java:55)
	at com.carrotsearch.randomizedtesting.rules.StatementAdapter.evaluate(StatementAdapter.java:36)
	at com.carrotsearch.randomizedtesting.ThreadLeakControl$StatementRunner.run(ThreadLeakControl.java:358)
	at java.lang.Thread.run(Thread.java:744)


FAILED:  junit.framework.TestSuite.org.apache.solr.schema.EnumFieldTest

Error Message:
Suite timeout exceeded (>= 7200000 msec).

Stack Trace:
java.lang.Exception: Suite timeout exceeded (>= 7200000 msec).
	at __randomizedtesting.SeedInfo.seed([D516CCFD887BECE1]:0)




Build Log:
[...truncated 10264 lines...]
   [junit4] Suite: org.apache.solr.schema.EnumFieldTest
   [junit4]   2> 561260 T2565 oas.SolrTestCaseJ4.initCore ####initCore
   [junit4]   2> Creating dataDir: C:\Users\JenkinsSlave\workspace\Lucene-Solr-trunk-Windows\solr\build\solr-core\test\J0\.\solrtest-EnumFieldTest-1385335740897
   [junit4]   2> 561261 T2565 oasc.SolrResourceLoader.<init> new SolrResourceLoader for directory: 'C:\Users\JenkinsSlave\workspace\Lucene-Solr-trunk-Windows\solr\build\solr-core\test-files\solr\collection1\'
   [junit4]   2> 561262 T2565 oasc.SolrResourceLoader.replaceClassLoader Adding 'file:/C:/Users/JenkinsSlave/workspace/Lucene-Solr-trunk-Windows/solr/build/solr-core/test-files/solr/collection1/lib/classes/' to classloader
   [junit4]   2> 561265 T2565 oasc.SolrResourceLoader.replaceClassLoader Adding 'file:/C:/Users/JenkinsSlave/workspace/Lucene-Solr-trunk-Windows/solr/build/solr-core/test-files/solr/collection1/lib/README' to classloader
   [junit4]   2> 561305 T2565 oasc.SolrConfig.<init> Using Lucene MatchVersion: LUCENE_50
   [junit4]   2> 561309 T2565 oasc.SolrConfig.<init> Loaded SolrConfig: solrconfig-minimal.xml
   [junit4]   2> 561309 T2565 oass.IndexSchema.readSchema Reading Solr Schema from schema-enums.xml
   [junit4]   2> 561313 T2565 oass.IndexSchema.readSchema [null] Schema name=tiny
   [junit4]   2> 561345 T2565 oass.IndexSchema.readSchema unique key field: id
   [junit4]   2> 561345 T2565 oasc.SolrResourceLoader.locateSolrHome JNDI not configured for solr (NoInitialContextEx)
   [junit4]   2> 561345 T2565 oasc.SolrResourceLoader.locateSolrHome using system property solr.solr.home: C:\Users\JenkinsSlave\workspace\Lucene-Solr-trunk-Windows\solr\build\solr-core\test-files\solr
   [junit4]   2> 561345 T2565 oasc.SolrResourceLoader.<init> new SolrResourceLoader for directory: 'C:\Users\JenkinsSlave\workspace\Lucene-Solr-trunk-Windows\solr\build\solr-core\test-files\solr\'
   [junit4]   2> 561360 T2565 oasc.SolrResourceLoader.locateSolrHome JNDI not configured for solr (NoInitialContextEx)
   [junit4]   2> 561361 T2565 oasc.SolrResourceLoader.locateSolrHome using system property solr.solr.home: C:\Users\JenkinsSlave\workspace\Lucene-Solr-trunk-Windows\solr\build\solr-core\test-files\solr
   [junit4]   2> 561361 T2565 oasc.SolrResourceLoader.<init> new SolrResourceLoader for deduced Solr Home: 'C:\Users\JenkinsSlave\workspace\Lucene-Solr-trunk-Windows\solr\build\solr-core\test-files\solr\'
   [junit4]   2> 561385 T2565 oasc.CoreContainer.<init> New CoreContainer 27923901
   [junit4]   2> 561385 T2565 oasc.CoreContainer.load Loading cores into CoreContainer [instanceDir=C:\Users\JenkinsSlave\workspace\Lucene-Solr-trunk-Windows\solr\build\solr-core\test-files\solr\]
   [junit4]   2> 561386 T2565 oashc.HttpShardHandlerFactory.getParameter Setting socketTimeout to: 0
   [junit4]   2> 561386 T2565 oashc.HttpShardHandlerFactory.getParameter Setting urlScheme to: http://
   [junit4]   2> 561386 T2565 oashc.HttpShardHandlerFactory.getParameter Setting connTimeout to: 0
   [junit4]   2> 561386 T2565 oashc.HttpShardHandlerFactory.getParameter Setting maxConnectionsPerHost to: 20
   [junit4]   2> 561386 T2565 oashc.HttpShardHandlerFactory.getParameter Setting corePoolSize to: 0
   [junit4]   2> 561386 T2565 oashc.HttpShardHandlerFactory.getParameter Setting maximumPoolSize to: 2147483647
   [junit4]   2> 561386 T2565 oashc.HttpShardHandlerFactory.getParameter Setting maxThreadIdleTime to: 5
   [junit4]   2> 561386 T2565 oashc.HttpShardHandlerFactory.getParameter Setting sizeOfQueue to: -1
   [junit4]   2> 561386 T2565 oashc.HttpShardHandlerFactory.getParameter Setting fairnessPolicy to: false
   [junit4]   2> 561393 T2565 oasl.LogWatcher.createWatcher SLF4J impl is org.slf4j.impl.Log4jLoggerFactory
   [junit4]   2> 561395 T2565 oasl.LogWatcher.newRegisteredLogWatcher Registering Log Listener [Log4j (org.slf4j.impl.Log4jLoggerFactory)]
   [junit4]   2> 561395 T2565 oasc.CoreContainer.load Host Name: 
   [junit4]   2> 561398 T2566 oasc.CoreContainer.create Creating SolrCore 'collection1' using instanceDir: C:\Users\JenkinsSlave\workspace\Lucene-Solr-trunk-Windows\solr\build\solr-core\test-files\solr\collection1
   [junit4]   2> 561402 T2566 oasc.SolrResourceLoader.<init> new SolrResourceLoader for directory: 'C:\Users\JenkinsSlave\workspace\Lucene-Solr-trunk-Windows\solr\build\solr-core\test-files\solr\collection1\'
   [junit4]   2> 561402 T2566 oasc.SolrResourceLoader.replaceClassLoader Adding 'file:/C:/Users/JenkinsSlave/workspace/Lucene-Solr-trunk-Windows/solr/build/solr-core/test-files/solr/collection1/lib/classes/' to classloader
   [junit4]   2> 561402 T2566 oasc.SolrResourceLoader.replaceClassLoader Adding 'file:/C:/Users/JenkinsSlave/workspace/Lucene-Solr-trunk-Windows/solr/build/solr-core/test-files/solr/collection1/lib/README' to classloader
   [junit4]   2> 561422 T2566 oasc.SolrConfig.<init> Using Lucene MatchVersion: LUCENE_50
   [junit4]   2> 561425 T2566 oasc.SolrConfig.<init> Loaded SolrConfig: solrconfig-minimal.xml
   [junit4]   2> 561425 T2566 oass.IndexSchema.readSchema Reading Solr Schema from schema-enums.xml
   [junit4]   2> 561429 T2566 oass.IndexSchema.readSchema [collection1] Schema name=tiny
   [junit4]   2> 561434 T2566 oass.IndexSchema.readSchema unique key field: id
   [junit4]   2> 561434 T2566 oasc.SolrCore.initDirectoryFactory org.apache.solr.core.MockDirectoryFactory
   [junit4]   2> 561436 T2566 oasc.SolrCore.<init> [collection1] Opening new SolrCore at C:\Users\JenkinsSlave\workspace\Lucene-Solr-trunk-Windows\solr\build\solr-core\test-files\solr\collection1\, dataDir=C:\Users\JenkinsSlave\workspace\Lucene-Solr-trunk-Windows\solr\build\solr-core\test\J0\.\solrtest-EnumFieldTest-1385335740897\
   [junit4]   2> 561436 T2566 oasc.SolrCore.<init> JMX monitoring not detected for core: collection1
   [junit4]   2> 561436 T2566 oasc.CachingDirectoryFactory.get return new directory for C:\Users\JenkinsSlave\workspace\Lucene-Solr-trunk-Windows\solr\build\solr-core\test\J0\.\solrtest-EnumFieldTest-1385335740897\
   [junit4]   2> 561436 T2566 oasc.SolrCore.getNewIndexDir New index directory detected: old=null new=C:\Users\JenkinsSlave\workspace\Lucene-Solr-trunk-Windows\solr\build\solr-core\test\J0\.\solrtest-EnumFieldTest-1385335740897\index/
   [junit4]   2> 561436 T2566 oasc.SolrCore.initIndex WARN [collection1] Solr index directory 'C:\Users\JenkinsSlave\workspace\Lucene-Solr-trunk-Windows\solr\build\solr-core\test\J0\.\solrtest-EnumFieldTest-1385335740897\index' doesn't exist. Creating new index...
   [junit4]   2> 561437 T2566 oasc.CachingDirectoryFactory.get return new directory for C:\Users\JenkinsSlave\workspace\Lucene-Solr-trunk-Windows\solr\build\solr-core\test\J0\.\solrtest-EnumFieldTest-1385335740897\index
   [junit4]   2> 561437 T2566 oasu.RandomMergePolicy.<init> RandomMergePolicy wrapping class org.apache.lucene.index.TieredMergePolicy: [TieredMergePolicy: maxMergeAtOnce=31, maxMergeAtOnceExplicit=18, maxMergedSegmentMB=58.86328125, floorSegmentMB=1.12890625, forceMergeDeletesPctAllowed=28.732339032026154, segmentsPerTier=20.0, maxCFSSegmentSizeMB=8.796093022207999E12, noCFSRatio=0.2806798019617426
   [junit4]   2> 561437 T2566 oasc.SolrDeletionPolicy.onCommit SolrDeletionPolicy.onCommit: commits: num=1
   [junit4]   2> 		commit{dir=MockDirectoryWrapper(org.apache.lucene.store.RAMDirectory@1d6ddf5 lockFactory=org.apache.lucene.store.SingleInstanceLockFactory@1f2da1c),segFN=segments_1,generation=1}
   [junit4]   2> 561437 T2566 oasc.SolrDeletionPolicy.updateCommits newest commit generation = 1
   [junit4]   2> 561509 T2566 oasc.SolrCore.loadUpdateProcessorChains no updateRequestProcessorChain defined as default, creating implicit default
   [junit4]   2> 561510 T2566 oasc.RequestHandlers.initHandlersFromConfig created /select: solr.SearchHandler
   [junit4]   2> 561510 T2566 oasc.RequestHandlers.initHandlersFromConfig created /admin/: org.apache.solr.handler.admin.AdminHandlers
   [junit4]   2> 561510 T2566 oasc.RequestHandlers.initHandlersFromConfig created /update: solr.UpdateRequestHandler
   [junit4]   2> 561516 T2566 oashl.XMLLoader.init xsltCacheLifetimeSeconds=60
   [junit4]   2> 561518 T2566 oasu.CommitTracker.<init> Hard AutoCommit: disabled
   [junit4]   2> 561518 T2566 oasu.CommitTracker.<init> Soft AutoCommit: disabled
   [junit4]   2> 561520 T2566 oasu.RandomMergePolicy.<init> RandomMergePolicy wrapping class org.apache.lucene.index.LogByteSizeMergePolicy: [LogByteSizeMergePolicy: minMergeSize=1677721, mergeFactor=27, maxMergeSize=2147483648, maxMergeSizeForForcedMerge=9223372036854775807, calibrateSizeByDeletes=true, maxMergeDocs=2147483647, maxCFSSegmentSizeMB=8.796093022207999E12, noCFSRatio=1.0]
   [junit4]   2> 561568 T2566 oasc.SolrDeletionPolicy.onInit SolrDeletionPolicy.onInit: commits: num=1
   [junit4]   2> 		commit{dir=MockDirectoryWrapper(org.apache.lucene.store.RAMDirectory@1d6ddf5 lockFactory=org.apache.lucene.store.SingleInstanceLockFactory@1f2da1c),segFN=segments_1,generation=1}
   [junit4]   2> 561568 T2566 oasc.SolrDeletionPolicy.updateCommits newest commit generation = 1
   [junit4]   2> 561568 T2566 oass.SolrIndexSearcher.<init> Opening Searcher@14a9c2e main
   [junit4]   2> 561569 T2566 oasc.CoreContainer.registerCore registering core: collection1
   [junit4]   2> 561569 T2567 oasc.SolrCore.registerSearcher [collection1] Registered new searcher Searcher@14a9c2e main{StandardDirectoryReader(segments_1:1:nrt)}
   [junit4]   2> 561571 T2565 oas.SolrTestCaseJ4.initCore ####initCore end
   [junit4]   2> 561576 T2565 oas.SolrTestCaseJ4.setUp ###Starting testEnumSchema
   [junit4]   2> 561576 T2565 oas.SolrTestCaseJ4.tearDown ###Ending testEnumSchema
   [junit4]   2> 561579 T2565 oas.SolrTestCaseJ4.setUp ###Starting testBogusEnumSearch
   [junit4]   2> ASYNC  NEW_CORE C1300 name=collection1 org.apache.solr.core.SolrCore@15c22a7
   [junit4]   2> 561580 T2565 C1300 oasu.DirectUpdateHandler2.deleteAll [collection1] REMOVING ALL DOCUMENTS FROM INDEX
   [junit4]   2> 561582 T2565 C1300 oasup.LogUpdateProcessor.finish [collection1] webapp=null path=null params={} {deleteByQuery=*:*} 0 3
   [junit4]   2> 561585 T2565 C1300 oasup.LogUpdateProcessor.finish [collection1] webapp=null path=null params={} {add=[0]} 0 1
   [junit4]   2> 561586 T2565 C1300 oasup.LogUpdateProcessor.finish [collection1] webapp=null path=null params={} {add=[1]} 0 1
   [junit4]   2> 561587 T2565 C1300 oasup.LogUpdateProcessor.finish [collection1] webapp=null path=null params={} {add=[2]} 0 1
   [junit4]   2> 561588 T2565 C1300 oasup.LogUpdateProcessor.finish [collection1] webapp=null path=null params={} {add=[3]} 0 0
   [junit4]   2> 561589 T2565 C1300 oasup.LogUpdateProcessor.finish [collection1] webapp=null path=null params={} {add=[4]} 0 0
   [junit4]   2> 561591 T2565 C1300 oasup.LogUpdateProcessor.finish [collection1] webapp=null path=null params={} {add=[8]} 0 1
   [junit4]   2> 561592 T2565 C1300 oasup.LogUpdateProcessor.finish [collection1] webapp=null path=null params={} {add=[9]} 0 0
   [junit4]   2> 561593 T2565 C1300 oasu.DirectUpdateHandler2.commit start commit{,optimize=false,openSearcher=true,waitSearcher=true,expungeDeletes=false,softCommit=false,prepareCommit=false}
   [junit4]   2> 561595 T2565 C1300 oasc.SolrDeletionPolicy.onCommit SolrDeletionPolicy.onCommit: commits: num=2
   [junit4]   2> 		commit{dir=MockDirectoryWrapper(org.apache.lucene.store.RAMDirectory@1d6ddf5 lockFactory=org.apache.lucene.store.SingleInstanceLockFactory@1f2da1c),segFN=segments_1,generation=1}
   [junit4]   2> 		commit{dir=MockDirectoryWrapper(org.apache.lucene.store.RAMDirectory@1d6ddf5 lockFactory=org.apache.lucene.store.SingleInstanceLockFactory@1f2da1c),segFN=segments_2,generation=2}
   [junit4]   2> 561596 T2565 C1300 oasc.SolrDeletionPolicy.updateCommits newest commit generation = 2
   [junit4]   2> 561596 T2565 C1300 oass.SolrIndexSearcher.<init> Opening Searcher@d7ce30 main
   [junit4]   2> 561597 T2567 oasc.SolrCore.registerSearcher [collection1] Registered new searcher Searcher@d7ce30 main{StandardDirectoryReader(segments_2:4:nrt _0(5.0):c7)}
   [junit4]   2> 561597 T2565 C1300 oasu.DirectUpdateHandler2.commit end_commit_flush
   [junit4]   2> 561597 T2565 C1300 oasup.LogUpdateProcessor.finish [collection1] webapp=null path=null params={} {commit=} 0 4
   [junit4]   2> 561599 T2565 C1300 oasc.SolrCore.execute [collection1] webapp=null path=null params={q=severity:bla&fl=severity} hits=0 status=0 QTime=1 
   [junit4]   2> 561600 T2565 C1300 oasc.SolrCore.execute [collection1] webapp=null path=null params={q=severity:7&fl=severity} hits=0 status=0 QTime=0 
   [junit4]   2> 561600 T2565 C1300 oasc.SolrCore.execute [collection1] webapp=null path=null params={q=severity:"-3"&fl=severity} hits=0 status=0 QTime=0 
   [junit4]   2> 561600 T2565 oas.SolrTestCaseJ4.tearDown ###Ending testBogusEnumSearch
   [junit4]   2> 561608 T2565 oas.SolrTestCaseJ4.setUp ###Starting testEnumRangeSearch
   [junit4]   2> 561609 T2565 C1300 oasu.DirectUpdateHandler2.deleteAll [collection1] REMOVING ALL DOCUMENTS FROM INDEX
   [junit4]   2> 561609 T2565 C1300 oasup.LogUpdateProcessor.finish [collection1] webapp=null path=null params={} {deleteByQuery=*:*} 0 1
   [junit4]   2> 561610 T2565 C1300 oasup.LogUpdateProcessor.finish [collection1] webapp=null path=null params={} {add=[0]} 0 0
   [junit4]   2> 561612 T2565 C1300 oasup.LogUpdateProcessor.finish [collection1] webapp=null path=null params={} {add=[1]} 0 0
   [junit4]   2> ASYNC  NEW_CORE C1301 name=collection1 org.apache.solr.core.SolrCore@15c22a7
   [junit4]   2> 561619 T2565 C1301 oasup.LogUpdateProcessor.finish [collection1] webapp=null path=null params={} {add=[2]} 0 1
   [junit4]   2> 561620 T2565 C1301 oasup.LogUpdateProcessor.finish [collection1] webapp=null path=null params={} {add=[3]} 0 0
   [junit4]   2> 561622 T2565 C1301 oasup.LogUpdateProcessor.finish [collection1] webapp=null path=null params={} {add=[4]} 0 1
   [junit4]   2> 561623 T2565 C1301 oasup.LogUpdateProcessor.finish [collection1] webapp=null path=null params={} {add=[5]} 0 0
   [junit4]   2> 561624 T2565 C1301 oasup.LogUpdateProcessor.finish [collection1] webapp=null path=null params={} {add=[6]} 0 0
   [junit4]   2> 561626 T2565 C1301 oasup.LogUpdateProcessor.finish [collection1] webapp=null path=null params={} {add=[7]} 0 1
   [junit4]   2> 561627 T2565 C1301 oasup.LogUpdateProcessor.finish [collection1] webapp=null path=null params={} {add=[8]} 0 0
   [junit4]   2> 561628 T2565 C1301 oasup.LogUpdateProcessor.finish [collection1] webapp=null path=null params={} {add=[9]} 0 0
   [junit4]   2> 561629 T2565 C1301 oasup.LogUpdateProcessor.finish [collection1] webapp=null path=null params={} {add=[10]} 0 0
   [junit4]   2> 561630 T2565 C1301 oasup.LogUpdateProcessor.finish [collection1] webapp=null path=null params={} {add=[11]} 0 0
   [junit4]   2> 561632 T2565 C1301 oasup.LogUpdateProcessor.finish [collection1] webapp=null path=null params={} {add=[12]} 0 0
   [junit4]   2> 561633 T2565 C1301 oasup.LogUpdateProcessor.finish [collection1] webapp=null path=null params={} {add=[13]} 0 1
   [junit4]   2> 561634 T2565 C1301 oasup.LogUpdateProcessor.finish [collection1] webapp=null path=null params={} {add=[14]} 0 0
   [junit4]   2> 561635 T2565 C1301 oasup.LogUpdateProcessor.finish [collection1] webapp=null path=null params={} {add=[20]} 0 0
   [junit4]   2> 561636 T2565 C1301 oasup.LogUpdateProcessor.finish [collection1] webapp=null path=null params={} {add=[21]} 0 0
   [junit4]   2> 561637 T2565 C1301 oasu.DirectUpdateHandler2.commit start commit{,optimize=false,openSearcher=true,waitSearcher=true,expungeDeletes=false,softCommit=false,prepareCommit=false}
   [junit4]   2> 561641 T2565 C1301 oasc.SolrDeletionPolicy.onCommit SolrDeletionPolicy.onCommit: commits: num=2
   [junit4]   2> 		commit{dir=MockDirectoryWrapper(org.apache.lucene.store.RAMDirectory@1d6ddf5 lockFactory=org.apache.lucene.store.SingleInstanceLockFactory@1f2da1c),segFN=segments_2,generation=2}
   [junit4]   2> 		commit{dir=MockDirectoryWrapper(org.apache.lucene.store.RAMDirectory@1d6ddf5 lockFactory=org.apache.lucene.store.SingleInstanceLockFactory@1f2da1c),segFN=segments_3,generation=3}
   [junit4]   2> 561641 T2565 C1301 oasc.SolrDeletionPolicy.updateCommits newest commit generation = 3
   [junit4]   2> 561642 T2565 C1301 oass.SolrIndexSearcher.<init> Opening Searcher@bc6f04 main
   [junit4]   2> 561642 T2565 C1301 oasu.DirectUpdateHandler2.commit end_commit_flush
   [junit4]   2> 561643 T2567 oasc.SolrCore.registerSearcher [collection1] Registered new searcher Searcher@bc6f04 main{StandardDirectoryReader(segments_3:7:nrt _1(5.0):c17)}
   [junit4]   2> 561644 T2565 C1301 oasup.LogUpdateProcessor.finish [collection1] webapp=null path=null params={} {commit=} 0 7
   [junit4]   2> 561645 T2565 C1301 oasc.SolrCore.execute [collection1] webapp=null path=null params={q=severity:["Not+Available"+TO+"Not+Available"]&fl=severity} hits=5 status=0 QTime=0 
   [junit4]   2> 561646 T2565 C1301 oasc.SolrCore.execute [collection1] webapp=null path=null params={q=severity:["Not+Available"+TO+Critical]&fl=severity} hits=15 status=0 QTime=0 
   [junit4]   2> 561647 T2565 C1301 oasc.SolrCore.execute [collection1] webapp=null path=null params={q=severity:[Low+TO+High]&fl=severity} hits=9 status=0 QTime=1 
   [junit4]   2> 561648 T2565 C1301 oasc.SolrCore.execute [collection1] webapp=null path=null params={q=severity:[High+TO+Low]&fl=severity} hits=0 status=0 QTime=1 
   [junit4]   2> 561649 T2565 C1301 oasc.SolrCore.execute [collection1] webapp=null path=null params={q=severity:[High+TO+4]&fl=severity} hits=3 status=0 QTime=1 
   [junit4]   2> 561650 T2565 C1301 oasc.SolrCore.execute [collection1] webapp=null path=null params={q=severity:[3+TO+Critical]&fl=severity} hits=3 status=0 QTime=1 
   [junit4]   2> 561650 T2565 C1301 oasc.SolrCore.execute [collection1] webapp=null path=null params={q=severity:[3+TO+4]&fl=severity} hits=3 status=0 QTime=0 
   [junit4]   2> 561651 T2565 C1301 oasc.SolrCore.execute [collection1] webapp=null path=null params={q=severity:{Low+TO+High]&fl=severity} hits=5 status=0 QTime=0 
   [junit4]   2> 561652 T2565 C1301 oasc.SolrCore.execute [collection1] webapp=null path=null params={q=severity:[Low+TO+High}&fl=severity} hits=7 status=0 QTime=0 
   [junit4]   2> 561652 T2565 C1301 oasc.SolrCore.execute [collection1] webapp=null path=null params={q=severity:{Low+TO+High}&fl=severity} hits=3 status=0 QTime=0 
   [junit4]   2> 561653 T2565 C1301 oasc.SolrCore.execute [collection1] webapp=null path=null params={q=*:*&fl=severity} hits=17 status=0 QTime=1 
   [junit4]   2> 561654 T2565 C1301 oasc.SolrCore.execute [collection1] webapp=null path=null params={q=severity:[*+TO+*]&fl=severity} hits=15 status=0 QTime=1 
   [junit4]   2> 561656 T2565 C1301 oasc.SolrCore.execute [collection1] webapp=null path=null params={q=-severity:[*+TO+*]&fl=severity} hits=2 status=0 QTime=2 
   [junit4]   2> 561656 T2565 oas.SolrTestCaseJ4.tearDown ###Ending testEnumRangeSearch
   [junit4]   2> 561663 T2565 oas.SolrTestCaseJ4.setUp ###Starting testKnownIntegerEnumIndexing
   [junit4]   2> 561664 T2565 C1301 oasu.DirectUpdateHandler2.deleteAll [collection1] REMOVING ALL DOCUMENTS FROM INDEX
   [junit4]   2> 561664 T2565 C1301 oasup.LogUpdateProcessor.finish [collection1] webapp=null path=null params={} {deleteByQuery=*:*} 0 1
   [junit4]   2> 561667 T2565 C1301 oasup.LogUpdateProcessor.finish [collection1] webapp=null path=null params={} {add=[0]} 0 2
   [junit4]   2> 561669 T2565 C1301 oasu.DirectUpdateHandler2.commit start commit{,optimize=false,openSearcher=true,waitSearcher=true,expungeDeletes=false,softCommit=false,prepareCommit=false}
   [junit4]   2> 561670 T2565 C1301 oasc.SolrDeletionPolicy.onCommit SolrDeletionPolicy.onCommit: commits: num=2
   [junit4]   2> 		commit{dir=MockDirectoryWrapper(org.apache.lucene.store.RAMDirectory@1d6ddf5 lockFactory=org.apache.lucene.store.SingleInstanceLockFactory@1f2da1c),segFN=segments_3,generation=3}
   [junit4]   2> 		commit{dir=MockDirectoryWrapper(org.apache.lucene.store.RAMDirectory@1d6ddf5 lockFactory=org.apache.lucene.store.SingleInstanceLockFactory@1f2da1c),segFN=segments_4,generation=4}
   [junit4]   2> 561670 T2565 C1301 oasc.SolrDeletionPolicy.updateCommits newest commit generation = 4
   [junit4]   2> 561670 T2565 C1301 oass.SolrIndexSearcher.<init> Opening Searcher@1ead180 main
   [junit4]   2> 561670 T2565 C1301 oasu.DirectUpdateHandler2.commit end_commit_flush
   [junit4]   2> 561673 T2567 oasc.SolrCore.registerSearcher [collection1] Registered new searcher Searcher@1ead180 main{StandardDirectoryReader(segments_4:10:nrt _2(5.0):c1)}
   [junit4]   2> 561673 T2565 C1301 oasup.LogUpdateProcessor.finish [collection1] webapp=null path=null params={} {commit=} 0 5
   [junit4]   2> 561674 T2565 C1301 oasc.SolrCore.execute [collection1] webapp=null path=null params={q=*:*&fl=severity} hits=1 status=0 QTime=0 
   [junit4]   2> 561678 T2565 oas.SolrTestCaseJ4.tearDown ###Ending testKnownIntegerEnumIndexing
   [junit4]   2> 561684 T2565 oas.SolrTestCaseJ4.setUp ###Starting testEnumSort
   [junit4]   2> 561686 T2565 C1301 oasu.DirectUpdateHandler2.deleteAll [collection1] REMOVING ALL DOCUMENTS FROM INDEX
   [junit4]   2> 561686 T2565 C1301 oasup.LogUpdateProcessor.finish [collection1] webapp=null path=null params={} {deleteByQuery=*:*} 0 0
   [junit4]   2> 561688 T2565 C1301 oasup.LogUpdateProcessor.finish [collection1] webapp=null path=null params={} {add=[0]} 0 0
   [junit4]   2> 561689 T2565 C1301 oasup.LogUpdateProcessor.finish [collection1] webapp=null path=null params={} {add=[1]} 0 0
   [junit4]   2> 561690 T2565 C1301 oasup.LogUpdateProcessor.finish [collection1] webapp=null path=null params={} {add=[2]} 0 0
   [junit4]   2> 561692 T2565 C1301 oasup.LogUpdateProcessor.finish [collection1] webapp=null path=null params={} {add=[3]} 0 1
   [junit4]   2> 561693 T2565 C1301 oasup.LogUpdateProcessor.finish [collection1] webapp=null path=null params={} {add=[4]} 0 0
   [junit4]   2> 561694 T2565 C1301 oasup.LogUpdateProcessor.finish [collection1] webapp=null path=null params={} {add=[8]} 0 0
   [junit4]   2> 561696 T2565 C1301 oasup.LogUpdateProcessor.finish [collection1] webapp=null path=null params={} {add=[9]} 0 0
   [junit4]   2> 561697 T2565 C1301 oasu.DirectUpdateHandler2.commit start commit{,optimize=false,openSearcher=true,waitSearcher=true,expungeDeletes=false,softCommit=false,prepareCommit=false}
   [junit4]   2> 561698 T2565 C1301 oasc.SolrDeletionPolicy.onCommit SolrDeletionPolicy.onCommit: commits: num=2
   [junit4]   2> 		commit{dir=MockDirectoryWrapper(org.apache.lucene.store.RAMDirectory@1d6ddf5 lockFactory=org.apache.lucene.store.SingleInstanceLockFactory@1f2da1c),segFN=segments_4,generation=4}
   [junit4]   2> 		commit{dir=MockDirectoryWrapper(org.apache.lucene.store.RAMDirectory@1d6ddf5 lockFactory=org.apache.lucene.store.SingleInstanceLockFactory@1f2da1c),segFN=segments_5,generation=5}
   [junit4]   2> 561699 T2565 C1301 oasc.SolrDeletionPolicy.updateCommits newest commit generation = 5
   [junit4]   2> 561699 T2565 C1301 oass.SolrIndexSearcher.<init> Opening Searcher@14202b0 main
   [junit4]   2> 561699 T2565 C1301 oasu.DirectUpdateHandler2.commit end_commit_flush
   [junit4]   2> 561701 T2567 oasc.SolrCore.registerSearcher [collection1] Registered new searcher Searcher@14202b0 main{StandardDirectoryReader(segments_5:13:nrt _3(5.0):c7)}
   [junit4]   2> 561701 T2565 C1301 oasup.LogUpdateProcessor.finish [collection1] webapp=null path=null params={} {commit=} 0 4
   [junit4]   2> 561703 T2565 C1301 oasc.SolrCore.execute [collection1] webapp=null path=null params={q=*:*&fl=severity&sort=severity+desc} hits=7 status=0 QTime=0 
   [junit4]   2> 561704 T2565 C1301 oasc.SolrCore.execute [collection1] webapp=null path=null params={q=*:*&fl=severity&sort=severity+asc} hits=7 status=0 QTime=1 
   [junit4]   2> 561705 T2565 C1301 oasc.SolrCore.execute [collection1] webapp=null path=null params={q=severity:[*+TO+*]&fl=severity&sort=severity+asc} hits=5 status=0 QTime=0 
   [junit4]   2> 561705 T2565 oas.SolrTestCaseJ4.tearDown ###Ending testEnumSort
   [junit4]   2> 561713 T2565 oas.SolrTestCaseJ4.setUp ###Starting testBogusEnumIndexing
   [junit4]   2> 561719 T2565 C1301 oasu.DirectUpdateHandler2.deleteAll [collection1] REMOVING ALL DOCUMENTS FROM INDEX
   [junit4]   2> 561719 T2565 C1301 oasup.LogUpdateProcessor.finish [collection1] webapp=null path=null params={} {deleteByQuery=*:*} 0 6
   [junit4]   2> ASYNC  NEW_CORE C1302 name=collection1 org.apache.solr.core.SolrCore@15c22a7
   [junit4]   2> 561726 T2565 C1302 oasup.LogUpdateProcessor.finish [collection1] webapp=null path=null params={} {} 0 0
   [junit4]   2> 561727 T2565 C1302 oasc.SolrException.log Ignoring exception matching Unknown value for enum field: blabla
   [junit4]   2> 561728 T2565 C1302 oasup.LogUpdateProcessor.finish [collection1] webapp=null path=null params={} {} 0 0
   [junit4]   2> 561728 T2565 C1302 oasc.SolrException.log Ignoring exception matching Unknown value for enum field: 10
   [junit4]   2> 561730 T2565 C1302 oasup.LogUpdateProcessor.finish [collection1] webapp=null path=null params={} {} 0 1
   [junit4]   2> 561731 T2565 C1302 oasc.SolrException.log Ignoring exception matching Unknown value for enum field: -4
   [junit4]   2> 561732 T2565 oas.SolrTestCaseJ4.tearDown ###Ending testBogusEnumIndexing
   [junit4]   2> 561732 T2565 oas.SolrTestCaseJ4.deleteCore ###deleteCore
   [junit4]   2> 561732 T2565 oasc.CoreContainer.shutdown Shutting down CoreContainer instance=27923901
   [junit4]   2> 7235311 T2564 ccr.ThreadLeakControl$2.evaluate WARNING Suite execution timed out: org.apache.solr.schema.EnumFieldTest
   [junit4]   2> 	==== jstack at approximately timeout time ====
   [junit4]   2> 	"Thread-1167" ID=2568 WAITING on java.lang.Object@10894b4
   [junit4]   2> 		at java.lang.Object.wait(Native Method)
   [junit4]   2> 		- waiting on java.lang.Object@10894b4
   [junit4]   2> 		at java.lang.Object.wait(Object.java:502)
   [junit4]   2> 		at org.apache.solr.core.CloserThread.run(CoreContainer.java:1006)
   [junit4]   2> 	
   [junit4]   2> 	"searcherExecutor-1650-thread-1" ID=2567 WAITING on java.util.concurrent.locks.AbstractQueuedSynchronizer$ConditionObject@6e56d4
   [junit4]   2> 		at sun.misc.Unsafe.park(Native Method)
   [junit4]   2> 		- waiting on java.util.concurrent.locks.AbstractQueuedSynchronizer$ConditionObject@6e56d4
   [junit4]   2> 		at java.util.concurrent.locks.LockSupport.park(LockSupport.java:175)
   [junit4]   2> 		at java.util.concurrent.locks.AbstractQueuedSynchronizer$ConditionObject.await(AbstractQueuedSynchronizer.java:2039)
   [junit4]   2> 		at java.util.concurrent.LinkedBlockingQueue.take(LinkedBlockingQueue.java:442)
   [junit4]   2> 		at java.util.concurrent.ThreadPoolExecutor.getTask(ThreadPoolExecutor.java:1067)
   [junit4]   2> 		at java.util.concurrent.ThreadPoolExecutor.runWorker(ThreadPoolExecutor.java:1127)
   [junit4]   2> 		at java.util.concurrent.ThreadPoolExecutor$Worker.run(ThreadPoolExecutor.java:617)
   [junit4]   2> 		at java.lang.Thread.run(Thread.java:744)
   [junit4]   2> 	
   [junit4]   2> 	"SUITE-EnumFieldTest-seed#[D516CCFD887BECE1]-worker" ID=2565 WAITING on org.apache.solr.core.CloserThread@1c78f85
   [junit4]   2> 		at java.lang.Object.wait(Native Method)
   [junit4]   2> 		- waiting on org.apache.solr.core.CloserThread@1c78f85
   [junit4]   2> 		at java.lang.Thread.join(Thread.java:1244)
   [junit4]   2> 		at java.lang.Thread.join(Thread.java:1318)
   [junit4]   2> 		at org.apache.solr.core.CoreContainer.shutdown(CoreContainer.java:376)
   [junit4]   2> 		at org.apache.solr.util.TestHarness.close(TestHarness.java:337)
   [junit4]   2> 		at org.apache.solr.SolrTestCaseJ4.deleteCore(SolrTestCaseJ4.java:539)
   [junit4]   2> 		at org.apache.solr.SolrTestCaseJ4.afterClass(SolrTestCaseJ4.java:134)
   [junit4]   2> 		at sun.reflect.GeneratedMethodAccessor36.invoke(Unknown Source)
   [junit4]   2> 		at sun.reflect.DelegatingMethodAccessorImpl.invoke(DelegatingMethodAccessorImpl.java:43)
   [junit4]   2> 		at java.lang.reflect.Method.invoke(Method.java:483)
   [junit4]   2> 		at com.carrotsearch.randomizedtesting.RandomizedRunner.invoke(RandomizedRunner.java:1559)
   [junit4]   2> 		at com.carrotsearch.randomizedtesting.RandomizedRunner.access$600(RandomizedRunner.java:79)
   [junit4]   2> 		at com.carrotsearch.randomizedtesting.RandomizedRunner$5.evaluate(RandomizedRunner.java:700)
   [junit4]   2> 		at com.carrotsearch.randomizedtesting.rules.StatementAdapter.evaluate(StatementAdapter.java:36)
   [junit4]   2> 		at com.carrotsearch.randomizedtesting.rules.SystemPropertiesRestoreRule$1.evaluate(SystemPropertiesRestoreRule.java:53)
   [junit4]   2> 		at org.apache.lucene.util.AbstractBeforeAfterRule$1.evaluate(AbstractBeforeAfterRule.java:46)
   [junit4]   2> 		at org.apache.lucene.util.TestRuleStoreClassName$1.evaluate(TestRuleStoreClassName.java:42)
   [junit4]   2> 		at com.carrotsearch.randomizedtesting.rules.SystemPropertiesInvariantRule$1.evaluate(SystemPropertiesInvariantRule.java:55)
   [junit4]   2> 		at com.carrotsearch.randomizedtesting.rules.NoShadowingOrOverridesOnMethodsRule$1.evaluate(NoShadowingOrOverridesOnMethodsRule.java:39)
   [junit4]   2> 		at com.carrotsearch.randomizedtesting.rules.NoShadowingOrOverridesOnMethodsRule$1.evaluate(NoShadowingOrOverridesOnMethodsRule.java:39)
   [junit4]   2> 		at com.carrotsearch.randomizedtesting.rules.StatementAdapter.evaluate(StatementAdapter.java:36)
   [junit4]   2> 		at org.apache.lucene.util.TestRuleAssertionsRequired$1.evaluate(TestRuleAssertionsRequired.java:43)
   [junit4]   2> 		at org.apache.lucene.util.TestRuleMarkFailure$1.evaluate(TestRuleMarkFailure.java:48)
   [junit4]   2> 		at org.apache.lucene.util.TestRuleIgnoreAfterMaxFailures$1.evaluate(TestRuleIgnoreAfterMaxFailures.java:70)
   [junit4]   2> 		at org.apache.lucene.util.TestRuleIgnoreTestSuites$1.evaluate(TestRuleIgnoreTestSuites.java:55)
   [junit4]   2> 		at com.carrotsearch.randomizedtesting.rules.StatementAdapter.evaluate(StatementAdapter.java:36)
   [junit4]   2> 		at com.carrotsearch.randomizedtesting.ThreadLeakControl$StatementRunner.run(ThreadLeakControl.java:358)
   [junit4]   2> 		at java.lang.Thread.run(Thread.java:744)
   [junit4]   2> 	
   [junit4]   2> 	"SUITE-EnumFieldTest-seed#[D516CCFD887BECE1]" ID=2564 RUNNABLE
   [junit4]   2> 		at sun.management.ThreadImpl.dumpThreads0(Native Method)
   [junit4]   2> 		at sun.management.ThreadImpl.dumpAllThreads(ThreadImpl.java:446)
   [junit4]   2> 		at com.carrotsearch.randomizedtesting.ThreadLeakControl.formatThreadStacksFull(ThreadLeakControl.java:655)
   [junit4]   2> 		at com.carrotsearch.randomizedtesting.ThreadLeakControl.access$800(ThreadLeakControl.java:60)
   [junit4]   2> 		at com.carrotsearch.randomizedtesting.ThreadLeakControl$2.evaluate(ThreadLeakControl.java:396)
   [junit4]   2> 		- locked java.lang.Object@cb7a30
   [junit4]   2> 		at com.carrotsearch.randomizedtesting.RandomizedRunner.runSuite(RandomizedRunner.java:556)
   [junit4]   2> 		at com.carrotsearch.randomizedtesting.RandomizedRunner.access$200(RandomizedRunner.java:79)
   [junit4]   2> 		at com.carrotsearch.randomizedtesting.RandomizedRunner$1.run(RandomizedRunner.java:492)
   [junit4]   2> 	
   [junit4]   2> 	"RMI TCP Accept-0" ID=952 RUNNABLE (in native code)
   [junit4]   2> 		at java.net.DualStackPlainSocketImpl.accept0(Native Method)
   [junit4]   2> 		at java.net.DualStackPlainSocketImpl.socketAccept(DualStackPlainSocketImpl.java:131)
   [junit4]   2> 		at java.net.AbstractPlainSocketImpl.accept(AbstractPlainSocketImpl.java:404)
   [junit4]   2> 		at java.net.PlainSocketImpl.accept(PlainSocketImpl.java:199)
   [junit4]   2> 		- locked java.net.SocksSocketImpl@47e6f3
   [junit4]   2> 		at java.net.ServerSocket.implAccept(ServerSocket.java:545)
   [junit4]   2> 		at java.net.ServerSocket.accept(ServerSocket.java:513)
   [junit4]   2> 		at sun.rmi.transport.tcp.TCPTransport$AcceptLoop.executeAcceptLoop(TCPTransport.java:389)
   [junit4]   2> 		at sun.rmi.transport.tcp.TCPTransport$AcceptLoop.run(TCPTransport.java:361)
   [junit4]   2> 		at java.lang.Thread.run(Thread.java:744)
   [junit4]   2> 	
   [junit4]   2> 	"RMI RenewClean-[127.0.0.1:58546]" ID=948 TIMED_WAITING on java.lang.ref.ReferenceQueue$Lock@1276bfb
   [junit4]   2> 		at java.lang.Object.wait(Native Method)
   [junit4]   2> 		- timed waiting on java.lang.ref.ReferenceQueue$Lock@1276bfb
   [junit4]   2> 		at java.lang.ref.ReferenceQueue.remove(ReferenceQueue.java:142)
   [junit4]   2> 		at sun.rmi.transport.DGCClient$EndpointEntry$RenewCleanThread.run(DGCClient.java:536)
   [junit4]   2> 		at java.lang.Thread.run(Thread.java:744)
   [junit4]   2> 	
   [junit4]   2> 	"RMI Scheduler(0)" ID=947 TIMED_WAITING on java.util.concurrent.locks.AbstractQueuedSynchronizer$ConditionObject@1d148fd
   [junit4]   2> 		at sun.misc.Unsafe.park(Native Method)
   [junit4]   2> 		- timed waiting on java.util.concurrent.locks.AbstractQueuedSynchronizer$ConditionObject@1d148fd
   [junit4]   2> 		at java.util.concurrent.locks.LockSupport.parkNanos(LockSupport.java:215)
   [junit4]   2> 		at java.util.concurrent.locks.AbstractQueuedSynchronizer$ConditionObject.awaitNanos(AbstractQueuedSynchronizer.java:2078)
   [junit4]   2> 		at java.util.concurrent.ScheduledThreadPoolExecutor$DelayedWorkQueue.take(ScheduledThreadPoolExecutor.java:1093)
   [junit4]   2> 		at java.util.concurrent.ScheduledThreadPoolExecutor$DelayedWorkQueue.take(ScheduledThreadPoolExecutor.java:809)
   [junit4]   2> 		at java.util.concurrent.ThreadPoolExecutor.getTask(ThreadPoolExecutor.java:1067)
   [junit4]   2> 		at java.util.concurrent.ThreadPoolExecutor.runWorker(ThreadPoolExecutor.java:1127)
   [junit4]   2> 		at java.util.concurrent.ThreadPoolExecutor$Worker.run(ThreadPoolExecutor.java:617)
   [junit4]   2> 		at java.lang.Thread.run(Thread.java:744)
   [junit4]   2> 	
   [junit4]   2> 	"GC Daemon" ID=945 TIMED_WAITING on sun.misc.GC$LatencyLock@a8a0cd
   [junit4]   2> 		at java.lang.Object.wait(Native Method)
   [junit4]   2> 		- timed waiting on sun.misc.GC$LatencyLock@a8a0cd
   [junit4]   2> 		at sun.misc.GC$Daemon.run(GC.java:117)
   [junit4]   2> 	
   [junit4]   2> 	"RMI Reaper" ID=944 WAITING on java.lang.ref.ReferenceQueue$Lock@143aad5
   [junit4]   2> 		at java.lang.Object.wait(Native Method)
   [junit4]   2> 		- waiting on java.lang.ref.ReferenceQueue$Lock@143aad5
   [junit4]   2> 		at java.lang.ref.ReferenceQueue.remove(ReferenceQueue.java:142)
   [junit4]   2> 		at java.lang.ref.ReferenceQueue.remove(ReferenceQueue.java:158)
   [junit4]   2> 		at sun.rmi.transport.ObjectTable$Reaper.run(ObjectTable.java:351)
   [junit4]   2> 		at java.lang.Thread.run(Thread.java:744)
   [junit4]   2> 	
   [junit4]   2> 	"RMI TCP Accept-0" ID=943 RUNNABLE (in native code)
   [junit4]   2> 		at java.net.DualStackPlainSocketImpl.accept0(Native Method)
   [junit4]   2> 		at java.net.DualStackPlainSocketImpl.socketAccept(DualStackPlainSocketImpl.java:131)
   [junit4]   2> 		at java.net.AbstractPlainSocketImpl.accept(AbstractPlainSocketImpl.java:404)
   [junit4]   2> 		at java.net.PlainSocketImpl.accept(PlainSocketImpl.java:199)
   [junit4]   2> 		- locked java.net.SocksSocketImpl@1697675
   [junit4]   2> 		at java.net.ServerSocket.implAccept(ServerSocket.java:545)
   [junit4]   2> 		at java.net.ServerSocket.accept(ServerSocket.java:513)
   [junit4]   2> 		at sun.rmi.transport.tcp.TCPTransport$AcceptLoop.executeAcceptLoop(TCPTransport.java:389)
   [junit4]   2> 		at sun.rmi.transport.tcp.TCPTransport$AcceptLoop.run(TCPTransport.java:361)
   [junit4]   2> 		at java.lang.Thread.run(Thread.java:744)
   [junit4]   2> 	
   [junit4]   2> 	"RMI TCP Accept-0" ID=942 RUNNABLE (in native code)
   [junit4]   2> 		at java.net.DualStackPlainSocketImpl.accept0(Native Method)
   [junit4]   2> 		at java.net.DualStackPlainSocketImpl.socketAccept(DualStackPlainSocketImpl.java:131)
   [junit4]   2> 		at java.net.AbstractPlainSocketImpl.accept(AbstractPlainSocketImpl.java:404)
   [junit4]   2> 		at java.net.PlainSocketImpl.accept(PlainSocketImpl.java:199)
   [junit4]   2> 		- locked java.net.SocksSocketImpl@325d85
   [junit4]   2> 		at java.net.ServerSocket.implAccept(ServerSocket.java:545)
   [junit4]   2> 		at java.net.ServerSocket.accept(ServerSocket.java:513)
   [junit4]   2> 		at sun.rmi.transport.tcp.TCPTransport$AcceptLoop.executeAcceptLoop(TCPTransport.java:389)
   [junit4]   2> 		at sun.rmi.transport.tcp.TCPTransport$AcceptLoop.run(TCPTransport.java:361)
   [junit4]   2> 		at java.lang.Thread.run(Thread.java:744)
   [junit4]   2> 	
   [junit4]   2> 	"Attach Listener" ID=5 RUNNABLE
   [junit4]   2> 	
   [junit4]   2> 	"Signal Dispatcher" ID=4 RUNNABLE
   [junit4]   2> 	
   [junit4]   2> 	"Finalizer" ID=3 WAITING on java.lang.ref.ReferenceQueue$Lock@1fd3f86
   [junit4]   2> 		at java.lang.Object.wait(Native Method)
   [junit4]   2> 		- waiting on java.lang.ref.ReferenceQueue$Lock@1fd3f86
   [junit4]   2> 		at java.lang.ref.ReferenceQueue.remove(ReferenceQueue.java:142)
   [junit4]   2> 		at java.lang.ref.ReferenceQueue.remove(ReferenceQueue.java:158)
   [junit4]   2> 		at java.lang.ref.Finalizer$FinalizerThread.run(Finalizer.java:189)
   [junit4]   2> 	
   [junit4]   2> 	"Reference Handler" ID=2 WAITING on java.lang.ref.Reference$Lock@14a206e
   [junit4]   2> 		at java.lang.Object.wait(Native Method)
   [junit4]   2> 		- waiting on java.lang.ref.Reference$Lock@14a206e
   [junit4]   2> 		at java.lang.Object.wait(Object.java:502)
   [junit4]   2> 		at java.lang.ref.Reference$ReferenceHandler.run(Reference.java:157)
   [junit4]   2> 	
   [junit4]   2> 	"main" ID=1 WAITING on com.carrotsearch.randomizedtesting.RandomizedRunner$1@359e8f
   [junit4]   2> 		at java.lang.Object.wait(Native Method)
   [junit4]   2> 		- waiting on com.carrotsearch.randomizedtesting.RandomizedRunner$1@359e8f
   [junit4]   2> 		at java.lang.Thread.join(Thread.java:1244)
   [junit4]   2> 		at java.lang.Thread.join(Thread.java:1318)
   [junit4]   2> 		at com.carrotsearch.randomizedtesting.RandomizedRunner.runSuite(RandomizedRunner.java:502)
   [junit4]   2> 		at com.carrotsearch.randomizedtesting.RandomizedRunner.run(RandomizedRunner.java:399)
   [junit4]   2> 		at com.carrotsearch.ant.tasks.junit4.slave.SlaveMain.execute(SlaveMain.java:180)
   [junit4]   2> 		at com.carrotsearch.ant.tasks.junit4.slave.SlaveMain.main(SlaveMain.java:275)
   [junit4]   2> 		at com.carrotsearch.ant.tasks.junit4.slave.SlaveMainSafe.main(SlaveMainSafe.java:12)
   [junit4]   2> 	
   [junit4]   2> 	^^==============================================
   [junit4]   2> 	
   [junit4]   2> 7235315 T2564 ccr.ThreadLeakControl.checkThreadLeaks WARNING Will linger awaiting termination of 3 leaked thread(s).
   [junit4]   2> 7255363 T2564 ccr.ThreadLeakControl.checkThreadLeaks SEVERE 3 threads leaked from SUITE scope at org.apache.solr.schema.EnumFieldTest: 
   [junit4]   2> 	   1) Thread[id=2568, name=Thread-1167, state=WAITING, group=TGRP-EnumFieldTest]
   [junit4]   2> 	        at java.lang.Object.wait(Native Method)
   [junit4]   2> 	        at java.lang.Object.wait(Object.java:502)
   [junit4]   2> 	        at org.apache.solr.core.CloserThread.run(CoreContainer.java:1006)
   [junit4]   2> 	   2) Thread[id=2567, name=searcherExecutor-1650-thread-1, state=WAITING, group=TGRP-EnumFieldTest]
   [junit4]   2> 	        at sun.misc.Unsafe.park(Native Method)
   [junit4]   2> 	        at java.util.concurrent.locks.LockSupport.park(LockSupport.java:175)
   [junit4]   2> 	        at java.util.concurrent.locks.AbstractQueuedSynchronizer$ConditionObject.await(AbstractQueuedSynchronizer.java:2039)
   [junit4]   2> 	        at java.util.concurrent.LinkedBlockingQueue.take(LinkedBlockingQueue.java:442)
   [junit4]   2> 	        at java.util.concurrent.ThreadPoolExecutor.getTask(ThreadPoolExecutor.java:1067)
   [junit4]   2> 	        at java.util.concurrent.ThreadPoolExecutor.runWorker(ThreadPoolExecutor.java:1127)
   [junit4]   2> 	        at java.util.concurrent.ThreadPoolExecutor$Worker.run(ThreadPoolExecutor.java:617)
   [junit4]   2> 	        at java.lang.Thread.run(Thread.java:744)
   [junit4]   2> 	   3) Thread[id=2565, name=SUITE-EnumFieldTest-seed#[D516CCFD887BECE1]-worker, state=WAITING, group=TGRP-EnumFieldTest]
   [junit4]   2> 	        at java.lang.Object.wait(Native Method)
   [junit4]   2> 	        at java.lang.Thread.join(Thread.java:1244)
   [junit4]   2> 	        at java.lang.Thread.join(Thread.java:1318)
   [junit4]   2> 	        at org.apache.solr.core.CoreContainer.shutdown(CoreContainer.java:376)
   [junit4]   2> 	        at org.apache.solr.util.TestHarness.close(TestHarness.java:337)
   [junit4]   2> 	        at org.apache.solr.SolrTestCaseJ4.deleteCore(SolrTestCaseJ4.java:539)
   [junit4]   2> 	        at org.apache.solr.SolrTestCaseJ4.afterClass(SolrTestCaseJ4.java:134)
   [junit4]   2> 	        at sun.reflect.GeneratedMethodAccessor36.invoke(Unknown Source)
   [junit4]   2> 	        at sun.reflect.DelegatingMethodAccessorImpl.invoke(DelegatingMethodAccessorImpl.java:43)
   [junit4]   2> 	        at java.lang.reflect.Method.invoke(Method.java:483)
   [junit4]   2> 	        at com.carrotsearch.randomizedtesting.RandomizedRunner.invoke(RandomizedRunner.java:1559)
   [junit4]   2> 	        at com.carrotsearch.randomizedtesting.RandomizedRunner.access$600(RandomizedRunner.java:79)
   [junit4]   2> 	        at com.carrotsearch.randomizedtesting.RandomizedRunner$5.evaluate(RandomizedRunner.java:700)
   [junit4]   2> 	        at com.carrotsearch.randomizedtesting.rules.StatementAdapter.evaluate(StatementAdapter.java:36)
   [junit4]   2> 	        at com.carrotsearch.randomizedtesting.rules.SystemPropertiesRestoreRule$1.evaluate(SystemPropertiesRestoreRule.java:53)
   [junit4]   2> 	        at org.apache.lucene.util.AbstractBeforeAfterRule$1.evaluate(AbstractBeforeAfterRule.java:46)
   [junit4]   2> 	        at org.apache.lucene.util.TestRuleStoreClassName$1.evaluate(TestRuleStoreClassName.java:42)
   [junit4]   2> 	        at com.carrotsearch.randomizedtesting.rules.SystemPropertiesInvariantRule$1.evaluate(SystemPropertiesInvariantRule.java:55)
   [junit4]   2> 	        at com.carrotsearch.randomizedtesting.rules.NoShadowingOrOverridesOnMethodsRule$1.evaluate(NoShadowingOrOverridesOnMethodsRule.java:39)
   [junit4]   2> 	        at com.carrotsearch.randomizedtesting.rules.NoShadowingOrOverridesOnMethodsRule$1.evaluate(NoShadowingOrOverridesOnMethodsRule.java:39)
   [junit4]   2> 	        at com.carrotsearch.randomizedtesting.rules.StatementAdapter.evaluate(StatementAdapter.java:36)
   [junit4]   2> 	        at org.apache.lucene.util.TestRuleAssertionsRequired$1.evaluate(TestRuleAssertionsRequired.java:43)
   [junit4]   2> 	        at org.apache.lucene.util.TestRuleMarkFailure$1.evaluate(TestRuleMarkFailure.java:48)
   [junit4]   2> 	        at org.apache.lucene.util.TestRuleIgnoreAfterMaxFailures$1.evaluate(TestRuleIgnoreAfterMaxFailures.java:70)
   [junit4]   2> 	        at org.apache.lucene.util.TestRuleIgnoreTestSuites$1.evaluate(TestRuleIgnoreTestSuites.java:55)
   [junit4]   2> 	        at com.carrotsearch.randomizedtesting.rules.StatementAdapter.evaluate(StatementAdapter.java:36)
   [junit4]   2> 	        at com.carrotsearch.randomizedtesting.ThreadLeakControl$StatementRunner.run(ThreadLeakControl.java:358)
   [junit4]   2> 	        at java.lang.Thread.run(Thread.java:744)
   [junit4]   2> 7255366 T2564 ccr.ThreadLeakControl.tryToInterruptAll Starting to interrupt leaked threads:
   [junit4]   2> 	   1) Thread[id=2568, name=Thread-1167, state=WAITING, group=TGRP-EnumFieldTest]
   [junit4]   2> 	   2) Thread[id=2567, name=searcherExecutor-1650-thread-1, state=WAITING, group=TGRP-EnumFieldTest]
   [junit4]   2> 	   3) Thread[id=2565, name=SUITE-EnumFieldTest-seed#[D516CCFD887BECE1]-worker, state=WAITING, group=TGRP-EnumFieldTest]
   [junit4]   2> 7816625 T2565 oasc.SolrCore.close [collection1]  CLOSING SolrCore org.apache.solr.core.SolrCore@15c22a7
   [junit4]   2> 7816626 T2565 oasu.DirectUpdateHandler2.close closing DirectUpdateHandler2{commits=4,autocommits=0,soft autocommits=0,optimizes=0,rollbacks=0,expungeDeletes=0,docsPending=0,adds=3,deletesById=0,deletesByQuery=1,errors=3,cumulative_adds=35,cumulative_deletesById=0,cumulative_deletesByQuery=5,cumulative_errors=3}
   [junit4]   2> 7816626 T2565 oasu.SolrCoreState.decrefSolrCoreState Closing SolrCoreState
   [junit4]   2> 7816626 T2565 oasu.DefaultSolrCoreState.closeIndexWriter SolrCoreState ref count has reached 0 - closing IndexWriter
   [junit4]   2> 7816626 T2565 oasu.DefaultSolrCoreState.closeIndexWriter closing IndexWriter with IndexWriterCloser
   [junit4]   2> ASYNC  NEW_CORE C1303 name=collection1 org.apache.solr.core.SolrCore@15c22a7
   [junit4]   2> 7816630 T2565 C1303 oasc.SolrDeletionPolicy.onCommit SolrDeletionPolicy.onCommit: commits: num=2
   [junit4]   2> 		commit{dir=MockDirectoryWrapper(org.apache.lucene.store.RAMDirectory@1d6ddf5 lockFactory=org.apache.lucene.store.SingleInstanceLockFactory@1f2da1c),segFN=segments_5,generation=5}
   [junit4]   2> 		commit{dir=MockDirectoryWrapper(org.apache.lucene.store.RAMDirectory@1d6ddf5 lockFactory=org.apache.lucene.store.SingleInstanceLockFactory@1f2da1c),segFN=segments_6,generation=6}
   [junit4]   2> 7816632 T2565 C1303 oasc.SolrDeletionPolicy.updateCommits newest commit generation = 6
   [junit4]   2> 7816636 T2565 oasc.SolrCore.closeSearcher [collection1] Closing main searcher on request.
   [junit4]   2> 7816637 T2565 oasc.CachingDirectoryFactory.close Closing MockDirectoryFactory - 2 directories currently being tracked
   [junit4]   2> 7816637 T2565 oasc.CachingDirectoryFactory.closeCacheValue looking to close C:\Users\JenkinsSlave\workspace\Lucene-Solr-trunk-Windows\solr\build\solr-core\test\J0\.\solrtest-EnumFieldTest-1385335740897\index [CachedDir<<refCount=0;path=C:\Users\JenkinsSlave\workspace\Lucene-Solr-trunk-Windows\solr\build\solr-core\test\J0\.\solrtest-EnumFieldTest-1385335740897\index;done=false>>]
   [junit4]   2> 7816640 T2565 oasc.CachingDirectoryFactory.close Closing directory: C:\Users\JenkinsSlave\workspace\Lucene-Solr-trunk-Windows\solr\build\solr-core\test\J0\.\solrtest-EnumFieldTest-1385335740897\index
   [junit4]   2> 7816641 T2565 oasc.CachingDirectoryFactory.closeCacheValue looking to close C:\Users\JenkinsSlave\workspace\Lucene-Solr-trunk-Windows\solr\build\solr-core\test\J0\.\solrtest-EnumFieldTest-1385335740897\ [CachedDir<<refCount=0;path=C:\Users\JenkinsSlave\workspace\Lucene-Solr-trunk-Windows\solr\build\solr-core\test\J0\.\solrtest-EnumFieldTest-1385335740897\;done=false>>]
   [junit4]   2> 7816641 T2565 oasc.CachingDirectoryFactory.close Closing directory: C:\Users\JenkinsSlave\workspace\Lucene-Solr-trunk-Windows\solr\build\solr-core\test\J0\.\solrtest-EnumFieldTest-1385335740897\
   [junit4]   2> 7255393 T2564 ccr.ThreadLeakControl.tryToInterruptAll All leaked threads terminated.
   [junit4]   2> NOTE: test params are: codec=Lucene42, sim=DefaultSimilarity, locale=sr_RS, timezone=America/Argentina/ComodRivadavia
   [junit4]   2> NOTE: Windows 7 6.1 x86/Oracle Corporation 1.8.0-ea (32-bit)/cpus=2,threads=1,free=204632456,total=235413504
   [junit4]   2> NOTE: All tests run in this JVM: [DOMUtilTest, TestWriterPerf, TestAnalyzeInfixSuggestions, TestConfig, TermVectorComponentDistributedTest, SOLR749Test, IndexSchemaTest, TestIndexingPerformance, TestLRUCache, CollectionsAPIDistributedZkTest, NumericFieldsTest, TestRTGBase, TestLMJelinekMercerSimilarityFactory, SolrCoreCheckLockOnStartupTest, TestFastLRUCache, SortByFunctionTest, TestWordDelimiterFilterFactory, DocValuesMissingTest, PingRequestHandlerTest, PrimitiveFieldTypeTest, SolrCoreTest, TestIndexSearcher, ParsingFieldUpdateProcessorsTest, TestCSVLoader, TestJmxIntegration, TermsComponentTest, StandardRequestHandlerTest, TestDefaultSearchFieldResource, DistributedQueryElevationComponentTest, TestSolrQueryParserDefaultOperatorResource, TestJmxMonitoredMap, DefaultValueUpdateProcessorTest, RecoveryZkTest, BlockCacheTest, TestModifyConfFiles, HdfsLockFactoryTest, PrimUtilsTest, TestRecoveryHdfs, TestMaxScoreQueryParser, TriLevelCompositeIdRoutingTest, BadIndexSchemaTest, SimplePostToolTest, BadComponentTest, SuggesterTest, TimeZoneUtilsTest, PolyFieldTest, TestClassNameShortening, TestRandomMergePolicy, FieldFacetTest, DistributedSpellCheckComponentTest, HdfsSyncSliceTest, SampleTest, OpenCloseCoreStressTest, TestSolrXml, DateFieldTest, TestCollapseQParserPlugin, TestAnalyzedSuggestions, SolrIndexSplitterTest, TestCloudManagedSchemaAddField, CustomCollectionTest, TermVectorComponentTest, QueryEqualityTest, FunctionTest, ZkControllerTest, ZkSolrClientTest, UniqFieldsUpdateProcessorFactoryTest, TestCoreDiscovery, TestRandomDVFaceting, HighlighterConfigTest, TestInfoStreamLogging, DistributedTermsComponentTest, HdfsBasicDistributedZkTest, TestFoldingMultitermQuery, TestCodecSupport, AlternateDirectoryTest, TestNumberUtils, EnumFieldTest]
   [junit4]   2> NOTE: reproduce with: ant test  -Dtestcase=EnumFieldTest -Dtests.seed=D516CCFD887BECE1 -Dtests.slow=true -Dtests.locale=sr_RS -Dtests.timezone=America/Argentina/ComodRivadavia -Dtests.file.encoding=US-ASCII
   [junit4] ERROR   0.00s | EnumFieldTest (suite) <<<
   [junit4]    > Throwable #1: java.lang.Exception: Suite timeout exceeded (>= 7200000 msec).
   [junit4]    > 	at __randomizedtesting.SeedInfo.seed([D516CCFD887BECE1]:0)
   [junit4] Completed in 7255.47s, 6 tests, 1 error <<< FAILURES!

[...truncated 118 lines...]
   [junit4] Suite: org.apache.solr.cloud.OverseerTest
   [junit4]   2> 8197150 T3688 oas.SolrTestCaseJ4.initCore ####initCore
   [junit4]   2> Creating dataDir: C:\Users\JenkinsSlave\workspace\Lucene-Solr-trunk-Windows\solr\build\solr-core\test\J0\.\solrtest-OverseerTest-1385343376787
   [junit4]   2> 8197153 T3688 oas.SolrTestCaseJ4.initCore ####initCore end
   [junit4]   2> 8197156 T3688 oas.SolrTestCaseJ4.setUp ###Starting testDoubleAssignment
   [junit4]   2> 8197157 T3688 oasc.ZkTestServer.run STARTING ZK TEST SERVER
   [junit4]   2> 8197157 T3689 oasc.ZkTestServer$ZKServerMain.runFromConfig Starting server
   [junit4]   2> 8197256 T3688 oasc.ZkTestServer.run start zk server on port:60077
   [junit4]   2> 8197258 T3688 oascc.ConnectionManager.waitForConnected Waiting for client to connect to ZooKeeper
   [junit4]   2> 8197271 T3695 oascc.ConnectionManager.process Watcher org.apache.solr.common.cloud.ConnectionManager@1ff0e9b name:ZooKeeperConnection Watcher:127.0.0.1:60077/solr got event WatchedEvent state:SyncConnected type:None path:null path:null type:None
   [junit4]   2> 8197271 T3688 oascc.ConnectionManager.waitForConnected Client is connected to ZooKeeper
   [junit4]   2> 8197273 T3688 oascc.ConnectionManager.waitForConnected Waiting for client to connect to ZooKeeper
   [junit4]   2> 8197277 T3697 oascc.ConnectionManager.process Watcher org.apache.solr.common.cloud.ConnectionManager@15dc934 name:ZooKeeperConnection Watcher:127.0.0.1:60077 got event WatchedEvent state:SyncConnected type:None path:null path:null type:None
   [junit4]   2> 8197277 T3688 oascc.ConnectionManager.waitForConnected Client is connected to ZooKeeper
   [junit4]   2> 8197281 T3690 oazs.NIOServerCnxn.doIO WARN caught end of stream exception EndOfStreamException: Unable to read additional data from client sessionid 0x1428ce65da30001, likely client has closed socket
   [junit4]   2> 	at org.apache.zookeeper.server.NIOServerCnxn.doIO(NIOServerCnxn.java:220)
   [junit4]   2> 	at org.apache.zookeeper.server.NIOServerCnxnFactory.run(NIOServerCnxnFactory.java:208)
   [junit4]   2> 	at java.lang.Thread.run(Thread.java:744)
   [junit4]   2> 
   [junit4]   2> 8197283 T3688 oascc.ConnectionManager.waitForConnected Waiting for client to connect to ZooKeeper
   [junit4]   2> 8197288 T3699 oascc.ConnectionManager.process Watcher org.apache.solr.common.cloud.ConnectionManager@36fdbb name:ZooKeeperConnection Watcher:127.0.0.1:60077 got event WatchedEvent state:SyncConnected type:None path:null path:null type:None
   [junit4]   2> 8197288 T3688 oascc.ConnectionManager.waitForConnected Client is connected to ZooKeeper
   [junit4]   2> 8197288 T3688 oascc.SolrZkClient.makePath makePath: /solr
   [junit4]   2> 8197296 T3688 oascc.SolrZkClient.makePath makePath: /live_nodes
   [junit4]   2> 8197296 T3690 oazs.NIOServerCnxn.doIO WARN caught end of stream exception EndOfStreamException: Unable to read additional data from client sessionid 0x1428ce65da30002, likely client has closed socket
   [junit4]   2> 	at org.apache.zookeeper.server.NIOServerCnxn.doIO(NIOServerCnxn.java:220)
   [junit4]   2> 	at org.apache.zookeeper.server.NIOServerCnxnFactory.run(NIOServerCnxnFactory.java:208)
   [junit4]   2> 	at java.lang.Thread.run(Thread.java:744)
   [junit4]   2> 
   [junit4]   2> 8197305 T3688 oascc.SolrZkClient.makePath makePath: /clusterstate.json
   [junit4]   2> 8197309 T3688 oascc.SolrZkClient.makePath makePath: /aliases.json
   [junit4]   2> 8197312 T3688 oascc.ZkStateReader.createClusterStateWatchersAndUpdate Updating cluster state from ZooKeeper... 
   [junit4]   2> 8197317 T3688 oascc.ConnectionManager.waitForConnected Waiting for client to connect to ZooKeeper
   [junit4]   2> 8197324 T3701 oascc.ConnectionManager.process Watcher org.apache.solr.common.cloud.ConnectionManager@1efa42b name:ZooKeeperConnection Watcher:127.0.0.1:60077/solr got event WatchedEvent state:SyncConnected type:None path:null path:null type:None
   [junit4]   2> 8197324 T3688 oascc.ConnectionManager.waitForConnected Client is connected to ZooKeeper
   [junit4]   2> 8197326 T3688 oascc.ZkStateReader.createClusterStateWatchersAndUpdate Updating cluster state from ZooKeeper... 
   [junit4]   2> 8197330 T3688 oascc.SolrZkClient.makePath makePath: /live_nodes/node1
   [junit4]   2> 8197335 T3695 oascc.ZkStateReader$3.process Updating live nodes... (1)
   [junit4]   2> 8197335 T3701 oascc.ZkStateReader$3.process Updating live nodes... (1)
   [junit4]   2> 8197337 T3688 oascc.ConnectionManager.waitForConnected Waiting for client to connect to ZooKeeper
   [junit4]   2> 8197340 T3703 oascc.ConnectionManager.process Watcher org.apache.solr.common.cloud.ConnectionManager@c1f51b name:ZooKeeperConnection Watcher:127.0.0.1:60077/solr got event WatchedEvent state:SyncConnected type:None path:null path:null type:None
   [junit4]   2> 8197341 T3688 oascc.ConnectionManager.waitForConnected Client is connected to ZooKeeper
   [junit4]   2> 8197342 T3688 oascc.SolrZkClient.makePath makePath: /overseer_elect/election
   [junit4]   2> 8197354 T3688 oascc.SolrZkClient.makePath makePath: /overseer_elect/leader
   [junit4]   2> 8197358 T3688 oasc.Overseer.start Overseer (id=90789863542161412-127.0.0.1:60077_solr-n_0000000000) starting
   [junit4]   2> 8197362 T3688 oascc.SolrZkClient.makePath makePath: /overseer/queue
   [junit4]   2> 8197366 T3688 oascc.SolrZkClient.makePath makePath: /overseer/queue-work
   [junit4]   2> 8197372 T3688 oascc.SolrZkClient.makePath makePath: /overseer/collection-queue-work
   [junit4]   2> 8197379 T3705 oasc.OverseerCollectionProcessor.run Process current queue of collection creations
   [junit4]   2> 8197394 T3704 oasc.Overseer$ClusterStateUpdater.run Starting to work on the main queue
   [junit4]   2> 8197401 T3704 oascc.ZkStateReader.updateClusterState Updating cloud state from ZooKeeper... 
   [junit4]   2> 8197402 T3704 oasc.Overseer$ClusterStateUpdater.updateState Update state numShards=1 message={
   [junit4]   2> 	  "operation":"state",
   [junit4]   2> 	  "state":"recovering",
   [junit4]   2> 	  "node_name":"node1",
   [junit4]   2> 	  "core":"core1",
   [junit4]   2> 	  "core_node_name":"core_node1",
   [junit4]   2> 	  "collection":"collection1",
   [junit4]   2> 	  "numShards":"1",
   [junit4]   2> 	  "base_url":"http://node1/solr/"}
   [junit4]   2> 8197402 T3704 oasc.Overseer$ClusterStateUpdater.createCollection Create collection collection1 with shards [shard1]
   [junit4]   2> 8197402 T3704 oasc.Overseer$ClusterStateUpdater.updateState Assigning new node to shard shard=shard1
   [junit4]   2> 8197408 T3703 oasc.DistributedQueue$LatchChildWatcher.process LatchChildWatcher fired on path: /overseer/queue state: SyncConnected type NodeChildrenChanged
   [junit4]   2> 8197409 T3695 oascc.ZkStateReader$2.process A cluster state change: WatchedEvent state:SyncConnected type:NodeDataChanged path:/clusterstate.json, has occurred - updating... (live nodes size: 1)
   [junit4]   2> 8197410 T3701 oascc.ZkStateReader$2.process A cluster state change: WatchedEvent state:SyncConnected type:NodeDataChanged path:/clusterstate.json, has occurred - updating... (live nodes size: 1)
   [junit4]   2> 8197888 T3688 oascc.SolrZkClient.makePath makePath: /collections/collection1/leader_elect/shard1/election
   [junit4]   2> 8197911 T3688 oascc.SolrZkClient.makePath makePath: /collections/collection1/leaders/shard1
   [junit4]   2> 8197922 T3703 oasc.DistributedQueue$LatchChildWatcher.process LatchChildWatcher fired on path: /overseer/queue state: SyncConnected type NodeChildrenChanged
   [junit4]   2> 8197924 T3688 oascc.ZkStateReader.updateClusterState Updating cloud state from ZooKeeper... 
   [junit4]   2> 8197925 T3704 oascc.ZkStateReader.updateClusterState Updating cloud state from ZooKeeper... 
   [junit4]   2> 8197930 T3695 oascc.ZkStateReader$3.process Updating live nodes... (0)
   [junit4]   2> 8197930 T3701 oascc.ZkStateReader$3.process Updating live nodes... (0)
   [junit4]   2> 8197933 T3690 oazs.NIOServerCnxn.doIO WARN caught end of stream exception EndOfStreamException: Unable to read additional data from client sessionid 0x1428ce65da30003, likely client has closed socket
   [junit4]   2> 	at org.apache.zookeeper.server.NIOServerCnxn.doIO(NIOServerCnxn.java:220)
   [junit4]   2> 	at org.apache.zookeeper.server.NIOServerCnxnFactory.run(NIOServerCnxnFactory.java:208)
   [junit4]   2> 	at java.lang.Thread.run(Thread.java:744)
   [junit4]   2> 
   [junit4]   2> 8197934 T3703 oasc.DistributedQueue$LatchChildWatcher.process LatchChildWatcher fired on path: /overseer/queue state: SyncConnected type NodeChildrenChanged
   [junit4]   2> 8197936 T3688 oascc.ConnectionManager.waitForConnected Waiting for client to connect to ZooKeeper
   [junit4]   2> 8197940 T3707 oascc.ConnectionManager.process Watcher org.apache.solr.common.cloud.ConnectionManager@192909e name:ZooKeeperConnection Watcher:127.0.0.1:60077/solr got event WatchedEvent state:SyncConnected type:None path:null path:null type:None
   [junit4]   2> 8197940 T3688 oascc.ConnectionManager.waitForConnected Client is connected to ZooKeeper
   [junit4]   2> 8197943 T3688 oascc.ZkStateReader.createClusterStateWatchersAndUpdate Updating cluster state from ZooKeeper... 
   [junit4]   2> 8197948 T3688 oascc.SolrZkClient.makePath makePath: /live_nodes/node1
   [junit4]   2> 8197953 T3695 oascc.ZkStateReader$3.process Updating live nodes... (1)
   [junit4]   2> 8197954 T3707 oascc.ZkStateReader$3.process Updating live nodes... (1)
   [junit4]   2> 8197958 T3703 oasc.DistributedQueue$LatchChildWatcher.process LatchChildWatcher fired on path: /overseer/queue state: SyncConnected type NodeChildrenChanged
   [junit4]   2> 8197958 T3688 oascc.SolrZkClient.makePath makePath: /collections/collection1/leader_elect/shard1/election
   [junit4]   2> 8197960 T3704 oasc.Overseer$ClusterStateUpdater.updateState Update state numShards=1 message={
   [junit4]   2> 	  "operation":"state",
   [junit4]   2> 	  "state":"recovering",
   [junit4]   2> 	  "node_name":"node1",
   [junit4]   2> 	  "core":"core1",
   [junit4]   2> 	  "core_node_name":"core_node1",
   [junit4]   2> 	  "collection":"collection1",
   [junit4]   2> 	  "numShards":"1",
   [junit4]   2> 	  "base_url":"http://node1/solr/"}
   [junit4]   2> 8197960 T3704 oasc.Overseer$ClusterStateUpdater.updateState shard=shard1 is already registered
   [junit4]   2> 8197967 T3703 oasc.DistributedQueue$LatchChildWatcher.process LatchChildWatcher fired on path: /overseer/queue state: SyncConnected type NodeChildrenChanged
   [junit4]   2> 8197973 T3688 oascc.SolrZkClient.makePath makePath: /collections/collection1/leaders/shard1
   [junit4]   2> 8197983 T3703 oasc.DistributedQueue$LatchChildWatcher.process LatchChildWatcher fired on path: /overseer/queue state: SyncConnected type NodeChildrenChanged
   [junit4]   2> 8197989 T3703 oasc.DistributedQueue$LatchChildWatcher.process LatchChildWatcher fired on path: /overseer/queue state: SyncConnected type NodeChildrenChanged
   [junit4]   2> 8198092 T3707 oascc.ZkStateReader$2.process A cluster state change: WatchedEvent state:SyncConnected type:NodeDataChanged path:/clusterstate.json, has occurred - updating... (live nodes size: 1)
   [junit4]   2> 8198093 T3695 oascc.ZkStateReader$2.process A cluster state change: WatchedEvent state:SyncConnected type:NodeDataChanged path:/clusterstate.json, has occurred - updating... (live nodes size: 1)
   [junit4]   2> 8198095 T3688 oascc.ZkStateReader.updateClusterState Updating cloud state from ZooKeeper... 
   [junit4]   2> 8198103 T3707 oascc.ZkStateReader$3.process Updating live nodes... (0)
   [junit4]   2> 8198103 T3695 oascc.ZkStateReader$3.process Updating live nodes... (0)
   [junit4]   2> 8198109 T3690 oazs.NIOServerCnxn.doIO WARN caught end of stream exception EndOfStreamException: Unable to read additional data from client sessionid 0x1428ce65da30000, likely client has closed socket
   [junit4]   2> 	at org.apache.zookeeper.server.NIOServerCnxn.doIO(NIOServerCnxn.java:220)
   [junit4]   2> 	at org.apache.zookeeper.server.NIOServerCnxnFactory.run(NIOServerCnxnFactory.java:208)
   [junit4]   2> 	at java.lang.Thread.run(Thread.java:744)
   [junit4]   2> 
   [junit4]   2> 8198114 T3688 oasc.ZkTestServer.send4LetterWord connecting to 127.0.0.1:60077 60077
   [junit4]   2> 8199554 T3704 oasc.Overseer$ClusterStateUpdater.run WARN Solr cannot talk to ZK, exiting Overseer main queue loop org.apache.zookeeper.KeeperException$SessionExpiredException: KeeperErrorCode = Session expired for /overseer/queue-work/qn-0000000002
   [junit4]   2> 	at org.apache.zookeeper.KeeperException.create(KeeperException.java:127)
   [junit4]   2> 	at org.apache.zookeeper.KeeperException.create(KeeperException.java:51)
   [junit4]   2> 	at org.apache.zookeeper.ZooKeeper.getData(ZooKeeper.java:1151)
   [junit4]   2> 	at org.apache.solr.common.cloud.SolrZkClient$7.execute(SolrZkClient.java:269)
   [junit4]   2> 	at org.apache.solr.common.cloud.SolrZkClient$7.execute(SolrZkClient.java:266)
   [junit4]   2> 	at org.apache.solr.common.cloud.ZkCmdExecutor.retryOperation(ZkCmdExecutor.java:65)
   [junit4]   2> 	at org.apache.solr.common.cloud.SolrZkClient.getData(SolrZkClient.java:266)
   [junit4]   2> 	at org.apache.solr.cloud.DistributedQueue.remove(DistributedQueue.java:169)
   [junit4]   2> 	at org.apache.solr.cloud.DistributedQueue.poll(DistributedQueue.java:445)
   [junit4]   2> 	at org.apache.solr.cloud.Overseer$ClusterStateUpdater.run(Overseer.java:199)
   [junit4]   2> 	at java.lang.Thread.run(Thread.java:744)
   [junit4]   2> 
   [junit4]   2> 8200240 T3688 oas.SolrTestCaseJ4.tearDown ###Ending testDoubleAssignment
   [junit4]   1> client port:0.0.0.0/0.0.0.0:0
   [junit4]   2> 8200244 T3688 oas.SolrTestCaseJ4.setUp ###Starting testShardAssignment
   [junit4]   2> 8200244 T3688 oasc.ZkTestServer.run STARTING ZK TEST SERVER
   [junit4]   2> 8200246 T3708 oasc.ZkTestServer$ZKServerMain.runFromConfig Starting server
   [junit4]   2> 8200335 T3688 oasc.ZkTestServer.run start zk server on port:60098
   [junit4]   2> 8200336 T3688 oascc.ConnectionManager.waitForConnected Waiting for client to connect to ZooKeeper
   [junit4]   2> 8200345 T3714 oascc.ConnectionManager.process Watcher org.apache.solr.common.cloud.ConnectionManager@ae7e32 name:ZooKeeperConnection Watcher:127.0.0.1:60098 got event WatchedEvent state:SyncConnected type:None path:null path:null type:None
   [junit4]   2> 8200345 T3688 oascc.ConnectionManager.waitForConnected Client is connected to ZooKeeper
   [junit4]   2> 8200384 T3709 oazs.NIOServerCnxn.doIO WARN caught end of stream exception EndOfStreamException: Unable to read additional data from client sessionid 0x1428ce669b00000, likely client has closed socket
   [junit4]   2> 	at org.apache.zookeeper.server.NIOServerCnxn.doIO(NIOServerCnxn.java:220)
   [junit4]   2> 	at org.apache.zookeeper.server.NIOServerCnxnFactory.run(NIOServerCnxnFactory.java:208)
   [junit4]   2> 	at java.lang.Thread.run(Thread.java:744)
   [junit4]   2> 
   [junit4]   2> 8200387 T3688 oascc.ConnectionManager.waitForConnected Waiting for client to connect to ZooKeeper
   [junit4]   2> 8200393 T3716 oascc.ConnectionManager.process Watcher org.apache.solr.common.cloud.ConnectionManager@7e4030 name:ZooKeeperConnection Watcher:127.0.0.1:60098 got event WatchedEvent state:SyncConnected type:None path:null path:null type:None
   [junit4]   2> 8200394 T3688 oascc.ConnectionManager.waitForConnected Client is connected to ZooKeeper
   [junit4]   2> 8200394 T3688 oascc.SolrZkClient.makePath makePath: /solr
   [junit4]   2> 8200399 T3709 oazs.NIOServerCnxn.doIO WARN caught end of stream exception EndOfStreamException: Unable to read additional data from client sessionid 0x1428ce669b00001, likely client has closed socket
   [junit4]   2> 	at org.apache.zookeeper.server.NIOServerCnxn.doIO(NIOServerCnxn.java:220)
   [junit4]   2> 	at org.apache.zookeeper.server.NIOServerCnxnFactory.run(NIOServerCnxnFactory.java:208)
   [junit4]   2> 	at java.lang.Thread.run(Thread.java:744)
   [junit4]   2> 
   [junit4]   2> 8200400 T3688 oascc.ConnectionManager.waitForConnected Waiting for client to connect to ZooKeeper
   [junit4]   2> 8200407 T3718 oascc.ConnectionManager.process Watcher org.apache.solr.common.cloud.ConnectionManager@1de0b09 name:ZooKeeperConnection Watcher:127.0.0.1:60098/solr got event WatchedEvent state:SyncConnected type:None path:null path:null type:None
   [junit4]   2> 8200407 T3688 oascc.ConnectionManager.waitForConnected Client is connected to ZooKeeper
   [junit4]   2> 8200407 T3688 oascc.SolrZkClient.makePath makePath: /live_nodes
   [junit4]   2> 8200417 T3688 oascc.ConnectionManager.waitForConnected Waiting for client to connect to ZooKeeper
   [junit4]   2> 8200423 T3720 oascc.ConnectionManager.process Watcher org.apache.solr.common.cloud.ConnectionManager@dd6bcc name:ZooKeeperConnection Watcher:127.0.0.1:60098/solr got event WatchedEvent state:SyncConnected type:None path:null path:null type:None
   [junit4]   2> 8200423 T3688 oascc.ConnectionManager.waitForConnected Client is connected to ZooKeeper
   [junit4]   2> 8200427 T3688 oascc.SolrZkClient.makePath makePath: /overseer_elect/election
   [junit4]   2> 8200436 T3688 oascc.SolrZkClient.makePath makePath: /overseer_elect/leader
   [junit4]   2> 8200441 T3688 oasc.Overseer.start Overseer (id=90789863744339971-127.0.0.1:60098_solr-n_0000000000) starting
   [junit4]   2> 8200445 T3688 oascc.SolrZkClient.makePath makePath: /overseer/queue
   [junit4]   2> 8200450 T3688 oascc.SolrZkClient.makePath makePath: /overseer/queue-work
   [junit4]   2> 8200456 T3688 oascc.SolrZkClient.makePath makePath: /overseer/collection-queue-work
   [junit4]   2> 8200487 T3722 oasc.OverseerCollectionProcessor.run Process current queue of collection creations
   [junit4]   2> 8200488 T3688 oascc.SolrZkClient.makePath makePath: /clusterstate.json
   [junit4]   2> 8200493 T3688 oascc.SolrZkClient.makePath makePath: /aliases.json
   [junit4]   2> 8200494 T3721 oasc.Overseer$ClusterStateUpdater.run Starting to work on the main queue
   [junit4]   2> 8200498 T3688 oascc.ZkStateReader.createClusterStateWatchersAndUpdate Updating cluster state from ZooKeeper... 
   [junit4]   2> 8200508 T3688 oascc.ConnectionManager.waitForConnected Waiting for client to connect to ZooKeeper
   [junit4]   2> 8200514 T3724 oascc.ConnectionManager.process Watcher org.apache.solr.common.cloud.ConnectionManager@197ce8b name:ZooKeeperConnection Watcher:127.0.0.1:60098/solr got event WatchedEvent state:SyncConnected type:None path:null path:null type:None
   [junit4]   2> 8200514 T3688 oascc.ConnectionManager.waitForConnected Client is connected to ZooKeeper
   [junit4]   2> 8200516 T3688 oascc.ZkStateReader.createClusterStateWatchersAndUpdate Updating cluster state from ZooKeeper... 
   [junit4]   2> 8200521 T3688 oascc.SolrZkClient.makePath makePath: /live_nodes/127.0.0.1
   [junit4]   2> 8200526 T3724 oascc.ZkStateReader$3.process Updating live nodes... (1)
   [junit4]   2> 8200526 T3718 oascc.ZkStateReader$3.process Updating live nodes... (1)
   [junit4]   2> 8200530 T3720 oasc.DistributedQueue$LatchChildWatcher.process LatchChildWatcher fired on path: /overseer/queue state: SyncConnected type NodeChildrenChanged
   [junit4]   2> 8200533 T3721 oascc.ZkStateReader.updateClusterState Updating cloud state from ZooKeeper... 
   [junit4]   2> 8200534 T3721 oasc.Overseer$ClusterStateUpdater.updateState Update state numShards=3 message={
   [junit4]   2> 	  "operation":"state",
   [junit4]   2> 	  "state":"active",
   [junit4]   2> 	  "node_name":"127.0.0.1",
   [junit4]   2> 	  "core":"core1",
   [junit4]   2> 	  "core_node_name":"node1",
   [junit4]   2> 	  "collection":"collection1",
   [junit4]   2> 	  "numShards":"3",
   [junit4]   2> 	  "base_url":"http://127.0.0.1/solr/"}
   [junit4]   2> 8200534 T3721 oasc.Overseer$ClusterStateUpdater.createCollection Create collection collection1 with shards [shard1, shard2, shard3]
   [junit4]   2> 8200534 T3721 oasc.Overseer$ClusterStateUpdater.updateState Assigning new node to shard shard=shard2
   [junit4]   2> 8200538 T3720 oasc.DistributedQueue$LatchChildWatcher.process LatchChildWatcher fired on path: /overseer/queue state: SyncConnected type NodeChildrenChanged
   [junit4]   2> 8200540 T3718 oascc.ZkStateReader$2.process A cluster state change: WatchedEvent state:SyncConnected type:NodeDataChanged path:/clusterstate.json, has occurred - updating... (live nodes size: 1)
   [junit4]   2> 8200540 T3724 oascc.ZkStateReader$2.process A cluster state change: WatchedEvent state:SyncConnected type:NodeDataChanged path:/clusterstate.json, has occurred - updating... (live nodes size: 1)
   [junit4]   2> 8200976 T3688 oascc.SolrZkClient.makePath makePath: /collections/collection1/leader_elect/shard2/election
   [junit4]   2> 8200989 T3688 oascc.SolrZkClient.makePath makePath: /collections/collection1/leaders/shard2
   [junit4]   2> 8200999 T3720 oasc.DistributedQueue$LatchChildWatcher.process LatchChildWatcher fired on path: /overseer/queue state: SyncConnected type NodeChildrenChanged
   [junit4]   2> 8201002 T3720 oasc.DistributedQueue$LatchChildWatcher.process LatchChildWatcher fired on path: /overseer/queue state: SyncConnected type NodeChildrenChanged
   [junit4]   2> 8201003 T3721 oascc.ZkStateReader.updateClusterState Updating cloud state from ZooKeeper... 
   [junit4]   2> 8201010 T3721 oasc.Overseer$ClusterStateUpdater.updateState Update state numShards=3 message={
   [junit4]   2> 	  "operation":"state",
   [junit4]   2> 	  "state":"active",
   [junit4]   2> 	  "node_name":"127.0.0.1",
   [junit4]   2> 	  "core":"core2",
   [junit4]   2> 	  "core_node_name":"node2",
   [junit4]   2> 	  "collection":"collection1",
   [junit4]   2> 	  "numShards":"3",
   [junit4]   2> 	  "base_url":"http://127.0.0.1/solr/"}
   [junit4]   2> 8201010 T3721 oasc.Overseer$ClusterStateUpdater.updateState Collection already exists with numShards=3
   [junit4]   2> 8201010 T3721 oasc.Overseer$ClusterStateUpdater.updateState Assigning new node to shard shard=shard3
   [junit4]   2> 8201014 T3720 oasc.DistributedQueue$LatchChildWatcher.process LatchChildWatcher fired on path: /overseer/queue state: SyncConnected type NodeChildrenChanged
   [junit4]   2> 8201106 T3718 oascc.ZkStateReader$2.process A cluster state change: WatchedEvent state:SyncConnected type:NodeDataChanged path:/clusterstate.json, has occurred - updating... (live nodes size: 1)
   [junit4]   2> 8201107 T3724 oascc.ZkStateReader$2.process A cluster state change: WatchedEvent state:SyncConnected type:NodeDataChanged path:/clusterstate.json, has occurred - updating... (live nodes size: 1)
   [junit4]   2> 8201448 T3688 oascc.SolrZkClient.makePath makePath: /collections/collection1/leader_elect/shard3/election
   [junit4]   2> 8201458 T3688 oascc.SolrZkClient.makePath makePath: /collections/collection1/leaders/shard3
   [junit4]   2> 8201465 T3720 oasc.DistributedQueue$LatchChildWatcher.process LatchChildWatcher fired on path: /overseer/queue state: SyncConnected type NodeChildrenChanged
   [junit4]   2> 8201465 T3720 oasc.DistributedQueue$LatchChildWatcher.process LatchChildWatcher fired on path: /overseer/queue state: SyncConnected type NodeChildrenChanged
   [junit4]   2> 8201465 T3720 oasc.DistributedQueue$LatchChildWatcher.process LatchChildWatcher fired on path: /overseer/queue state: SyncConnected type NodeChildrenChanged
   [junit4]   2> 8201467 T3720 oasc.DistributedQueue$LatchChildWatcher.process LatchChildWatcher fired on path: /overseer/queue state: SyncConnected type NodeChildrenChanged
   [junit4]   2> 8201468 T3721 oascc.ZkStateReader.updateClusterState Updating cloud state from ZooKeeper... 
   [junit4]   2> 8201473 T3721 oasc.Overseer$ClusterStateUpdater.updateState Update state numShards=3 message={
   [junit4]   2> 	  "operation":"state",
   [junit4]   2> 	  "state":"active",
   [junit4]   2> 	  "node_name":"127.0.0.1",
   [junit4]   2> 	  "core":"core3",
   [junit4]   2> 	  "core_node_name":"node3",
   [junit4]   2> 	  "collection":"collection1",
   [junit4]   2> 	  "numShards":"3",
   [junit4]   2> 	  "base_url":"http://127.0.0.1/solr/"}
   [junit4]   2> 8201473 T3721 oasc.Overseer$ClusterStateUpdater.updateState Collection already exists with numShards=3
   [junit4]   2> 8201473 T3721 oasc.Overseer$ClusterStateUpdater.updateState Assigning new node to shard shard=shard1
   [junit4]   2> 8201477 T3720 oasc.DistributedQueue$LatchChildWatcher.process LatchChildWatcher fired on path: /overseer/queue state: SyncConnected type NodeChildrenChanged
   [junit4]   2> 8201569 T3718 oascc.ZkStateReader$2.process A cluster state change: WatchedEvent state:SyncConnected type:NodeDataChanged path:/clusterstate.json, has occurred - updating... (live nodes size: 1)
   [junit4]   2> 8201570 T3724 oascc.ZkStateReader$2.process A cluster state change: WatchedEvent state:SyncConnected type:NodeDataChanged path:/clusterstate.json, has occurred - updating... (live nodes size: 1)
   [junit4]   2> 8201914 T3688 oascc.SolrZkClient.makePath makePath: /collections/collection1/leader_elect/shard1/election
   [junit4]   2> 8201922 T3688 oascc.SolrZkClient.makePath makePath: /collections/collection1/leaders/shard1
   [junit4]   2> 8201929 T3720 oasc.DistributedQueue$LatchChildWatcher.process LatchChildWatcher fired on path: /overseer/queue state: SyncConnected type NodeChildrenChanged
   [junit4]   2> 8201930 T3720 oasc.DistributedQueue$LatchChildWatcher.process LatchChildWatcher fired on path: /overseer/queue state: SyncConnected type NodeChildrenChanged
   [junit4]   2> 8201930 T3720 oasc.DistributedQueue$LatchChildWatcher.process LatchChildWatcher fired on path: /overseer/queue state: SyncConnected type NodeChildrenChanged
   [junit4]   2> 8201933 T3720 oasc.DistributedQueue$LatchChildWatcher.process LatchChildWatcher fired on path: /overseer/queue state: SyncConnected type NodeChildrenChanged
   [junit4]   2> 8201934 T3721 oascc.ZkStateReader.updateClusterState Updating cloud state from ZooKeeper... 
   [junit4]   2> 8201940 T3721 oasc.Overseer$ClusterStateUpdater.updateState Update state numShards=3 message={
   [junit4]   2> 	  "operation":"state",
   [junit4]   2> 	  "state":"active",
   [junit4]   2> 	  "node_name":"127.0.0.1",
   [junit4]   2> 	  "core":"core4",
   [junit4]   2> 	  "core_node_name":"node4",
   [junit4]   2> 	  "collection":"collection1",
   [junit4]   2> 	  "numShards":"3",
   [junit4]   2> 	  "base_url":"http://127.0.0.1/solr/"}
   [junit4]   2> 8201940 T3721 oasc.Overseer$ClusterStateUpdater.updateState Collection already exists with numShards=3
   [junit4]   2> 8201940 T3721 oasc.Overseer$ClusterStateUpdater.updateState Assigning new node to shard shard=shard2
   [junit4]   2> 8201943 T3720 oasc.DistributedQueue$LatchChildWatcher.process LatchChildWatcher fired on path: /overseer/queue state: SyncConnected type NodeChildrenChanged
   [junit4]   2> 8202036 T3718 oascc.ZkStateReader$2.process A cluster state change: WatchedEvent state:SyncConnected type:NodeDataChanged path:/clusterstate.json, has occurred - updating... (live nodes size: 1)
   [junit4]   2> 8202036 T3724 oascc.ZkStateReader$2.process A cluster state change: WatchedEvent state:SyncConnected type:NodeDataChanged path:/clusterstate.json, has occurred - updating... (live nodes size: 1)
   [junit4]   2> 8202378 T3688 oascc.SolrZkClient.makePath makePath: /collections/collection1/leader_elect/shard2/election
   [junit4]   2> 8202394 T3720 oasc.DistributedQueue$LatchChildWatcher.process LatchChildWatcher fired on path: /overseer/queue state: SyncConnected type NodeChildrenChanged
   [junit4]   2> 8202394 T3720 oasc.DistributedQueue$LatchChildWatcher.process LatchChildWatcher fired on path: /overseer/queue state: SyncConnected type NodeChildrenChanged
   [junit4]   2> 8202394 T3720 oasc.DistributedQueue$LatchChildWatcher.process LatchChildWatcher fired on path: /overseer/queue state: SyncConnected type NodeCh

[...truncated too long message...]

org.apache.solr.handler.TestReplicationHandler$SolrInstance-1385344472080\master\collection1\data\
   [junit4]   2> 9299586 T6537 oasc.CachingDirectoryFactory.closeCacheValue looking to close C:\Users\JenkinsSlave\workspace\Lucene-Solr-trunk-Windows\solr\build\solr-core\test\J0\.\org.apache.solr.handler.TestReplicationHandler$SolrInstance-1385344472080\master\collection1\data\index [CachedDir<<refCount=0;path=C:\Users\JenkinsSlave\workspace\Lucene-Solr-trunk-Windows\solr\build\solr-core\test\J0\.\org.apache.solr.handler.TestReplicationHandler$SolrInstance-1385344472080\master\collection1\data\index;done=false>>]
   [junit4]   2> 9299587 T6537 oasc.CachingDirectoryFactory.close Closing directory: C:\Users\JenkinsSlave\workspace\Lucene-Solr-trunk-Windows\solr\build\solr-core\test\J0\.\org.apache.solr.handler.TestReplicationHandler$SolrInstance-1385344472080\master\collection1\data\index
   [junit4]   2> 9299588 T6537 oejsh.ContextHandler.doStop stopped o.e.j.s.ServletContextHandler{/solr,null}
   [junit4]   2> 9299656 T6537 oasc.CoreContainer.shutdown Shutting down CoreContainer instance=9660000
   [junit4]   2> 9299658 T6537 oasc.SolrCore.close [collection1]  CLOSING SolrCore org.apache.solr.core.SolrCore@1ceb73
   [junit4]   2> 9299659 T6537 oasu.DirectUpdateHandler2.close closing DirectUpdateHandler2{commits=0,autocommits=0,soft autocommits=0,optimizes=0,rollbacks=0,expungeDeletes=0,docsPending=0,adds=0,deletesById=0,deletesByQuery=0,errors=0,cumulative_adds=0,cumulative_deletesById=0,cumulative_deletesByQuery=0,cumulative_errors=0}
   [junit4]   2> 9299661 T6537 oasu.SolrCoreState.decrefSolrCoreState Closing SolrCoreState
   [junit4]   2> 9299661 T6537 oasu.DefaultSolrCoreState.closeIndexWriter SolrCoreState ref count has reached 0 - closing IndexWriter
   [junit4]   2> 9299661 T6537 oasu.DefaultSolrCoreState.closeIndexWriter closing IndexWriter with IndexWriterCloser
   [junit4]   2> 9299662 T6537 oasc.SolrCore.closeSearcher [collection1] Closing main searcher on request.
   [junit4]   2> 9299662 T6537 oasc.CachingDirectoryFactory.close Closing MockDirectoryFactory - 2 directories currently being tracked
   [junit4]   2> 9299662 T6537 oasc.CachingDirectoryFactory.closeCacheValue looking to close C:\Users\JenkinsSlave\workspace\Lucene-Solr-trunk-Windows\solr\build\solr-core\test\J0\.\org.apache.solr.handler.TestReplicationHandler$SolrInstance-1385344472270\slave\collection1\data\ [CachedDir<<refCount=0;path=C:\Users\JenkinsSlave\workspace\Lucene-Solr-trunk-Windows\solr\build\solr-core\test\J0\.\org.apache.solr.handler.TestReplicationHandler$SolrInstance-1385344472270\slave\collection1\data\;done=false>>]
   [junit4]   2> 9299662 T6537 oasc.CachingDirectoryFactory.close Closing directory: C:\Users\JenkinsSlave\workspace\Lucene-Solr-trunk-Windows\solr\build\solr-core\test\J0\.\org.apache.solr.handler.TestReplicationHandler$SolrInstance-1385344472270\slave\collection1\data\
   [junit4]   2> 9299665 T6537 oasc.CachingDirectoryFactory.closeCacheValue looking to close C:\Users\JenkinsSlave\workspace\Lucene-Solr-trunk-Windows\solr\build\solr-core\test\J0\.\org.apache.solr.handler.TestReplicationHandler$SolrInstance-1385344472270\slave\collection1\data\index [CachedDir<<refCount=0;path=C:\Users\JenkinsSlave\workspace\Lucene-Solr-trunk-Windows\solr\build\solr-core\test\J0\.\org.apache.solr.handler.TestReplicationHandler$SolrInstance-1385344472270\slave\collection1\data\index;done=false>>]
   [junit4]   2> 9299665 T6537 oasc.CachingDirectoryFactory.close Closing directory: C:\Users\JenkinsSlave\workspace\Lucene-Solr-trunk-Windows\solr\build\solr-core\test\J0\.\org.apache.solr.handler.TestReplicationHandler$SolrInstance-1385344472270\slave\collection1\data\index
   [junit4]   2> 9299666 T6537 oejsh.ContextHandler.doStop stopped o.e.j.s.ServletContextHandler{/solr,null}
   [junit4]   2> 9299751 T6537 oas.SolrTestCaseJ4.deleteCore ###deleteCore
   [junit4]   2> NOTE: test params are: codec=DummyCompressingStoredFields(storedFieldsFormat=CompressingStoredFieldsFormat(compressionMode=DUMMY, chunkSize=28), termVectorsFormat=CompressingTermVectorsFormat(compressionMode=DUMMY, chunkSize=28)), sim=DefaultSimilarity, locale=sr_ME_#Latn, timezone=Asia/Ulaanbaatar
   [junit4]   2> NOTE: Windows 7 6.1 x86/Oracle Corporation 1.8.0-ea (32-bit)/cpus=2,threads=1,free=71917912,total=367157248
   [junit4]   2> NOTE: All tests run in this JVM: [DOMUtilTest, TestWriterPerf, TestAnalyzeInfixSuggestions, TestConfig, TermVectorComponentDistributedTest, SOLR749Test, IndexSchemaTest, TestIndexingPerformance, TestLRUCache, CollectionsAPIDistributedZkTest, NumericFieldsTest, TestRTGBase, TestLMJelinekMercerSimilarityFactory, SolrCoreCheckLockOnStartupTest, TestFastLRUCache, SortByFunctionTest, TestWordDelimiterFilterFactory, DocValuesMissingTest, PingRequestHandlerTest, PrimitiveFieldTypeTest, SolrCoreTest, TestIndexSearcher, ParsingFieldUpdateProcessorsTest, TestCSVLoader, TestJmxIntegration, TermsComponentTest, StandardRequestHandlerTest, TestDefaultSearchFieldResource, DistributedQueryElevationComponentTest, TestSolrQueryParserDefaultOperatorResource, TestJmxMonitoredMap, DefaultValueUpdateProcessorTest, RecoveryZkTest, BlockCacheTest, TestModifyConfFiles, HdfsLockFactoryTest, PrimUtilsTest, TestRecoveryHdfs, TestMaxScoreQueryParser, TriLevelCompositeIdRoutingTest, BadIndexSchemaTest, SimplePostToolTest, BadComponentTest, SuggesterTest, TimeZoneUtilsTest, PolyFieldTest, TestClassNameShortening, TestRandomMergePolicy, FieldFacetTest, DistributedSpellCheckComponentTest, HdfsSyncSliceTest, SampleTest, OpenCloseCoreStressTest, TestSolrXml, DateFieldTest, TestCollapseQParserPlugin, TestAnalyzedSuggestions, SolrIndexSplitterTest, TestCloudManagedSchemaAddField, CustomCollectionTest, TermVectorComponentTest, QueryEqualityTest, FunctionTest, ZkControllerTest, ZkSolrClientTest, UniqFieldsUpdateProcessorFactoryTest, TestCoreDiscovery, TestRandomDVFaceting, HighlighterConfigTest, TestInfoStreamLogging, DistributedTermsComponentTest, HdfsBasicDistributedZkTest, TestFoldingMultitermQuery, TestCodecSupport, AlternateDirectoryTest, TestNumberUtils, EnumFieldTest, SliceStateTest, MigrateRouteKeyTest, TestSerializedLuceneMatchVersion, StatelessScriptUpdateProcessorFactoryTest, SpellCheckCollatorTest, LegacyHTMLStripCharFilterTest, TestValueSourceCache, TestFieldTypeCollectionResource, RequiredFieldsTest, TestFunctionQuery, TestSolrXmlPersistor, DeleteShardTest, CoreMergeIndexesAdminHandlerTest, TestLFUCache, AnalysisAfterCoreReloadTest, SolrPluginUtilsTest, SignatureUpdateProcessorFactoryTest, ClusterStateUpdateTest, TestRandomFaceting, DirectUpdateHandlerTest, TestNonNRTOpen, BlockDirectoryTest, HighlighterTest, TestZkChroot, HdfsUnloadDistributedZkTest, TestDFRSimilarityFactory, TestBadConfig, TestSolrIndexConfig, TestReloadAndDeleteDocs, TestStressLucene, TestFastOutputStream, TestMultiCoreConfBootstrap, PeerSyncTest, SynonymTokenizerTest, UpdateParamsTest, ChaosMonkeyNothingIsSafeTest, OverseerTest, TestTrie, RequestHandlersTest, IndexSchemaRuntimeFieldTest, TestQueryUtils, TestDynamicFieldCollectionResource, TestCharFilters, TestFieldResource, DocumentBuilderTest, SliceStateUpdateTest, TestUtils, HdfsChaosMonkeySafeLeaderTest, ExpressionTest, QueryResultKeyTest, TestRecovery, AbstractAnalyticsStatsTest, LeaderElectionIntegrationTest, PathHierarchyTokenizerFactoryTest, AliasIntegrationTest, CSVRequestHandlerTest, AbstractAnalyticsFacetTest, CoreAdminHandlerTest, HdfsRecoveryZkTest, TestJoin, UpdateRequestProcessorFactoryTest, SystemInfoHandlerTest, HdfsBasicDistributedZk2Test, IndexBasedSpellCheckerTest, RegexBoostProcessorTest, TestStressReorder, RAMDirectoryFactoryTest, TestSolrQueryParser, TestXIncludeConfig, DateMathParserTest, TestGroupingSearch, MoreLikeThisHandlerTest, LeaderElectionTest, TestSuggestSpellingConverter, BadCopyFieldTest, TestSolrJ, TestUpdate, TestElisionMultitermQuery, ConvertedLegacyTest, ShardRoutingTest, TestReload, TestQuerySenderNoQuery, PreAnalyzedFieldTest, TestStressUserVersions, TestSimpleQParserPlugin, TestRealTimeGet, TestCoreContainer, TestFieldTypeResource, TestUniqueKeyFieldResource, UUIDFieldTest, CoreAdminCreateDiscoverTest, FieldAnalysisRequestHandlerTest, StatsComponentTest, OpenExchangeRatesOrgProviderTest, BasicDistributedZkTest, ChaosMonkeySafeLeaderTest, BasicDistributedZk2Test, UnloadDistributedZkTest, SyncSliceTest, BasicZkTest, FullSolrCloudDistribCmdsTest, TestReplicationHandler]
   [junit4] Completed in 46.94s, 14 tests, 1 failure <<< FAILURES!

[...truncated 530 lines...]
BUILD FAILED
C:\Users\JenkinsSlave\workspace\Lucene-Solr-trunk-Windows\build.xml:420: The following error occurred while executing this line:
C:\Users\JenkinsSlave\workspace\Lucene-Solr-trunk-Windows\build.xml:400: The following error occurred while executing this line:
C:\Users\JenkinsSlave\workspace\Lucene-Solr-trunk-Windows\build.xml:39: The following error occurred while executing this line:
C:\Users\JenkinsSlave\workspace\Lucene-Solr-trunk-Windows\extra-targets.xml:37: The following error occurred while executing this line:
C:\Users\JenkinsSlave\workspace\Lucene-Solr-trunk-Windows\solr\build.xml:189: The following error occurred while executing this line:
C:\Users\JenkinsSlave\workspace\Lucene-Solr-trunk-Windows\solr\common-build.xml:492: The following error occurred while executing this line:
C:\Users\JenkinsSlave\workspace\Lucene-Solr-trunk-Windows\lucene\common-build.xml:1275: The following error occurred while executing this line:
C:\Users\JenkinsSlave\workspace\Lucene-Solr-trunk-Windows\lucene\common-build.xml:908: There were test failures: 353 suites, 1558 tests, 1 suite-level error, 1 error, 1 failure, 42 ignored (11 assumptions)

Total time: 189 minutes 53 seconds
Build step 'Invoke Ant' marked build as failure
Description set: Java: 32bit/jdk1.8.0-ea-b116 -server -XX:+UseSerialGC
Archiving artifacts
Recording test results
Email was triggered for: Failure
Sending email for trigger: Failure



Mime
View raw message