lucene-dev mailing list archives

Site index · List index
Message view « Date » · « Thread »
Top « Date » · « Thread »
From Policeman Jenkins Server <jenk...@thetaphi.de>
Subject [JENKINS] Lucene-Solr-4.x-Windows (64bit/jdk1.7.0_45) - Build # 3384 - Failure!
Date Wed, 13 Nov 2013 17:59:12 GMT
Build: http://jenkins.thetaphi.de/job/Lucene-Solr-4.x-Windows/3384/
Java: 64bit/jdk1.7.0_45 -XX:-UseCompressedOops -XX:+UseSerialGC

1 tests failed.
REGRESSION:  org.apache.solr.core.TestNonNRTOpen.testReaderIsNotNRT

Error Message:
expected:<3> but was:<2>

Stack Trace:
java.lang.AssertionError: expected:<3> but was:<2>
	at __randomizedtesting.SeedInfo.seed([F87A09729A9C2DA4:4DFC68F5255D9F50]:0)
	at org.junit.Assert.fail(Assert.java:93)
	at org.junit.Assert.failNotEquals(Assert.java:647)
	at org.junit.Assert.assertEquals(Assert.java:128)
	at org.junit.Assert.assertEquals(Assert.java:472)
	at org.junit.Assert.assertEquals(Assert.java:456)
	at org.apache.solr.core.TestNonNRTOpen.assertNotNRT(TestNonNRTOpen.java:133)
	at org.apache.solr.core.TestNonNRTOpen.testReaderIsNotNRT(TestNonNRTOpen.java:94)
	at sun.reflect.NativeMethodAccessorImpl.invoke0(Native Method)
	at sun.reflect.NativeMethodAccessorImpl.invoke(NativeMethodAccessorImpl.java:57)
	at sun.reflect.DelegatingMethodAccessorImpl.invoke(DelegatingMethodAccessorImpl.java:43)
	at java.lang.reflect.Method.invoke(Method.java:606)
	at com.carrotsearch.randomizedtesting.RandomizedRunner.invoke(RandomizedRunner.java:1559)
	at com.carrotsearch.randomizedtesting.RandomizedRunner.access$600(RandomizedRunner.java:79)
	at com.carrotsearch.randomizedtesting.RandomizedRunner$6.evaluate(RandomizedRunner.java:737)
	at com.carrotsearch.randomizedtesting.RandomizedRunner$7.evaluate(RandomizedRunner.java:773)
	at com.carrotsearch.randomizedtesting.RandomizedRunner$8.evaluate(RandomizedRunner.java:787)
	at com.carrotsearch.randomizedtesting.rules.SystemPropertiesRestoreRule$1.evaluate(SystemPropertiesRestoreRule.java:53)
	at org.apache.lucene.util.TestRuleSetupTeardownChained$1.evaluate(TestRuleSetupTeardownChained.java:50)
	at org.apache.lucene.util.TestRuleFieldCacheSanity$1.evaluate(TestRuleFieldCacheSanity.java:51)
	at org.apache.lucene.util.AbstractBeforeAfterRule$1.evaluate(AbstractBeforeAfterRule.java:46)
	at com.carrotsearch.randomizedtesting.rules.SystemPropertiesInvariantRule$1.evaluate(SystemPropertiesInvariantRule.java:55)
	at org.apache.lucene.util.TestRuleThreadAndTestName$1.evaluate(TestRuleThreadAndTestName.java:49)
	at org.apache.lucene.util.TestRuleIgnoreAfterMaxFailures$1.evaluate(TestRuleIgnoreAfterMaxFailures.java:70)
	at org.apache.lucene.util.TestRuleMarkFailure$1.evaluate(TestRuleMarkFailure.java:48)
	at com.carrotsearch.randomizedtesting.rules.StatementAdapter.evaluate(StatementAdapter.java:36)
	at com.carrotsearch.randomizedtesting.ThreadLeakControl$StatementRunner.run(ThreadLeakControl.java:358)
	at com.carrotsearch.randomizedtesting.ThreadLeakControl.forkTimeoutingTask(ThreadLeakControl.java:782)
	at com.carrotsearch.randomizedtesting.ThreadLeakControl$3.evaluate(ThreadLeakControl.java:442)
	at com.carrotsearch.randomizedtesting.RandomizedRunner.runSingleTest(RandomizedRunner.java:746)
	at com.carrotsearch.randomizedtesting.RandomizedRunner$3.evaluate(RandomizedRunner.java:648)
	at com.carrotsearch.randomizedtesting.RandomizedRunner$4.evaluate(RandomizedRunner.java:682)
	at com.carrotsearch.randomizedtesting.RandomizedRunner$5.evaluate(RandomizedRunner.java:693)
	at com.carrotsearch.randomizedtesting.rules.StatementAdapter.evaluate(StatementAdapter.java:36)
	at com.carrotsearch.randomizedtesting.rules.SystemPropertiesRestoreRule$1.evaluate(SystemPropertiesRestoreRule.java:53)
	at org.apache.lucene.util.AbstractBeforeAfterRule$1.evaluate(AbstractBeforeAfterRule.java:46)
	at org.apache.lucene.util.TestRuleStoreClassName$1.evaluate(TestRuleStoreClassName.java:42)
	at com.carrotsearch.randomizedtesting.rules.SystemPropertiesInvariantRule$1.evaluate(SystemPropertiesInvariantRule.java:55)
	at com.carrotsearch.randomizedtesting.rules.NoShadowingOrOverridesOnMethodsRule$1.evaluate(NoShadowingOrOverridesOnMethodsRule.java:39)
	at com.carrotsearch.randomizedtesting.rules.NoShadowingOrOverridesOnMethodsRule$1.evaluate(NoShadowingOrOverridesOnMethodsRule.java:39)
	at com.carrotsearch.randomizedtesting.rules.StatementAdapter.evaluate(StatementAdapter.java:36)
	at org.apache.lucene.util.TestRuleAssertionsRequired$1.evaluate(TestRuleAssertionsRequired.java:43)
	at org.apache.lucene.util.TestRuleMarkFailure$1.evaluate(TestRuleMarkFailure.java:48)
	at org.apache.lucene.util.TestRuleIgnoreAfterMaxFailures$1.evaluate(TestRuleIgnoreAfterMaxFailures.java:70)
	at org.apache.lucene.util.TestRuleIgnoreTestSuites$1.evaluate(TestRuleIgnoreTestSuites.java:55)
	at com.carrotsearch.randomizedtesting.rules.StatementAdapter.evaluate(StatementAdapter.java:36)
	at com.carrotsearch.randomizedtesting.ThreadLeakControl$StatementRunner.run(ThreadLeakControl.java:358)
	at java.lang.Thread.run(Thread.java:744)




Build Log:
[...truncated 10026 lines...]
   [junit4] Suite: org.apache.solr.core.TestNonNRTOpen
   [junit4]   2> 44020 T53 oas.SolrTestCaseJ4.initCore ####initCore
   [junit4]   2> Creating dataDir: C:\Users\JenkinsSlave\workspace\Lucene-Solr-4.x-Windows\solr\build\solr-core\test\J0\.\solrtest-TestNonNRTOpen-1384362110126
   [junit4]   2> 44023 T53 oasc.SolrResourceLoader.<init> new SolrResourceLoader for directory: 'C:\Users\JenkinsSlave\workspace\Lucene-Solr-4.x-Windows\solr\build\solr-core\test-files\solr\collection1\'
   [junit4]   2> 44026 T53 oasc.SolrResourceLoader.replaceClassLoader Adding 'file:/C:/Users/JenkinsSlave/workspace/Lucene-Solr-4.x-Windows/solr/build/solr-core/test-files/solr/collection1/lib/classes/' to classloader
   [junit4]   2> 44026 T53 oasc.SolrResourceLoader.replaceClassLoader Adding 'file:/C:/Users/JenkinsSlave/workspace/Lucene-Solr-4.x-Windows/solr/build/solr-core/test-files/solr/collection1/lib/README' to classloader
   [junit4]   2> 44156 T53 oasc.SolrConfig.<init> Using Lucene MatchVersion: LUCENE_47
   [junit4]   2> 44258 T53 oasc.SolrConfig.<init> Loaded SolrConfig: solrconfig-basic.xml
   [junit4]   2> 44258 T53 oass.IndexSchema.readSchema Reading Solr Schema from schema-minimal.xml
   [junit4]   2> 44269 T53 oass.IndexSchema.readSchema [null] Schema name=minimal
   [junit4]   2> 44296 T53 oass.IndexSchema.readSchema WARN no uniqueKey specified in schema.
   [junit4]   2> 44297 T53 oasc.SolrResourceLoader.locateSolrHome JNDI not configured for solr (NoInitialContextEx)
   [junit4]   2> 44299 T53 oasc.SolrResourceLoader.locateSolrHome using system property solr.solr.home: C:\Users\JenkinsSlave\workspace\Lucene-Solr-4.x-Windows\solr\build\solr-core\test-files\solr
   [junit4]   2> 44299 T53 oasc.SolrResourceLoader.<init> new SolrResourceLoader for directory: 'C:\Users\JenkinsSlave\workspace\Lucene-Solr-4.x-Windows\solr\build\solr-core\test-files\solr\'
   [junit4]   2> 44322 T53 oasc.SolrResourceLoader.locateSolrHome JNDI not configured for solr (NoInitialContextEx)
   [junit4]   2> 44324 T53 oasc.SolrResourceLoader.locateSolrHome using system property solr.solr.home: C:\Users\JenkinsSlave\workspace\Lucene-Solr-4.x-Windows\solr\build\solr-core\test-files\solr
   [junit4]   2> 44324 T53 oasc.SolrResourceLoader.<init> new SolrResourceLoader for deduced Solr Home: 'C:\Users\JenkinsSlave\workspace\Lucene-Solr-4.x-Windows\solr\build\solr-core\test-files\solr\'
   [junit4]   2> 44458 T53 oasc.CoreContainer.<init> New CoreContainer 1865420605
   [junit4]   2> 44458 T53 oasc.CoreContainer.load Loading cores into CoreContainer [instanceDir=C:\Users\JenkinsSlave\workspace\Lucene-Solr-4.x-Windows\solr\build\solr-core\test-files\solr\]
   [junit4]   2> 44461 T53 oashc.HttpShardHandlerFactory.getParameter Setting socketTimeout to: 0
   [junit4]   2> 44461 T53 oashc.HttpShardHandlerFactory.getParameter Setting urlScheme to: http://
   [junit4]   2> 44462 T53 oashc.HttpShardHandlerFactory.getParameter Setting connTimeout to: 0
   [junit4]   2> 44462 T53 oashc.HttpShardHandlerFactory.getParameter Setting maxConnectionsPerHost to: 20
   [junit4]   2> 44462 T53 oashc.HttpShardHandlerFactory.getParameter Setting corePoolSize to: 0
   [junit4]   2> 44464 T53 oashc.HttpShardHandlerFactory.getParameter Setting maximumPoolSize to: 2147483647
   [junit4]   2> 44464 T53 oashc.HttpShardHandlerFactory.getParameter Setting maxThreadIdleTime to: 5
   [junit4]   2> 44464 T53 oashc.HttpShardHandlerFactory.getParameter Setting sizeOfQueue to: -1
   [junit4]   2> 44465 T53 oashc.HttpShardHandlerFactory.getParameter Setting fairnessPolicy to: false
   [junit4]   2> 44472 T53 oasl.LogWatcher.createWatcher SLF4J impl is org.slf4j.impl.Log4jLoggerFactory
   [junit4]   2> 44472 T53 oasl.LogWatcher.newRegisteredLogWatcher Registering Log Listener [Log4j (org.slf4j.impl.Log4jLoggerFactory)]
   [junit4]   2> 44482 T54 oasc.CoreContainer.create Creating SolrCore 'collection1' using instanceDir: C:\Users\JenkinsSlave\workspace\Lucene-Solr-4.x-Windows\solr\build\solr-core\test-files\solr\collection1
   [junit4]   2> 44483 T54 oasc.SolrResourceLoader.<init> new SolrResourceLoader for directory: 'C:\Users\JenkinsSlave\workspace\Lucene-Solr-4.x-Windows\solr\build\solr-core\test-files\solr\collection1\'
   [junit4]   2> 44485 T54 oasc.SolrResourceLoader.replaceClassLoader Adding 'file:/C:/Users/JenkinsSlave/workspace/Lucene-Solr-4.x-Windows/solr/build/solr-core/test-files/solr/collection1/lib/classes/' to classloader
   [junit4]   2> 44485 T54 oasc.SolrResourceLoader.replaceClassLoader Adding 'file:/C:/Users/JenkinsSlave/workspace/Lucene-Solr-4.x-Windows/solr/build/solr-core/test-files/solr/collection1/lib/README' to classloader
   [junit4]   2> 44577 T54 oasc.SolrConfig.<init> Using Lucene MatchVersion: LUCENE_47
   [junit4]   2> 44670 T54 oasc.SolrConfig.<init> Loaded SolrConfig: solrconfig-basic.xml
   [junit4]   2> 44670 T54 oass.IndexSchema.readSchema Reading Solr Schema from schema-minimal.xml
   [junit4]   2> 44682 T54 oass.IndexSchema.readSchema [collection1] Schema name=minimal
   [junit4]   2> 44703 T54 oass.IndexSchema.readSchema WARN no uniqueKey specified in schema.
   [junit4]   2> 44706 T54 oasc.SolrCore.initDirectoryFactory solr.StandardDirectoryFactory
   [junit4]   2> 44748 T54 oasc.SolrCore.<init> [collection1] Opening new SolrCore at C:\Users\JenkinsSlave\workspace\Lucene-Solr-4.x-Windows\solr\build\solr-core\test-files\solr\collection1\, dataDir=C:\Users\JenkinsSlave\workspace\Lucene-Solr-4.x-Windows\solr\build\solr-core\test\J0\.\solrtest-TestNonNRTOpen-1384362110126\
   [junit4]   2> 44748 T54 oasc.SolrCore.<init> JMX monitoring not detected for core: collection1
   [junit4]   2> 44749 T54 oasc.CachingDirectoryFactory.get return new directory for C:\Users\JenkinsSlave\workspace\Lucene-Solr-4.x-Windows\solr\build\solr-core\test\J0\solrtest-TestNonNRTOpen-1384362110126
   [junit4]   2> 44749 T54 oasc.SolrCore.getNewIndexDir New index directory detected: old=null new=C:\Users\JenkinsSlave\workspace\Lucene-Solr-4.x-Windows\solr\build\solr-core\test\J0\.\solrtest-TestNonNRTOpen-1384362110126\index/
   [junit4]   2> 44749 T54 oasc.SolrCore.initIndex WARN [collection1] Solr index directory 'C:\Users\JenkinsSlave\workspace\Lucene-Solr-4.x-Windows\solr\build\solr-core\test\J0\.\solrtest-TestNonNRTOpen-1384362110126\index' doesn't exist. Creating new index...
   [junit4]   2> 44749 T54 oasc.CachingDirectoryFactory.get return new directory for C:\Users\JenkinsSlave\workspace\Lucene-Solr-4.x-Windows\solr\build\solr-core\test\J0\solrtest-TestNonNRTOpen-1384362110126\index
   [junit4]   2> 44759 T54 oasc.SolrDeletionPolicy.onCommit SolrDeletionPolicy.onCommit: commits: num=1
   [junit4]   2> 		commit{dir=C:\Users\JenkinsSlave\workspace\Lucene-Solr-4.x-Windows\solr\build\solr-core\test\J0\solrtest-TestNonNRTOpen-1384362110126\index,segFN=segments_1,generation=1}
   [junit4]   2> 44759 T54 oasc.SolrDeletionPolicy.updateCommits newest commit generation = 1
   [junit4]   2> 44761 T54 oasc.SolrCore.loadUpdateProcessorChains no updateRequestProcessorChain defined as default, creating implicit default
   [junit4]   2> 44762 T54 oasc.RequestHandlers.initHandlersFromConfig created standard: solr.StandardRequestHandler
   [junit4]   2> 44762 T54 oasc.RequestHandlers.initHandlersFromConfig created /update: solr.UpdateRequestHandler
   [junit4]   2> 44777 T54 oashl.XMLLoader.init xsltCacheLifetimeSeconds=60
   [junit4]   2> 44783 T54 oasu.CommitTracker.<init> Hard AutoCommit: disabled
   [junit4]   2> 44783 T54 oasu.CommitTracker.<init> Soft AutoCommit: disabled
   [junit4]   2> 44786 T54 oass.SolrIndexSearcher.<init> Opening Searcher@2dbfbbcc main
   [junit4]   2> 44786 T54 oasc.CoreContainer.registerCore registering core: collection1
   [junit4]   2> 44786 T55 oasc.SolrCore.registerSearcher [collection1] Registered new searcher Searcher@2dbfbbcc main{StandardDirectoryReader(segments_1:1)}
   [junit4]   2> 44789 T53 oas.SolrTestCaseJ4.initCore ####initCore end
   [junit4]   2> ASYNC  NEW_CORE C75 name=collection1 org.apache.solr.core.SolrCore@69149578
   [junit4]   2> 44810 T53 C75 oasc.SolrDeletionPolicy.onInit SolrDeletionPolicy.onInit: commits: num=1
   [junit4]   2> 		commit{dir=C:\Users\JenkinsSlave\workspace\Lucene-Solr-4.x-Windows\solr\build\solr-core\test\J0\solrtest-TestNonNRTOpen-1384362110126\index,segFN=segments_1,generation=1}
   [junit4]   2> 44814 T53 C75 oasc.SolrDeletionPolicy.updateCommits newest commit generation = 1
   [junit4]   2> 44817 T53 C75 oasup.LogUpdateProcessor.finish [collection1] webapp=null path=null params={} {add=[(null)]} 0 10
   [junit4]   2> 44832 T53 C75 oasu.DirectUpdateHandler2.commit start commit{,optimize=false,openSearcher=true,waitSearcher=true,expungeDeletes=false,softCommit=false,prepareCommit=false}
   [junit4]   2> 44874 T53 C75 oasc.SolrDeletionPolicy.onCommit SolrDeletionPolicy.onCommit: commits: num=2
   [junit4]   2> 		commit{dir=C:\Users\JenkinsSlave\workspace\Lucene-Solr-4.x-Windows\solr\build\solr-core\test\J0\solrtest-TestNonNRTOpen-1384362110126\index,segFN=segments_1,generation=1}
   [junit4]   2> 		commit{dir=C:\Users\JenkinsSlave\workspace\Lucene-Solr-4.x-Windows\solr\build\solr-core\test\J0\solrtest-TestNonNRTOpen-1384362110126\index,segFN=segments_2,generation=2}
   [junit4]   2> 44874 T53 C75 oasc.SolrDeletionPolicy.updateCommits newest commit generation = 2
   [junit4]   2> 44889 T53 C75 oass.SolrIndexSearcher.<init> Opening Searcher@bc8edce main
   [junit4]   2> 44894 T53 C75 oasu.DirectUpdateHandler2.commit end_commit_flush
   [junit4]   2> 44894 T55 oasc.SolrCore.registerSearcher [collection1] Registered new searcher Searcher@bc8edce main{StandardDirectoryReader(segments_2:3 _0(4.7):c1)}
   [junit4]   2> 44895 T53 C75 oasup.LogUpdateProcessor.finish [collection1] webapp=null path=null params={} {commit=} 0 63
   [junit4]   2> 44902 T53 oas.SolrTestCaseJ4.deleteCore ###deleteCore
   [junit4]   2> 44902 T53 oasc.CoreContainer.shutdown Shutting down CoreContainer instance=1865420605
   [junit4]   2> 44903 T53 oasc.SolrCore.close [collection1]  CLOSING SolrCore org.apache.solr.core.SolrCore@69149578
   [junit4]   2> 44903 T53 oasu.DirectUpdateHandler2.close closing DirectUpdateHandler2{commits=1,autocommits=0,soft autocommits=0,optimizes=0,rollbacks=0,expungeDeletes=0,docsPending=0,adds=0,deletesById=0,deletesByQuery=0,errors=0,cumulative_adds=1,cumulative_deletesById=0,cumulative_deletesByQuery=0,cumulative_errors=0}
   [junit4]   2> 44903 T53 oasu.SolrCoreState.decrefSolrCoreState Closing SolrCoreState
   [junit4]   2> 44905 T53 oasu.DefaultSolrCoreState.closeIndexWriter SolrCoreState ref count has reached 0 - closing IndexWriter
   [junit4]   2> 44905 T53 oasu.DefaultSolrCoreState.closeIndexWriter closing IndexWriter with IndexWriterCloser
   [junit4]   2> 44908 T53 oasc.SolrCore.closeSearcher [collection1] Closing main searcher on request.
   [junit4]   2> 44908 T53 oasc.CachingDirectoryFactory.close Closing StandardDirectoryFactory - 2 directories currently being tracked
   [junit4]   2> 44908 T53 oasc.CachingDirectoryFactory.closeCacheValue looking to close C:\Users\JenkinsSlave\workspace\Lucene-Solr-4.x-Windows\solr\build\solr-core\test\J0\solrtest-TestNonNRTOpen-1384362110126 [CachedDir<<refCount=0;path=C:\Users\JenkinsSlave\workspace\Lucene-Solr-4.x-Windows\solr\build\solr-core\test\J0\solrtest-TestNonNRTOpen-1384362110126;done=false>>]
   [junit4]   2> 44908 T53 oasc.CachingDirectoryFactory.close Closing directory: C:\Users\JenkinsSlave\workspace\Lucene-Solr-4.x-Windows\solr\build\solr-core\test\J0\solrtest-TestNonNRTOpen-1384362110126
   [junit4]   2> 44908 T53 oasc.CachingDirectoryFactory.closeCacheValue looking to close C:\Users\JenkinsSlave\workspace\Lucene-Solr-4.x-Windows\solr\build\solr-core\test\J0\solrtest-TestNonNRTOpen-1384362110126\index [CachedDir<<refCount=0;path=C:\Users\JenkinsSlave\workspace\Lucene-Solr-4.x-Windows\solr\build\solr-core\test\J0\solrtest-TestNonNRTOpen-1384362110126\index;done=false>>]
   [junit4]   2> 44908 T53 oasc.CachingDirectoryFactory.close Closing directory: C:\Users\JenkinsSlave\workspace\Lucene-Solr-4.x-Windows\solr\build\solr-core\test\J0\solrtest-TestNonNRTOpen-1384362110126\index
   [junit4]   2> NOTE: per solr.test.leavedatadir, dataDir will not be removed: C:\Users\JenkinsSlave\workspace\Lucene-Solr-4.x-Windows\solr\build\solr-core\test\J0\.\solrtest-TestNonNRTOpen-1384362110126
   [junit4]   2> 44910 T53 oas.SolrTestCaseJ4.initCore ####initCore
   [junit4]   2> 44913 T53 oasc.SolrResourceLoader.<init> new SolrResourceLoader for directory: 'C:\Users\JenkinsSlave\workspace\Lucene-Solr-4.x-Windows\solr\build\solr-core\test-files\solr\collection1\'
   [junit4]   2> 44916 T53 oasc.SolrResourceLoader.replaceClassLoader Adding 'file:/C:/Users/JenkinsSlave/workspace/Lucene-Solr-4.x-Windows/solr/build/solr-core/test-files/solr/collection1/lib/classes/' to classloader
   [junit4]   2> 44916 T53 oasc.SolrResourceLoader.replaceClassLoader Adding 'file:/C:/Users/JenkinsSlave/workspace/Lucene-Solr-4.x-Windows/solr/build/solr-core/test-files/solr/collection1/lib/README' to classloader
   [junit4]   2> 45046 T53 oasc.SolrConfig.<init> Using Lucene MatchVersion: LUCENE_47
   [junit4]   2> 45165 T53 oasc.SolrConfig.<init> Loaded SolrConfig: solrconfig-basic.xml
   [junit4]   2> 45165 T53 oass.IndexSchema.readSchema Reading Solr Schema from schema-minimal.xml
   [junit4]   2> 45178 T53 oass.IndexSchema.readSchema [null] Schema name=minimal
   [junit4]   2> 45203 T53 oass.IndexSchema.readSchema WARN no uniqueKey specified in schema.
   [junit4]   2> 45208 T53 oasc.SolrResourceLoader.locateSolrHome JNDI not configured for solr (NoInitialContextEx)
   [junit4]   2> 45208 T53 oasc.SolrResourceLoader.locateSolrHome using system property solr.solr.home: C:\Users\JenkinsSlave\workspace\Lucene-Solr-4.x-Windows\solr\build\solr-core\test-files\solr
   [junit4]   2> 45208 T53 oasc.SolrResourceLoader.<init> new SolrResourceLoader for directory: 'C:\Users\JenkinsSlave\workspace\Lucene-Solr-4.x-Windows\solr\build\solr-core\test-files\solr\'
   [junit4]   2> 45235 T53 oasc.SolrResourceLoader.locateSolrHome JNDI not configured for solr (NoInitialContextEx)
   [junit4]   2> 45235 T53 oasc.SolrResourceLoader.locateSolrHome using system property solr.solr.home: C:\Users\JenkinsSlave\workspace\Lucene-Solr-4.x-Windows\solr\build\solr-core\test-files\solr
   [junit4]   2> 45235 T53 oasc.SolrResourceLoader.<init> new SolrResourceLoader for deduced Solr Home: 'C:\Users\JenkinsSlave\workspace\Lucene-Solr-4.x-Windows\solr\build\solr-core\test-files\solr\'
   [junit4]   2> 45357 T53 oasc.CoreContainer.<init> New CoreContainer 220542814
   [junit4]   2> 45357 T53 oasc.CoreContainer.load Loading cores into CoreContainer [instanceDir=C:\Users\JenkinsSlave\workspace\Lucene-Solr-4.x-Windows\solr\build\solr-core\test-files\solr\]
   [junit4]   2> 45360 T53 oashc.HttpShardHandlerFactory.getParameter Setting socketTimeout to: 0
   [junit4]   2> 45361 T53 oashc.HttpShardHandlerFactory.getParameter Setting urlScheme to: http://
   [junit4]   2> 45361 T53 oashc.HttpShardHandlerFactory.getParameter Setting connTimeout to: 0
   [junit4]   2> 45361 T53 oashc.HttpShardHandlerFactory.getParameter Setting maxConnectionsPerHost to: 20
   [junit4]   2> 45361 T53 oashc.HttpShardHandlerFactory.getParameter Setting corePoolSize to: 0
   [junit4]   2> 45361 T53 oashc.HttpShardHandlerFactory.getParameter Setting maximumPoolSize to: 2147483647
   [junit4]   2> 45361 T53 oashc.HttpShardHandlerFactory.getParameter Setting maxThreadIdleTime to: 5
   [junit4]   2> 45361 T53 oashc.HttpShardHandlerFactory.getParameter Setting sizeOfQueue to: -1
   [junit4]   2> 45361 T53 oashc.HttpShardHandlerFactory.getParameter Setting fairnessPolicy to: false
   [junit4]   2> 45368 T53 oasl.LogWatcher.createWatcher SLF4J impl is org.slf4j.impl.Log4jLoggerFactory
   [junit4]   2> 45368 T53 oasl.LogWatcher.newRegisteredLogWatcher Registering Log Listener [Log4j (org.slf4j.impl.Log4jLoggerFactory)]
   [junit4]   2> 45381 T57 oasc.CoreContainer.create Creating SolrCore 'collection1' using instanceDir: C:\Users\JenkinsSlave\workspace\Lucene-Solr-4.x-Windows\solr\build\solr-core\test-files\solr\collection1
   [junit4]   2> 45381 T57 oasc.SolrResourceLoader.<init> new SolrResourceLoader for directory: 'C:\Users\JenkinsSlave\workspace\Lucene-Solr-4.x-Windows\solr\build\solr-core\test-files\solr\collection1\'
   [junit4]   2> 45381 T57 oasc.SolrResourceLoader.replaceClassLoader Adding 'file:/C:/Users/JenkinsSlave/workspace/Lucene-Solr-4.x-Windows/solr/build/solr-core/test-files/solr/collection1/lib/classes/' to classloader
   [junit4]   2> 45381 T57 oasc.SolrResourceLoader.replaceClassLoader Adding 'file:/C:/Users/JenkinsSlave/workspace/Lucene-Solr-4.x-Windows/solr/build/solr-core/test-files/solr/collection1/lib/README' to classloader
   [junit4]   2> 45472 T57 oasc.SolrConfig.<init> Using Lucene MatchVersion: LUCENE_47
   [junit4]   2> 45561 T57 oasc.SolrConfig.<init> Loaded SolrConfig: solrconfig-basic.xml
   [junit4]   2> 45561 T57 oass.IndexSchema.readSchema Reading Solr Schema from schema-minimal.xml
   [junit4]   2> 45572 T57 oass.IndexSchema.readSchema [collection1] Schema name=minimal
   [junit4]   2> 45599 T57 oass.IndexSchema.readSchema WARN no uniqueKey specified in schema.
   [junit4]   2> 45602 T57 oasc.SolrCore.initDirectoryFactory solr.StandardDirectoryFactory
   [junit4]   2> 45603 T57 oasc.SolrCore.<init> [collection1] Opening new SolrCore at C:\Users\JenkinsSlave\workspace\Lucene-Solr-4.x-Windows\solr\build\solr-core\test-files\solr\collection1\, dataDir=C:\Users\JenkinsSlave\workspace\Lucene-Solr-4.x-Windows\solr\build\solr-core\test\J0\.\solrtest-TestNonNRTOpen-1384362110126\
   [junit4]   2> 45603 T57 oasc.SolrCore.<init> JMX monitoring not detected for core: collection1
   [junit4]   2> 45603 T57 oasc.CachingDirectoryFactory.get return new directory for C:\Users\JenkinsSlave\workspace\Lucene-Solr-4.x-Windows\solr\build\solr-core\test\J0\solrtest-TestNonNRTOpen-1384362110126
   [junit4]   2> 45603 T57 oasc.SolrCore.getNewIndexDir New index directory detected: old=null new=C:\Users\JenkinsSlave\workspace\Lucene-Solr-4.x-Windows\solr\build\solr-core\test\J0\.\solrtest-TestNonNRTOpen-1384362110126\index/
   [junit4]   2> 45606 T57 oasc.SolrCore.loadUpdateProcessorChains no updateRequestProcessorChain defined as default, creating implicit default
   [junit4]   2> 45606 T57 oasc.RequestHandlers.initHandlersFromConfig created standard: solr.StandardRequestHandler
   [junit4]   2> 45607 T57 oasc.RequestHandlers.initHandlersFromConfig created /update: solr.UpdateRequestHandler
   [junit4]   2> 45619 T57 oashl.XMLLoader.init xsltCacheLifetimeSeconds=60
   [junit4]   2> 45624 T57 oasu.CommitTracker.<init> Hard AutoCommit: disabled
   [junit4]   2> 45624 T57 oasu.CommitTracker.<init> Soft AutoCommit: disabled
   [junit4]   2> 45624 T57 oasc.CachingDirectoryFactory.get return new directory for C:\Users\JenkinsSlave\workspace\Lucene-Solr-4.x-Windows\solr\build\solr-core\test\J0\solrtest-TestNonNRTOpen-1384362110126\index
   [junit4]   2> 45641 T57 oass.SolrIndexSearcher.<init> Opening Searcher@65cd7629 main
   [junit4]   2> 45642 T57 oasc.CoreContainer.registerCore registering core: collection1
   [junit4]   2> 45642 T58 oasc.SolrCore.registerSearcher [collection1] Registered new searcher Searcher@65cd7629 main{StandardDirectoryReader(segments_2:3 _0(4.7):c1)}
   [junit4]   2> 45655 T53 oas.SolrTestCaseJ4.initCore ####initCore end
   [junit4]   2> 45665 T53 oas.SolrTestCaseJ4.setUp ###Starting testSharedCores
   [junit4]   2> ASYNC  NEW_CORE C76 name=collection1 org.apache.solr.core.SolrCore@78cbe299
   [junit4]   2> 45677 T53 C76 oasu.DirectUpdateHandler2.deleteAll [collection1] REMOVING ALL DOCUMENTS FROM INDEX
   [junit4]   2> 45686 T53 C76 oasc.SolrDeletionPolicy.onInit SolrDeletionPolicy.onInit: commits: num=1
   [junit4]   2> 		commit{dir=C:\Users\JenkinsSlave\workspace\Lucene-Solr-4.x-Windows\solr\build\solr-core\test\J0\solrtest-TestNonNRTOpen-1384362110126\index,segFN=segments_2,generation=2}
   [junit4]   2> 45687 T53 C76 oasc.SolrDeletionPolicy.updateCommits newest commit generation = 2
   [junit4]   2> 45687 T53 C76 oasup.LogUpdateProcessor.finish [collection1] webapp=null path=null params={} {deleteByQuery=*:*} 0 11
   [junit4]   2> 45707 T53 C76 oasup.LogUpdateProcessor.finish [collection1] webapp=null path=null params={} {add=[(null)]} 0 4
   [junit4]   2> 45721 T53 C76 oasu.DirectUpdateHandler2.commit start commit{,optimize=false,openSearcher=true,waitSearcher=true,expungeDeletes=false,softCommit=false,prepareCommit=false}
   [junit4]   2> 45757 T53 C76 oasc.SolrDeletionPolicy.onCommit SolrDeletionPolicy.onCommit: commits: num=2
   [junit4]   2> 		commit{dir=C:\Users\JenkinsSlave\workspace\Lucene-Solr-4.x-Windows\solr\build\solr-core\test\J0\solrtest-TestNonNRTOpen-1384362110126\index,segFN=segments_2,generation=2}
   [junit4]   2> 		commit{dir=C:\Users\JenkinsSlave\workspace\Lucene-Solr-4.x-Windows\solr\build\solr-core\test\J0\solrtest-TestNonNRTOpen-1384362110126\index,segFN=segments_3,generation=3}
   [junit4]   2> 45757 T53 C76 oasc.SolrDeletionPolicy.updateCommits newest commit generation = 3
   [junit4]   2> 45773 T53 C76 oass.SolrIndexSearcher.<init> Opening Searcher@384daf96 main
   [junit4]   2> 45773 T53 C76 oasu.DirectUpdateHandler2.commit end_commit_flush
   [junit4]   2> 45775 T58 oasc.SolrCore.registerSearcher [collection1] Registered new searcher Searcher@384daf96 main{StandardDirectoryReader(segments_3:6 _1(4.7):c1)}
   [junit4]   2> 45778 T53 C76 oasup.LogUpdateProcessor.finish [collection1] webapp=null path=null params={} {commit=} 0 57
   [junit4]   2> 45801 T53 C76 oasu.DirectUpdateHandler2.commit start commit{,optimize=true,openSearcher=true,waitSearcher=true,expungeDeletes=false,softCommit=false,prepareCommit=false}
   [junit4]   2> 45872 T53 C76 oasc.SolrDeletionPolicy.onCommit SolrDeletionPolicy.onCommit: commits: num=2
   [junit4]   2> 		commit{dir=C:\Users\JenkinsSlave\workspace\Lucene-Solr-4.x-Windows\solr\build\solr-core\test\J0\solrtest-TestNonNRTOpen-1384362110126\index,segFN=segments_3,generation=3}
   [junit4]   2> 		commit{dir=C:\Users\JenkinsSlave\workspace\Lucene-Solr-4.x-Windows\solr\build\solr-core\test\J0\solrtest-TestNonNRTOpen-1384362110126\index,segFN=segments_4,generation=4}
   [junit4]   2> 45872 T53 C76 oasc.SolrDeletionPolicy.updateCommits newest commit generation = 4
   [junit4]   2> 45887 T53 C76 oass.SolrIndexSearcher.<init> Opening Searcher@3b728ee5 main
   [junit4]   2> 45887 T53 C76 oasu.DirectUpdateHandler2.commit end_commit_flush
   [junit4]   2> 45892 T58 oasc.SolrCore.registerSearcher [collection1] Registered new searcher Searcher@3b728ee5 main{StandardDirectoryReader(segments_4:8 _2(4.7):c1)}
   [junit4]   2> 45893 T53 C76 oasup.LogUpdateProcessor.finish [collection1] webapp=null path=null params={} {optimize=} 0 98
   [junit4]   2> ASYNC  NEW_CORE C77 name=collection1 org.apache.solr.core.SolrCore@78cbe299
   [junit4]   2> 45920 T53 C77 oasup.LogUpdateProcessor.finish [collection1] webapp=null path=null params={} {add=[(null)]} 0 5
   [junit4]   2> 45935 T53 C77 oasu.DirectUpdateHandler2.commit start commit{,optimize=false,openSearcher=true,waitSearcher=true,expungeDeletes=false,softCommit=false,prepareCommit=false}
   [junit4]   2> 45992 T53 C77 oasc.SolrDeletionPolicy.onCommit SolrDeletionPolicy.onCommit: commits: num=2
   [junit4]   2> 		commit{dir=C:\Users\JenkinsSlave\workspace\Lucene-Solr-4.x-Windows\solr\build\solr-core\test\J0\solrtest-TestNonNRTOpen-1384362110126\index,segFN=segments_4,generation=4}
   [junit4]   2> 		commit{dir=C:\Users\JenkinsSlave\workspace\Lucene-Solr-4.x-Windows\solr\build\solr-core\test\J0\solrtest-TestNonNRTOpen-1384362110126\index,segFN=segments_5,generation=5}
   [junit4]   2> 45992 T53 C77 oasc.SolrDeletionPolicy.updateCommits newest commit generation = 5
   [junit4]   2> 46008 T53 C77 oass.SolrIndexSearcher.<init> Opening Searcher@62fe9f60 main
   [junit4]   2> 46008 T53 C77 oasu.DirectUpdateHandler2.commit end_commit_flush
   [junit4]   2> 46011 T58 oasc.SolrCore.registerSearcher [collection1] Registered new searcher Searcher@62fe9f60 main{StandardDirectoryReader(segments_5:10 _2(4.7):c1 _3(4.7):c1)}
   [junit4]   2> 46012 T53 C77 oasup.LogUpdateProcessor.finish [collection1] webapp=null path=null params={} {commit=} 0 77
   [junit4]   2> 46034 T53 C77 oasup.LogUpdateProcessor.finish [collection1] webapp=null path=null params={} {add=[(null)]} 0 5
   [junit4]   2> 46053 T53 C77 oasup.LogUpdateProcessor.finish [collection1] webapp=null path=null params={} {add=[(null)]} 0 2
   [junit4]   2> 46071 T53 C77 oasu.DirectUpdateHandler2.commit start commit{,optimize=false,openSearcher=true,waitSearcher=true,expungeDeletes=false,softCommit=false,prepareCommit=false}
   [junit4]   2> 46114 T53 C77 oasc.SolrDeletionPolicy.onCommit SolrDeletionPolicy.onCommit: commits: num=2
   [junit4]   2> 		commit{dir=C:\Users\JenkinsSlave\workspace\Lucene-Solr-4.x-Windows\solr\build\solr-core\test\J0\solrtest-TestNonNRTOpen-1384362110126\index,segFN=segments_5,generation=5}
   [junit4]   2> 		commit{dir=C:\Users\JenkinsSlave\workspace\Lucene-Solr-4.x-Windows\solr\build\solr-core\test\J0\solrtest-TestNonNRTOpen-1384362110126\index,segFN=segments_6,generation=6}
   [junit4]   2> 46114 T53 C77 oasc.SolrDeletionPolicy.updateCommits newest commit generation = 6
   [junit4]   2> 46127 T53 C77 oass.SolrIndexSearcher.<init> Opening Searcher@34805da0 main
   [junit4]   2> 46127 T53 C77 oasu.DirectUpdateHandler2.commit end_commit_flush
   [junit4]   2> 46130 T58 oasc.SolrCore.registerSearcher [collection1] Registered new searcher Searcher@34805da0 main{StandardDirectoryReader(segments_6:12 _2(4.7):c1 _3(4.7):c1 _4(4.7):c2)}
   [junit4]   2> 46131 T53 C77 oasup.LogUpdateProcessor.finish [collection1] webapp=null path=null params={} {commit=} 0 64
   [junit4]   2> ASYNC  NEW_CORE C78 name=collection1 org.apache.solr.core.SolrCore@78cbe299
   [junit4]   2> 46158 T53 C78 oasup.LogUpdateProcessor.finish [collection1] webapp=null path=null params={} {deleteByQuery=foo2:doc} 0 5
   [junit4]   2> 46172 T53 C78 oasu.DirectUpdateHandler2.commit start commit{,optimize=false,openSearcher=true,waitSearcher=true,expungeDeletes=false,softCommit=false,prepareCommit=false}
   [junit4]   2> 46191 T53 C78 oasc.SolrDeletionPolicy.onCommit SolrDeletionPolicy.onCommit: commits: num=2
   [junit4]   2> 		commit{dir=C:\Users\JenkinsSlave\workspace\Lucene-Solr-4.x-Windows\solr\build\solr-core\test\J0\solrtest-TestNonNRTOpen-1384362110126\index,segFN=segments_6,generation=6}
   [junit4]   2> 		commit{dir=C:\Users\JenkinsSlave\workspace\Lucene-Solr-4.x-Windows\solr\build\solr-core\test\J0\solrtest-TestNonNRTOpen-1384362110126\index,segFN=segments_7,generation=7}
   [junit4]   2> 46191 T53 C78 oasc.SolrDeletionPolicy.updateCommits newest commit generation = 7
   [junit4]   2> 46204 T53 C78 oass.SolrIndexSearcher.<init> Opening Searcher@19e662ee main
   [junit4]   2> 46207 T53 C78 oasu.DirectUpdateHandler2.commit end_commit_flush
   [junit4]   2> 46208 T58 oasc.SolrCore.registerSearcher [collection1] Registered new searcher Searcher@19e662ee main{StandardDirectoryReader(segments_7:13 _2(4.7):c1 _3(4.7):c1 _4(4.7):c2/1:delGen=1)}
   [junit4]   2> 46209 T53 C78 oasup.LogUpdateProcessor.finish [collection1] webapp=null path=null params={} {commit=} 0 37
   [junit4]   2> 46216 T53 oas.SolrTestCaseJ4.tearDown ###Ending testSharedCores
   [junit4]   2> 46226 T53 oas.SolrTestCaseJ4.setUp ###Starting testReaderIsNotNRT
   [junit4]   2> 46244 T53 C78 oasu.DirectUpdateHandler2.deleteAll [collection1] REMOVING ALL DOCUMENTS FROM INDEX
   [junit4]   2> 46246 T53 C78 oasup.LogUpdateProcessor.finish [collection1] webapp=null path=null params={} {deleteByQuery=*:*} 0 10
   [junit4]   2> 46263 T53 C78 oasup.LogUpdateProcessor.finish [collection1] webapp=null path=null params={} {add=[(null)]} 0 3
   [junit4]   2> 46275 T53 C78 oasu.DirectUpdateHandler2.commit start commit{,optimize=false,openSearcher=true,waitSearcher=true,expungeDeletes=false,softCommit=false,prepareCommit=false}
   [junit4]   2> 46312 T53 C78 oasc.SolrDeletionPolicy.onCommit SolrDeletionPolicy.onCommit: commits: num=2
   [junit4]   2> 		commit{dir=C:\Users\JenkinsSlave\workspace\Lucene-Solr-4.x-Windows\solr\build\solr-core\test\J0\solrtest-TestNonNRTOpen-1384362110126\index,segFN=segments_7,generation=7}
   [junit4]   2> 		commit{dir=C:\Users\JenkinsSlave\workspace\Lucene-Solr-4.x-Windows\solr\build\solr-core\test\J0\solrtest-TestNonNRTOpen-1384362110126\index,segFN=segments_8,generation=8}
   [junit4]   2> 46312 T53 C78 oasc.SolrDeletionPolicy.updateCommits newest commit generation = 8
   [junit4]   2> 46340 T53 C78 oass.SolrIndexSearcher.<init> Opening Searcher@11e70842 main
   [junit4]   2> 46342 T53 C78 oasu.DirectUpdateHandler2.commit end_commit_flush
   [junit4]   2> 46342 T58 oasc.SolrCore.registerSearcher [collection1] Registered new searcher Searcher@11e70842 main{StandardDirectoryReader(segments_8:16 _5(4.7):c1)}
   [junit4]   2> 46345 T53 C78 oasup.LogUpdateProcessor.finish [collection1] webapp=null path=null params={} {commit=} 0 70
   [junit4]   2> 46356 T53 oasc.CoreContainer.reload Reloading SolrCore 'collection1' using instanceDir: C:\Users\JenkinsSlave\workspace\Lucene-Solr-4.x-Windows\solr\build\solr-core\test-files\solr\collection1
   [junit4]   2> 46356 T53 oasc.SolrResourceLoader.<init> new SolrResourceLoader for directory: 'C:\Users\JenkinsSlave\workspace\Lucene-Solr-4.x-Windows\solr\build\solr-core\test-files\solr\collection1\'
   [junit4]   2> 46358 T53 oasc.SolrResourceLoader.replaceClassLoader Adding 'file:/C:/Users/JenkinsSlave/workspace/Lucene-Solr-4.x-Windows/solr/build/solr-core/test-files/solr/collection1/lib/classes/' to classloader
   [junit4]   2> 46361 T53 oasc.SolrResourceLoader.replaceClassLoader Adding 'file:/C:/Users/JenkinsSlave/workspace/Lucene-Solr-4.x-Windows/solr/build/solr-core/test-files/solr/collection1/lib/README' to classloader
   [junit4]   2> 46496 T53 oasc.SolrConfig.<init> Using Lucene MatchVersion: LUCENE_47
   [junit4]   2> 46593 T53 oasc.SolrConfig.<init> Loaded SolrConfig: solrconfig-basic.xml
   [junit4]   2> 46593 T53 oass.IndexSchema.readSchema Reading Solr Schema from schema-minimal.xml
   [junit4]   2> 46604 T53 oass.IndexSchema.readSchema [collection1] Schema name=minimal
   [junit4]   2> 46629 T53 oass.IndexSchema.readSchema WARN no uniqueKey specified in schema.
   [junit4]   2> 46632 T53 oasc.SolrCore.<init> [collection1] Opening new SolrCore at C:\Users\JenkinsSlave\workspace\Lucene-Solr-4.x-Windows\solr\build\solr-core\test-files\solr\collection1\, dataDir=C:\Users\JenkinsSlave\workspace\Lucene-Solr-4.x-Windows\solr\build\solr-core\test\J0\.\solrtest-TestNonNRTOpen-1384362110126\
   [junit4]   2> 46632 T53 oasc.SolrCore.<init> JMX monitoring not detected for core: collection1
   [junit4]   2> 46632 T53 oasc.SolrCore.getNewIndexDir New index directory detected: old=null new=C:\Users\JenkinsSlave\workspace\Lucene-Solr-4.x-Windows\solr\build\solr-core\test\J0\.\solrtest-TestNonNRTOpen-1384362110126\index/
   [junit4]   2> 46636 T53 oasc.SolrCore.loadUpdateProcessorChains no updateRequestProcessorChain defined as default, creating implicit default
   [junit4]   2> 46636 T53 oasc.RequestHandlers.initHandlersFromConfig created standard: solr.StandardRequestHandler
   [junit4]   2> 46638 T53 oasc.RequestHandlers.initHandlersFromConfig created /update: solr.UpdateRequestHandler
   [junit4]   2> 46647 T53 oashl.XMLLoader.init xsltCacheLifetimeSeconds=60
   [junit4]   2> 46659 T53 oasu.CommitTracker.<init> Hard AutoCommit: disabled
   [junit4]   2> 46659 T53 oasu.CommitTracker.<init> Soft AutoCommit: disabled
   [junit4]   2> 46664 T53 oass.SolrIndexSearcher.<init> Opening Searcher@51be8406 main
   [junit4]   2> 46666 T53 oasu.DefaultSolrCoreState.newIndexWriter Creating new IndexWriter...
   [junit4]   2> 46667 T53 oasu.DefaultSolrCoreState.newIndexWriter Waiting until IndexWriter is unused... core=collection1
   [junit4]   2> 46668 T53 oasu.DefaultSolrCoreState.newIndexWriter Closing old IndexWriter... core=collection1
   [junit4]   2> 46667 T61 oasc.SolrCore.registerSearcher [collection1] Registered new searcher Searcher@51be8406 main{StandardDirectoryReader(segments_8:16 _5(4.7):c1)}
   [junit4]   2> 46678 T53 oasc.SolrDeletionPolicy.onInit SolrDeletionPolicy.onInit: commits: num=1
   [junit4]   2> 		commit{dir=C:\Users\JenkinsSlave\workspace\Lucene-Solr-4.x-Windows\solr\build\solr-core\test\J0\solrtest-TestNonNRTOpen-1384362110126\index,segFN=segments_8,generation=8}
   [junit4]   2> 46678 T53 oasc.SolrDeletionPolicy.updateCommits newest commit generation = 8
   [junit4]   2> 46681 T53 oasu.DefaultSolrCoreState.newIndexWriter New IndexWriter is ready to be used.
   [junit4]   2> 46684 T53 oass.SolrIndexSearcher.<init> Opening Searcher@16f3ce67 main
   [junit4]   2> 46685 T61 oasc.SolrCore.registerSearcher [collection1] Registered new searcher Searcher@16f3ce67 main{StandardDirectoryReader(segments_8:16 _5(4.7):c1)}
   [junit4]   2> 46685 T53 oasc.CoreContainer.registerCore replacing core: collection1
   [junit4]   2> 46685 T53 oasc.SolrCore.close [collection1]  CLOSING SolrCore org.apache.solr.core.SolrCore@78cbe299
   [junit4]   2> 46685 T53 oasu.DirectUpdateHandler2.close closing DirectUpdateHandler2{commits=5,autocommits=0,soft autocommits=0,optimizes=1,rollbacks=0,expungeDeletes=0,docsPending=0,adds=0,deletesById=0,deletesByQuery=0,errors=0,cumulative_adds=5,cumulative_deletesById=0,cumulative_deletesByQuery=3,cumulative_errors=0}
   [junit4]   2> 46688 T53 oasc.SolrCore.closeSearcher [collection1] Closing main searcher on request.
   [junit4]   2> ASYNC  NEW_CORE C79 name=collection1 org.apache.solr.core.SolrCore@6073d7f6
   [junit4]   2> 46710 T53 C79 oasup.LogUpdateProcessor.finish [collection1] webapp=null path=null params={} {add=[(null)]} 0 8
   [junit4]   2> 46727 T53 C79 oasu.DirectUpdateHandler2.commit start commit{,optimize=false,openSearcher=true,waitSearcher=true,expungeDeletes=false,softCommit=false,prepareCommit=false}
   [junit4]   2> 46765 T53 C79 oasc.SolrDeletionPolicy.onCommit SolrDeletionPolicy.onCommit: commits: num=2
   [junit4]   2> 		commit{dir=C:\Users\JenkinsSlave\workspace\Lucene-Solr-4.x-Windows\solr\build\solr-core\test\J0\solrtest-TestNonNRTOpen-1384362110126\index,segFN=segments_8,generation=8}
   [junit4]   2> 		commit{dir=C:\Users\JenkinsSlave\workspace\Lucene-Solr-4.x-Windows\solr\build\solr-core\test\J0\solrtest-TestNonNRTOpen-1384362110126\index,segFN=segments_9,generation=9}
   [junit4]   2> 46765 T53 C79 oasc.SolrDeletionPolicy.updateCommits newest commit generation = 9
   [junit4]   2> 46775 T53 C79 oass.SolrIndexSearcher.<init> Opening Searcher@49f5cd23 main
   [junit4]   2> 46775 T53 C79 oasu.DirectUpdateHandler2.commit end_commit_flush
   [junit4]   2> 46779 T61 oasc.SolrCore.registerSearcher [collection1] Registered new searcher Searcher@49f5cd23 main{StandardDirectoryReader(segments_9:18 _5(4.7):c1 _6(4.7):c1)}
   [junit4]   2> 46779 T53 C79 oasup.LogUpdateProcessor.finish [collection1] webapp=null path=null params={} {commit=} 0 52
   [junit4]   2> ASYNC  NEW_CORE C80 name=collection1 org.apache.solr.core.SolrCore@6073d7f6
   [junit4]   2> 46810 T53 C80 oasup.LogUpdateProcessor.finish [collection1] webapp=null path=null params={} {add=[(null)]} 0 9
   [junit4]   2> 46813 T53 oasc.CoreContainer.reload Reloading SolrCore 'collection1' using instanceDir: C:\Users\JenkinsSlave\workspace\Lucene-Solr-4.x-Windows\solr\build\solr-core\test-files\solr\collection1
   [junit4]   2> 46814 T53 oasc.SolrResourceLoader.<init> new SolrResourceLoader for directory: 'C:\Users\JenkinsSlave\workspace\Lucene-Solr-4.x-Windows\solr\build\solr-core\test-files\solr\collection1\'
   [junit4]   2> 46817 T53 oasc.SolrResourceLoader.replaceClassLoader Adding 'file:/C:/Users/JenkinsSlave/workspace/Lucene-Solr-4.x-Windows/solr/build/solr-core/test-files/solr/collection1/lib/classes/' to classloader
   [junit4]   2> 46820 T53 oasc.SolrResourceLoader.replaceClassLoader Adding 'file:/C:/Users/JenkinsSlave/workspace/Lucene-Solr-4.x-Windows/solr/build/solr-core/test-files/solr/collection1/lib/README' to classloader
   [junit4]   2> 46957 T53 oasc.SolrConfig.<init> Using Lucene MatchVersion: LUCENE_47
   [junit4]   2> 47052 T53 oasc.SolrConfig.<init> Loaded SolrConfig: solrconfig-basic.xml
   [junit4]   2> 47052 T53 oass.IndexSchema.readSchema Reading Solr Schema from schema-minimal.xml
   [junit4]   2> 47063 T53 oass.IndexSchema.readSchema [collection1] Schema name=minimal
   [junit4]   2> 47093 T53 oass.IndexSchema.readSchema WARN no uniqueKey specified in schema.
   [junit4]   2> 47095 T53 oasc.SolrCore.<init> [collection1] Opening new SolrCore at C:\Users\JenkinsSlave\workspace\Lucene-Solr-4.x-Windows\solr\build\solr-core\test-files\solr\collection1\, dataDir=C:\Users\JenkinsSlave\workspace\Lucene-Solr-4.x-Windows\solr\build\solr-core\test\J0\.\solrtest-TestNonNRTOpen-1384362110126\
   [junit4]   2> 47095 T53 oasc.SolrCore.<init> JMX monitoring not detected for core: collection1
   [junit4]   2> 47095 T53 oasc.SolrCore.getNewIndexDir New index directory detected: old=null new=C:\Users\JenkinsSlave\workspace\Lucene-Solr-4.x-Windows\solr\build\solr-core\test\J0\.\solrtest-TestNonNRTOpen-1384362110126\index/
   [junit4]   2> 47100 T53 oasc.SolrCore.loadUpdateProcessorChains no updateRequestProcessorChain defined as default, creating implicit default
   [junit4]   2> 47101 T53 oasc.RequestHandlers.initHandlersFromConfig created standard: solr.StandardRequestHandler
   [junit4]   2> 47101 T53 oasc.RequestHandlers.initHandlersFromConfig created /update: solr.UpdateRequestHandler
   [junit4]   2> 47112 T53 oashl.XMLLoader.init xsltCacheLifetimeSeconds=60
   [junit4]   2> 47118 T53 oasu.CommitTracker.<init> Hard AutoCommit: disabled
   [junit4]   2> 47118 T53 oasu.CommitTracker.<init> Soft AutoCommit: disabled
   [junit4]   2> 47123 T53 oass.SolrIndexSearcher.<init> Opening Searcher@6a03a539 main
   [junit4]   2> 47125 T53 oasu.DefaultSolrCoreState.newIndexWriter Creating new IndexWriter...
   [junit4]   2> 47129 T53 oasu.DefaultSolrCoreState.newIndexWriter Waiting until IndexWriter is unused... core=collection1
   [junit4]   2> 47129 T53 oasu.DefaultSolrCoreState.newIndexWriter Closing old IndexWriter... core=collection1
   [junit4]   2> 47128 T62 oasc.SolrCore.registerSearcher [collection1] Registered new searcher Searcher@6a03a539 main{StandardDirectoryReader(segments_9:18 _5(4.7):c1 _6(4.7):c1)}
   [junit4]   2> 47172 T53 oasc.SolrDeletionPolicy.onCommit SolrDeletionPolicy.onCommit: commits: num=2
   [junit4]   2> 		commit{dir=C:\Users\JenkinsSlave\workspace\Lucene-Solr-4.x-Windows\solr\build\solr-core\test\J0\solrtest-TestNonNRTOpen-1384362110126\index,segFN=segments_9,generation=9}
   [junit4]   2> 		commit{dir=C:\Users\JenkinsSlave\workspace\Lucene-Solr-4.x-Windows\solr\build\solr-core\test\J0\solrtest-TestNonNRTOpen-1384362110126\index,segFN=segments_a,generation=10}
   [junit4]   2> 47172 T53 oasc.SolrDeletionPolicy.updateCommits newest commit generation = 10
   [junit4]   2> 47189 T53 oasc.SolrDeletionPolicy.onInit SolrDeletionPolicy.onInit: commits: num=1
   [junit4]   2> 		commit{dir=C:\Users\JenkinsSlave\workspace\Lucene-Solr-4.x-Windows\solr\build\solr-core\test\J0\solrtest-TestNonNRTOpen-1384362110126\index,segFN=segments_a,generation=10}
   [junit4]   2> 47191 T53 oasc.SolrDeletionPolicy.updateCommits newest commit generation = 10
   [junit4]   2> 47191 T53 oasu.DefaultSolrCoreState.newIndexWriter New IndexWriter is ready to be used.
   [junit4]   2> 47203 T53 oass.SolrIndexSearcher.<init> Opening Searcher@65a1efe main
   [junit4]   2> 47205 T53 oasc.CoreContainer.registerCore replacing core: collection1
   [junit4]   2> 47205 T53 oasc.SolrCore.close [collection1]  CLOSING SolrCore org.apache.solr.core.SolrCore@6073d7f6
   [junit4]   2> 47206 T53 oasu.DirectUpdateHandler2.close closing DirectUpdateHandler2{commits=1,autocommits=0,soft autocommits=0,optimizes=0,rollbacks=0,expungeDeletes=0,docsPending=1,adds=1,deletesById=0,deletesByQuery=0,errors=0,cumulative_adds=2,cumulative_deletesById=0,cumulative_deletesByQuery=0,cumulative_errors=0}
   [junit4]   2> 47207 T53 oasc.SolrCore.closeSearcher [collection1] Closing main searcher on request.
   [junit4]   2> 47209 T53 oas.SolrTestCaseJ4.tearDown ###Ending testReaderIsNotNRT
   [junit4]   2> 47212 T62 oasc.SolrCore.registerSearcher [collection1] Registered new searcher Searcher@65a1efe main{StandardDirectoryReader(segments_a:20 _5(4.7):c1 _6(4.7):c1 _7(4.7):c1)}
   [junit4]   2> NOTE: reproduce with: ant test  -Dtestcase=TestNonNRTOpen -Dtests.method=testReaderIsNotNRT -Dtests.seed=F87A09729A9C2DA4 -Dtests.slow=true -Dtests.locale=da_DK -Dtests.timezone=Africa/Banjul -Dtests.file.encoding=ISO-8859-1
   [junit4] FAILURE 1.05s | TestNonNRTOpen.testReaderIsNotNRT <<<
   [junit4]    > Throwable #1: java.lang.AssertionError: expected:<3> but was:<2>
   [junit4]    > 	at __randomizedtesting.SeedInfo.seed([F87A09729A9C2DA4:4DFC68F5255D9F50]:0)
   [junit4]    > 	at org.apache.solr.core.TestNonNRTOpen.assertNotNRT(TestNonNRTOpen.java:133)
   [junit4]    > 	at org.apache.solr.core.TestNonNRTOpen.testReaderIsNotNRT(TestNonNRTOpen.java:94)
   [junit4]    > 	at java.lang.Thread.run(Thread.java:744)
   [junit4]   2> 47266 T53 oas.SolrTestCaseJ4.deleteCore ###deleteCore
   [junit4]   2> 47275 T53 oasc.CoreContainer.shutdown Shutting down CoreContainer instance=220542814
   [junit4]   2> 47276 T53 oasc.SolrCore.close [collection1]  CLOSING SolrCore org.apache.solr.core.SolrCore@6a8b8f4
   [junit4]   2> 47276 T53 oasu.DirectUpdateHandler2.close closing DirectUpdateHandler2{commits=0,autocommits=0,soft autocommits=0,optimizes=0,rollbacks=0,expungeDeletes=0,docsPending=0,adds=0,deletesById=0,deletesByQuery=0,errors=0,cumulative_adds=0,cumulative_deletesById=0,cumulative_deletesByQuery=0,cumulative_errors=0}
   [junit4]   2> 47276 T53 oasu.SolrCoreState.decrefSolrCoreState Closing SolrCoreState
   [junit4]   2> 47276 T53 oasu.DefaultSolrCoreState.closeIndexWriter SolrCoreState ref count has reached 0 - closing IndexWriter
   [junit4]   2> 47276 T53 oasu.DefaultSolrCoreState.closeIndexWriter closing IndexWriter with IndexWriterCloser
   [junit4]   2> 47280 T53 oasc.SolrCore.closeSearcher [collection1] Closing main searcher on request.
   [junit4]   2> 47282 T53 oasc.CachingDirectoryFactory.close Closing StandardDirectoryFactory - 2 directories currently being tracked
   [junit4]   2> 47282 T53 oasc.CachingDirectoryFactory.closeCacheValue looking to close C:\Users\JenkinsSlave\workspace\Lucene-Solr-4.x-Windows\solr\build\solr-core\test\J0\solrtest-TestNonNRTOpen-1384362110126 [CachedDir<<refCount=0;path=C:\Users\JenkinsSlave\workspace\Lucene-Solr-4.x-Windows\solr\build\solr-core\test\J0\solrtest-TestNonNRTOpen-1384362110126;done=false>>]
   [junit4]   2> 47282 T53 oasc.CachingDirectoryFactory.close Closing directory: C:\Users\JenkinsSlave\workspace\Lucene-Solr-4.x-Windows\solr\build\solr-core\test\J0\solrtest-TestNonNRTOpen-1384362110126
   [junit4]   2> 47282 T53 oasc.CachingDirectoryFactory.closeCacheValue looking to close C:\Users\JenkinsSlave\workspace\Lucene-Solr-4.x-Windows\solr\build\solr-core\test\J0\solrtest-TestNonNRTOpen-1384362110126\index [CachedDir<<refCount=0;path=C:\Users\JenkinsSlave\workspace\Lucene-Solr-4.x-Windows\solr\build\solr-core\test\J0\solrtest-TestNonNRTOpen-1384362110126\index;done=false>>]
   [junit4]   2> 47282 T53 oasc.CachingDirectoryFactory.close Closing directory: C:\Users\JenkinsSlave\workspace\Lucene-Solr-4.x-Windows\solr\build\solr-core\test\J0\solrtest-TestNonNRTOpen-1384362110126\index
   [junit4]   2> NOTE: test params are: codec=Lucene42, sim=DefaultSimilarity, locale=da_DK, timezone=Africa/Banjul
   [junit4]   2> NOTE: Windows 7 6.1 amd64/Oracle Corporation 1.7.0_45 (64-bit)/cpus=2,threads=1,free=48128936,total=90976256
   [junit4]   2> NOTE: All tests run in this JVM: [AddBlockUpdateTest, BasicFunctionalityTest, TestDynamicFieldCollectionResource, SolrIndexSplitterTest, ZkNodePropsTest, TestNonNRTOpen]
   [junit4] Completed in 3.34s, 2 tests, 1 failure <<< FAILURES!

[...truncated 1035 lines...]
BUILD FAILED
C:\Users\JenkinsSlave\workspace\Lucene-Solr-4.x-Windows\build.xml:429: The following error occurred while executing this line:
C:\Users\JenkinsSlave\workspace\Lucene-Solr-4.x-Windows\build.xml:409: The following error occurred while executing this line:
C:\Users\JenkinsSlave\workspace\Lucene-Solr-4.x-Windows\build.xml:39: The following error occurred while executing this line:
C:\Users\JenkinsSlave\workspace\Lucene-Solr-4.x-Windows\solr\build.xml:189: The following error occurred while executing this line:
C:\Users\JenkinsSlave\workspace\Lucene-Solr-4.x-Windows\solr\common-build.xml:489: The following error occurred while executing this line:
C:\Users\JenkinsSlave\workspace\Lucene-Solr-4.x-Windows\lucene\common-build.xml:1276: The following error occurred while executing this line:
C:\Users\JenkinsSlave\workspace\Lucene-Solr-4.x-Windows\lucene\common-build.xml:912: There were test failures: 335 suites, 1475 tests, 1 failure, 40 ignored (11 assumptions)

Total time: 84 minutes 8 seconds
Build step 'Invoke Ant' marked build as failure
Description set: Java: 64bit/jdk1.7.0_45 -XX:-UseCompressedOops -XX:+UseSerialGC
Archiving artifacts
Recording test results
Email was triggered for: Failure
Sending email for trigger: Failure



Mime
View raw message