lucene-dev mailing list archives

Site index · List index
Message view « Date » · « Thread »
Top « Date » · « Thread »
From Policeman Jenkins Server <jenk...@thetaphi.de>
Subject [JENKINS] Lucene-Solr-trunk-Linux (32bit/jdk1.7.0_45) - Build # 8448 - Still Failing!
Date Sun, 24 Nov 2013 15:54:34 GMT
Build: http://jenkins.thetaphi.de/job/Lucene-Solr-trunk-Linux/8448/
Java: 32bit/jdk1.7.0_45 -server -XX:+UseG1GC

1 tests failed.
FAILED:  org.apache.solr.analytics.facet.QueryFacetTest.queryTest

Error Message:
The query facet dependencies [float3] either do not exist or are defined in a dependency looop.

Stack Trace:
org.apache.solr.common.SolrException: The query facet dependencies [float3] either do not
exist or are defined in a dependency looop.
	at __randomizedtesting.SeedInfo.seed([3B67895930059F7A:A67EC7B856AFD0EF]:0)
	at org.apache.solr.analytics.request.AnalyticsRequestFactory.parse(AnalyticsRequestFactory.java:148)
	at org.apache.solr.analytics.request.AnalyticsStats.execute(AnalyticsStats.java:66)
	at org.apache.solr.handler.component.AnalyticsComponent.process(AnalyticsComponent.java:44)
	at org.apache.solr.handler.component.SearchHandler.handleRequestBody(SearchHandler.java:209)
	at org.apache.solr.handler.RequestHandlerBase.handleRequest(RequestHandlerBase.java:135)
	at org.apache.solr.core.SolrCore.execute(SolrCore.java:1866)
	at org.apache.solr.util.TestHarness.query(TestHarness.java:291)
	at org.apache.solr.util.TestHarness.query(TestHarness.java:273)
	at org.apache.solr.analytics.facet.QueryFacetTest.queryTest(QueryFacetTest.java:105)
	at sun.reflect.NativeMethodAccessorImpl.invoke0(Native Method)
	at sun.reflect.NativeMethodAccessorImpl.invoke(NativeMethodAccessorImpl.java:57)
	at sun.reflect.DelegatingMethodAccessorImpl.invoke(DelegatingMethodAccessorImpl.java:43)
	at java.lang.reflect.Method.invoke(Method.java:606)
	at com.carrotsearch.randomizedtesting.RandomizedRunner.invoke(RandomizedRunner.java:1559)
	at com.carrotsearch.randomizedtesting.RandomizedRunner.access$600(RandomizedRunner.java:79)
	at com.carrotsearch.randomizedtesting.RandomizedRunner$6.evaluate(RandomizedRunner.java:737)
	at com.carrotsearch.randomizedtesting.RandomizedRunner$7.evaluate(RandomizedRunner.java:773)
	at com.carrotsearch.randomizedtesting.RandomizedRunner$8.evaluate(RandomizedRunner.java:787)
	at com.carrotsearch.randomizedtesting.rules.SystemPropertiesRestoreRule$1.evaluate(SystemPropertiesRestoreRule.java:53)
	at org.apache.lucene.util.TestRuleSetupTeardownChained$1.evaluate(TestRuleSetupTeardownChained.java:50)
	at org.apache.lucene.util.TestRuleFieldCacheSanity$1.evaluate(TestRuleFieldCacheSanity.java:51)
	at org.apache.lucene.util.AbstractBeforeAfterRule$1.evaluate(AbstractBeforeAfterRule.java:46)
	at com.carrotsearch.randomizedtesting.rules.SystemPropertiesInvariantRule$1.evaluate(SystemPropertiesInvariantRule.java:55)
	at org.apache.lucene.util.TestRuleThreadAndTestName$1.evaluate(TestRuleThreadAndTestName.java:49)
	at org.apache.lucene.util.TestRuleIgnoreAfterMaxFailures$1.evaluate(TestRuleIgnoreAfterMaxFailures.java:70)
	at org.apache.lucene.util.TestRuleMarkFailure$1.evaluate(TestRuleMarkFailure.java:48)
	at com.carrotsearch.randomizedtesting.rules.StatementAdapter.evaluate(StatementAdapter.java:36)
	at com.carrotsearch.randomizedtesting.ThreadLeakControl$StatementRunner.run(ThreadLeakControl.java:358)
	at com.carrotsearch.randomizedtesting.ThreadLeakControl.forkTimeoutingTask(ThreadLeakControl.java:782)
	at com.carrotsearch.randomizedtesting.ThreadLeakControl$3.evaluate(ThreadLeakControl.java:442)
	at com.carrotsearch.randomizedtesting.RandomizedRunner.runSingleTest(RandomizedRunner.java:746)
	at com.carrotsearch.randomizedtesting.RandomizedRunner$3.evaluate(RandomizedRunner.java:648)
	at com.carrotsearch.randomizedtesting.RandomizedRunner$4.evaluate(RandomizedRunner.java:682)
	at com.carrotsearch.randomizedtesting.RandomizedRunner$5.evaluate(RandomizedRunner.java:693)
	at com.carrotsearch.randomizedtesting.rules.StatementAdapter.evaluate(StatementAdapter.java:36)
	at com.carrotsearch.randomizedtesting.rules.SystemPropertiesRestoreRule$1.evaluate(SystemPropertiesRestoreRule.java:53)
	at org.apache.lucene.util.AbstractBeforeAfterRule$1.evaluate(AbstractBeforeAfterRule.java:46)
	at org.apache.lucene.util.TestRuleStoreClassName$1.evaluate(TestRuleStoreClassName.java:42)
	at com.carrotsearch.randomizedtesting.rules.SystemPropertiesInvariantRule$1.evaluate(SystemPropertiesInvariantRule.java:55)
	at com.carrotsearch.randomizedtesting.rules.NoShadowingOrOverridesOnMethodsRule$1.evaluate(NoShadowingOrOverridesOnMethodsRule.java:39)
	at com.carrotsearch.randomizedtesting.rules.NoShadowingOrOverridesOnMethodsRule$1.evaluate(NoShadowingOrOverridesOnMethodsRule.java:39)
	at com.carrotsearch.randomizedtesting.rules.StatementAdapter.evaluate(StatementAdapter.java:36)
	at org.apache.lucene.util.TestRuleAssertionsRequired$1.evaluate(TestRuleAssertionsRequired.java:43)
	at org.apache.lucene.util.TestRuleMarkFailure$1.evaluate(TestRuleMarkFailure.java:48)
	at org.apache.lucene.util.TestRuleIgnoreAfterMaxFailures$1.evaluate(TestRuleIgnoreAfterMaxFailures.java:70)
	at org.apache.lucene.util.TestRuleIgnoreTestSuites$1.evaluate(TestRuleIgnoreTestSuites.java:55)
	at com.carrotsearch.randomizedtesting.rules.StatementAdapter.evaluate(StatementAdapter.java:36)
	at com.carrotsearch.randomizedtesting.ThreadLeakControl$StatementRunner.run(ThreadLeakControl.java:358)
	at java.lang.Thread.run(Thread.java:744)




Build Log:
[...truncated 10376 lines...]
   [junit4] Suite: org.apache.solr.analytics.facet.QueryFacetTest
   [junit4]   2> 868910 T1272 oas.SolrTestCaseJ4.initCore ####initCore
   [junit4]   2> Creating dataDir: /mnt/ssd/jenkins/workspace/Lucene-Solr-trunk-Linux/solr/build/solr-core/test/J1/./solrtest-QueryFacetTest-1385307752552
   [junit4]   2> 868910 T1272 oasc.SolrResourceLoader.<init> new SolrResourceLoader
for directory: '/mnt/ssd/jenkins/workspace/Lucene-Solr-trunk-Linux/solr/build/solr-core/test-files/solr/collection1/'
   [junit4]   2> 868911 T1272 oasc.SolrResourceLoader.replaceClassLoader Adding 'file:/mnt/ssd/jenkins/workspace/Lucene-Solr-trunk-Linux/solr/build/solr-core/test-files/solr/collection1/lib/classes/'
to classloader
   [junit4]   2> 868911 T1272 oasc.SolrResourceLoader.replaceClassLoader Adding 'file:/mnt/ssd/jenkins/workspace/Lucene-Solr-trunk-Linux/solr/build/solr-core/test-files/solr/collection1/lib/README'
to classloader
   [junit4]   2> 868945 T1272 oasc.SolrConfig.<init> Using Lucene MatchVersion: LUCENE_50
   [junit4]   2> 868972 T1272 oasc.SolrConfig.<init> Loaded SolrConfig: solrconfig-basic.xml
   [junit4]   2> 868973 T1272 oass.IndexSchema.readSchema Reading Solr Schema from schema-analytics.xml
   [junit4]   2> 868977 T1272 oass.IndexSchema.readSchema [null] Schema name=schema-docValues
   [junit4]   2> 869019 T1272 oass.IndexSchema.readSchema unique key field: id
   [junit4]   2> 869020 T1272 oasc.SolrResourceLoader.locateSolrHome JNDI not configured
for solr (NoInitialContextEx)
   [junit4]   2> 869020 T1272 oasc.SolrResourceLoader.locateSolrHome using system property
solr.solr.home: /mnt/ssd/jenkins/workspace/Lucene-Solr-trunk-Linux/solr/build/solr-core/test-files/solr
   [junit4]   2> 869020 T1272 oasc.SolrResourceLoader.<init> new SolrResourceLoader
for directory: '/mnt/ssd/jenkins/workspace/Lucene-Solr-trunk-Linux/solr/build/solr-core/test-files/solr/'
   [junit4]   2> 869029 T1272 oasc.SolrResourceLoader.locateSolrHome JNDI not configured
for solr (NoInitialContextEx)
   [junit4]   2> 869029 T1272 oasc.SolrResourceLoader.locateSolrHome using system property
solr.solr.home: /mnt/ssd/jenkins/workspace/Lucene-Solr-trunk-Linux/solr/build/solr-core/test-files/solr
   [junit4]   2> 869029 T1272 oasc.SolrResourceLoader.<init> new SolrResourceLoader
for deduced Solr Home: '/mnt/ssd/jenkins/workspace/Lucene-Solr-trunk-Linux/solr/build/solr-core/test-files/solr/'
   [junit4]   2> 869068 T1272 oasc.CoreContainer.<init> New CoreContainer 14309373
   [junit4]   2> 869069 T1272 oasc.CoreContainer.load Loading cores into CoreContainer
[instanceDir=/mnt/ssd/jenkins/workspace/Lucene-Solr-trunk-Linux/solr/build/solr-core/test-files/solr/]
   [junit4]   2> 869069 T1272 oashc.HttpShardHandlerFactory.getParameter Setting socketTimeout
to: 0
   [junit4]   2> 869070 T1272 oashc.HttpShardHandlerFactory.getParameter Setting urlScheme
to: http://
   [junit4]   2> 869070 T1272 oashc.HttpShardHandlerFactory.getParameter Setting connTimeout
to: 0
   [junit4]   2> 869070 T1272 oashc.HttpShardHandlerFactory.getParameter Setting maxConnectionsPerHost
to: 20
   [junit4]   2> 869070 T1272 oashc.HttpShardHandlerFactory.getParameter Setting corePoolSize
to: 0
   [junit4]   2> 869071 T1272 oashc.HttpShardHandlerFactory.getParameter Setting maximumPoolSize
to: 2147483647
   [junit4]   2> 869071 T1272 oashc.HttpShardHandlerFactory.getParameter Setting maxThreadIdleTime
to: 5
   [junit4]   2> 869071 T1272 oashc.HttpShardHandlerFactory.getParameter Setting sizeOfQueue
to: -1
   [junit4]   2> 869071 T1272 oashc.HttpShardHandlerFactory.getParameter Setting fairnessPolicy
to: false
   [junit4]   2> 869075 T1272 oasl.LogWatcher.createWatcher SLF4J impl is org.slf4j.impl.Log4jLoggerFactory
   [junit4]   2> 869075 T1272 oasl.LogWatcher.newRegisteredLogWatcher Registering Log Listener
[Log4j (org.slf4j.impl.Log4jLoggerFactory)]
   [junit4]   2> 869075 T1272 oasc.CoreContainer.load Host Name: 
   [junit4]   2> 869078 T1273 oasc.CoreContainer.create Creating SolrCore 'collection1'
using instanceDir: /mnt/ssd/jenkins/workspace/Lucene-Solr-trunk-Linux/solr/build/solr-core/test-files/solr/collection1
   [junit4]   2> 869079 T1273 oasc.SolrResourceLoader.<init> new SolrResourceLoader
for directory: '/mnt/ssd/jenkins/workspace/Lucene-Solr-trunk-Linux/solr/build/solr-core/test-files/solr/collection1/'
   [junit4]   2> 869079 T1273 oasc.SolrResourceLoader.replaceClassLoader Adding 'file:/mnt/ssd/jenkins/workspace/Lucene-Solr-trunk-Linux/solr/build/solr-core/test-files/solr/collection1/lib/classes/'
to classloader
   [junit4]   2> 869079 T1273 oasc.SolrResourceLoader.replaceClassLoader Adding 'file:/mnt/ssd/jenkins/workspace/Lucene-Solr-trunk-Linux/solr/build/solr-core/test-files/solr/collection1/lib/README'
to classloader
   [junit4]   2> 869111 T1273 oasc.SolrConfig.<init> Using Lucene MatchVersion: LUCENE_50
   [junit4]   2> 869140 T1273 oasc.SolrConfig.<init> Loaded SolrConfig: solrconfig-basic.xml
   [junit4]   2> 869141 T1273 oass.IndexSchema.readSchema Reading Solr Schema from schema-analytics.xml
   [junit4]   2> 869146 T1273 oass.IndexSchema.readSchema [collection1] Schema name=schema-docValues
   [junit4]   2> 869171 T1273 oass.IndexSchema.readSchema unique key field: id
   [junit4]   2> 869172 T1273 oasc.SolrCore.initDirectoryFactory org.apache.solr.core.MockDirectoryFactory
   [junit4]   2> 869173 T1273 oasc.SolrCore.<init> [collection1] Opening new SolrCore
at /mnt/ssd/jenkins/workspace/Lucene-Solr-trunk-Linux/solr/build/solr-core/test-files/solr/collection1/,
dataDir=/mnt/ssd/jenkins/workspace/Lucene-Solr-trunk-Linux/solr/build/solr-core/test/J1/./solrtest-QueryFacetTest-1385307752552/
   [junit4]   2> 869173 T1273 oasc.SolrCore.<init> JMX monitoring not detected for
core: collection1
   [junit4]   2> 869173 T1273 oasc.CachingDirectoryFactory.get return new directory for
/mnt/ssd/jenkins/workspace/Lucene-Solr-trunk-Linux/solr/build/solr-core/test/J1/./solrtest-QueryFacetTest-1385307752552
   [junit4]   2> 869173 T1273 oasc.SolrCore.getNewIndexDir New index directory detected:
old=null new=/mnt/ssd/jenkins/workspace/Lucene-Solr-trunk-Linux/solr/build/solr-core/test/J1/./solrtest-QueryFacetTest-1385307752552/index/
   [junit4]   2> 869174 T1273 oasc.SolrCore.initIndex WARN [collection1] Solr index directory
'/mnt/ssd/jenkins/workspace/Lucene-Solr-trunk-Linux/solr/build/solr-core/test/J1/./solrtest-QueryFacetTest-1385307752552/index'
doesn't exist. Creating new index...
   [junit4]   2> 869174 T1273 oasc.CachingDirectoryFactory.get return new directory for
/mnt/ssd/jenkins/workspace/Lucene-Solr-trunk-Linux/solr/build/solr-core/test/J1/./solrtest-QueryFacetTest-1385307752552/index
   [junit4]   2> 869174 T1273 oasu.RandomMergePolicy.<init> RandomMergePolicy wrapping
class org.apache.lucene.index.TieredMergePolicy: [TieredMergePolicy: maxMergeAtOnce=41, maxMergeAtOnceExplicit=26,
maxMergedSegmentMB=83.09375, floorSegmentMB=0.9228515625, forceMergeDeletesPctAllowed=14.3140019179908,
segmentsPerTier=39.0, maxCFSSegmentSizeMB=8.796093022207999E12, noCFSRatio=1.0
   [junit4]   2> 869175 T1273 oasc.SolrDeletionPolicy.onCommit SolrDeletionPolicy.onCommit:
commits: num=1
   [junit4]   2> 		commit{dir=MockDirectoryWrapper(org.apache.lucene.store.RAMDirectory@11e66ea
lockFactory=org.apache.lucene.store.SingleInstanceLockFactory@1af5128),segFN=segments_1,generation=1}
   [junit4]   2> 869175 T1273 oasc.SolrDeletionPolicy.updateCommits newest commit generation
= 1
   [junit4]   2> 869176 T1273 oasc.SolrCore.loadUpdateProcessorChains no updateRequestProcessorChain
defined as default, creating implicit default
   [junit4]   2> 869176 T1273 oasc.RequestHandlers.initHandlersFromConfig created standard:
solr.StandardRequestHandler
   [junit4]   2> 869176 T1273 oasc.RequestHandlers.initHandlersFromConfig created /update:
solr.UpdateRequestHandler
   [junit4]   2> 869179 T1273 oashl.XMLLoader.init xsltCacheLifetimeSeconds=60
   [junit4]   2> 869180 T1273 oasu.CommitTracker.<init> Hard AutoCommit: disabled
   [junit4]   2> 869180 T1273 oasu.CommitTracker.<init> Soft AutoCommit: disabled
   [junit4]   2> 869181 T1273 oasu.RandomMergePolicy.<init> RandomMergePolicy wrapping
class org.apache.lucene.index.LogByteSizeMergePolicy: [LogByteSizeMergePolicy: minMergeSize=1677721,
mergeFactor=36, maxMergeSize=2147483648, maxMergeSizeForForcedMerge=9223372036854775807, calibrateSizeByDeletes=false,
maxMergeDocs=2147483647, maxCFSSegmentSizeMB=8.796093022207999E12, noCFSRatio=0.8722601422991834]
   [junit4]   2> 869181 T1273 oasc.SolrDeletionPolicy.onInit SolrDeletionPolicy.onInit:
commits: num=1
   [junit4]   2> 		commit{dir=MockDirectoryWrapper(org.apache.lucene.store.RAMDirectory@11e66ea
lockFactory=org.apache.lucene.store.SingleInstanceLockFactory@1af5128),segFN=segments_1,generation=1}
   [junit4]   2> 869181 T1273 oasc.SolrDeletionPolicy.updateCommits newest commit generation
= 1
   [junit4]   2> 869182 T1273 oass.SolrIndexSearcher.<init> Opening Searcher@650eed
main
   [junit4]   2> 869182 T1274 oasc.SolrCore.registerSearcher [collection1] Registered new
searcher Searcher@650eed main{StandardDirectoryReader(segments_1:1:nrt)}
   [junit4]   2> 869182 T1273 oasc.CoreContainer.registerCore registering core: collection1
   [junit4]   2> 869184 T1272 oas.SolrTestCaseJ4.initCore ####initCore end
   [junit4]   2> 869187 T1272 oas.SolrTestCaseJ4.setUp ###Starting queryTest
   [junit4]   2> ASYNC  NEW_CORE C839 name=collection1 org.apache.solr.core.SolrCore@1045119
   [junit4]   2> 869191 T1272 C839 oasu.DirectUpdateHandler2.deleteAll [collection1] REMOVING
ALL DOCUMENTS FROM INDEX
   [junit4]   2> 869192 T1272 C839 oasup.LogUpdateProcessor.finish [collection1] webapp=null
path=null params={} {deleteByQuery=*:*} 0 2
   [junit4]   2> 869196 T1272 C839 oasup.LogUpdateProcessor.finish [collection1] webapp=null
path=null params={} {add=[10000]} 0 1
   [junit4]   2> 869202 T1272 C839 oasup.LogUpdateProcessor.finish [collection1] webapp=null
path=null params={} {add=[10001]} 0 0
   [junit4]   2> 869209 T1272 C839 oasup.LogUpdateProcessor.finish [collection1] webapp=null
path=null params={} {add=[10002]} 0 1
   [junit4]   2> 869214 T1272 C839 oasup.LogUpdateProcessor.finish [collection1] webapp=null
path=null params={} {add=[10003]} 0 1
   [junit4]   2> 869220 T1272 C839 oasup.LogUpdateProcessor.finish [collection1] webapp=null
path=null params={} {add=[10004]} 0 1
   [junit4]   2> 869227 T1272 C839 oasup.LogUpdateProcessor.finish [collection1] webapp=null
path=null params={} {add=[10005]} 0 1
   [junit4]   2> 869232 T1272 C839 oasup.LogUpdateProcessor.finish [collection1] webapp=null
path=null params={} {add=[10006]} 0 1
   [junit4]   2> 869236 T1272 C839 oasup.LogUpdateProcessor.finish [collection1] webapp=null
path=null params={} {add=[10007]} 0 0
   [junit4]   2> 869241 T1272 C839 oasup.LogUpdateProcessor.finish [collection1] webapp=null
path=null params={} {add=[10008]} 0 1
   [junit4]   2> 869246 T1272 C839 oasup.LogUpdateProcessor.finish [collection1] webapp=null
path=null params={} {add=[10009]} 0 0
   [junit4]   2> 869252 T1272 C839 oasup.LogUpdateProcessor.finish [collection1] webapp=null
path=null params={} {add=[100010]} 0 1
   [junit4]   2> 869258 T1272 C839 oasup.LogUpdateProcessor.finish [collection1] webapp=null
path=null params={} {add=[100011]} 0 1
   [junit4]   2> 869263 T1272 C839 oasup.LogUpdateProcessor.finish [collection1] webapp=null
path=null params={} {add=[100012]} 0 1
   [junit4]   2> 869268 T1272 C839 oasup.LogUpdateProcessor.finish [collection1] webapp=null
path=null params={} {add=[100013]} 0 1
   [junit4]   2> 869273 T1272 C839 oasup.LogUpdateProcessor.finish [collection1] webapp=null
path=null params={} {add=[100014]} 0 1
   [junit4]   2> 869278 T1272 C839 oasup.LogUpdateProcessor.finish [collection1] webapp=null
path=null params={} {add=[100015]} 0 0
   [junit4]   2> 869283 T1272 C839 oasup.LogUpdateProcessor.finish [collection1] webapp=null
path=null params={} {add=[100016]} 0 0
   [junit4]   2> 869288 T1272 C839 oasup.LogUpdateProcessor.finish [collection1] webapp=null
path=null params={} {add=[100017]} 0 0
   [junit4]   2> 869293 T1272 C839 oasup.LogUpdateProcessor.finish [collection1] webapp=null
path=null params={} {add=[100018]} 0 0
   [junit4]   2> 869298 T1272 C839 oasup.LogUpdateProcessor.finish [collection1] webapp=null
path=null params={} {add=[100019]} 0 0
   [junit4]   2> 869303 T1272 C839 oasup.LogUpdateProcessor.finish [collection1] webapp=null
path=null params={} {add=[100020]} 0 0
   [junit4]   2> 869308 T1272 C839 oasup.LogUpdateProcessor.finish [collection1] webapp=null
path=null params={} {add=[100021]} 0 0
   [junit4]   2> 869314 T1272 C839 oasup.LogUpdateProcessor.finish [collection1] webapp=null
path=null params={} {add=[100022]} 0 1
   [junit4]   2> 869319 T1272 C839 oasup.LogUpdateProcessor.finish [collection1] webapp=null
path=null params={} {add=[100023]} 0 1
   [junit4]   2> 869324 T1272 C839 oasup.LogUpdateProcessor.finish [collection1] webapp=null
path=null params={} {add=[100024]} 0 1
   [junit4]   2> 869330 T1272 C839 oasup.LogUpdateProcessor.finish [collection1] webapp=null
path=null params={} {add=[100025]} 0 1
   [junit4]   2> 869335 T1272 C839 oasup.LogUpdateProcessor.finish [collection1] webapp=null
path=null params={} {add=[100026]} 0 0
   [junit4]   2> 869340 T1272 C839 oasup.LogUpdateProcessor.finish [collection1] webapp=null
path=null params={} {add=[100027]} 0 0
   [junit4]   2> 869345 T1272 C839 oasup.LogUpdateProcessor.finish [collection1] webapp=null
path=null params={} {add=[100028]} 0 0
   [junit4]   2> 869351 T1272 C839 oasup.LogUpdateProcessor.finish [collection1] webapp=null
path=null params={} {add=[100029]} 0 1
   [junit4]   2> 869356 T1272 C839 oasup.LogUpdateProcessor.finish [collection1] webapp=null
path=null params={} {add=[100030]} 0 0
   [junit4]   2> 869361 T1272 C839 oasup.LogUpdateProcessor.finish [collection1] webapp=null
path=null params={} {add=[100031]} 0 1
   [junit4]   2> 869365 T1272 C839 oasup.LogUpdateProcessor.finish [collection1] webapp=null
path=null params={} {add=[100032]} 0 0
   [junit4]   2> 869370 T1272 C839 oasup.LogUpdateProcessor.finish [collection1] webapp=null
path=null params={} {add=[100033]} 0 0
   [junit4]   2> 869375 T1272 C839 oasup.LogUpdateProcessor.finish [collection1] webapp=null
path=null params={} {add=[100034]} 0 0
   [junit4]   2> 869381 T1272 C839 oasup.LogUpdateProcessor.finish [collection1] webapp=null
path=null params={} {add=[100035]} 0 1
   [junit4]   2> 869385 T1272 C839 oasup.LogUpdateProcessor.finish [collection1] webapp=null
path=null params={} {add=[100036]} 0 0
   [junit4]   2> 869390 T1272 C839 oasup.LogUpdateProcessor.finish [collection1] webapp=null
path=null params={} {add=[100037]} 0 0
   [junit4]   2> 869395 T1272 C839 oasup.LogUpdateProcessor.finish [collection1] webapp=null
path=null params={} {add=[100038]} 0 1
   [junit4]   2> 869400 T1272 C839 oasup.LogUpdateProcessor.finish [collection1] webapp=null
path=null params={} {add=[100039]} 0 1
   [junit4]   2> 869405 T1272 C839 oasup.LogUpdateProcessor.finish [collection1] webapp=null
path=null params={} {add=[100040]} 0 1
   [junit4]   2> 869410 T1272 C839 oasup.LogUpdateProcessor.finish [collection1] webapp=null
path=null params={} {add=[100041]} 0 1
   [junit4]   2> 869415 T1272 C839 oasup.LogUpdateProcessor.finish [collection1] webapp=null
path=null params={} {add=[100042]} 0 0
   [junit4]   2> 869420 T1272 C839 oasup.LogUpdateProcessor.finish [collection1] webapp=null
path=null params={} {add=[100043]} 0 1
   [junit4]   2> 869425 T1272 C839 oasup.LogUpdateProcessor.finish [collection1] webapp=null
path=null params={} {add=[100044]} 0 1
   [junit4]   2> 869431 T1272 C839 oasup.LogUpdateProcessor.finish [collection1] webapp=null
path=null params={} {add=[100045]} 0 1
   [junit4]   2> 869436 T1272 C839 oasup.LogUpdateProcessor.finish [collection1] webapp=null
path=null params={} {add=[100046]} 0 0
   [junit4]   2> 869441 T1272 C839 oasup.LogUpdateProcessor.finish [collection1] webapp=null
path=null params={} {add=[100047]} 0 0
   [junit4]   2> 869447 T1272 C839 oasup.LogUpdateProcessor.finish [collection1] webapp=null
path=null params={} {add=[100048]} 0 1
   [junit4]   2> 869452 T1272 C839 oasup.LogUpdateProcessor.finish [collection1] webapp=null
path=null params={} {add=[100049]} 0 0
   [junit4]   2> 869457 T1272 C839 oasup.LogUpdateProcessor.finish [collection1] webapp=null
path=null params={} {add=[100050]} 0 0
   [junit4]   2> 869462 T1272 C839 oasup.LogUpdateProcessor.finish [collection1] webapp=null
path=null params={} {add=[100051]} 0 0
   [junit4]   2> ASYNC  NEW_CORE C840 name=collection1 org.apache.solr.core.SolrCore@1045119
   [junit4]   2> 869486 T1272 C840 oasup.LogUpdateProcessor.finish [collection1] webapp=null
path=null params={} {add=[100052]} 0 1
   [junit4]   2> 869493 T1272 C840 oasup.LogUpdateProcessor.finish [collection1] webapp=null
path=null params={} {add=[100053]} 0 1
   [junit4]   2> 869498 T1272 C840 oasup.LogUpdateProcessor.finish [collection1] webapp=null
path=null params={} {add=[100054]} 0 0
   [junit4]   2> 869503 T1272 C840 oasup.LogUpdateProcessor.finish [collection1] webapp=null
path=null params={} {add=[100055]} 0 0
   [junit4]   2> 869511 T1272 C840 oasup.LogUpdateProcessor.finish [collection1] webapp=null
path=null params={} {add=[100056]} 0 1
   [junit4]   2> 869519 T1272 C840 oasup.LogUpdateProcessor.finish [collection1] webapp=null
path=null params={} {add=[100057]} 0 1
   [junit4]   2> 869524 T1272 C840 oasup.LogUpdateProcessor.finish [collection1] webapp=null
path=null params={} {add=[100058]} 0 0
   [junit4]   2> 869529 T1272 C840 oasup.LogUpdateProcessor.finish [collection1] webapp=null
path=null params={} {add=[100059]} 0 0
   [junit4]   2> 869535 T1272 C840 oasup.LogUpdateProcessor.finish [collection1] webapp=null
path=null params={} {add=[100060]} 0 0
   [junit4]   2> 869541 T1272 C840 oasup.LogUpdateProcessor.finish [collection1] webapp=null
path=null params={} {add=[100061]} 0 1
   [junit4]   2> 869547 T1272 C840 oasup.LogUpdateProcessor.finish [collection1] webapp=null
path=null params={} {add=[100062]} 0 1
   [junit4]   2> 869552 T1272 C840 oasup.LogUpdateProcessor.finish [collection1] webapp=null
path=null params={} {add=[100063]} 0 0
   [junit4]   2> 869557 T1272 C840 oasup.LogUpdateProcessor.finish [collection1] webapp=null
path=null params={} {add=[100064]} 0 0
   [junit4]   2> 869563 T1272 C840 oasup.LogUpdateProcessor.finish [collection1] webapp=null
path=null params={} {add=[100065]} 0 1
   [junit4]   2> 869568 T1272 C840 oasup.LogUpdateProcessor.finish [collection1] webapp=null
path=null params={} {add=[100066]} 0 0
   [junit4]   2> 869573 T1272 C840 oasup.LogUpdateProcessor.finish [collection1] webapp=null
path=null params={} {add=[100067]} 0 0
   [junit4]   2> 869578 T1272 C840 oasup.LogUpdateProcessor.finish [collection1] webapp=null
path=null params={} {add=[100068]} 0 0
   [junit4]   2> 869583 T1272 C840 oasup.LogUpdateProcessor.finish [collection1] webapp=null
path=null params={} {add=[100069]} 0 0
   [junit4]   2> 869589 T1272 C840 oasup.LogUpdateProcessor.finish [collection1] webapp=null
path=null params={} {add=[100070]} 0 1
   [junit4]   2> 869594 T1272 C840 oasup.LogUpdateProcessor.finish [collection1] webapp=null
path=null params={} {add=[100071]} 0 1
   [junit4]   2> 869599 T1272 C840 oasup.LogUpdateProcessor.finish [collection1] webapp=null
path=null params={} {add=[100072]} 0 0
   [junit4]   2> 869604 T1272 C840 oasup.LogUpdateProcessor.finish [collection1] webapp=null
path=null params={} {add=[100073]} 0 0
   [junit4]   2> 869609 T1272 C840 oasup.LogUpdateProcessor.finish [collection1] webapp=null
path=null params={} {add=[100074]} 0 0
   [junit4]   2> 869614 T1272 C840 oasup.LogUpdateProcessor.finish [collection1] webapp=null
path=null params={} {add=[100075]} 0 0
   [junit4]   2> 869619 T1272 C840 oasup.LogUpdateProcessor.finish [collection1] webapp=null
path=null params={} {add=[100076]} 0 0
   [junit4]   2> 869624 T1272 C840 oasup.LogUpdateProcessor.finish [collection1] webapp=null
path=null params={} {add=[100077]} 0 0
   [junit4]   2> 869629 T1272 C840 oasup.LogUpdateProcessor.finish [collection1] webapp=null
path=null params={} {add=[100078]} 0 0
   [junit4]   2> 869634 T1272 C840 oasup.LogUpdateProcessor.finish [collection1] webapp=null
path=null params={} {add=[100079]} 0 0
   [junit4]   2> 869640 T1272 C840 oasup.LogUpdateProcessor.finish [collection1] webapp=null
path=null params={} {add=[100080]} 0 0
   [junit4]   2> 869645 T1272 C840 oasup.LogUpdateProcessor.finish [collection1] webapp=null
path=null params={} {add=[100081]} 0 0
   [junit4]   2> 869652 T1272 C840 oasup.LogUpdateProcessor.finish [collection1] webapp=null
path=null params={} {add=[100082]} 0 1
   [junit4]   2> 869657 T1272 C840 oasup.LogUpdateProcessor.finish [collection1] webapp=null
path=null params={} {add=[100083]} 0 1
   [junit4]   2> 869662 T1272 C840 oasup.LogUpdateProcessor.finish [collection1] webapp=null
path=null params={} {add=[100084]} 0 1
   [junit4]   2> 869666 T1272 C840 oasup.LogUpdateProcessor.finish [collection1] webapp=null
path=null params={} {add=[100085]} 0 0
   [junit4]   2> 869671 T1272 C840 oasup.LogUpdateProcessor.finish [collection1] webapp=null
path=null params={} {add=[100086]} 0 0
   [junit4]   2> 869676 T1272 C840 oasup.LogUpdateProcessor.finish [collection1] webapp=null
path=null params={} {add=[100087]} 0 1
   [junit4]   2> 869681 T1272 C840 oasup.LogUpdateProcessor.finish [collection1] webapp=null
path=null params={} {add=[100088]} 0 1
   [junit4]   2> 869685 T1272 C840 oasup.LogUpdateProcessor.finish [collection1] webapp=null
path=null params={} {add=[100089]} 0 0
   [junit4]   2> 869690 T1272 C840 oasup.LogUpdateProcessor.finish [collection1] webapp=null
path=null params={} {add=[100090]} 0 1
   [junit4]   2> 869694 T1272 C840 oasup.LogUpdateProcessor.finish [collection1] webapp=null
path=null params={} {add=[100091]} 0 0
   [junit4]   2> 869699 T1272 C840 oasup.LogUpdateProcessor.finish [collection1] webapp=null
path=null params={} {add=[100092]} 0 1
   [junit4]   2> 869703 T1272 C840 oasup.LogUpdateProcessor.finish [collection1] webapp=null
path=null params={} {add=[100093]} 0 0
   [junit4]   2> 869708 T1272 C840 oasup.LogUpdateProcessor.finish [collection1] webapp=null
path=null params={} {add=[100094]} 0 0
   [junit4]   2> 869713 T1272 C840 oasup.LogUpdateProcessor.finish [collection1] webapp=null
path=null params={} {add=[100095]} 0 0
   [junit4]   2> 869718 T1272 C840 oasup.LogUpdateProcessor.finish [collection1] webapp=null
path=null params={} {add=[100096]} 0 0
   [junit4]   2> 869724 T1272 C840 oasup.LogUpdateProcessor.finish [collection1] webapp=null
path=null params={} {add=[100097]} 0 1
   [junit4]   2> 869729 T1272 C840 oasup.LogUpdateProcessor.finish [collection1] webapp=null
path=null params={} {add=[100098]} 0 1
   [junit4]   2> 869734 T1272 C840 oasup.LogUpdateProcessor.finish [collection1] webapp=null
path=null params={} {add=[100099]} 0 1
   [junit4]   2> 869739 T1272 C840 oasu.DirectUpdateHandler2.commit start commit{,optimize=false,openSearcher=true,waitSearcher=true,expungeDeletes=false,softCommit=false,prepareCommit=false}
   [junit4]   2> 869752 T1272 C840 oasc.SolrDeletionPolicy.onCommit SolrDeletionPolicy.onCommit:
commits: num=2
   [junit4]   2> 		commit{dir=MockDirectoryWrapper(org.apache.lucene.store.RAMDirectory@11e66ea
lockFactory=org.apache.lucene.store.SingleInstanceLockFactory@1af5128),segFN=segments_1,generation=1}
   [junit4]   2> 		commit{dir=MockDirectoryWrapper(org.apache.lucene.store.RAMDirectory@11e66ea
lockFactory=org.apache.lucene.store.SingleInstanceLockFactory@1af5128),segFN=segments_2,generation=2}
   [junit4]   2> 869753 T1272 C840 oasc.SolrDeletionPolicy.updateCommits newest commit
generation = 2
   [junit4]   2> 869756 T1272 C840 oass.SolrIndexSearcher.<init> Opening Searcher@11c07ed
main
   [junit4]   2> 869756 T1272 C840 oasu.DirectUpdateHandler2.commit end_commit_flush
   [junit4]   2> 869756 T1274 oasc.SolrCore.registerSearcher [collection1] Registered new
searcher Searcher@11c07ed main{StandardDirectoryReader(segments_2:4:nrt _0(5.0):C100)}
   [junit4]   2> 869757 T1272 C840 oasup.LogUpdateProcessor.finish [collection1] webapp=null
path=null params={} {commit=} 0 18
   [junit4]   2> 869773 T1272 C840 oasc.SolrException.log ERROR org.apache.solr.common.SolrException:
The query facet dependencies [float3] either do not exist or are defined in a dependency looop.
   [junit4]   2> 		at org.apache.solr.analytics.request.AnalyticsRequestFactory.parse(AnalyticsRequestFactory.java:148)
   [junit4]   2> 		at org.apache.solr.analytics.request.AnalyticsStats.execute(AnalyticsStats.java:66)
   [junit4]   2> 		at org.apache.solr.handler.component.AnalyticsComponent.process(AnalyticsComponent.java:44)
   [junit4]   2> 		at org.apache.solr.handler.component.SearchHandler.handleRequestBody(SearchHandler.java:209)
   [junit4]   2> 		at org.apache.solr.handler.RequestHandlerBase.handleRequest(RequestHandlerBase.java:135)
   [junit4]   2> 		at org.apache.solr.core.SolrCore.execute(SolrCore.java:1866)
   [junit4]   2> 		at org.apache.solr.util.TestHarness.query(TestHarness.java:291)
   [junit4]   2> 		at org.apache.solr.util.TestHarness.query(TestHarness.java:273)
   [junit4]   2> 		at org.apache.solr.analytics.facet.QueryFacetTest.queryTest(QueryFacetTest.java:105)
   [junit4]   2> 		at sun.reflect.NativeMethodAccessorImpl.invoke0(Native Method)
   [junit4]   2> 		at sun.reflect.NativeMethodAccessorImpl.invoke(NativeMethodAccessorImpl.java:57)
   [junit4]   2> 		at sun.reflect.DelegatingMethodAccessorImpl.invoke(DelegatingMethodAccessorImpl.java:43)
   [junit4]   2> 		at java.lang.reflect.Method.invoke(Method.java:606)
   [junit4]   2> 		at com.carrotsearch.randomizedtesting.RandomizedRunner.invoke(RandomizedRunner.java:1559)
   [junit4]   2> 		at com.carrotsearch.randomizedtesting.RandomizedRunner.access$600(RandomizedRunner.java:79)
   [junit4]   2> 		at com.carrotsearch.randomizedtesting.RandomizedRunner$6.evaluate(RandomizedRunner.java:737)
   [junit4]   2> 		at com.carrotsearch.randomizedtesting.RandomizedRunner$7.evaluate(RandomizedRunner.java:773)
   [junit4]   2> 		at com.carrotsearch.randomizedtesting.RandomizedRunner$8.evaluate(RandomizedRunner.java:787)
   [junit4]   2> 		at com.carrotsearch.randomizedtesting.rules.SystemPropertiesRestoreRule$1.evaluate(SystemPropertiesRestoreRule.java:53)
   [junit4]   2> 		at org.apache.lucene.util.TestRuleSetupTeardownChained$1.evaluate(TestRuleSetupTeardownChained.java:50)
   [junit4]   2> 		at org.apache.lucene.util.TestRuleFieldCacheSanity$1.evaluate(TestRuleFieldCacheSanity.java:51)
   [junit4]   2> 		at org.apache.lucene.util.AbstractBeforeAfterRule$1.evaluate(AbstractBeforeAfterRule.java:46)
   [junit4]   2> 		at com.carrotsearch.randomizedtesting.rules.SystemPropertiesInvariantRule$1.evaluate(SystemPropertiesInvariantRule.java:55)
   [junit4]   2> 		at org.apache.lucene.util.TestRuleThreadAndTestName$1.evaluate(TestRuleThreadAndTestName.java:49)
   [junit4]   2> 		at org.apache.lucene.util.TestRuleIgnoreAfterMaxFailures$1.evaluate(TestRuleIgnoreAfterMaxFailures.java:70)
   [junit4]   2> 		at org.apache.lucene.util.TestRuleMarkFailure$1.evaluate(TestRuleMarkFailure.java:48)
   [junit4]   2> 		at com.carrotsearch.randomizedtesting.rules.StatementAdapter.evaluate(StatementAdapter.java:36)
   [junit4]   2> 		at com.carrotsearch.randomizedtesting.ThreadLeakControl$StatementRunner.run(ThreadLeakControl.java:358)
   [junit4]   2> 		at com.carrotsearch.randomizedtesting.ThreadLeakControl.forkTimeoutingTask(ThreadLeakControl.java:782)
   [junit4]   2> 		at com.carrotsearch.randomizedtesting.ThreadLeakControl$3.evaluate(ThreadLeakControl.java:442)
   [junit4]   2> 		at com.carrotsearch.randomizedtesting.RandomizedRunner.runSingleTest(RandomizedRunner.java:746)
   [junit4]   2> 		at com.carrotsearch.randomizedtesting.RandomizedRunner$3.evaluate(RandomizedRunner.java:648)
   [junit4]   2> 		at com.carrotsearch.randomizedtesting.RandomizedRunner$4.evaluate(RandomizedRunner.java:682)
   [junit4]   2> 		at com.carrotsearch.randomizedtesting.RandomizedRunner$5.evaluate(RandomizedRunner.java:693)
   [junit4]   2> 		at com.carrotsearch.randomizedtesting.rules.StatementAdapter.evaluate(StatementAdapter.java:36)
   [junit4]   2> 		at com.carrotsearch.randomizedtesting.rules.SystemPropertiesRestoreRule$1.evaluate(SystemPropertiesRestoreRule.java:53)
   [junit4]   2> 		at org.apache.lucene.util.AbstractBeforeAfterRule$1.evaluate(AbstractBeforeAfterRule.java:46)
   [junit4]   2> 		at org.apache.lucene.util.TestRuleStoreClassName$1.evaluate(TestRuleStoreClassName.java:42)
   [junit4]   2> 		at com.carrotsearch.randomizedtesting.rules.SystemPropertiesInvariantRule$1.evaluate(SystemPropertiesInvariantRule.java:55)
   [junit4]   2> 		at com.carrotsearch.randomizedtesting.rules.NoShadowingOrOverridesOnMethodsRule$1.evaluate(NoShadowingOrOverridesOnMethodsRule.java:39)
   [junit4]   2> 		at com.carrotsearch.randomizedtesting.rules.NoShadowingOrOverridesOnMethodsRule$1.evaluate(NoShadowingOrOverridesOnMethodsRule.java:39)
   [junit4]   2> 		at com.carrotsearch.randomizedtesting.rules.StatementAdapter.evaluate(StatementAdapter.java:36)
   [junit4]   2> 		at org.apache.lucene.util.TestRuleAssertionsRequired$1.evaluate(TestRuleAssertionsRequired.java:43)
   [junit4]   2> 		at org.apache.lucene.util.TestRuleMarkFailure$1.evaluate(TestRuleMarkFailure.java:48)
   [junit4]   2> 		at org.apache.lucene.util.TestRuleIgnoreAfterMaxFailures$1.evaluate(TestRuleIgnoreAfterMaxFailures.java:70)
   [junit4]   2> 		at org.apache.lucene.util.TestRuleIgnoreTestSuites$1.evaluate(TestRuleIgnoreTestSuites.java:55)
   [junit4]   2> 		at com.carrotsearch.randomizedtesting.rules.StatementAdapter.evaluate(StatementAdapter.java:36)
   [junit4]   2> 		at com.carrotsearch.randomizedtesting.ThreadLeakControl$StatementRunner.run(ThreadLeakControl.java:358)
   [junit4]   2> 		at java.lang.Thread.run(Thread.java:744)
   [junit4]   2> 	
   [junit4]   2> 869775 T1272 C840 oasc.SolrCore.execute [collection1] webapp=null path=null
params={o.lr.qf=string&o.lr.qf.string.q=string_sd:abc1&o.lr.qf.string.q=string_sd:abc2&o.lr.s.sum=sum(long_ld)&o.fr.s.mean=mean(float_fd)&o.fr.s.sum=sum(float_fd)&o.ir.qf.float1.q=float_fd:[*+TO+50]&o.pr.ff.string_sd.h=true&o.ir.ff.string_sd.h=true&o.fr.s.percentile_8=percentile(8,float_fd)&o.ir.qf.float2.q=float_fd:[*+TO+30]&o.lr.s.median=median(long_ld)&o.fr.qf=lad&olap=true&o.pr.qf.float4.d=float3&o.pr.s.sum=sum(int_id)&o.ir.qf=float1&o.ir.qf=float2&o.pr.s.mean=mean(int_id)&o.ir.s.median=median(int_id)&o.pr.qf.float3.q=result(q1)&o.pr.qf.float3.q=result(q2)&o.pr.qf.float3.q=result(q3)&o.pr.qf.float3.q=result(q1,string_sd,abc2)&rows=0&o.pr.ff=string_sd&o.ir.ff=string_sd&indent=true&o.ir.s.sum=sum(int_id)&o.ir.s.mean=mean(int_id)&o.pr.s.q1=concat(const_str(float_fd:[),+percentile(10,int_id),+const_str(+TO+),+median(int_id),+const_str(]))&o.pr.qf.float4.q=qresult(q1,float3,result(q1))&o.ir.s.percentile_8=percentile(8,int_id)&o.pr.s.percentile_8=percentile(8,int_id)&o.lr.s.percentile_8=percentile(8,long_ld)&o.pr.s.median=median(int_id)&o.pr.hs.q3=concat(const_str(float_fd:[),+percentile(40,int_id),+const_str(+TO+),+median(int_id),+const_str(]))&o.fr.qf.lad.q=long_ld:[20+TO+*]&o.fr.qf.lad.q=long_ld:[30+TO+*]&o.fr.qf.lad.q=double_dd:[*+TO+50]&q=*:*&o.pr.hs.q2=concat(const_str(float_fd:[),+percentile(30,int_id),+const_str(+TO+),+median(int_id),+const_str(]))&o.pr.qf=float3&o.pr.qf=float4&o.lr.s.mean=mean(long_ld)&o.fr.s.median=median(float_fd)}
hits=100 status=400 QTime=5 
   [junit4]   2> 869776 T1272 oas.SolrTestCaseJ4.tearDown ###Ending queryTest
   [junit4]   2> NOTE: reproduce with: ant test  -Dtestcase=QueryFacetTest -Dtests.method=queryTest
-Dtests.seed=3B67895930059F7A -Dtests.multiplier=3 -Dtests.slow=true -Dtests.locale=th_TH
-Dtests.timezone=Antarctica/Macquarie -Dtests.file.encoding=UTF-8
   [junit4] ERROR   0.61s J1 | QueryFacetTest.queryTest <<<
   [junit4]    > Throwable #1: org.apache.solr.common.SolrException: The query facet dependencies
[float3] either do not exist or are defined in a dependency looop.
   [junit4]    > 	at __randomizedtesting.SeedInfo.seed([3B67895930059F7A:A67EC7B856AFD0EF]:0)
   [junit4]    > 	at org.apache.solr.analytics.request.AnalyticsRequestFactory.parse(AnalyticsRequestFactory.java:148)
   [junit4]    > 	at org.apache.solr.analytics.request.AnalyticsStats.execute(AnalyticsStats.java:66)
   [junit4]    > 	at org.apache.solr.handler.component.AnalyticsComponent.process(AnalyticsComponent.java:44)
   [junit4]    > 	at org.apache.solr.handler.component.SearchHandler.handleRequestBody(SearchHandler.java:209)
   [junit4]    > 	at org.apache.solr.handler.RequestHandlerBase.handleRequest(RequestHandlerBase.java:135)
   [junit4]    > 	at org.apache.solr.core.SolrCore.execute(SolrCore.java:1866)
   [junit4]    > 	at org.apache.solr.util.TestHarness.query(TestHarness.java:291)
   [junit4]    > 	at org.apache.solr.util.TestHarness.query(TestHarness.java:273)
   [junit4]    > 	at org.apache.solr.analytics.facet.QueryFacetTest.queryTest(QueryFacetTest.java:105)
   [junit4]    > 	at java.lang.Thread.run(Thread.java:744)
   [junit4]   2> 869793 T1272 oas.SolrTestCaseJ4.deleteCore ###deleteCore
   [junit4]   2> 869793 T1272 oasc.CoreContainer.shutdown Shutting down CoreContainer instance=14309373
   [junit4]   2> 869794 T1272 oasc.SolrCore.close [collection1]  CLOSING SolrCore org.apache.solr.core.SolrCore@1045119
   [junit4]   2> 869794 T1272 oasu.DirectUpdateHandler2.close closing DirectUpdateHandler2{commits=1,autocommits=0,soft
autocommits=0,optimizes=0,rollbacks=0,expungeDeletes=0,docsPending=0,adds=0,deletesById=0,deletesByQuery=0,errors=0,cumulative_adds=100,cumulative_deletesById=0,cumulative_deletesByQuery=1,cumulative_errors=0}
   [junit4]   2> 869795 T1272 oasu.SolrCoreState.decrefSolrCoreState Closing SolrCoreState
   [junit4]   2> 869795 T1272 oasu.DefaultSolrCoreState.closeIndexWriter SolrCoreState
ref count has reached 0 - closing IndexWriter
   [junit4]   2> 869795 T1272 oasu.DefaultSolrCoreState.closeIndexWriter closing IndexWriter
with IndexWriterCloser
   [junit4]   2> 869796 T1272 oasc.SolrCore.closeSearcher [collection1] Closing main searcher
on request.
   [junit4]   2> 869796 T1272 oasc.CachingDirectoryFactory.close Closing MockDirectoryFactory
- 2 directories currently being tracked
   [junit4]   2> 869797 T1272 oasc.CachingDirectoryFactory.closeCacheValue looking to close
/mnt/ssd/jenkins/workspace/Lucene-Solr-trunk-Linux/solr/build/solr-core/test/J1/./solrtest-QueryFacetTest-1385307752552/index
[CachedDir<<refCount=0;path=/mnt/ssd/jenkins/workspace/Lucene-Solr-trunk-Linux/solr/build/solr-core/test/J1/./solrtest-QueryFacetTest-1385307752552/index;done=false>>]
   [junit4]   2> 869797 T1272 oasc.CachingDirectoryFactory.close Closing directory: /mnt/ssd/jenkins/workspace/Lucene-Solr-trunk-Linux/solr/build/solr-core/test/J1/./solrtest-QueryFacetTest-1385307752552/index
   [junit4]   2> 869797 T1272 oasc.CachingDirectoryFactory.closeCacheValue looking to close
/mnt/ssd/jenkins/workspace/Lucene-Solr-trunk-Linux/solr/build/solr-core/test/J1/./solrtest-QueryFacetTest-1385307752552
[CachedDir<<refCount=0;path=/mnt/ssd/jenkins/workspace/Lucene-Solr-trunk-Linux/solr/build/solr-core/test/J1/./solrtest-QueryFacetTest-1385307752552;done=false>>]
   [junit4]   2> 869798 T1272 oasc.CachingDirectoryFactory.close Closing directory: /mnt/ssd/jenkins/workspace/Lucene-Solr-trunk-Linux/solr/build/solr-core/test/J1/./solrtest-QueryFacetTest-1385307752552
   [junit4]   2> NOTE: test params are: codec=Lucene46: {string_sd=PostingsFormat(name=Memory
doPackFST= true), long_ld=TestBloomFilteredLucene41Postings(BloomFilteringPostingsFormat(Lucene41(blocksize=128))),
date_dtd=TestBloomFilteredLucene41Postings(BloomFilteringPostingsFormat(Lucene41(blocksize=128))),
id=TestBloomFilteredLucene41Postings(BloomFilteringPostingsFormat(Lucene41(blocksize=128))),
int_id=PostingsFormat(name=Memory doPackFST= true), float_fd=PostingsFormat(name=Memory doPackFST=
true), double_dd=FST41}, docValues:{stringdv=DocValuesFormat(name=Disk), long_ld=DocValuesFormat(name=Disk),
longdv=DocValuesFormat(name=Memory), int_id=DocValuesFormat(name=SimpleText), float_fd=DocValuesFormat(name=Disk),
double_dd=DocValuesFormat(name=Memory), string_sd=DocValuesFormat(name=SimpleText), date_dtd=DocValuesFormat(name=Disk),
intdv=DocValuesFormat(name=SimpleText), floatdv=DocValuesFormat(name=Memory), stringdvm=DocValuesFormat(name=Memory),
doubledv=DocValuesFormat(name=Disk), datedv=DocValuesFormat(name=Lucene45)}, sim=DefaultSimilarity,
locale=th_TH, timezone=Antarctica/Macquarie
   [junit4]   2> NOTE: Linux 3.8.0-33-generic i386/Oracle Corporation 1.7.0_45 (32-bit)/cpus=8,threads=1,free=198382448,total=536870912
   [junit4]   2> NOTE: All tests run in this JVM: [TestComponentsName, TestBinaryField,
TestFieldCollectionResource, TestFieldTypeCollectionResource, TestRecovery, FileUtilsTest,
BlockCacheTest, StressHdfsTest, HdfsBasicDistributedZk2Test, TestRandomFaceting, SignatureUpdateProcessorFactoryTest,
AssignTest, ZkNodePropsTest, ChaosMonkeyNothingIsSafeTest, TestHighFrequencyDictionaryFactory,
TestCSVResponseWriter, TestDistribDocBasedVersion, NoFacetTest, DirectSolrConnectionTest,
PingRequestHandlerTest, TestCopyFieldCollectionResource, TestAnalyzedSuggestions, FieldFacetExtrasTest,
OutputWriterTest, MinimalSchemaTest, BasicDistributedZk2Test, DebugComponentTest, MultiTermTest,
HighlighterConfigTest, PreAnalyzedUpdateProcessorTest, ShardSplitTest, SpellingQueryConverterTest,
FunctionTest, TestStressRecovery, SolrPluginUtilsTest, ExpressionTest, TestFiltering, FieldAnalysisRequestHandlerTest,
TestXIncludeConfig, TestUpdate, TestOmitPositions, TestSweetSpotSimilarityFactory, AbstractAnalyticsFacetTest,
TestUtils, TestRandomMergePolicy, JSONWriterTest, DisMaxRequestHandlerTest, InfoHandlerTest,
NoCacheHeaderTest, PrimUtilsTest, CoreContainerCoreInitFailuresTest, CachingDirectoryFactoryTest,
TestJmxIntegration, TestCodecSupport, SolrRequestParserTest, BasicZkTest, TestReload, TestFastOutputStream,
QueryFacetTest]
   [junit4] Completed on J1 in 0.91s, 1 test, 1 error <<< FAILURES!

[...truncated 636 lines...]
BUILD FAILED
/mnt/ssd/jenkins/workspace/Lucene-Solr-trunk-Linux/build.xml:420: The following error occurred
while executing this line:
/mnt/ssd/jenkins/workspace/Lucene-Solr-trunk-Linux/build.xml:400: The following error occurred
while executing this line:
/mnt/ssd/jenkins/workspace/Lucene-Solr-trunk-Linux/build.xml:39: The following error occurred
while executing this line:
/mnt/ssd/jenkins/workspace/Lucene-Solr-trunk-Linux/extra-targets.xml:37: The following error
occurred while executing this line:
/mnt/ssd/jenkins/workspace/Lucene-Solr-trunk-Linux/solr/build.xml:189: The following error
occurred while executing this line:
/mnt/ssd/jenkins/workspace/Lucene-Solr-trunk-Linux/solr/common-build.xml:492: The following
error occurred while executing this line:
/mnt/ssd/jenkins/workspace/Lucene-Solr-trunk-Linux/lucene/common-build.xml:1275: The following
error occurred while executing this line:
/mnt/ssd/jenkins/workspace/Lucene-Solr-trunk-Linux/lucene/common-build.xml:908: There were
test failures: 353 suites, 1558 tests, 1 error, 34 ignored (6 assumptions)

Total time: 53 minutes 3 seconds
Build step 'Invoke Ant' marked build as failure
Description set: Java: 32bit/jdk1.7.0_45 -server -XX:+UseG1GC
Archiving artifacts
Recording test results
Email was triggered for: Failure
Sending email for trigger: Failure



Mime
View raw message