lucene-dev mailing list archives

Site index · List index
Message view « Date » · « Thread »
Top « Date » · « Thread »
From Apache Jenkins Server <jenk...@builds.apache.org>
Subject [JENKINS-MAVEN] Lucene-Solr-Maven-4.x #493: POMs out of sync
Date Thu, 31 Oct 2013 20:22:11 GMT
Build: https://builds.apache.org/job/Lucene-Solr-Maven-4.x/493/

4 tests failed.
REGRESSION:  org.apache.solr.cloud.DeleteReplicaTest.testDistribSearch

Error Message:
Invalid shard name : shard1 in collection : delLiveColl

Stack Trace:
org.apache.solr.client.solrj.impl.HttpSolrServer$RemoteSolrException: Invalid shard name : shard1 in collection : delLiveColl
	at __randomizedtesting.SeedInfo.seed([7570CFB3E33385B:86B182E3496C5867]:0)
	at org.apache.solr.client.solrj.impl.HttpSolrServer.request(HttpSolrServer.java:464)
	at org.apache.solr.client.solrj.impl.HttpSolrServer.request(HttpSolrServer.java:181)
	at org.apache.solr.client.solrj.impl.LBHttpSolrServer.request(LBHttpSolrServer.java:268)
	at org.apache.solr.client.solrj.impl.CloudSolrServer.request(CloudSolrServer.java:640)
	at org.apache.solr.cloud.DeleteReplicaTest.removeAndWaitForReplicaGone(DeleteReplicaTest.java:148)
	at org.apache.solr.cloud.DeleteReplicaTest.deleteLiveReplicaTest(DeleteReplicaTest.java:134)
	at org.apache.solr.cloud.DeleteReplicaTest.doTest(DeleteReplicaTest.java:115)


FAILED:  org.apache.solr.cloud.DeleteReplicaTest.org.apache.solr.cloud.DeleteReplicaTest

Error Message:
ERROR: SolrZkClient opens=15 closes=14

Stack Trace:
java.lang.AssertionError: ERROR: SolrZkClient opens=15 closes=14
	at __randomizedtesting.SeedInfo.seed([7570CFB3E33385B]:0)
	at org.junit.Assert.fail(Assert.java:93)
	at org.apache.solr.SolrTestCaseJ4.endTrackingZkClients(SolrTestCaseJ4.java:343)
	at org.apache.solr.SolrTestCaseJ4.afterClass(SolrTestCaseJ4.java:135)
	at sun.reflect.GeneratedMethodAccessor10.invoke(Unknown Source)
	at sun.reflect.DelegatingMethodAccessorImpl.invoke(DelegatingMethodAccessorImpl.java:43)
	at java.lang.reflect.Method.invoke(Method.java:616)
	at com.carrotsearch.randomizedtesting.RandomizedRunner.invoke(RandomizedRunner.java:1559)
	at com.carrotsearch.randomizedtesting.RandomizedRunner.access$600(RandomizedRunner.java:79)
	at com.carrotsearch.randomizedtesting.RandomizedRunner$5.evaluate(RandomizedRunner.java:700)
	at com.carrotsearch.randomizedtesting.rules.StatementAdapter.evaluate(StatementAdapter.java:36)
	at com.carrotsearch.randomizedtesting.rules.SystemPropertiesRestoreRule$1.evaluate(SystemPropertiesRestoreRule.java:53)
	at org.apache.lucene.util.AbstractBeforeAfterRule$1.evaluate(AbstractBeforeAfterRule.java:46)
	at org.apache.lucene.util.TestRuleStoreClassName$1.evaluate(TestRuleStoreClassName.java:42)
	at com.carrotsearch.randomizedtesting.rules.SystemPropertiesInvariantRule$1.evaluate(SystemPropertiesInvariantRule.java:55)
	at com.carrotsearch.randomizedtesting.rules.NoShadowingOrOverridesOnMethodsRule$1.evaluate(NoShadowingOrOverridesOnMethodsRule.java:39)
	at com.carrotsearch.randomizedtesting.rules.NoShadowingOrOverridesOnMethodsRule$1.evaluate(NoShadowingOrOverridesOnMethodsRule.java:39)
	at com.carrotsearch.randomizedtesting.rules.StatementAdapter.evaluate(StatementAdapter.java:36)
	at org.apache.lucene.util.TestRuleAssertionsRequired$1.evaluate(TestRuleAssertionsRequired.java:43)
	at org.apache.lucene.util.TestRuleMarkFailure$1.evaluate(TestRuleMarkFailure.java:48)
	at org.apache.lucene.util.TestRuleIgnoreAfterMaxFailures$1.evaluate(TestRuleIgnoreAfterMaxFailures.java:70)
	at org.apache.lucene.util.TestRuleIgnoreTestSuites$1.evaluate(TestRuleIgnoreTestSuites.java:55)
	at com.carrotsearch.randomizedtesting.rules.StatementAdapter.evaluate(StatementAdapter.java:36)
	at com.carrotsearch.randomizedtesting.ThreadLeakControl$StatementRunner.run(ThreadLeakControl.java:358)
	at java.lang.Thread.run(Thread.java:679)


FAILED:  org.apache.solr.cloud.DeleteReplicaTest.org.apache.solr.cloud.DeleteReplicaTest

Error Message:
2 threads leaked from SUITE scope at org.apache.solr.cloud.DeleteReplicaTest: 
   1) Thread[id=6384, name=TEST-DeleteReplicaTest.testDistribSearch-seed#[7570CFB3E33385B]-EventThread, state=WAITING, group=TGRP-DeleteReplicaTest]
        at sun.misc.Unsafe.park(Native Method)
        at java.util.concurrent.locks.LockSupport.park(LockSupport.java:186)
        at java.util.concurrent.locks.AbstractQueuedSynchronizer$ConditionObject.await(AbstractQueuedSynchronizer.java:2043)
        at java.util.concurrent.LinkedBlockingQueue.take(LinkedBlockingQueue.java:386)
        at org.apache.zookeeper.ClientCnxn$EventThread.run(ClientCnxn.java:491)
   2) Thread[id=6383, name=TEST-DeleteReplicaTest.testDistribSearch-seed#[7570CFB3E33385B]-SendThread(localhost:58871), state=RUNNABLE, group=TGRP-DeleteReplicaTest]
        at sun.nio.ch.KqueueArrayWrapper.kevent(Native Method)
        at sun.nio.ch.KqueueArrayWrapper.poll(KqueueArrayWrapper.java:146)
        at sun.nio.ch.KqueueSelectorImpl.doSelect(KqueueSelectorImpl.java:69)
        at sun.nio.ch.SelectorImpl.lockAndDoSelect(SelectorImpl.java:87)
        at sun.nio.ch.SelectorImpl.select(SelectorImpl.java:98)
        at org.apache.zookeeper.ClientCnxnSocketNIO.doTransport(ClientCnxnSocketNIO.java:338)
        at org.apache.zookeeper.ClientCnxn$SendThread.run(ClientCnxn.java:1068)

Stack Trace:
com.carrotsearch.randomizedtesting.ThreadLeakError: 2 threads leaked from SUITE scope at org.apache.solr.cloud.DeleteReplicaTest: 
   1) Thread[id=6384, name=TEST-DeleteReplicaTest.testDistribSearch-seed#[7570CFB3E33385B]-EventThread, state=WAITING, group=TGRP-DeleteReplicaTest]
        at sun.misc.Unsafe.park(Native Method)
        at java.util.concurrent.locks.LockSupport.park(LockSupport.java:186)
        at java.util.concurrent.locks.AbstractQueuedSynchronizer$ConditionObject.await(AbstractQueuedSynchronizer.java:2043)
        at java.util.concurrent.LinkedBlockingQueue.take(LinkedBlockingQueue.java:386)
        at org.apache.zookeeper.ClientCnxn$EventThread.run(ClientCnxn.java:491)
   2) Thread[id=6383, name=TEST-DeleteReplicaTest.testDistribSearch-seed#[7570CFB3E33385B]-SendThread(localhost:58871), state=RUNNABLE, group=TGRP-DeleteReplicaTest]
        at sun.nio.ch.KqueueArrayWrapper.kevent(Native Method)
        at sun.nio.ch.KqueueArrayWrapper.poll(KqueueArrayWrapper.java:146)
        at sun.nio.ch.KqueueSelectorImpl.doSelect(KqueueSelectorImpl.java:69)
        at sun.nio.ch.SelectorImpl.lockAndDoSelect(SelectorImpl.java:87)
        at sun.nio.ch.SelectorImpl.select(SelectorImpl.java:98)
        at org.apache.zookeeper.ClientCnxnSocketNIO.doTransport(ClientCnxnSocketNIO.java:338)
        at org.apache.zookeeper.ClientCnxn$SendThread.run(ClientCnxn.java:1068)
	at __randomizedtesting.SeedInfo.seed([7570CFB3E33385B]:0)


FAILED:  org.apache.solr.cloud.DeleteReplicaTest.org.apache.solr.cloud.DeleteReplicaTest

Error Message:
There are still zombie threads that couldn't be terminated:
   1) Thread[id=6383, name=TEST-DeleteReplicaTest.testDistribSearch-seed#[7570CFB3E33385B]-SendThread(localhost:58871), state=RUNNABLE, group=TGRP-DeleteReplicaTest]
        at sun.nio.ch.KqueueArrayWrapper.interrupt(Native Method)
        at sun.nio.ch.KqueueArrayWrapper.interrupt(KqueueArrayWrapper.java:206)
        at sun.nio.ch.KqueueSelectorImpl.wakeup(KqueueSelectorImpl.java:194)
        at java.nio.channels.spi.AbstractSelector$1.interrupt(AbstractSelector.java:210)
        at java.nio.channels.spi.AbstractSelector.begin(AbstractSelector.java:215)
        at sun.nio.ch.KqueueSelectorImpl.doSelect(KqueueSelectorImpl.java:68)
        at sun.nio.ch.SelectorImpl.lockAndDoSelect(SelectorImpl.java:87)
        at sun.nio.ch.SelectorImpl.select(SelectorImpl.java:98)
        at org.apache.zookeeper.ClientCnxnSocketNIO.doTransport(ClientCnxnSocketNIO.java:338)
        at org.apache.zookeeper.ClientCnxn$SendThread.run(ClientCnxn.java:1068)

Stack Trace:
com.carrotsearch.randomizedtesting.ThreadLeakError: There are still zombie threads that couldn't be terminated:
   1) Thread[id=6383, name=TEST-DeleteReplicaTest.testDistribSearch-seed#[7570CFB3E33385B]-SendThread(localhost:58871), state=RUNNABLE, group=TGRP-DeleteReplicaTest]
        at sun.nio.ch.KqueueArrayWrapper.interrupt(Native Method)
        at sun.nio.ch.KqueueArrayWrapper.interrupt(KqueueArrayWrapper.java:206)
        at sun.nio.ch.KqueueSelectorImpl.wakeup(KqueueSelectorImpl.java:194)
        at java.nio.channels.spi.AbstractSelector$1.interrupt(AbstractSelector.java:210)
        at java.nio.channels.spi.AbstractSelector.begin(AbstractSelector.java:215)
        at sun.nio.ch.KqueueSelectorImpl.doSelect(KqueueSelectorImpl.java:68)
        at sun.nio.ch.SelectorImpl.lockAndDoSelect(SelectorImpl.java:87)
        at sun.nio.ch.SelectorImpl.select(SelectorImpl.java:98)
        at org.apache.zookeeper.ClientCnxnSocketNIO.doTransport(ClientCnxnSocketNIO.java:338)
        at org.apache.zookeeper.ClientCnxn$SendThread.run(ClientCnxn.java:1068)
	at __randomizedtesting.SeedInfo.seed([7570CFB3E33385B]:0)




Build Log:
[...truncated 35230 lines...]
      [mvn] java.lang.AssertionError: ERROR: SolrZkClient opens=15 closes=14
      [mvn] 	at __randomizedtesting.SeedInfo.seed([7570CFB3E33385B]:0)
      [mvn] 	at org.junit.Assert.fail(Assert.java:93)
      [mvn] 	at org.apache.solr.SolrTestCaseJ4.endTrackingZkClients(SolrTestCaseJ4.java:343)
      [mvn] 	at org.apache.solr.SolrTestCaseJ4.afterClass(SolrTestCaseJ4.java:135)
      [mvn] 	at sun.reflect.GeneratedMethodAccessor10.invoke(Unknown Source)
      [mvn] 	at sun.reflect.DelegatingMethodAccessorImpl.invoke(DelegatingMethodAccessorImpl.java:43)
      [mvn] 	at java.lang.reflect.Method.invoke(Method.java:616)
      [mvn] 	at com.carrotsearch.randomizedtesting.RandomizedRunner.invoke(RandomizedRunner.java:1559)
      [mvn] 	at com.carrotsearch.randomizedtesting.RandomizedRunner.access$600(RandomizedRunner.java:79)
      [mvn] 	at com.carrotsearch.randomizedtesting.RandomizedRunner$5.evaluate(RandomizedRunner.java:700)
      [mvn] 	at com.carrotsearch.randomizedtesting.rules.StatementAdapter.evaluate(StatementAdapter.java:36)
      [mvn] 	at com.carrotsearch.randomizedtesting.rules.SystemPropertiesRestoreRule$1.evaluate(SystemPropertiesRestoreRule.java:53)
      [mvn] 	at org.apache.lucene.util.AbstractBeforeAfterRule$1.evaluate(AbstractBeforeAfterRule.java:46)
      [mvn] 	at org.apache.lucene.util.TestRuleStoreClassName$1.evaluate(TestRuleStoreClassName.java:42)
      [mvn] 	at com.carrotsearch.randomizedtesting.rules.SystemPropertiesInvariantRule$1.evaluate(SystemPropertiesInvariantRule.java:55)
      [mvn] 	at com.carrotsearch.randomizedtesting.rules.NoShadowingOrOverridesOnMethodsRule$1.evaluate(NoShadowingOrOverridesOnMethodsRule.java:39)
      [mvn] 	at com.carrotsearch.randomizedtesting.rules.NoShadowingOrOverridesOnMethodsRule$1.evaluate(NoShadowingOrOverridesOnMethodsRule.java:39)
      [mvn] 	at com.carrotsearch.randomizedtesting.rules.StatementAdapter.evaluate(StatementAdapter.java:36)
      [mvn] 	at org.apache.lucene.util.TestRuleAssertionsRequired$1.evaluate(TestRuleAssertionsRequired.java:43)
      [mvn] 	at org.apache.lucene.util.TestRuleMarkFailure$1.evaluate(TestRuleMarkFailure.java:48)
      [mvn] 	at org.apache.lucene.util.TestRuleIgnoreAfterMaxFailures$1.evaluate(TestRuleIgnoreAfterMaxFailures.java:70)
      [mvn] 	at org.apache.lucene.util.TestRuleIgnoreTestSuites$1.evaluate(TestRuleIgnoreTestSuites.java:55)
      [mvn] 	at com.carrotsearch.randomizedtesting.rules.StatementAdapter.evaluate(StatementAdapter.java:36)
      [mvn] 	at com.carrotsearch.randomizedtesting.ThreadLeakControl$StatementRunner.run(ThreadLeakControl.java:358)
      [mvn] 	at java.lang.Thread.run(Thread.java:679)
      [mvn] 
      [mvn] org.apache.solr.cloud.DeleteReplicaTest  Time elapsed: 118.96 sec  <<< ERROR!
      [mvn] com.carrotsearch.randomizedtesting.ThreadLeakError: 2 threads leaked from SUITE scope at org.apache.solr.cloud.DeleteReplicaTest: 
      [mvn]    1) Thread[id=6384, name=TEST-DeleteReplicaTest.testDistribSearch-seed#[7570CFB3E33385B]-EventThread, state=WAITING, group=TGRP-DeleteReplicaTest]
      [mvn]         at sun.misc.Unsafe.park(Native Method)
      [mvn]         at java.util.concurrent.locks.LockSupport.park(LockSupport.java:186)
      [mvn]         at java.util.concurrent.locks.AbstractQueuedSynchronizer$ConditionObject.await(AbstractQueuedSynchronizer.java:2043)
      [mvn]         at java.util.concurrent.LinkedBlockingQueue.take(LinkedBlockingQueue.java:386)
      [mvn]         at org.apache.zookeeper.ClientCnxn$EventThread.run(ClientCnxn.java:491)
      [mvn]    2) Thread[id=6383, name=TEST-DeleteReplicaTest.testDistribSearch-seed#[7570CFB3E33385B]-SendThread(localhost:58871), state=RUNNABLE, group=TGRP-DeleteReplicaTest]
      [mvn]         at sun.nio.ch.KqueueArrayWrapper.kevent(Native Method)
      [mvn]         at sun.nio.ch.KqueueArrayWrapper.poll(KqueueArrayWrapper.java:146)
      [mvn]         at sun.nio.ch.KqueueSelectorImpl.doSelect(KqueueSelectorImpl.java:69)
      [mvn]         at sun.nio.ch.SelectorImpl.lockAndDoSelect(SelectorImpl.java:87)
      [mvn]         at sun.nio.ch.SelectorImpl.select(SelectorImpl.java:98)
      [mvn]         at org.apache.zookeeper.ClientCnxnSocketNIO.doTransport(ClientCnxnSocketNIO.java:338)
      [mvn]         at org.apache.zookeeper.ClientCnxn$SendThread.run(ClientCnxn.java:1068)
      [mvn] 	at __randomizedtesting.SeedInfo.seed([7570CFB3E33385B]:0)
      [mvn] 
      [mvn] org.apache.solr.cloud.DeleteReplicaTest  Time elapsed: 118.961 sec  <<< ERROR!
      [mvn] com.carrotsearch.randomizedtesting.ThreadLeakError: There are still zombie threads that couldn't be terminated:
      [mvn]    1) Thread[id=6383, name=TEST-DeleteReplicaTest.testDistribSearch-seed#[7570CFB3E33385B]-SendThread(localhost:58871), state=RUNNABLE, group=TGRP-DeleteReplicaTest]
      [mvn]         at sun.nio.ch.KqueueArrayWrapper.interrupt(Native Method)
      [mvn]         at sun.nio.ch.KqueueArrayWrapper.interrupt(KqueueArrayWrapper.java:206)
      [mvn]         at sun.nio.ch.KqueueSelectorImpl.wakeup(KqueueSelectorImpl.java:194)
      [mvn]         at java.nio.channels.spi.AbstractSelector$1.interrupt(AbstractSelector.java:210)
      [mvn]         at java.nio.channels.spi.AbstractSelector.begin(AbstractSelector.java:215)
      [mvn]         at sun.nio.ch.KqueueSelectorImpl.doSelect(KqueueSelectorImpl.java:68)
      [mvn]         at sun.nio.ch.SelectorImpl.lockAndDoSelect(SelectorImpl.java:87)
      [mvn]         at sun.nio.ch.SelectorImpl.select(SelectorImpl.java:98)
      [mvn]         at org.apache.zookeeper.ClientCnxnSocketNIO.doTransport(ClientCnxnSocketNIO.java:338)
      [mvn]         at org.apache.zookeeper.ClientCnxn$SendThread.run(ClientCnxn.java:1068)
      [mvn] 	at __randomizedtesting.SeedInfo.seed([7570CFB3E33385B]:0)
      [mvn] 
      [mvn] Running org.apache.solr.search.TestSolr4Spatial
      [mvn] Tests run: 29, Failures: 0, Errors: 0, Skipped: 29, Time elapsed: 0.001 sec - in org.apache.solr.search.TestSolr4Spatial
      [mvn] org.apache.solr.search.TestSolr4Spatial skipped
      [mvn] checkResultFormat {p0=srpt_geohash}(org.apache.solr.search.TestSolr4Spatial) skipped
      [mvn] testBadShapeParse400 {p0=srpt_geohash}(org.apache.solr.search.TestSolr4Spatial) skipped
      [mvn] testSortMultiVal {p0=srpt_geohash}(org.apache.solr.search.TestSolr4Spatial) skipped
      [mvn] checkQueryEmptyIndex {p0=srpt_geohash}(org.apache.solr.search.TestSolr4Spatial) skipped
      [mvn] testIntersectFilter {p0=srpt_geohash}(org.apache.solr.search.TestSolr4Spatial) skipped
      [mvn] testSort {p0=srpt_geohash}(org.apache.solr.search.TestSolr4Spatial) skipped
      [mvn] testRangeSyntax {p0=srpt_geohash}(org.apache.solr.search.TestSolr4Spatial) skipped
      [mvn] checkResultFormat {p0=srpt_quad}(org.apache.solr.search.TestSolr4Spatial) skipped
      [mvn] testBadShapeParse400 {p0=srpt_quad}(org.apache.solr.search.TestSolr4Spatial) skipped
      [mvn] testSortMultiVal {p0=srpt_quad}(org.apache.solr.search.TestSolr4Spatial) skipped
      [mvn] checkQueryEmptyIndex {p0=srpt_quad}(org.apache.solr.search.TestSolr4Spatial) skipped
      [mvn] testIntersectFilter {p0=srpt_quad}(org.apache.solr.search.TestSolr4Spatial) skipped
      [mvn] testSort {p0=srpt_quad}(org.apache.solr.search.TestSolr4Spatial) skipped
      [mvn] testRangeSyntax {p0=srpt_quad}(org.apache.solr.search.TestSolr4Spatial) skipped
      [mvn] checkResultFormat {p0=stqpt_geohash}(org.apache.solr.search.TestSolr4Spatial) skipped
      [mvn] testBadShapeParse400 {p0=stqpt_geohash}(org.apache.solr.search.TestSolr4Spatial) skipped
      [mvn] testSortMultiVal {p0=stqpt_geohash}(org.apache.solr.search.TestSolr4Spatial) skipped
      [mvn] checkQueryEmptyIndex {p0=stqpt_geohash}(org.apache.solr.search.TestSolr4Spatial) skipped
      [mvn] testIntersectFilter {p0=stqpt_geohash}(org.apache.solr.search.TestSolr4Spatial) skipped
      [mvn] testSort {p0=stqpt_geohash}(org.apache.solr.search.TestSolr4Spatial) skipped
      [mvn] testRangeSyntax {p0=stqpt_geohash}(org.apache.solr.search.TestSolr4Spatial) skipped
      [mvn] checkResultFormat {p0=pointvector}(org.apache.solr.search.TestSolr4Spatial) skipped
      [mvn] testBadShapeParse400 {p0=pointvector}(org.apache.solr.search.TestSolr4Spatial) skipped
      [mvn] testSortMultiVal {p0=pointvector}(org.apache.solr.search.TestSolr4Spatial) skipped
      [mvn] checkQueryEmptyIndex {p0=pointvector}(org.apache.solr.search.TestSolr4Spatial) skipped
      [mvn] testIntersectFilter {p0=pointvector}(org.apache.solr.search.TestSolr4Spatial) skipped
      [mvn] testSort {p0=pointvector}(org.apache.solr.search.TestSolr4Spatial) skipped
      [mvn] testRangeSyntax {p0=pointvector}(org.apache.solr.search.TestSolr4Spatial) skipped
      [mvn] Running org.apache.solr.cloud.TestHashPartitioner
      [mvn] Tests run: 4, Failures: 0, Errors: 0, Skipped: 4, Time elapsed: 0 sec - in org.apache.solr.cloud.TestHashPartitioner
      [mvn] org.apache.solr.cloud.TestHashPartitioner skipped
      [mvn] testHashCodes(org.apache.solr.cloud.TestHashPartitioner) skipped
      [mvn] testMapHashes(org.apache.solr.cloud.TestHashPartitioner) skipped
      [mvn] testCompositeHashCodes(org.apache.solr.cloud.TestHashPartitioner) skipped
      [mvn] Running org.apache.solr.logging.TestLogWatcher
      [mvn] Tests run: 1, Failures: 0, Errors: 0, Skipped: 0, Time elapsed: 0 sec - in org.apache.solr.logging.TestLogWatcher
      [mvn] testLog4jWatcher(org.apache.solr.logging.TestLogWatcher)  Time elapsed: 0 sec
      [mvn] Running org.apache.solr.handler.FieldAnalysisRequestHandlerTest
      [mvn] Tests run: 5, Failures: 0, Errors: 0, Skipped: 5, Time elapsed: 0 sec - in org.apache.solr.handler.FieldAnalysisRequestHandlerTest
      [mvn] org.apache.solr.handler.FieldAnalysisRequestHandlerTest skipped
      [mvn] testPositionHistoryWithWDF(org.apache.solr.handler.FieldAnalysisRequestHandlerTest) skipped
      [mvn] testCharFilterAnalysis(org.apache.solr.handler.FieldAnalysisRequestHandlerTest) skipped
      [mvn] testResolveAnalysisRequest(org.apache.solr.handler.FieldAnalysisRequestHandlerTest) skipped
      [mvn] testHandleAnalysisRequest(org.apache.solr.handler.FieldAnalysisRequestHandlerTest) skipped
      [mvn] Running org.apache.solr.TestDistributedGrouping
      [mvn] Tests run: 2, Failures: 0, Errors: 0, Skipped: 2, Time elapsed: 0 sec - in org.apache.solr.TestDistributedGrouping
      [mvn] org.apache.solr.TestDistributedGrouping skipped
      [mvn] testDistribSearch(org.apache.solr.TestDistributedGrouping) skipped
      [mvn] Running org.apache.solr.cloud.SliceStateTest
      [mvn] Tests run: 2, Failures: 0, Errors: 0, Skipped: 2, Time elapsed: 0 sec - in org.apache.solr.cloud.SliceStateTest
      [mvn] org.apache.solr.cloud.SliceStateTest skipped
      [mvn] testDefaultSliceState(org.apache.solr.cloud.SliceStateTest) skipped
      [mvn] Running org.apache.solr.store.blockcache.BlockDirectoryTest
      [mvn] Tests run: 5, Failures: 0, Errors: 0, Skipped: 5, Time elapsed: 0 sec - in org.apache.solr.store.blockcache.BlockDirectoryTest
      [mvn] org.apache.solr.store.blockcache.BlockDirectoryTest skipped
      [mvn] testRandomAccessWrites(org.apache.solr.store.blockcache.BlockDirectoryTest) skipped
      [mvn] testRandomAccessWritesLargeCache(org.apache.solr.store.blockcache.BlockDirectoryTest) skipped
      [mvn] ensureCacheConfigurable(org.apache.solr.store.blockcache.BlockDirectoryTest) skipped
      [mvn] testEOF(org.apache.solr.store.blockcache.BlockDirectoryTest) skipped
      [mvn] Running org.apache.solr.analysis.LegacyHTMLStripCharFilterTest
      [mvn] Tests run: 14, Failures: 0, Errors: 0, Skipped: 14, Time elapsed: 0 sec - in org.apache.solr.analysis.LegacyHTMLStripCharFilterTest
      [mvn] org.apache.solr.analysis.LegacyHTMLStripCharFilterTest skipped
      [mvn] testRandom(org.apache.solr.analysis.LegacyHTMLStripCharFilterTest) skipped
      [mvn] test(org.apache.solr.analysis.LegacyHTMLStripCharFilterTest) skipped
      [mvn] testRandomBrokenHTML(org.apache.solr.analysis.LegacyHTMLStripCharFilterTest) skipped
      [mvn] testReserved(org.apache.solr.analysis.LegacyHTMLStripCharFilterTest) skipped
      [mvn] testComment(org.apache.solr.analysis.LegacyHTMLStripCharFilterTest) skipped
      [mvn] testRandomText(org.apache.solr.analysis.LegacyHTMLStripCharFilterTest) skipped
      [mvn] testBufferOverflow(org.apache.solr.analysis.LegacyHTMLStripCharFilterTest) skipped
      [mvn] testOffsets(org.apache.solr.analysis.LegacyHTMLStripCharFilterTest) skipped
      [mvn] testEntities(org.apache.solr.analysis.LegacyHTMLStripCharFilterTest) skipped
      [mvn] testMoreEntities(org.apache.solr.analysis.LegacyHTMLStripCharFilterTest) skipped
      [mvn] testMalformedHTML(org.apache.solr.analysis.LegacyHTMLStripCharFilterTest) skipped
      [mvn] testHTML(org.apache.solr.analysis.LegacyHTMLStripCharFilterTest) skipped
      [mvn] testGamma(org.apache.solr.analysis.LegacyHTMLStripCharFilterTest) skipped
      [mvn] Running org.apache.solr.search.TestRangeQuery
      [mvn] Tests run: 3, Failures: 0, Errors: 0, Skipped: 3, Time elapsed: 0 sec - in org.apache.solr.search.TestRangeQuery
      [mvn] org.apache.solr.search.TestRangeQuery skipped
      [mvn] testRandomRangeQueries(org.apache.solr.search.TestRangeQuery) skipped
      [mvn] testRangeQueries(org.apache.solr.search.TestRangeQuery) skipped
      [mvn] Running org.apache.solr.handler.admin.InfoHandlerTest
      [mvn] Tests run: 2, Failures: 0, Errors: 0, Skipped: 2, Time elapsed: 0 sec - in org.apache.solr.handler.admin.InfoHandlerTest
      [mvn] org.apache.solr.handler.admin.InfoHandlerTest skipped
      [mvn] testCoreAdminHandler(org.apache.solr.handler.admin.InfoHandlerTest) skipped
      [mvn] Running org.apache.solr.update.processor.ScriptEngineTest
      [mvn] Tests run: 7, Failures: 0, Errors: 0, Skipped: 7, Time elapsed: 0.001 sec - in org.apache.solr.update.processor.ScriptEngineTest
      [mvn] org.apache.solr.update.processor.ScriptEngineTest skipped
      [mvn] testEvalText(org.apache.solr.update.processor.ScriptEngineTest) skipped
      [mvn] testGetEngineByName(org.apache.solr.update.processor.ScriptEngineTest) skipped
      [mvn] testPut(org.apache.solr.update.processor.ScriptEngineTest) skipped
      [mvn] testEvalReader(org.apache.solr.update.processor.ScriptEngineTest) skipped
      [mvn] testGetEngineByExtension(org.apache.solr.update.processor.ScriptEngineTest) skipped
      [mvn] testJRuby(org.apache.solr.update.processor.ScriptEngineTest) skipped
      [mvn] Running org.apache.solr.internal.csv.writer.CSVConfigGuesserTest
      [mvn] Tests run: 3, Failures: 0, Errors: 0, Skipped: 0, Time elapsed: 0.001 sec - in org.apache.solr.internal.csv.writer.CSVConfigGuesserTest
      [mvn] testSetters(org.apache.solr.internal.csv.writer.CSVConfigGuesserTest)  Time elapsed: 0 sec
      [mvn] testConfigGuess1(org.apache.solr.internal.csv.writer.CSVConfigGuesserTest)  Time elapsed: 0 sec
      [mvn] testConfigGuess2(org.apache.solr.internal.csv.writer.CSVConfigGuesserTest)  Time elapsed: 0 sec
      [mvn] Running org.apache.solr.spelling.suggest.TestAnalyzeInfixSuggestions
      [mvn] Tests run: 3, Failures: 0, Errors: 0, Skipped: 3, Time elapsed: 0 sec - in org.apache.solr.spelling.suggest.TestAnalyzeInfixSuggestions
      [mvn] org.apache.solr.spelling.suggest.TestAnalyzeInfixSuggestions skipped
      [mvn] testSingle(org.apache.solr.spelling.suggest.TestAnalyzeInfixSuggestions) skipped
      [mvn] testMultiple(org.apache.solr.spelling.suggest.TestAnalyzeInfixSuggestions) skipped
      [mvn] Running org.apache.solr.search.TestReload
      [mvn] Tests run: 2, Failures: 0, Errors: 0, Skipped: 2, Time elapsed: 0 sec - in org.apache.solr.search.TestReload
      [mvn] org.apache.solr.search.TestReload skipped
      [mvn] testGetRealtimeReload(org.apache.solr.search.TestReload) skipped
      [mvn] Running org.apache.solr.cloud.BasicZkTest
      [mvn] Tests run: 2, Failures: 0, Errors: 0, Skipped: 2, Time elapsed: 0 sec - in org.apache.solr.cloud.BasicZkTest
      [mvn] org.apache.solr.cloud.BasicZkTest skipped
      [mvn] testBasic(org.apache.solr.cloud.BasicZkTest) skipped
      [mvn] Running org.apache.solr.spelling.suggest.TestFuzzyAnalyzedSuggestions
      [mvn] Tests run: 5, Failures: 0, Errors: 0, Skipped: 5, Time elapsed: 0 sec - in org.apache.solr.spelling.suggest.TestFuzzyAnalyzedSuggestions
      [mvn] org.apache.solr.spelling.suggest.TestFuzzyAnalyzedSuggestions skipped
      [mvn] testDefault(org.apache.solr.spelling.suggest.TestFuzzyAnalyzedSuggestions) skipped
      [mvn] testWithMaxEdit2(org.apache.solr.spelling.suggest.TestFuzzyAnalyzedSuggestions) skipped
      [mvn] testWithMinFuzzyLength2(org.apache.solr.spelling.suggest.TestFuzzyAnalyzedSuggestions) skipped
      [mvn] testWithNonFuzzyPrefix4(org.apache.solr.spelling.suggest.TestFuzzyAnalyzedSuggestions) skipped
      [mvn] Running org.apache.solr.schema.RequiredFieldsTest
      [mvn] Tests run: 4, Failures: 0, Errors: 0, Skipped: 4, Time elapsed: 0 sec - in org.apache.solr.schema.RequiredFieldsTest
      [mvn] org.apache.solr.schema.RequiredFieldsTest skipped
      [mvn] testRequiredFieldsConfig(org.apache.solr.schema.RequiredFieldsTest) skipped
      [mvn] testAddMultipleDocumentsWithErrors(org.apache.solr.schema.RequiredFieldsTest) skipped
      [mvn] testRequiredFieldsSingleAdd(org.apache.solr.schema.RequiredFieldsTest) skipped
      [mvn] Running org.apache.solr.search.similarities.TestIBSimilarityFactory
      [mvn] Tests run: 3, Failures: 0, Errors: 0, Skipped: 3, Time elapsed: 0 sec - in org.apache.solr.search.similarities.TestIBSimilarityFactory
      [mvn] org.apache.solr.search.similarities.TestIBSimilarityFactory skipped
      [mvn] test(org.apache.solr.search.similarities.TestIBSimilarityFactory) skipped
      [mvn] testParameters(org.apache.solr.search.similarities.TestIBSimilarityFactory) skipped
      [mvn] Running org.apache.solr.handler.admin.SystemInfoHandlerTest
      [mvn] Tests run: 2, Failures: 0, Errors: 0, Skipped: 2, Time elapsed: 0 sec - in org.apache.solr.handler.admin.SystemInfoHandlerTest
      [mvn] org.apache.solr.handler.admin.SystemInfoHandlerTest skipped
      [mvn] testMagickGetter(org.apache.solr.handler.admin.SystemInfoHandlerTest) skipped
      [mvn] Running org.apache.solr.update.DirectUpdateHandlerTest
      [mvn] Tests run: 7, Failures: 0, Errors: 0, Skipped: 7, Time elapsed: 0.001 sec - in org.apache.solr.update.DirectUpdateHandlerTest
      [mvn] org.apache.solr.update.DirectUpdateHandlerTest skipped
      [mvn] testPrepareCommit(org.apache.solr.update.DirectUpdateHandlerTest) skipped
      [mvn] testExpungeDeletes(org.apache.solr.update.DirectUpdateHandlerTest) skipped
      [mvn] testDeleteRollback(org.apache.solr.update.DirectUpdateHandlerTest) skipped
      [mvn] testRequireUniqueKey(org.apache.solr.update.DirectUpdateHandlerTest) skipped
      [mvn] testBasics(org.apache.solr.update.DirectUpdateHandlerTest) skipped
      [mvn] testAddRollback(org.apache.solr.update.DirectUpdateHandlerTest) skipped
      [mvn] Running org.apache.solr.update.UpdateParamsTest
      [mvn] Tests run: 2, Failures: 0, Errors: 0, Skipped: 2, Time elapsed: 0 sec - in org.apache.solr.update.UpdateParamsTest
      [mvn] org.apache.solr.update.UpdateParamsTest skipped
      [mvn] testUpdateProcessorParamDeprecationRemoved(org.apache.solr.update.UpdateParamsTest) skipped
      [mvn] Running org.apache.solr.rest.schema.TestSchemaSimilarityResource
      [mvn] Tests run: 2, Failures: 0, Errors: 0, Skipped: 2, Time elapsed: 0 sec - in org.apache.solr.rest.schema.TestSchemaSimilarityResource
      [mvn] org.apache.solr.rest.schema.TestSchemaSimilarityResource skipped
      [mvn] testGetSchemaSimilarity(org.apache.solr.rest.schema.TestSchemaSimilarityResource) skipped
      [mvn] Running org.apache.solr.core.TestReloadAndDeleteDocs
      [mvn] Tests run: 3, Failures: 0, Errors: 0, Skipped: 3, Time elapsed: 0 sec - in org.apache.solr.core.TestReloadAndDeleteDocs
      [mvn] org.apache.solr.core.TestReloadAndDeleteDocs skipped
      [mvn] testReloadAndDeleteDocsNoUpdateLog(org.apache.solr.core.TestReloadAndDeleteDocs) skipped
      [mvn] testReloadAndDeleteDocsWithUpdateLog(org.apache.solr.core.TestReloadAndDeleteDocs) skipped
      [mvn] Running org.apache.solr.rest.schema.TestUniqueKeyFieldResource
      [mvn] Tests run: 2, Failures: 0, Errors: 0, Skipped: 2, Time elapsed: 0 sec - in org.apache.solr.rest.schema.TestUniqueKeyFieldResource
      [mvn] org.apache.solr.rest.schema.TestUniqueKeyFieldResource skipped
      [mvn] testGetUniqueKey(org.apache.solr.rest.schema.TestUniqueKeyFieldResource) skipped
      [mvn] Running org.apache.solr.schema.TestBinaryField
      [mvn] Tests run: 2, Failures: 0, Errors: 0, Skipped: 2, Time elapsed: 0.001 sec - in org.apache.solr.schema.TestBinaryField
      [mvn] org.apache.solr.schema.TestBinaryField skipped
      [mvn] testSimple(org.apache.solr.schema.TestBinaryField) skipped
      [mvn] Running org.apache.solr.cloud.TestZkChroot
      [mvn] Tests run: 5, Failures: 0, Errors: 0, Skipped: 5, Time elapsed: 0 sec - in org.apache.solr.cloud.TestZkChroot
      [mvn] org.apache.solr.cloud.TestZkChroot skipped
      [mvn] testNoBootstrapConf(org.apache.solr.cloud.TestZkChroot) skipped
      [mvn] testInitPathExists(org.apache.solr.cloud.TestZkChroot) skipped
      [mvn] testChrootBootstrap(org.apache.solr.cloud.TestZkChroot) skipped
      [mvn] testWithUploadDir(org.apache.solr.cloud.TestZkChroot) skipped
      [mvn] Running org.apache.solr.spelling.suggest.TestPhraseSuggestions
      [mvn] Tests run: 2, Failures: 0, Errors: 0, Skipped: 2, Time elapsed: 0 sec - in org.apache.solr.spelling.suggest.TestPhraseSuggestions
      [mvn] org.apache.solr.spelling.suggest.TestPhraseSuggestions skipped
      [mvn] test(org.apache.solr.spelling.suggest.TestPhraseSuggestions) skipped
      [mvn] Running org.apache.solr.core.TestSolrDeletionPolicy1
      [mvn] Tests run: 4, Failures: 0, Errors: 0, Skipped: 4, Time elapsed: 0 sec - in org.apache.solr.core.TestSolrDeletionPolicy1
      [mvn] org.apache.solr.core.TestSolrDeletionPolicy1 skipped
      [mvn] testNumCommitsConfigured(org.apache.solr.core.TestSolrDeletionPolicy1) skipped
      [mvn] testKeepOptimizedOnlyCommits(org.apache.solr.core.TestSolrDeletionPolicy1) skipped
      [mvn] testCommitAge(org.apache.solr.core.TestSolrDeletionPolicy1) skipped
      [mvn] Running org.apache.solr.core.QueryResultKeyTest
      [mvn] Tests run: 3, Failures: 0, Errors: 0, Skipped: 3, Time elapsed: 0 sec - in org.apache.solr.core.QueryResultKeyTest
      [mvn] org.apache.solr.core.QueryResultKeyTest skipped
      [mvn] testQueryResultKeySortedFilters(org.apache.solr.core.QueryResultKeyTest) skipped
      [mvn] testFiltersHashCode(org.apache.solr.core.QueryResultKeyTest) skipped
      [mvn] Running org.apache.solr.core.TestBadConfig
      [mvn] Tests run: 14, Failures: 0, Errors: 0, Skipped: 14, Time elapsed: 0 sec - in org.apache.solr.core.TestBadConfig
      [mvn] org.apache.solr.core.TestBadConfig skipped
      [mvn] testUnknownSchemaAttribute(org.apache.solr.core.TestBadConfig) skipped
      [mvn] testBogusMergePolicy(org.apache.solr.core.TestBadConfig) skipped
      [mvn] testMultipleCFS(org.apache.solr.core.TestBadConfig) skipped
      [mvn] testMultipleIndexConfigs(org.apache.solr.core.TestBadConfig) skipped
      [mvn] testManagedSchemaCannotBeNamedSchemaDotXml(org.apache.solr.core.TestBadConfig) skipped
      [mvn] testSegmentMergerWithoutReopen(org.apache.solr.core.TestBadConfig) skipped
      [mvn] testSchemaMutableButNotManaged(org.apache.solr.core.TestBadConfig) skipped
      [mvn] testBogusScriptEngine(org.apache.solr.core.TestBadConfig) skipped
      [mvn] testInvalidScriptFile(org.apache.solr.core.TestBadConfig) skipped
      [mvn] testMissingScriptFile(org.apache.solr.core.TestBadConfig) skipped
      [mvn] testMultipleDirectoryFactories(org.apache.solr.core.TestBadConfig) skipped
      [mvn] testUnsetSysProperty(org.apache.solr.core.TestBadConfig) skipped
      [mvn] testUpdateLogButNoVersionField(org.apache.solr.core.TestBadConfig) skipped
      [mvn] Running org.apache.solr.update.DirectUpdateHandlerOptimizeTest
      [mvn] Tests run: 2, Failures: 0, Errors: 0, Skipped: 2, Time elapsed: 0 sec - in org.apache.solr.update.DirectUpdateHandlerOptimizeTest
      [mvn] org.apache.solr.update.DirectUpdateHandlerOptimizeTest skipped
      [mvn] testOptimize(org.apache.solr.update.DirectUpdateHandlerOptimizeTest) skipped
      [mvn] Running org.apache.solr.schema.MultiTermTest
      [mvn] Tests run: 4, Failures: 0, Errors: 0, Skipped: 4, Time elapsed: 0 sec - in org.apache.solr.schema.MultiTermTest
      [mvn] org.apache.solr.schema.MultiTermTest skipped
      [mvn] testDefaultCopiedToMulti(org.apache.solr.schema.MultiTermTest) skipped
      [mvn] testQueryCopiedToMulti(org.apache.solr.schema.MultiTermTest) skipped
      [mvn] testMultiFound(org.apache.solr.schema.MultiTermTest) skipped
      [mvn] Running org.apache.solr.handler.component.StatsComponentTest
      [mvn] Tests run: 8, Failures: 0, Errors: 0, Skipped: 8, Time elapsed: 0 sec - in org.apache.solr.handler.component.StatsComponentTest
      [mvn] org.apache.solr.handler.component.StatsComponentTest skipped
      [mvn] testStats(org.apache.solr.handler.component.StatsComponentTest) skipped
      [mvn] testFieldStatisticsResultsStringFieldAlwaysMissing(org.apache.solr.handler.component.StatsComponentTest) skipped
      [mvn] testFieldStatisticsResultsDateFieldAlwaysMissing(org.apache.solr.handler.component.StatsComponentTest) skipped
      [mvn] testFieldStatisticsResultsStringField(org.apache.solr.handler.component.StatsComponentTest) skipped
      [mvn] testFieldStatisticsResultsNumericFieldAlwaysMissing(org.apache.solr.handler.component.StatsComponentTest) skipped
      [mvn] testFieldStatisticsResultsDateField(org.apache.solr.handler.component.StatsComponentTest) skipped
      [mvn] testStatsFacetMultivaluedErrorHandling(org.apache.solr.handler.component.StatsComponentTest) skipped
      [mvn] Running org.apache.solr.handler.admin.CoreMergeIndexesAdminHandlerTest
      [mvn] Tests run: 2, Failures: 0, Errors: 0, Skipped: 2, Time elapsed: 0 sec - in org.apache.solr.handler.admin.CoreMergeIndexesAdminHandlerTest
      [mvn] org.apache.solr.handler.admin.CoreMergeIndexesAdminHandlerTest skipped
      [mvn] testMergeIndexesCoreAdminHandler(org.apache.solr.handler.admin.CoreMergeIndexesAdminHandlerTest) skipped
      [mvn] Running org.apache.solr.core.TestCoreDiscovery
      [mvn] Tests run: 5, Failures: 0, Errors: 0, Skipped: 5, Time elapsed: 0 sec - in org.apache.solr.core.TestCoreDiscovery
      [mvn] org.apache.solr.core.TestCoreDiscovery skipped
      [mvn] testDiscovery(org.apache.solr.core.TestCoreDiscovery) skipped
      [mvn] testAlternateCoreDir(org.apache.solr.core.TestCoreDiscovery) skipped
      [mvn] testNoCoreDir(org.apache.solr.core.TestCoreDiscovery) skipped
      [mvn] testDuplicateNames(org.apache.solr.core.TestCoreDiscovery) skipped
      [mvn] Running org.apache.solr.cloud.ChaosMonkeyNothingIsSafeTest
      [mvn] Tests run: 2, Failures: 0, Errors: 0, Skipped: 2, Time elapsed: 0 sec - in org.apache.solr.cloud.ChaosMonkeyNothingIsSafeTest
      [mvn] org.apache.solr.cloud.ChaosMonkeyNothingIsSafeTest skipped
      [mvn] testDistribSearch(org.apache.solr.cloud.ChaosMonkeyNothingIsSafeTest) skipped
      [mvn] Running org.apache.solr.util.TimeZoneUtilsTest
      [mvn] Tests run: 6, Failures: 0, Errors: 0, Skipped: 6, Time elapsed: 0 sec - in org.apache.solr.util.TimeZoneUtilsTest
      [mvn] org.apache.solr.util.TimeZoneUtilsTest skipped
      [mvn] testStupidIKnowButIDontTrustTheJVM(org.apache.solr.util.TimeZoneUtilsTest) skipped
      [mvn] testRandom(org.apache.solr.util.TimeZoneUtilsTest) skipped
      [mvn] testValidIds(org.apache.solr.util.TimeZoneUtilsTest) skipped
      [mvn] testInvalidInput(org.apache.solr.util.TimeZoneUtilsTest) skipped
      [mvn] testCustom(org.apache.solr.util.TimeZoneUtilsTest) skipped
      [mvn] Running org.apache.solr.rest.schema.TestFieldTypeCollectionResource
      [mvn] Tests run: 3, Failures: 0, Errors: 0, Skipped: 3, Time elapsed: 0 sec - in org.apache.solr.rest.schema.TestFieldTypeCollectionResource
      [mvn] org.apache.solr.rest.schema.TestFieldTypeCollectionResource skipped
      [mvn] testJsonGetAllFieldTypes(org.apache.solr.rest.schema.TestFieldTypeCollectionResource) skipped
      [mvn] testGetAllFieldTypes(org.apache.solr.rest.schema.TestFieldTypeCollectionResource) skipped
      [mvn] Running org.apache.solr.schema.CopyFieldTest
      [mvn] Tests run: 10, Failures: 0, Errors: 0, Skipped: 10, Time elapsed: 0.001 sec - in org.apache.solr.schema.CopyFieldTest
      [mvn] org.apache.solr.schema.CopyFieldTest skipped
      [mvn] testCatchAllCopyField(org.apache.solr.schema.CopyFieldTest) skipped
      [mvn] testCopyFieldSchemaFieldSchemaFieldInt(org.apache.solr.schema.CopyFieldTest) skipped
      [mvn] testExplicitSourceGlob(org.apache.solr.schema.CopyFieldTest) skipped
      [mvn] testGetDestination(org.apache.solr.schema.CopyFieldTest) skipped
      [mvn] testSourceGlobMatchesNoDynamicOrExplicitField(org.apache.solr.schema.CopyFieldTest) skipped
      [mvn] testGetSource(org.apache.solr.schema.CopyFieldTest) skipped
      [mvn] testCopyFieldSchemaFieldSchemaField(org.apache.solr.schema.CopyFieldTest) skipped
      [mvn] testCopyFieldFunctionality(org.apache.solr.schema.CopyFieldTest) skipped
      [mvn] testGetMaxChars(org.apache.solr.schema.CopyFieldTest) skipped
      [mvn] Running org.apache.solr.update.DocumentBuilderTest
      [mvn] Tests run: 14, Failures: 0, Errors: 0, Skipped: 14, Time elapsed: 0 sec - in org.apache.solr.update.DocumentBuilderTest
      [mvn] org.apache.solr.update.DocumentBuilderTest skipped
      [mvn] testWithPolyFieldsAndDocumentBoost(org.apache.solr.update.DocumentBuilderTest) skipped
      [mvn] testMultiField(org.apache.solr.update.DocumentBuilderTest) skipped
      [mvn] testNullField(org.apache.solr.update.DocumentBuilderTest) skipped
      [mvn] testMultiValuedFieldAndDocBoosts(org.apache.solr.update.DocumentBuilderTest) skipped
      [mvn] testBuildDocument(org.apache.solr.update.DocumentBuilderTest) skipped
      [mvn] testDocumentBoostOmitNorms(org.apache.solr.update.DocumentBuilderTest) skipped
      [mvn] testCopyFieldsAndFieldBoostsAndDocBoosts(org.apache.solr.update.DocumentBuilderTest) skipped
      [mvn] testExceptions(org.apache.solr.update.DocumentBuilderTest) skipped
      [mvn] testCopyFieldWithFieldBoost(org.apache.solr.update.DocumentBuilderTest) skipped
      [mvn] testBoost(org.apache.solr.update.DocumentBuilderTest) skipped
      [mvn] testCopyFieldWithDocumentBoost(org.apache.solr.update.DocumentBuilderTest) skipped
      [mvn] testBoostOmitNorms(org.apache.solr.update.DocumentBuilderTest) skipped
      [mvn] testWithPolyFieldsAndFieldBoost(org.apache.solr.update.DocumentBuilderTest) skipped
      [mvn] Running org.apache.solr.request.SimpleFacetsTest
      [mvn] Tests run: 33, Failures: 0, Errors: 0, Skipped: 33, Time elapsed: 0 sec - in org.apache.solr.request.SimpleFacetsTest
      [mvn] org.apache.solr.request.SimpleFacetsTest skipped
      [mvn] testNumericRangeFacetsOverflowSortableDouble(org.apache.solr.request.SimpleFacetsTest) skipped
      [mvn] testFacetPrefixMultiValued(org.apache.solr.request.SimpleFacetsTest) skipped
      [mvn] testNumericRangeFacetsSortableDouble(org.apache.solr.request.SimpleFacetsTest) skipped
      [mvn] testDateRangeFacets(org.apache.solr.request.SimpleFacetsTest) skipped
      [mvn] testNumericRangeFacetsOverflowSortableLong(org.apache.solr.request.SimpleFacetsTest) skipped
      [mvn] testSimpleFacetCounts(org.apache.solr.request.SimpleFacetsTest) skipped
      [mvn] testNumericRangeFacetsOverflowTrieLong(org.apache.solr.request.SimpleFacetsTest) skipped
      [mvn] testDateFacetsWithIncludeOption(org.apache.solr.request.SimpleFacetsTest) skipped
      [mvn] testSimpleGroupedQueryRangeFacets(org.apache.solr.request.SimpleFacetsTest) skipped
      [mvn] testTrieDateFacets(org.apache.solr.request.SimpleFacetsTest) skipped
      [mvn] testFacetSingleValued(org.apache.solr.request.SimpleFacetsTest) skipped
      [mvn] testDateFacetsWithTz(org.apache.solr.request.SimpleFacetsTest) skipped
      [mvn] testFacetSingleValuedFcs(org.apache.solr.request.SimpleFacetsTest) skipped
      [mvn] testTrieDateRangeFacetsWithIncludeOption(org.apache.solr.request.SimpleFacetsTest) skipped
      [mvn] testTrieDateRangeFacets(org.apache.solr.request.SimpleFacetsTest) skipped
      [mvn] testNumericRangeFacetsSortableLong(org.apache.solr.request.SimpleFacetsTest) skipped
      [mvn] testFacetPrefixSingleValuedFcs(org.apache.solr.request.SimpleFacetsTest) skipped
      [mvn] testSimpleGroupedFacets(org.apache.solr.request.SimpleFacetsTest) skipped
      [mvn] testNumericRangeFacetsSortableFloat(org.apache.solr.request.SimpleFacetsTest) skipped
      [mvn] testNumericRangeFacetsTrieLong(org.apache.solr.request.SimpleFacetsTest) skipped
      [mvn] testNumericRangeFacetsTrieDouble(org.apache.solr.request.SimpleFacetsTest) skipped
      [mvn] testNumericRangeFacetsTrieInt(org.apache.solr.request.SimpleFacetsTest) skipped
      [mvn] testTrieDateFacetsWithIncludeOption(org.apache.solr.request.SimpleFacetsTest) skipped
      [mvn] testDateFacets(org.apache.solr.request.SimpleFacetsTest) skipped
      [mvn] testRangeFacetInfiniteLoopDetection(org.apache.solr.request.SimpleFacetsTest) skipped
      [mvn] testNumericRangeFacetsTrieFloat(org.apache.solr.request.SimpleFacetsTest) skipped
      [mvn] testNumericRangeFacetsOverflowTrieDouble(org.apache.solr.request.SimpleFacetsTest) skipped
      [mvn] testEmptyFacetCounts(org.apache.solr.request.SimpleFacetsTest) skipped
      [mvn] testFacetPrefixSingleValued(org.apache.solr.request.SimpleFacetsTest) skipped
      [mvn] testNumericRangeFacetsSortableInt(org.apache.solr.request.SimpleFacetsTest) skipped
      [mvn] testCachingBigTerms(org.apache.solr.request.SimpleFacetsTest) skipped
      [mvn] testDateRangeFacetsWithIncludeOption(org.apache.solr.request.SimpleFacetsTest) skipped
      [mvn] Running org.apache.solr.search.TestNoOpRegenerator
      [mvn] Tests run: 2, Failures: 0, Errors: 0, Skipped: 2, Time elapsed: 0 sec - in org.apache.solr.search.TestNoOpRegenerator
      [mvn] org.apache.solr.search.TestNoOpRegenerator skipped
      [mvn] testRegeneration(org.apache.solr.search.TestNoOpRegenerator) skipped
      [mvn] Running org.apache.solr.core.TestJmxMonitoredMap
      [mvn] Tests run: 3, Failures: 0, Errors: 0, Skipped: 3, Time elapsed: 0 sec - in org.apache.solr.core.TestJmxMonitoredMap
      [mvn] org.apache.solr.core.TestJmxMonitoredMap skipped
      [mvn] testTypeName(org.apache.solr.core.TestJmxMonitoredMap) skipped
      [mvn] testPutRemoveClear(org.apache.solr.core.TestJmxMonitoredMap) skipped
      [mvn] Running org.apache.solr.TestRandomDVFaceting
      [mvn] Tests run: 2, Failures: 0, Errors: 0, Skipped: 2, Time elapsed: 0.001 sec - in org.apache.solr.TestRandomDVFaceting
      [mvn] org.apache.solr.TestRandomDVFaceting skipped
      [mvn] testRandomFaceting(org.apache.solr.TestRandomDVFaceting) skipped
      [mvn] Running org.apache.solr.core.TestCoreContainer
      [mvn] Tests run: 8, Failures: 0, Errors: 0, Skipped: 8, Time elapsed: 0.001 sec - in org.apache.solr.core.TestCoreContainer
      [mvn] org.apache.solr.core.TestCoreContainer skipped
      [mvn] testClassLoaderHierarchy(org.apache.solr.core.TestCoreContainer) skipped
      [mvn] testNoCores(org.apache.solr.core.TestCoreContainer) skipped
      [mvn] testReloadSequential(org.apache.solr.core.TestCoreContainer) skipped
      [mvn] testShareSchema(org.apache.solr.core.TestCoreContainer) skipped
      [mvn] testSharedLib(org.apache.solr.core.TestCoreContainer) skipped
      [mvn] testLogWatcherEnabledByDefault(org.apache.solr.core.TestCoreContainer) skipped
      [mvn] testReloadThreaded(org.apache.solr.core.TestCoreContainer) skipped
      [mvn] Running org.apache.solr.spelling.SpellCheckCollatorTest
      [mvn] Tests run: 9, Failures: 0, Errors: 0, Skipped: 9, Time elapsed: 0.001 sec - in org.apache.solr.spelling.SpellCheckCollatorTest
      [mvn] org.apache.solr.spelling.SpellCheckCollatorTest skipped
      [mvn] testEstimatedHitCounts(org.apache.solr.spelling.SpellCheckCollatorTest) skipped
      [mvn] testCollateWithOverride(org.apache.solr.spelling.SpellCheckCollatorTest) skipped
      [mvn] testCollationWithHypens(org.apache.solr.spelling.SpellCheckCollatorTest) skipped
      [mvn] testCollateWithMultipleRequestHandlers(org.apache.solr.spelling.SpellCheckCollatorTest) skipped
      [mvn] testExtendedCollate(org.apache.solr.spelling.SpellCheckCollatorTest) skipped
      [mvn] testContextSensitiveCollate(org.apache.solr.spelling.SpellCheckCollatorTest) skipped
      [mvn] testCollateWithGrouping(org.apache.solr.spelling.SpellCheckCollatorTest) skipped
      [mvn] testCollateWithFilter(org.apache.solr.spelling.SpellCheckCollatorTest) skipped
      [mvn] Running org.apache.solr.cloud.BasicDistributedZkTest
      [mvn] Tests run: 2, Failures: 0, Errors: 0, Skipped: 2, Time elapsed: 0.001 sec - in org.apache.solr.cloud.BasicDistributedZkTest
      [mvn] org.apache.solr.cloud.BasicDistributedZkTest skipped
      [mvn] testDistribSearch(org.apache.solr.cloud.BasicDistributedZkTest) skipped
      [mvn] Running org.apache.solr.update.processor.UniqFieldsUpdateProcessorFactoryTest
      [mvn] Tests run: 2, Failures: 0, Errors: 0, Skipped: 2, Time elapsed: 0 sec - in org.apache.solr.update.processor.UniqFieldsUpdateProcessorFactoryTest
      [mvn] org.apache.solr.update.processor.UniqFieldsUpdateProcessorFactoryTest skipped
      [mvn] testUniqFields(org.apache.solr.update.processor.UniqFieldsUpdateProcessorFactoryTest) skipped
      [mvn] Running org.apache.solr.spelling.SpellingQueryConverterTest
      [mvn] Tests run: 6, Failures: 0, Errors: 0, Skipped: 6, Time elapsed: 0 sec - in org.apache.solr.spelling.SpellingQueryConverterTest
      [mvn] org.apache.solr.spelling.SpellingQueryConverterTest skipped
      [mvn] testUnicode(org.apache.solr.spelling.SpellingQueryConverterTest) skipped
      [mvn] test(org.apache.solr.spelling.SpellingQueryConverterTest) skipped
      [mvn] testMultipleClauses(org.apache.solr.spelling.SpellingQueryConverterTest) skipped
      [mvn] testSpecialChars(org.apache.solr.spelling.SpellingQueryConverterTest) skipped
      [mvn] testRequiredOrProhibitedFlags(org.apache.solr.spelling.SpellingQueryConverterTest) skipped
      [mvn] Running org.apache.solr.internal.csv.CSVParserTest
      [mvn] Tests run: 23, Failures: 0, Errors: 0, Skipped: 0, Time elapsed: 0 sec - in org.apache.solr.internal.csv.CSVParserTest
      [mvn] testNextToken1(org.apache.solr.internal.csv.CSVParserTest)  Time elapsed: 0 sec
      [mvn] testNextToken2(org.apache.solr.internal.csv.CSVParserTest)  Time elapsed: 0 sec
      [mvn] testNextToken3(org.apache.solr.internal.csv.CSVParserTest)  Time elapsed: 0 sec
      [mvn] testNextToken4(org.apache.solr.internal.csv.CSVParserTest)  Time elapsed: 0 sec
      [mvn] testNextToken5(org.apache.solr.internal.csv.CSVParserTest)  Time elapsed: 0 sec
      [mvn] testNextToken6(org.apache.solr.internal.csv.CSVParserTest)  Time elapsed: 0 sec
      [mvn] testGetLine(org.apache.solr.internal.csv.CSVParserTest)  Time elapsed: 0 sec
      [mvn] testNextValue(org.apache.solr.internal.csv.CSVParserTest)  Time elapsed: 0 sec
      [mvn] testGetAllValues(org.apache.solr.internal.csv.CSVParserTest)  Time elapsed: 0 sec
      [mvn] testExcelStrategy1(org.apache.solr.internal.csv.CSVParserTest)  Time elapsed: 0 sec
      [mvn] testExcelStrategy2(org.apache.solr.internal.csv.CSVParserTest)  Time elapsed: 0 sec
      [mvn] testEndOfFileBehaviourExcel(org.apache.solr.internal.csv.CSVParserTest)  Time elapsed: 0 sec
      [mvn] testEndOfFileBehaviorCSV(org.apache.solr.internal.csv.CSVParserTest)  Time elapsed: 0 sec
      [mvn] testEmptyLineBehaviourExcel(org.apache.solr.internal.csv.CSVParserTest)  Time elapsed: 0 sec
      [mvn] testEmptyLineBehaviourCSV(org.apache.solr.internal.csv.CSVParserTest)  Time elapsed: 0 sec
      [mvn] testBackslashEscaping(org.apache.solr.internal.csv.CSVParserTest)  Time elapsed: 0 sec
      [mvn] testBackslashEscaping2(org.apache.solr.internal.csv.CSVParserTest)  Time elapsed: 0 sec
      [mvn] testDefaultStrategy(org.apache.solr.internal.csv.CSVParserTest)  Time elapsed: 0 sec
      [mvn] testUnicodeEscape(org.apache.solr.internal.csv.CSVParserTest)  Time elapsed: 0 sec
      [mvn] testCarriageReturnLineFeedEndings(org.apache.solr.internal.csv.CSVParserTest)  Time elapsed: 0 sec
      [mvn] testIgnoreEmptyLines(org.apache.solr.internal.csv.CSVParserTest)  Time elapsed: 0 sec
      [mvn] testLineTokenConsistency(org.apache.solr.internal.csv.CSVParserTest)  Time elapsed: 0 sec
      [mvn] testDelimiterIsWhitespace(org.apache.solr.internal.csv.CSVParserTest)  Time elapsed: 0 sec
      [mvn] Running org.apache.solr.handler.component.DistributedQueryElevationComponentTest
      [mvn] Tests run: 2, Failures: 0, Errors: 0, Skipped: 2, Time elapsed: 0.001 sec - in org.apache.solr.handler.component.DistributedQueryElevationComponentTest
      [mvn] org.apache.solr.handler.component.DistributedQueryElevationComponentTest skipped
      [mvn] testDistribSearch(org.apache.solr.handler.component.DistributedQueryElevationComponentTest) skipped
      [mvn] Running org.apache.solr.DisMaxRequestHandlerTest
      [mvn] Tests run: 3, Failures: 0, Errors: 0, Skipped: 3, Time elapsed: 0 sec - in org.apache.solr.DisMaxRequestHandlerTest
      [mvn] org.apache.solr.DisMaxRequestHandlerTest skipped
      [mvn] testSomeStuff(org.apache.solr.DisMaxRequestHandlerTest) skipped
      [mvn] testExtraBlankBQ(org.apache.solr.DisMaxRequestHandlerTest) skipped
      [mvn] Running org.apache.solr.core.TestXIncludeConfig
      [mvn] Tests run: 2, Failures: 0, Errors: 0, Skipped: 2, Time elapsed: 0 sec - in org.apache.solr.core.TestXIncludeConfig
      [mvn] org.apache.solr.core.TestXIncludeConfig skipped
      [mvn] testXInclude(org.apache.solr.core.TestXIncludeConfig) skipped
      [mvn] Running org.apache.solr.handler.component.BadComponentTest
      [mvn] Tests run: 2, Failures: 0, Errors: 0, Skipped: 2, Time elapsed: 0 sec - in org.apache.solr.handler.component.BadComponentTest
      [mvn] org.apache.solr.handler.component.BadComponentTest skipped
      [mvn] testBadElevate(org.apache.solr.handler.component.BadComponentTest) skipped
      [mvn] Running org.apache.solr.update.SoftAutoCommitTest
      [mvn] Tests run: 4, Failures: 0, Errors: 0, Skipped: 4, Time elapsed: 0 sec - in org.apache.solr.update.SoftAutoCommitTest
      [mvn] org.apache.solr.update.SoftAutoCommitTest skipped
      [mvn] testSoftAndHardCommitMaxTimeMixedAdds(org.apache.solr.update.SoftAutoCommitTest) skipped
      [mvn] testSoftAndHardCommitMaxTimeRapidAdds(org.apache.solr.update.SoftAutoCommitTest) skipped
      [mvn] testSoftAndHardCommitMaxTimeDelete(org.apache.solr.update.SoftAutoCommitTest) skipped
      [mvn] Running org.apache.solr.spelling.suggest.TestAnalyzedSuggestions
      [mvn] Tests run: 3, Failures: 0, Errors: 0, Skipped: 3, Time elapsed: 0 sec - in org.apache.solr.spelling.suggest.TestAnalyzedSuggestions
      [mvn] org.apache.solr.spelling.suggest.TestAnalyzedSuggestions skipped
      [mvn] test(org.apache.solr.spelling.suggest.TestAnalyzedSuggestions) skipped
      [mvn] testMultiple(org.apache.solr.spelling.suggest.TestAnalyzedSuggestions) skipped
      [mvn] Running org.apache.solr.handler.component.DebugComponentTest
      [mvn] Tests run: 3, Failures: 0, Errors: 0, Skipped: 3, Time elapsed: 0 sec - in org.apache.solr.handler.component.DebugComponentTest
      [mvn] org.apache.solr.handler.component.DebugComponentTest skipped
      [mvn] testPerItemInterface(org.apache.solr.handler.component.DebugComponentTest) skipped
      [mvn] testBasicInterface(org.apache.solr.handler.component.DebugComponentTest) skipped
      [mvn] Running org.apache.solr.search.QueryParsingTest
      [mvn] Tests run: 5, Failures: 0, Errors: 0, Skipped: 5, Time elapsed: 0 sec - in org.apache.solr.search.QueryParsingTest
      [mvn] org.apache.solr.search.QueryParsingTest skipped
      [mvn] testQParserEmptyInput(org.apache.solr.search.QueryParsingTest) skipped
      [mvn] testSort(org.apache.solr.search.QueryParsingTest) skipped
      [mvn] testBad(org.apache.solr.search.QueryParsingTest) skipped
      [mvn] testLiteralFunction(org.apache.solr.search.QueryParsingTest) skipped
      [mvn] Running org.apache.solr.core.RequestHandlersTest
      [mvn] Tests run: 5, Failures: 0, Errors: 0, Skipped: 5, Time elapsed: 0.001 sec - in org.apache.solr.core.RequestHandlersTest
      [mvn] org.apache.solr.core.RequestHandlersTest skipped
      [mvn] testInitCount(org.apache.solr.core.RequestHandlersTest) skipped
      [mvn] testStatistics(org.apache.solr.core.RequestHandlersTest) skipped
      [mvn] testPathNormalization(org.apache.solr.core.RequestHandlersTest) skipped
      [mvn] testLazyLoading(org.apache.solr.core.RequestHandlersTest) skipped
      [mvn] Running org.apache.solr.cloud.DeleteInactiveReplicaTest
      [mvn] Tests run: 2, Failures: 0, Errors: 0, Skipped: 2, Time elapsed: 0 sec - in org.apache.solr.cloud.DeleteInactiveReplicaTest
      [mvn] org.apache.solr.cloud.DeleteInactiveReplicaTest skipped
      [mvn] testDistribSearch(org.apache.solr.cloud.DeleteInactiveReplicaTest) skipped
      [mvn] Running org.apache.solr.core.TestImplicitCoreProperties
      [mvn] Tests run: 2, Failures: 0, Errors: 0, Skipped: 2, Time elapsed: 0 sec - in org.apache.solr.core.TestImplicitCoreProperties
      [mvn] org.apache.solr.core.TestImplicitCoreProperties skipped
      [mvn] testImplicitPropertiesAreSubstitutedInSolrConfig(org.apache.solr.core.TestImplicitCoreProperties) skipped
      [mvn] Running org.apache.solr.handler.PingRequestHandlerTest
      [mvn] Tests run: 6, Failures: 0, Errors: 0, Skipped: 6, Time elapsed: 0 sec - in org.apache.solr.handler.PingRequestHandlerTest
      [mvn] org.apache.solr.handler.PingRequestHandlerTest skipped
      [mvn] testBadActionRaisesException(org.apache.solr.handler.PingRequestHandlerTest) skipped
      [mvn] testGettingStatus(org.apache.solr.handler.PingRequestHandlerTest) skipped
      [mvn] testPingWithNoHealthCheck(org.apache.solr.handler.PingRequestHandlerTest) skipped
      [mvn] testDisablingServer(org.apache.solr.handler.PingRequestHandlerTest) skipped
      [mvn] testEnablingServer(org.apache.solr.handler.PingRequestHandlerTest) skipped
      [mvn] Running org.apache.solr.AnalysisAfterCoreReloadTest
      [mvn] Tests run: 2, Failures: 0, Errors: 0, Skipped: 2, Time elapsed: 0 sec - in org.apache.solr.AnalysisAfterCoreReloadTest
      [mvn] org.apache.solr.AnalysisAfterCoreReloadTest skipped
      [mvn] testStopwordsAfterCoreReload(org.apache.solr.AnalysisAfterCoreReloadTest) skipped
      [mvn] Running org.apache.solr.core.TestConfig
      [mvn] Tests run: 8, Failures: 0, Errors: 0, Skipped: 8, Time elapsed: 0 sec - in org.apache.solr.core.TestConfig
      [mvn] org.apache.solr.core.TestConfig skipped
      [mvn] testJavaProperty(org.apache.solr.core.TestConfig) skipped
      [mvn] testDisableRequetsHandler(org.apache.solr.core.TestConfig) skipped
      [mvn] testAutomaticDeprecationSupport(org.apache.solr.core.TestConfig) skipped
      [mvn] testDefaults(org.apache.solr.core.TestConfig) skipped
      [mvn] testLib(org.apache.solr.core.TestConfig) skipped
      [mvn] testSanityCheckTestSysPropsAreUsed(org.apache.solr.core.TestConfig) skipped
      [mvn] testTermIndexDivisor(org.apache.solr.core.TestConfig) skipped
      [mvn] Running org.apache.solr.highlight.HighlighterConfigTest
      [mvn] Tests run: 2, Failures: 0, Errors: 0, Skipped: 2, Time elapsed: 0 sec - in org.apache.solr.highlight.HighlighterConfigTest
      [mvn] org.apache.solr.highlight.HighlighterConfigTest skipped
      [mvn] testConfig(org.apache.solr.highlight.HighlighterConfigTest) skipped
      [mvn] Running org.apache.solr.rest.schema.TestSchemaVersionResource
      [mvn] Tests run: 2, Failures: 0, Errors: 0, Skipped: 2, Time elapsed: 0 sec - in org.apache.solr.rest.schema.TestSchemaVersionResource
      [mvn] org.apache.solr.rest.schema.TestSchemaVersionResource skipped
      [mvn] testGetSchemaVersion(org.apache.solr.rest.schema.TestSchemaVersionResource) skipped
      [mvn] Running org.apache.solr.cloud.DeleteShardTest
      [mvn] Tests run: 2, Failures: 0, Errors: 0, Skipped: 2, Time elapsed: 0 sec - in org.apache.solr.cloud.DeleteShardTest
      [mvn] org.apache.solr.cloud.DeleteShardTest skipped
      [mvn] testDistribSearch(org.apache.solr.cloud.DeleteShardTest) skipped
      [mvn] Running org.apache.solr.update.HardAutoCommitTest
      [mvn] Tests run: 2, Failures: 0, Errors: 0, Skipped: 2, Time elapsed: 0.001 sec - in org.apache.solr.update.HardAutoCommitTest
      [mvn] org.apache.solr.update.HardAutoCommitTest skipped
      [mvn] testCommitWithin(org.apache.solr.update.HardAutoCommitTest) skipped
      [mvn] Running org.apache.solr.update.processor.StatelessScriptUpdateProcessorFactoryTest
      [mvn] Tests run: 8, Failures: 0, Errors: 0, Skipped: 8, Time elapsed: 0 sec - in org.apache.solr.update.processor.StatelessScriptUpdateProcessorFactoryTest
      [mvn] org.apache.solr.update.processor.StatelessScriptUpdateProcessorFactoryTest skipped
      [mvn] testMissingFunctions(org.apache.solr.update.processor.StatelessScriptUpdateProcessorFactoryTest) skipped
      [mvn] testSingleScript(org.apache.solr.update.processor.StatelessScriptUpdateProcessorFactoryTest) skipped
      [mvn] testPropogatedException(org.apache.solr.update.processor.StatelessScriptUpdateProcessorFactoryTest) skipped
      [mvn] testFullRequestHandlerFlow(org.apache.solr.update.processor.StatelessScriptUpdateProcessorFactoryTest) skipped
      [mvn] testForceEngine(org.apache.solr.update.processor.StatelessScriptUpdateProcessorFactoryTest) skipped
      [mvn] testConditionalExecution(org.apache.solr.update.processor.StatelessScriptUpdateProcessorFactoryTest) skipped
      [mvn] testMultipleScripts(org.apache.solr.update.processor.StatelessScriptUpdateProcessorFactoryTest) skipped
      [mvn] Running org.apache.solr.cloud.hdfs.HdfsCollectionsAPIDistributedZkTest
      [mvn] Tests run: 2, Failures: 0, Errors: 0, Skipped: 2, Time elapsed: 0 sec - in org.apache.solr.cloud.hdfs.HdfsCollectionsAPIDistributedZkTest
      [mvn] org.apache.solr.cloud.hdfs.HdfsCollectionsAPIDistributedZkTest skipped
      [mvn] testDistribSearch(org.apache.solr.cloud.hdfs.HdfsCollectionsAPIDistributedZkTest) skipped
      [mvn] Running org.apache.solr.rest.schema.TestSolrQueryParserResource
      [mvn] Tests run: 2, Failures: 0, Errors: 0, Skipped: 2, Time elapsed: 0 sec - in org.apache.solr.rest.schema.TestSolrQueryParserResource
      [mvn] org.apache.solr.rest.schema.TestSolrQueryParserResource skipped
      [mvn] testGetSolrQueryParser(org.apache.solr.rest.schema.TestSolrQueryParserResource) skipped
      [mvn] Running org.apache.solr.cloud.TestMultiCoreConfBootstrap
      [mvn] Tests run: 2, Failures: 0, Errors: 0, Skipped: 2, Time elapsed: 0 sec - in org.apache.solr.cloud.TestMultiCoreConfBootstrap
      [mvn] org.apache.solr.cloud.TestMultiCoreConfBootstrap skipped
      [mvn] testMultiCoreConfBootstrap(org.apache.solr.cloud.TestMultiCoreConfBootstrap) skipped
      [mvn] Running org.apache.solr.cloud.hdfs.HdfsSyncSliceTest
      [mvn] Tests run: 2, Failures: 0, Errors: 0, Skipped: 2, Time elapsed: 0 sec - in org.apache.solr.cloud.hdfs.HdfsSyncSliceTest
      [mvn] org.apache.solr.cloud.hdfs.HdfsSyncSliceTest skipped
      [mvn] testDistribSearch(org.apache.solr.cloud.hdfs.HdfsSyncSliceTest) skipped
      [mvn] Running org.apache.solr.spelling.suggest.SuggesterFSTTest
      [mvn] Tests run: 5, Failures: 0, Errors: 0, Skipped: 5, Time elapsed: 0 sec - in org.apache.solr.spelling.suggest.SuggesterFSTTest
      [mvn] org.apache.solr.spelling.suggest.SuggesterFSTTest skipped
      [mvn] testRebuild(org.apache.solr.spelling.suggest.SuggesterFSTTest) skipped
      [mvn] testSuggestions(org.apache.solr.spelling.suggest.SuggesterFSTTest) skipped
      [mvn] testReload(org.apache.solr.spelling.suggest.SuggesterFSTTest) skipped
      [mvn] testAnalyzer(org.apache.solr.spelling.suggest.SuggesterFSTTest) skipped
      [mvn] Running org.apache.solr.search.TestFastLRUCache
      [mvn] Tests run: 8, Failures: 0, Errors: 0, Skipped: 8, Time elapsed: 0 sec - in org.apache.solr.search.TestFastLRUCache
      [mvn] org.apache.solr.search.TestFastLRUCache skipped
      [mvn] testPercentageAutowarmMultiple(org.apache.solr.search.TestFastLRUCache) skipped
      [mvn] testSimple(org.apache.solr.search.TestFastLRUCache) skipped
      [mvn] testFullAutowarm(org.apache.solr.search.TestFastLRUCache) skipped
      [mvn] testNoAutowarm(org.apache.solr.search.TestFastLRUCache) skipped
      [mvn] testRandom(org.apache.solr.search.TestFastLRUCache) skipped
      [mvn] testPercentageAutowarm(org.apache.solr.search.TestFastLRUCache) skipped
      [mvn] testOldestItems(org.apache.solr.search.TestFastLRUCache) skipped
      [mvn] Running org.apache.solr.cloud.RecoveryZkTest
      [mvn] Tests run: 2, Failures: 0, Errors: 0, Skipped: 2, Time elapsed: 0 sec - in org.apache.solr.cloud.RecoveryZkTest
      [mvn] org.apache.solr.cloud.RecoveryZkTest skipped
      [mvn] testDistribSearch(org.apache.solr.cloud.RecoveryZkTest) skipped
      [mvn] Running org.apache.solr.util.TestNumberUtils
      [mvn] Tests run: 2, Failures: 0, Errors: 0, Skipped: 2, Time elapsed: 0 sec - in org.apache.solr.util.TestNumberUtils
      [mvn] org.apache.solr.util.TestNumberUtils skipped
      [mvn] testConverters(org.apache.solr.util.TestNumberUtils) skipped
      [mvn] Running org.apache.solr.OutputWriterTest
      [mvn] Tests run: 6, Failures: 0, Errors: 0, Skipped: 6, Time elapsed: 0 sec - in org.apache.solr.OutputWriterTest
      [mvn] org.apache.solr.OutputWriterTest skipped
      [mvn] testUselessWriter(org.apache.solr.OutputWriterTest) skipped
      [mvn] testLazy(org.apache.solr.OutputWriterTest) skipped
      [mvn] testTrivialXsltWriterInclude(org.apache.solr.OutputWriterTest) skipped
      [mvn] testTrivialXsltWriter(org.apache.solr.OutputWriterTest) skipped
      [mvn] testSOLR59responseHeaderVersions(org.apache.solr.OutputWriterTest) skipped
      [mvn] Running org.apache.solr.store.hdfs.HdfsLockFactoryTest
      [mvn] Tests run: 2, Failures: 0, Errors: 0, Skipped: 2, Time elapsed: 0 sec - in org.apache.solr.store.hdfs.HdfsLockFactoryTest
      [mvn] org.apache.solr.store.hdfs.HdfsLockFactoryTest skipped
      [mvn] testBasic(org.apache.solr.store.hdfs.HdfsLockFactoryTest) skipped
      [mvn] Running org.apache.solr.rest.schema.TestClassNameShortening
      [mvn] Tests run: 4, Failures: 0, Errors: 0, Skipped: 4, Time elapsed: 0 sec - in org.apache.solr.rest.schema.TestClassNameShortening
      [mvn] org.apache.solr.rest.schema.TestClassNameShortening skipped
      [mvn] testShortenedGlobalSimilarityStaysShortened(org.apache.solr.rest.schema.TestClassNameShortening) skipped
      [mvn] testClassNamesNotShortened(org.apache.solr.rest.schema.TestClassNameShortening) skipped
      [mvn] testShortenedClassNamesStayShortened(org.apache.solr.rest.schema.TestClassNameShortening) skipped
      [mvn] Running org.apache.solr.handler.admin.CoreAdminCreateDiscoverTest
      [mvn] Tests run: 4, Failures: 0, Errors: 0, Skipped: 4, Time elapsed: 0 sec - in org.apache.solr.handler.admin.CoreAdminCreateDiscoverTest
      [mvn] org.apache.solr.handler.admin.CoreAdminCreateDiscoverTest skipped
      [mvn] testCreateSavesRegProps(org.apache.solr.handler.admin.CoreAdminCreateDiscoverTest) skipped
      [mvn] testCreateSavesSysProps(org.apache.solr.handler.admin.CoreAdminCreateDiscoverTest) skipped
      [mvn] testCannotCreateTwoCoresWithSameInstanceDir(org.apache.solr.handler.admin.CoreAdminCreateDiscoverTest) skipped
      [mvn] Running org.apache.solr.update.processor.RegexBoostProcessorTest
      [mvn] Tests run: 5, Failures: 0, Errors: 0, Skipped: 5, Time elapsed: 0 sec - in org.apache.solr.update.processor.RegexBoostProcessorTest
      [mvn] org.apache.solr.update.processor.RegexBoostProcessorTest skipped
      [mvn] testBoostGood(org.apache.solr.update.processor.RegexBoostProcessorTest) skipped
      [mvn] testTwoRules(org.apache.solr.update.processor.RegexBoostProcessorTest) skipped
      [mvn] testDeboostOld(org.apache.solr.update.processor.RegexBoostProcessorTest) skipped
      [mvn] testNoBoost(org.apache.solr.update.processor.RegexBoostProcessorTest) skipped
      [mvn] Running org.apache.solr.search.function.SortByFunctionTest
      [mvn] Tests run: 3, Failures: 0, Errors: 0, Skipped: 3, Time elapsed: 0 sec - in org.apache.solr.search.function.SortByFunctionTest
      [mvn] org.apache.solr.search.function.SortByFunctionTest skipped
      [mvn] test(org.apache.solr.search.function.SortByFunctionTest) skipped
      [mvn] testSortJoinDocFreq(org.apache.solr.search.function.SortByFunctionTest) skipped
      [mvn] Running org.apache.solr.internal.csv.ExtendedBufferedReaderTest
      [mvn] Tests run: 8, Failures: 0, Errors: 0, Skipped: 0, Time elapsed: 0 sec - in org.apache.solr.internal.csv.ExtendedBufferedReaderTest
      [mvn] testConstructors(org.apache.solr.internal.csv.ExtendedBufferedReaderTest)  Time elapsed: 0 sec
      [mvn] testReadLookahead1(org.apache.solr.internal.csv.ExtendedBufferedReaderTest)  Time elapsed: 0 sec
      [mvn] testReadLookahead2(org.apache.solr.internal.csv.ExtendedBufferedReaderTest)  Time elapsed: 0 sec
      [mvn] testMarkSupported(org.apache.solr.internal.csv.ExtendedBufferedReaderTest)  Time elapsed: 0 sec
      [mvn] testReadLine(org.apache.solr.internal.csv.ExtendedBufferedReaderTest)  Time elapsed: 0 sec
      [mvn] testSkip0(org.apache.solr.internal.csv.ExtendedBufferedReaderTest)  Time elapsed: 0 sec
      [mvn] testSkipUntil(org.apache.solr.internal.csv.ExtendedBufferedReaderTest)  Time elapsed: 0 sec
      [mvn] testReadUntil(org.apache.solr.internal.csv.ExtendedBufferedReaderTest)  Time elapsed: 0 sec
      [mvn] Running org.apache.solr.rest.schema.TestDefaultSearchFieldResource
      [mvn] Tests run: 2, Failures: 0, Errors: 0, Skipped: 2, Time elapsed: 0 sec - in org.apache.solr.rest.schema.TestDefaultSearchFieldResource
      [mvn] org.apache.solr.rest.schema.TestDefaultSearchFieldResource skipped
      [mvn] testGetDefaultSearchField(org.apache.solr.rest.schema.TestDefaultSearchFieldResource) skipped
      [mvn] Running org.apache.solr.search.TestRTGBase
      [mvn] Tests run: 0, Failures: 0, Errors: 0, Skipped: 0, Time elapsed: 0 sec - in org.apache.solr.search.TestRTGBase
      [mvn] Running org.apache.solr.schema.PolyFieldTest
      [mvn] Tests run: 5, Failures: 0, Errors: 0, Skipped: 5, Time elapsed: 0 sec - in org.apache.solr.schema.PolyFieldTest
      [mvn] org.apache.solr.schema.PolyFieldTest skipped
      [mvn] testSearching(org.apache.solr.schema.PolyFieldTest) skipped
      [mvn] testSearchDetails(org.apache.solr.schema.PolyFieldTest) skipped
      [mvn] testSchemaBasics(org.apache.solr.schema.PolyFieldTest) skipped
      [mvn] testPointFieldType(org.apache.solr.schema.PolyFieldTest) skipped
      [mvn] Running org.apache.solr.cloud.CustomCollectionTest
      [mvn] Tests run: 2, Failures: 0, Errors: 0, Skipped: 2, Time elapsed: 0 sec - in org.apache.solr.cloud.CustomCollectionTest
      [mvn] org.apache.solr.cloud.CustomCollectionTest skipped
      [mvn] testDistribSearch(org.apache.solr.cloud.CustomCollectionTest) skipped
      [mvn] Running org.apache.solr.search.TestStressRecovery
      [mvn] Tests run: 2, Failures: 0, Errors: 0, Skipped: 2, Time elapsed: 0 sec - in org.apache.solr.search.TestStressRecovery
      [mvn] org.apache.solr.search.TestStressRecovery skipped
      [mvn] testStressRecovery(org.apache.solr.search.TestStressRecovery) skipped
      [mvn] Running org.apache.solr.spelling.suggest.SuggesterWFSTTest
      [mvn] Tests run: 5, Failures: 0, Errors: 0, Skipped: 5, Time elapsed: 0 sec - in org.apache.solr.spelling.suggest.SuggesterWFSTTest
      [mvn] org.apache.solr.spelling.suggest.SuggesterWFSTTest skipped
      [mvn] testReload(org.apache.solr.spelling.suggest.SuggesterWFSTTest) skipped
      [mvn] testRebuild(org.apache.solr.spelling.suggest.SuggesterWFSTTest) skipped
      [mvn] testAnalyzer(org.apache.solr.spelling.suggest.SuggesterWFSTTest) skipped
      [mvn] testSuggestions(org.apache.solr.spelling.suggest.SuggesterWFSTTest) skipped
      [mvn] Running org.apache.solr.cloud.SyncSliceTest
      [mvn] Tests run: 2, Failures: 0, Errors: 0, Skipped: 2, Time elapsed: 0 sec - in org.apache.solr.cloud.SyncSliceTest
      [mvn] org.apache.solr.cloud.SyncSliceTest skipped
      [mvn] testDistribSearch(org.apache.solr.cloud.SyncSliceTest) skipped
      [mvn] Running org.apache.solr.EchoParamsTest
      [mvn] Tests run: 2, Failures: 0, Errors: 0, Skipped: 2, Time elapsed: 0 sec - in org.apache.solr.EchoParamsTest
      [mvn] org.apache.solr.EchoParamsTest skipped
      [mvn] test(org.apache.solr.EchoParamsTest) skipped
      [mvn] Running org.apache.solr.cloud.ZkControllerTest
      [mvn] Tests run: 4, Failures: 0, Errors: 0, Skipped: 4, Time elapsed: 0 sec - in org.apache.solr.cloud.ZkControllerTest
      [mvn] org.apache.solr.cloud.ZkControllerTest skipped
      [mvn] testUploadToCloud(org.apache.solr.cloud.ZkControllerTest) skipped
      [mvn] testReadConfigName(org.apache.solr.cloud.ZkControllerTest) skipped
      [mvn] testNodeNameUrlConversion(org.apache.solr.cloud.ZkControllerTest) skipped
      [mvn] Running org.apache.solr.update.PeerSyncTest
      [mvn] Tests run: 2, Failures: 0, Errors: 0, Skipped: 2, Time elapsed: 0 sec - in org.apache.solr.update.PeerSyncTest
      [mvn] org.apache.solr.update.PeerSyncTest skipped
      [mvn] testDistribSearch(org.apache.solr.update.PeerSyncTest) skipped
      [mvn] Running org.apache.solr.TestTrie
      [mvn] Tests run: 9, Failures: 0, Errors: 0, Skipped: 9, Time elapsed: 0 sec - in org.apache.solr.TestTrie
      [mvn] org.apache.solr.TestTrie skipped
      [mvn] testTrieTermQuery(org.apache.solr.TestTrie) skipped
      [mvn] testTrieDoubleRangeSearch(org.apache.solr.TestTrie) skipped
      [mvn] testTrieIntRangeSearch(org.apache.solr.TestTrie) skipped
      [mvn] testTrieFacet_PrecisionStep(org.apache.solr.TestTrie) skipped
      [mvn] testTrieDoubleRangeSearch_CustomPrecisionStep(org.apache.solr.TestTrie) skipped
      [mvn] testTrieLongRangeSearch(org.apache.solr.TestTrie) skipped
      [mvn] testTrieFloatRangeSearch(org.apache.solr.TestTrie) skipped
      [mvn] testTrieDateRangeSearch(org.apache.solr.TestTrie) skipped
      [mvn] Running org.apache.solr.rest.schema.TestDynamicFieldCollectionResource
      [mvn] Tests run: 6, Failures: 0, Errors: 0, Skipped: 6, Time elapsed: 0 sec - in org.apache.solr.rest.schema.TestDynamicFieldCollectionResource
      [mvn] org.apache.solr.rest.schema.TestDynamicFieldCollectionResource skipped
      [mvn] testNotFoundDynamicFields(org.apache.solr.rest.schema.TestDynamicFieldCollectionResource) skipped
      [mvn] testJsonGetAllDynamicFields(org.apache.solr.rest.schema.TestDynamicFieldCollectionResource) skipped
      [mvn] testGetAllDynamicFields(org.apache.solr.rest.schema.TestDynamicFieldCollectionResource) skipped
      [mvn] testGetTwoDynamicFields(org.apache.solr.rest.schema.TestDynamicFieldCollectionResource) skipped
      [mvn] testJsonGetTwoDynamicFields(org.apache.solr.rest.schema.TestDynamicFieldCollectionResource) skipped
      [mvn] Running org.apache.solr.core.TestArbitraryIndexDir
      [mvn] Tests run: 2, Failures: 0, Errors: 0, Skipped: 2, Time elapsed: 0 sec - in org.apache.solr.core.TestArbitraryIndexDir
      [mvn] org.apache.solr.core.TestArbitraryIndexDir skipped
      [mvn] testLoadNewIndexDir(org.apache.solr.core.TestArbitraryIndexDir) skipped
      [mvn] Running org.apache.solr.update.TestIndexingPerformance
      [mvn] Tests run: 2, Failures: 0, Errors: 0, Skipped: 2, Time elapsed: 0 sec - in org.apache.solr.update.TestIndexingPerformance
      [mvn] org.apache.solr.update.TestIndexingPerformance skipped
      [mvn] testIndexingPerf(org.apache.solr.update.TestIndexingPerformance) skipped
      [mvn] Running org.apache.solr.search.TestQueryUtils
      [mvn] Tests run: 2, Failures: 0, Errors: 0, Skipped: 2, Time elapsed: 0 sec - in org.apache.solr.search.TestQueryUtils
      [mvn] org.apache.solr.search.TestQueryUtils skipped
      [mvn] testNegativeQueries(org.apache.solr.search.TestQueryUtils) skipped
      [mvn] Running org.apache.solr.cloud.SolrXmlInZkTest
      [mvn] Tests run: 9, Failures: 0, Errors: 0, Skipped: 9, Time elapsed: 0 sec - in org.apache.solr.cloud.SolrXmlInZkTest
      [mvn] org.apache.solr.cloud.SolrXmlInZkTest skipped
      [mvn] testNotInZkAndShouldBe(org.apache.solr.cloud.SolrXmlInZkTest) skipped
      [mvn] testHardCodedSolrXml(org.apache.solr.cloud.SolrXmlInZkTest) skipped
      [mvn] testOnDiskOnly(org.apache.solr.cloud.SolrXmlInZkTest) skipped
      [mvn] testXmlOnBoth(org.apache.solr.cloud.SolrXmlInZkTest) skipped
      [mvn] testNotInZkOrOnDisk(org.apache.solr.cloud.SolrXmlInZkTest) skipped
      [mvn] testZkHostDiscovery(org.apache.solr.cloud.SolrXmlInZkTest) skipped
      [mvn] testXmlInZkOnly(org.apache.solr.cloud.SolrXmlInZkTest) skipped
      [mvn] testBadSysProp(org.apache.solr.cloud.SolrXmlInZkTest) skipped
      [mvn] Running org.apache.solr.internal.csv.CSVUtilsTest
      [mvn] Tests run: 14, Failures: 0, Errors: 0, Skipped: 0, Time elapsed: 0 sec - in org.apache.solr.internal.csv.CSVUtilsTest
      [mvn] testParse1(org.apache.solr.internal.csv.CSVUtilsTest)  Time elapsed: 0 sec
      [mvn] testParse2(org.apache.solr.internal.csv.CSVUtilsTest)  Time elapsed: 0 sec
      [mvn] testParse3(org.apache.solr.internal.csv.CSVUtilsTest)  Time elapsed: 0 sec
      [mvn] testParse4(org.apache.solr.internal.csv.CSVUtilsTest)  Time elapsed: 0 sec
      [mvn] testParse5(org.apache.solr.internal.csv.CSVUtilsTest)  Time elapsed: 0 sec
      [mvn] testParse6(org.apache.solr.internal.csv.CSVUtilsTest)  Time elapsed: 0 sec
      [mvn] testParse7(org.apache.solr.internal.csv.CSVUtilsTest)  Time elapsed: 0 sec
      [mvn] testParseLine1(org.apache.solr.internal.csv.CSVUtilsTest)  Time elapsed: 0 sec
      [mvn] testParseLine2(org.apache.solr.internal.csv.CSVUtilsTest)  Time elapsed: 0 sec
      [mvn] testParseLine3(org.apache.solr.internal.csv.CSVUtilsTest)  Time elapsed: 0 sec
      [mvn] testParseLine4(org.apache.solr.internal.csv.CSVUtilsTest)  Time elapsed: 0 sec
      [mvn] testParseLine5(org.apache.solr.internal.csv.CSVUtilsTest)  Time elapsed: 0 sec
      [mvn] testParseLine6(org.apache.solr.internal.csv.CSVUtilsTest)  Time elapsed: 0 sec
      [mvn] testParseLine7(org.apache.solr.internal.csv.CSVUtilsTest)  Time elapsed: 0 sec
      [mvn] 
      [mvn] Results :
      [mvn] 
      [mvn] Failed tests: 
      [mvn]   DeleteReplicaTest>SolrTestCaseJ4.afterClass:135->SolrTestCaseJ4.endTrackingZkClients:343->Assert.fail:93 ERROR: SolrZkClient opens=15 closes=14
      [mvn] 
      [mvn] Tests in error: 
      [mvn]   DeleteReplicaTest>BaseDistributedSearchTestCase.testDistribSearch:835->doTest:115->deleteLiveReplicaTest:134->removeAndWaitForReplicaGone:148 » RemoteSolr
      [mvn]   DeleteReplicaTest.org.apache.solr.cloud.DeleteReplicaTest » ThreadLeak 2 threa...
      [mvn]   DeleteReplicaTest.org.apache.solr.cloud.DeleteReplicaTest » ThreadLeak There a...
      [mvn] 
      [mvn] Tests run: 1573, Failures: 1, Errors: 3, Skipped: 476
      [mvn] 
      [mvn] [INFO] ------------------------------------------------------------------------
      [mvn] [INFO] Building Apache Solr Core aggregator POM
      [mvn] [INFO]    task-segment: [install]
      [mvn] [INFO] ------------------------------------------------------------------------
      [mvn] [INFO] [groovy:execute {execution: generate-timestamps-and-get-top-level-basedir}]
      [mvn] [INFO] [buildnumber:create {execution: default}]
      [mvn] [INFO] [enforcer:enforce {execution: enforce-java-compat-version-and-maven-2.2.1}]
      [mvn] [INFO] [remote-resources:process {execution: default}]
      [mvn] [INFO] [bundle:manifest {execution: bundle-manifest}]
      [mvn] [WARNING] Ignoring project type pom - supportedProjectTypes = [jar, bundle]
      [mvn] [INFO] [forbiddenapis:check {execution: solr-shared-check-forbidden-apis}]
      [mvn] [INFO] Reading bundled API signatures: jdk-unsafe
      [mvn] [INFO] Reading bundled API signatures: jdk-deprecated
      [mvn] [INFO] Reading API signatures: /usr/home/hudson/hudson-slave/workspace/Lucene-Solr-Maven-4.x/lucene/tools/forbiddenApis/base.txt
      [mvn] [INFO] Loading classes to check...
      [mvn] [WARNING] Classes directory does not exist, forbiddenapis check skipped: /usr/home/hudson/hudson-slave/workspace/Lucene-Solr-Maven-4.x/maven-build/solr/core/target/classes
      [mvn] [INFO] [forbiddenapis:testCheck {execution: solr-shared-test-check-forbidden-apis}]
      [mvn] [INFO] Reading bundled API signatures: jdk-unsafe
      [mvn] [INFO] Reading bundled API signatures: jdk-deprecated
      [mvn] [INFO] Reading API signatures: /usr/home/hudson/hudson-slave/workspace/Lucene-Solr-Maven-4.x/lucene/tools/forbiddenApis/tests.txt
      [mvn] [INFO] Reading API signatures: /usr/home/hudson/hudson-slave/workspace/Lucene-Solr-Maven-4.x/lucene/tools/forbiddenApis/base.txt
      [mvn] [INFO] Loading classes to check...
      [mvn] [WARNING] Classes directory does not exist, forbiddenapis check skipped: /usr/home/hudson/hudson-slave/workspace/Lucene-Solr-Maven-4.x/maven-build/solr/core/target/test-classes
      [mvn] [INFO] [site:attach-descriptor {execution: default-attach-descriptor}]
      [mvn] [INFO] [install:install {execution: default-install}]
      [mvn] [INFO] Installing /usr/home/hudson/hudson-slave/workspace/Lucene-Solr-Maven-4.x/maven-build/solr/core/pom.xml to /home/hudson/.m2/repository/org/apache/solr/solr-core-aggregator/4.6-SNAPSHOT/solr-core-aggregator-4.6-SNAPSHOT.pom
      [mvn] [INFO] ------------------------------------------------------------------------
      [mvn] [INFO] Building Apache Solr Solrj tests
      [mvn] [INFO]    task-segment: [install]
      [mvn] [INFO] ------------------------------------------------------------------------
      [mvn] [INFO] [groovy:execute {execution: generate-timestamps-and-get-top-level-basedir}]
      [mvn] [INFO] [buildnumber:create {execution: default}]
      [mvn] [INFO] [enforcer:enforce {execution: enforce-java-compat-version-and-maven-2.2.1}]
      [mvn] [INFO] [remote-resources:process {execution: default}]
      [mvn] [INFO] [resources:resources {execution: default-resources}]
      [mvn] [INFO] Using 'UTF-8' encoding to copy filtered resources.
      [mvn] [INFO] skip non existing resourceDirectory /usr/home/hudson/hudson-slave/workspace/Lucene-Solr-Maven-4.x/maven-build/solr/solrj/src/test/src/main/resources
      [mvn] [INFO] Copying 3 resources
      [mvn] [INFO] [compiler:compile {execution: default-compile}]
      [mvn] [INFO] No sources to compile
      [mvn] [INFO] [bundle:manifest {execution: bundle-manifest}]
      [mvn] [INFO] [resources:testResources {execution: default-testResources}]
      [mvn] [INFO] Using 'UTF-8' encoding to copy filtered resources.
      [mvn] [INFO] Copying 18 resources
      [mvn] [INFO] Copying 1 resource
      [mvn] [INFO] Copying 3 resources
      [mvn] [INFO] [compiler:testCompile {execution: default-testCompile}]
      [mvn] [INFO] Changes detected - recompiling the module!
      [mvn] [INFO] Compiling 55 source files to /usr/home/hudson/hudson-slave/workspace/Lucene-Solr-Maven-4.x/maven-build/solr/solrj/src/test/target/test-classes
      [mvn] [WARNING] /usr/home/hudson/hudson-slave/workspace/Lucene-Solr-Maven-4.x/solr/solrj/src/test/org/apache/solr/client/solrj/SolrQueryTest.java: Some input files use or override a deprecated API.
      [mvn] [WARNING] /usr/home/hudson/hudson-slave/workspace/Lucene-Solr-Maven-4.x/solr/solrj/src/test/org/apache/solr/client/solrj/SolrQueryTest.java: Recompile with -Xlint:deprecation for details.
      [mvn] [WARNING] /usr/home/hudson/hudson-slave/workspace/Lucene-Solr-Maven-4.x/solr/solrj/src/test/org/apache/solr/common/SolrDocumentTest.java: Some input files use unchecked or unsafe operations.
      [mvn] [WARNING] /usr/home/hudson/hudson-slave/workspace/Lucene-Solr-Maven-4.x/solr/solrj/src/test/org/apache/solr/common/SolrDocumentTest.java: Recompile with -Xlint:unchecked for details.
      [mvn] [INFO] [forbiddenapis:testCheck {execution: test-check-forbidden-servlet-api}]
      [mvn] [INFO] Reading API signatures: /usr/home/hudson/hudson-slave/workspace/Lucene-Solr-Maven-4.x/lucene/tools/forbiddenApis/servlet-api.txt
      [mvn] [INFO] Loading classes to check...
      [mvn] [INFO] Scanning for API signatures and dependencies...
      [mvn] [INFO] Scanned 87 (and 239 related) class file(s) for forbidden API invocations (in 0.13s), 0 error(s).
      [mvn] [INFO] [forbiddenapis:testCheck {execution: test-check-forbidden-apis}]
      [mvn] [INFO] Reading bundled API signatures: jdk-unsafe
      [mvn] [INFO] Reading bundled API signatures: jdk-deprecated
      [mvn] [INFO] Reading bundled API signatures: commons-io-unsafe-2.1
      [mvn] [INFO] Reading API signatures: /usr/home/hudson/hudson-slave/workspace/Lucene-Solr-Maven-4.x/lucene/tools/forbiddenApis/base.txt
      [mvn] [INFO] Reading API signatures: /usr/home/hudson/hudson-slave/workspace/Lucene-Solr-Maven-4.x/lucene/tools/forbiddenApis/tests.txt
      [mvn] [INFO] Loading classes to check...
      [mvn] [INFO] Scanning for API signatures and dependencies...
      [mvn] [INFO] Scanned 88 (and 416 related) class file(s) for forbidden API invocations (in 0.13s), 0 error(s).
      [mvn] [INFO] [surefire:test {execution: default-test}]
      [mvn] [INFO] Surefire report directory: /usr/home/hudson/hudson-slave/workspace/Lucene-Solr-Maven-4.x/maven-build/solr/solrj/src/test/target/surefire-reports
      [mvn] 
      [mvn] -------------------------------------------------------
      [mvn]  T E S T S
      [mvn] -------------------------------------------------------
      [mvn] Running org.apache.solr.common.util.TestNamedListCodec
      [mvn] Tests run: 4, Failures: 0, Errors: 0, Skipped: 0, Time elapsed: 1.175 sec - in org.apache.solr.common.util.TestNamedListCodec
      [mvn] testIterable(org.apache.solr.common.util.TestNamedListCodec)  Time elapsed: 0.063 sec
      [mvn] testSimple(org.apache.solr.common.util.TestNamedListCodec)  Time elapsed: 0.007 sec
      [mvn] testIterator(org.apache.solr.common.util.TestNamedListCodec)  Time elapsed: 0.006 sec
      [mvn] testRandom(org.apache.solr.common.util.TestNamedListCodec)  Time elapsed: 0.586 sec
      [mvn] Running org.apache.solr.client.solrj.response.TestSpellCheckResponse
      [mvn] Tests run: 3, Failures: 0, Errors: 0, Skipped: 0, Time elapsed: 3.871 sec - in org.apache.solr.client.solrj.response.TestSpellCheckResponse
      [mvn] testSpellCheckResponse_Extended(org.apache.solr.client.solrj.response.TestSpellCheckResponse)  Time elapsed: 0.469 sec
      [mvn] testSpellCheckResponse(org.apache.solr.client.solrj.response.TestSpellCheckResponse)  Time elapsed: 0.154 sec
      [mvn] testSpellCheckCollationResponse(org.apache.solr.client.solrj.response.TestSpellCheckResponse)  Time elapsed: 0.326 sec
      [mvn] Running org.apache.solr.client.solrj.response.FacetFieldTest
      [mvn] Tests run: 1, Failures: 0, Errors: 0, Skipped: 0, Time elapsed: 0.032 sec - in org.apache.solr.client.solrj.response.FacetFieldTest
      [mvn] testGetValues(org.apache.solr.client.solrj.response.FacetFieldTest)  Time elapsed: 0.007 sec
      [mvn] Running org.apache.solr.client.solrj.embedded.SolrExampleEmbeddedTest
      [mvn] Tests run: 26, Failures: 0, Errors: 0, Skipped: 0, Time elapsed: 7.517 sec - in org.apache.solr.client.solrj.embedded.SolrExampleEmbeddedTest
      [mvn] testSetNullUpdateOrder(org.apache.solr.client.solrj.embedded.SolrExampleEmbeddedTest)  Time elapsed: 0.057 sec
      [mvn] testPivotFacetsMissing(org.apache.solr.client.solrj.embedded.SolrExampleEmbeddedTest)  Time elapsed: 0.114 sec
      [mvn] testStreamingRequest(org.apache.solr.client.solrj.embedded.SolrExampleEmbeddedTest)  Time elapsed: 0.084 sec
      [mvn] testPivotFacets(org.apache.solr.client.solrj.embedded.SolrExampleEmbeddedTest)  Time elapsed: 0.094 sec
      [mvn] testContentStreamRequest(org.apache.solr.client.solrj.embedded.SolrExampleEmbeddedTest)  Time elapsed: 0.168 sec
      [mvn] testGetEmptyResults(org.apache.solr.client.solrj.embedded.SolrExampleEmbeddedTest)  Time elapsed: 0.074 sec
      [mvn] testUpdateField(org.apache.solr.client.solrj.embedded.SolrExampleEmbeddedTest)  Time elapsed: 0.15 sec
      [mvn] testChineseDefaults(org.apache.solr.client.solrj.embedded.SolrExampleEmbeddedTest)  Time elapsed: 0.069 sec
      [mvn] testUpdateRequestWithParameters(org.apache.solr.client.solrj.embedded.SolrExampleEmbeddedTest)  Time elapsed: 0.069 sec
      [mvn] testUnicode(org.apache.solr.client.solrj.embedded.SolrExampleEmbeddedTest)  Time elapsed: 0.208 sec
      [mvn] testUpdateMultiValuedField(org.apache.solr.client.solrj.embedded.SolrExampleEmbeddedTest)  Time elapsed: 0.114 sec
      [mvn] testLukeHandler(org.apache.solr.client.solrj.embedded.SolrExampleEmbeddedTest)  Time elapsed: 0.096 sec
      [mvn] testAddRetrieve(org.apache.solr.client.solrj.embedded.SolrExampleEmbeddedTest)  Time elapsed: 0.111 sec
      [mvn] testErrorHandling(org.apache.solr.client.solrj.embedded.SolrExampleEmbeddedTest)  Time elapsed: 0.025 sec
      [mvn] testMultiContentStreamRequest(org.apache.solr.client.solrj.embedded.SolrExampleEmbeddedTest)  Time elapsed: 0.113 sec
      [mvn] testSetNullUpdates(org.apache.solr.client.solrj.embedded.SolrExampleEmbeddedTest)  Time elapsed: 0.072 sec
      [mvn] testFaceting(org.apache.solr.client.solrj.embedded.SolrExampleEmbeddedTest)  Time elapsed: 0.08 sec
      [mvn] testAddDelete(org.apache.solr.client.solrj.embedded.SolrExampleEmbeddedTest)  Time elapsed: 0.173 sec
      [mvn] testPingHandler(org.apache.solr.client.solrj.embedded.SolrExampleEmbeddedTest)  Time elapsed: 0.021 sec
      [mvn] testRealtimeGet(org.apache.solr.client.solrj.embedded.SolrExampleEmbeddedTest)  Time elapsed: 0.041 sec
      [mvn] testCommitWithinOnDelete(org.apache.solr.client.solrj.embedded.SolrExampleEmbeddedTest)  Time elapsed: 1.326 sec
      [mvn] testAugmentFields(org.apache.solr.client.solrj.embedded.SolrExampleEmbeddedTest)  Time elapsed: 0.081 sec
      [mvn] testCommitWithinOnAdd(org.apache.solr.client.solrj.embedded.SolrExampleEmbeddedTest)  Time elapsed: 2.055 sec
      [mvn] testQueryWithParams(org.apache.solr.client.solrj.embedded.SolrExampleEmbeddedTest)  Time elapsed: 0.011 sec
      [mvn] testExampleConfig(org.apache.solr.client.solrj.embedded.SolrExampleEmbeddedTest)  Time elapsed: 0.245 sec
      [mvn] testStatistics(org.apache.solr.client.solrj.embedded.SolrExampleEmbeddedTest)  Time elapsed: 0.249 sec
      [mvn] Running org.apache.solr.client.solrj.SolrExceptionTest
      [mvn] Tests run: 1, Failures: 0, Errors: 0, Skipped: 0, Time elapsed: 0.122 sec - in org.apache.solr.client.solrj.SolrExceptionTest
      [mvn] testSolrException(org.apache.solr.client.solrj.SolrExceptionTest)  Time elapsed: 0.102 sec
      [mvn] Running org.apache.solr.client.solrj.embedded.SolrExampleStreamingBinaryTest
      [mvn] Tests run: 27, Failures: 0, Errors: 0, Skipped: 0, Time elapsed: 17.507 sec - in org.apache.solr.client.solrj.embedded.SolrExampleStreamingBinaryTest
      [mvn] testUnicode(org.apache.solr.client.solrj.embedded.SolrExampleStreamingBinaryTest)  Time elapsed: 1.018 sec
      [mvn] testCommitWithinOnAdd(org.apache.solr.client.solrj.embedded.SolrExampleStreamingBinaryTest)  Time elapsed: 2.084 sec
      [mvn] testChineseDefaults(org.apache.solr.client.solrj.embedded.SolrExampleStreamingBinaryTest)  Time elapsed: 0.091 sec
      [mvn] testMultiContentStreamRequest(org.apache.solr.client.solrj.embedded.SolrExampleStreamingBinaryTest)  Time elapsed: 0.195 sec
      [mvn] testCommitWithinOnDelete(org.apache.solr.client.solrj.embedded.SolrExampleStreamingBinaryTest)  Time elapsed: 1.359 sec
      [mvn] testUpdateRequestWithParameters(org.apache.solr.client.solrj.embedded.SolrExampleStreamingBinaryTest)  Time elapsed: 0.312 sec
      [mvn] testGetEmptyResults(org.apache.solr.client.solrj.embedded.SolrExampleStreamingBinaryTest)  Time elapsed: 0.321 sec
      [mvn] testSetNullUpdateOrder(org.apache.solr.client.solrj.embedded.SolrExampleStreamingBinaryTest)  Time elapsed: 0.575 sec
      [mvn] testErrorHandling(org.apache.solr.client.solrj.embedded.SolrExampleStreamingBinaryTest)  Time elapsed: 0.275 sec
      [mvn] testWaitOptions(org.apache.solr.client.solrj.embedded.SolrExampleStreamingBinaryTest)  Time elapsed: 1.273 sec
      [mvn] testPingHandler(org.apache.solr.client.solrj.embedded.SolrExampleStreamingBinaryT

[...truncated too long message...]

city.VelocityResponseWriterTest)  Time elapsed: 0.006 sec
      [mvn] 
      [mvn] Results :
      [mvn] 
      [mvn] Tests run: 3, Failures: 0, Errors: 0, Skipped: 0
      [mvn] 
      [mvn] [INFO] [jar:jar {execution: default-jar}]
      [mvn] [INFO] Building jar: /usr/home/hudson/hudson-slave/workspace/Lucene-Solr-Maven-4.x/maven-build/solr/contrib/velocity/target/solr-velocity-4.6-SNAPSHOT.jar
      [mvn] [INFO] [install:install {execution: default-install}]
      [mvn] [INFO] Installing /usr/home/hudson/hudson-slave/workspace/Lucene-Solr-Maven-4.x/maven-build/solr/contrib/velocity/target/solr-velocity-4.6-SNAPSHOT.jar to /home/hudson/.m2/repository/org/apache/solr/solr-velocity/4.6-SNAPSHOT/solr-velocity-4.6-SNAPSHOT.jar
      [mvn] [INFO] ------------------------------------------------------------------------
      [mvn] [INFO] Building Apache Solr Contrib aggregator POM
      [mvn] [INFO]    task-segment: [install]
      [mvn] [INFO] ------------------------------------------------------------------------
      [mvn] [INFO] [groovy:execute {execution: generate-timestamps-and-get-top-level-basedir}]
      [mvn] [INFO] [buildnumber:create {execution: default}]
      [mvn] [INFO] [enforcer:enforce {execution: enforce-java-compat-version-and-maven-2.2.1}]
      [mvn] [INFO] [remote-resources:process {execution: default}]
      [mvn] [INFO] [bundle:manifest {execution: bundle-manifest}]
      [mvn] [WARNING] Ignoring project type pom - supportedProjectTypes = [jar, bundle]
      [mvn] [INFO] [forbiddenapis:check {execution: solr-shared-check-forbidden-apis}]
      [mvn] [INFO] Reading bundled API signatures: jdk-unsafe
      [mvn] [INFO] Reading bundled API signatures: jdk-deprecated
      [mvn] [INFO] Reading API signatures: /usr/home/hudson/hudson-slave/workspace/Lucene-Solr-Maven-4.x/lucene/tools/forbiddenApis/base.txt
      [mvn] [INFO] Loading classes to check...
      [mvn] [WARNING] Classes directory does not exist, forbiddenapis check skipped: /usr/home/hudson/hudson-slave/workspace/Lucene-Solr-Maven-4.x/maven-build/solr/contrib/target/classes
      [mvn] [INFO] [forbiddenapis:testCheck {execution: solr-shared-test-check-forbidden-apis}]
      [mvn] [INFO] Reading bundled API signatures: jdk-unsafe
      [mvn] [INFO] Reading bundled API signatures: jdk-deprecated
      [mvn] [INFO] Reading API signatures: /usr/home/hudson/hudson-slave/workspace/Lucene-Solr-Maven-4.x/lucene/tools/forbiddenApis/tests.txt
      [mvn] [INFO] Reading API signatures: /usr/home/hudson/hudson-slave/workspace/Lucene-Solr-Maven-4.x/lucene/tools/forbiddenApis/base.txt
      [mvn] [INFO] Loading classes to check...
      [mvn] [WARNING] Classes directory does not exist, forbiddenapis check skipped: /usr/home/hudson/hudson-slave/workspace/Lucene-Solr-Maven-4.x/maven-build/solr/contrib/target/test-classes
      [mvn] [INFO] [site:attach-descriptor {execution: default-attach-descriptor}]
      [mvn] [INFO] [install:install {execution: default-install}]
      [mvn] [INFO] Installing /usr/home/hudson/hudson-slave/workspace/Lucene-Solr-Maven-4.x/maven-build/solr/contrib/pom.xml to /home/hudson/.m2/repository/org/apache/solr/solr-contrib-aggregator/4.6-SNAPSHOT/solr-contrib-aggregator-4.6-SNAPSHOT.pom
      [mvn] [INFO] 
      [mvn] [INFO] 
      [mvn] [INFO] ------------------------------------------------------------------------
      [mvn] [INFO] Reactor Summary:
      [mvn] [INFO] ------------------------------------------------------------------------
      [mvn] [INFO] Grandparent POM for Apache Lucene Core and Apache Solr  SUCCESS [9.377s]
      [mvn] [INFO] Lucene parent POM ..................................... SUCCESS [0.312s]
      [mvn] [INFO] Lucene Core ........................................... SUCCESS [17.795s]
      [mvn] [INFO] Lucene codecs ......................................... SUCCESS [3.264s]
      [mvn] [INFO] Lucene Test Framework ................................. SUCCESS [4.977s]
      [mvn] [INFO] Lucene Core tests ..................................... SUCCESS [6:42.809s]
      [mvn] [INFO] Lucene Core aggregator POM ............................ SUCCESS [0.159s]
      [mvn] [INFO] Lucene codecs tests ................................... SUCCESS [43.000s]
      [mvn] [INFO] Lucene codecs aggregator POM .......................... SUCCESS [0.190s]
      [mvn] [INFO] Lucene Common Analyzers ............................... SUCCESS [2:41.512s]
      [mvn] [INFO] Lucene ICU Analysis Components ........................ SUCCESS [12.454s]
      [mvn] [INFO] Lucene Kuromoji Japanese Morphological Analyzer ....... SUCCESS [24.737s]
      [mvn] [INFO] Lucene Morfologik Polish Lemmatizer ................... SUCCESS [3.774s]
      [mvn] [INFO] Lucene Phonetic Filters ............................... SUCCESS [12.023s]
      [mvn] [INFO] Lucene Smart Chinese Analyzer ......................... SUCCESS [8.253s]
      [mvn] [INFO] Lucene Stempel Analyzer ............................... SUCCESS [4.321s]
      [mvn] [INFO] Lucene UIMA Analysis Components ....................... SUCCESS [17.580s]
      [mvn] [INFO] Lucene Analysis Modules aggregator POM ................ SUCCESS [0.181s]
      [mvn] [INFO] Lucene Queries ........................................ SUCCESS [30.247s]
      [mvn] [INFO] Lucene Sandbox ........................................ SUCCESS [7.028s]
      [mvn] [INFO] Lucene QueryParsers ................................... SUCCESS [11.682s]
      [mvn] [INFO] Lucene Memory ......................................... SUCCESS [10.027s]
      [mvn] [INFO] Lucene Highlighter .................................... SUCCESS [18.977s]
      [mvn] [INFO] Lucene Facets ......................................... SUCCESS [1:47.368s]
      [mvn] [INFO] Lucene Spatial ........................................ SUCCESS [12.889s]
      [mvn] [INFO] Lucene Benchmark ...................................... SUCCESS [25.499s]
      [mvn] [INFO] Lucene Classification ................................. SUCCESS [8.888s]
      [mvn] [INFO] Lucene Demo ........................................... SUCCESS [4.507s]
      [mvn] [INFO] Lucene Expressions .................................... SUCCESS [13.465s]
      [mvn] [INFO] Lucene Grouping ....................................... SUCCESS [20.002s]
      [mvn] [INFO] Lucene Join ........................................... SUCCESS [14.902s]
      [mvn] [INFO] Lucene Miscellaneous .................................. SUCCESS [12.448s]
      [mvn] [INFO] Lucene Replicator ..................................... SUCCESS [14.301s]
      [mvn] [INFO] Lucene Suggest ........................................ SUCCESS [24.791s]
      [mvn] [INFO] Apache Solr parent POM ................................ SUCCESS [0.210s]
      [mvn] [INFO] Apache Solr Solrj ..................................... SUCCESS [3.502s]
      [mvn] [INFO] Apache Solr Core ...................................... SUCCESS [11.767s]
      [mvn] [INFO] Apache Solr Test Framework ............................ SUCCESS [3.362s]
      [mvn] [INFO] Apache Solr Core tests ................................ FAILED [30:28.801s]
      [mvn] [INFO] Apache Solr Core aggregator POM ....................... SUCCESS [0.170s]
      [mvn] [INFO] Apache Solr Solrj tests ............................... SUCCESS [2:39.396s]
      [mvn] [INFO] Apache Solr Solrj aggregator POM ...................... SUCCESS [0.167s]
      [mvn] [INFO] Apache Solr Search Server ............................. SUCCESS [4.649s]
      [mvn] [INFO] Apache Solr Analysis Extras ........................... SUCCESS [7.808s]
      [mvn] [INFO] Apache Solr Clustering ................................ SUCCESS [14.320s]
      [mvn] [INFO] Apache Solr DataImportHandler ......................... SUCCESS [3:16.848s]
      [mvn] [INFO] Apache Solr DataImportHandler Extras .................. SUCCESS [8.461s]
      [mvn] [INFO] Apache Solr Content Extraction Library ................ SUCCESS [11.347s]
      [mvn] [INFO] Apache Solr Language Identifier ....................... SUCCESS [8.093s]
      [mvn] [INFO] Apache Solr UIMA integration .......................... SUCCESS [31.465s]
      [mvn] [INFO] Apache Solr Velocity .................................. SUCCESS [5.637s]
      [mvn] [INFO] Apache Solr Contrib aggregator POM .................... SUCCESS [0.178s]
      [mvn] [INFO] ------------------------------------------------------------------------
      [mvn] [INFO] Error for project: Apache Solr Core tests (during install)
      [mvn] [INFO] ------------------------------------------------------------------------
      [mvn] [INFO] There are test failures.
      [mvn] 
      [mvn] Please refer to /usr/home/hudson/hudson-slave/workspace/Lucene-Solr-Maven-4.x/maven-build/solr/core/src/test/target/surefire-reports for the individual test results.
      [mvn] [INFO] ------------------------------------------------------------------------
      [mvn] [INFO] For more information, run Maven with the -e switch
      [mvn] [INFO] ------------------------------------------------------------------------
      [mvn] [INFO] BUILD ERRORS
      [mvn] [INFO] ------------------------------------------------------------------------
      [mvn] [INFO] Total time: 56 minutes 1 second
      [mvn] [INFO] Finished at: Thu Oct 31 20:22:00 GMT 2013
      [mvn] [INFO] Final Memory: 291M/2735M
      [mvn] [INFO] ------------------------------------------------------------------------

BUILD FAILED
/usr/home/hudson/hudson-slave/workspace/Lucene-Solr-Maven-4.x/build.xml:451: The following error occurred while executing this line:
/usr/home/hudson/hudson-slave/workspace/Lucene-Solr-Maven-4.x/build.xml:178: The following error occurred while executing this line:
/usr/home/hudson/hudson-slave/workspace/Lucene-Solr-Maven-4.x/extra-targets.xml:56: Java returned: 1

Total time: 78 minutes 57 seconds
Build step 'Invoke Ant' marked build as failure
Recording test results
Email was triggered for: Failure
Sending email for trigger: Failure




Mime
View raw message