lucene-dev mailing list archives

Site index · List index
Message view « Date » · « Thread »
Top « Date » · « Thread »
From Policeman Jenkins Server <jenk...@thetaphi.de>
Subject [JENKINS] Lucene-Solr-trunk-MacOSX (64bit/jdk1.7.0) - Build # 941 - Still Failing!
Date Wed, 23 Oct 2013 22:31:21 GMT
Build: http://jenkins.thetaphi.de/job/Lucene-Solr-trunk-MacOSX/941/
Java: 64bit/jdk1.7.0 -XX:+UseCompressedOops -XX:+UseParallelGC

1 tests failed.
FAILED:  org.apache.lucene.facet.search.OrdinalsCacheTest.testOrdinalsCacheWithThreads

Error Message:
expected:<804> but was:<76>

Stack Trace:
java.lang.AssertionError: expected:<804> but was:<76>
	at __randomizedtesting.SeedInfo.seed([43A4DA7C47F23380:29D08C209C05426A]:0)
	at org.junit.Assert.fail(Assert.java:93)
	at org.junit.Assert.failNotEquals(Assert.java:647)
	at org.junit.Assert.assertEquals(Assert.java:128)
	at org.junit.Assert.assertEquals(Assert.java:472)
	at org.junit.Assert.assertEquals(Assert.java:456)
	at org.apache.lucene.facet.search.OrdinalsCacheTest.testOrdinalsCacheWithThreads(OrdinalsCacheTest.java:83)
	at sun.reflect.NativeMethodAccessorImpl.invoke0(Native Method)
	at sun.reflect.NativeMethodAccessorImpl.invoke(NativeMethodAccessorImpl.java:57)
	at sun.reflect.DelegatingMethodAccessorImpl.invoke(DelegatingMethodAccessorImpl.java:43)
	at java.lang.reflect.Method.invoke(Method.java:606)
	at com.carrotsearch.randomizedtesting.RandomizedRunner.invoke(RandomizedRunner.java:1559)
	at com.carrotsearch.randomizedtesting.RandomizedRunner.access$600(RandomizedRunner.java:79)
	at com.carrotsearch.randomizedtesting.RandomizedRunner$6.evaluate(RandomizedRunner.java:737)
	at com.carrotsearch.randomizedtesting.RandomizedRunner$7.evaluate(RandomizedRunner.java:773)
	at com.carrotsearch.randomizedtesting.RandomizedRunner$8.evaluate(RandomizedRunner.java:787)
	at org.apache.lucene.util.TestRuleSetupTeardownChained$1.evaluate(TestRuleSetupTeardownChained.java:50)
	at org.apache.lucene.util.TestRuleFieldCacheSanity$1.evaluate(TestRuleFieldCacheSanity.java:51)
	at org.apache.lucene.util.AbstractBeforeAfterRule$1.evaluate(AbstractBeforeAfterRule.java:46)
	at com.carrotsearch.randomizedtesting.rules.SystemPropertiesInvariantRule$1.evaluate(SystemPropertiesInvariantRule.java:55)
	at org.apache.lucene.util.TestRuleThreadAndTestName$1.evaluate(TestRuleThreadAndTestName.java:49)
	at org.apache.lucene.util.TestRuleIgnoreAfterMaxFailures$1.evaluate(TestRuleIgnoreAfterMaxFailures.java:70)
	at org.apache.lucene.util.TestRuleMarkFailure$1.evaluate(TestRuleMarkFailure.java:48)
	at com.carrotsearch.randomizedtesting.rules.StatementAdapter.evaluate(StatementAdapter.java:36)
	at com.carrotsearch.randomizedtesting.ThreadLeakControl$StatementRunner.run(ThreadLeakControl.java:358)
	at com.carrotsearch.randomizedtesting.ThreadLeakControl.forkTimeoutingTask(ThreadLeakControl.java:782)
	at com.carrotsearch.randomizedtesting.ThreadLeakControl$3.evaluate(ThreadLeakControl.java:442)
	at com.carrotsearch.randomizedtesting.RandomizedRunner.runSingleTest(RandomizedRunner.java:746)
	at com.carrotsearch.randomizedtesting.RandomizedRunner$3.evaluate(RandomizedRunner.java:648)
	at com.carrotsearch.randomizedtesting.RandomizedRunner$4.evaluate(RandomizedRunner.java:682)
	at com.carrotsearch.randomizedtesting.RandomizedRunner$5.evaluate(RandomizedRunner.java:693)
	at org.apache.lucene.util.AbstractBeforeAfterRule$1.evaluate(AbstractBeforeAfterRule.java:46)
	at org.apache.lucene.util.TestRuleStoreClassName$1.evaluate(TestRuleStoreClassName.java:42)
	at com.carrotsearch.randomizedtesting.rules.SystemPropertiesInvariantRule$1.evaluate(SystemPropertiesInvariantRule.java:55)
	at com.carrotsearch.randomizedtesting.rules.NoShadowingOrOverridesOnMethodsRule$1.evaluate(NoShadowingOrOverridesOnMethodsRule.java:39)
	at com.carrotsearch.randomizedtesting.rules.NoShadowingOrOverridesOnMethodsRule$1.evaluate(NoShadowingOrOverridesOnMethodsRule.java:39)
	at com.carrotsearch.randomizedtesting.rules.StatementAdapter.evaluate(StatementAdapter.java:36)
	at org.apache.lucene.util.TestRuleAssertionsRequired$1.evaluate(TestRuleAssertionsRequired.java:43)
	at org.apache.lucene.util.TestRuleMarkFailure$1.evaluate(TestRuleMarkFailure.java:48)
	at org.apache.lucene.util.TestRuleIgnoreAfterMaxFailures$1.evaluate(TestRuleIgnoreAfterMaxFailures.java:70)
	at org.apache.lucene.util.TestRuleIgnoreTestSuites$1.evaluate(TestRuleIgnoreTestSuites.java:55)
	at com.carrotsearch.randomizedtesting.rules.StatementAdapter.evaluate(StatementAdapter.java:36)
	at com.carrotsearch.randomizedtesting.ThreadLeakControl$StatementRunner.run(ThreadLeakControl.java:358)
	at java.lang.Thread.run(Thread.java:744)




Build Log:
[...truncated 7319 lines...]
   [junit4] Suite: org.apache.lucene.facet.search.OrdinalsCacheTest
   [junit4]   2> NOTE: reproduce with: ant test  -Dtestcase=OrdinalsCacheTest -Dtests.method=testOrdinalsCacheWithThreads
-Dtests.seed=43A4DA7C47F23380 -Dtests.slow=true -Dtests.locale=hu -Dtests.timezone=Australia/Darwin
-Dtests.file.encoding=US-ASCII
   [junit4] FAILURE 0.23s | OrdinalsCacheTest.testOrdinalsCacheWithThreads <<<
   [junit4]    > Throwable #1: java.lang.AssertionError: expected:<804> but was:<76>
   [junit4]    > 	at __randomizedtesting.SeedInfo.seed([43A4DA7C47F23380:29D08C209C05426A]:0)
   [junit4]    > 	at org.apache.lucene.facet.search.OrdinalsCacheTest.testOrdinalsCacheWithThreads(OrdinalsCacheTest.java:83)
   [junit4]    > 	at java.lang.Thread.run(Thread.java:744)
   [junit4]   2> NOTE: test params are: codec=Asserting, sim=DefaultSimilarity, locale=hu,
timezone=Australia/Darwin
   [junit4]   2> NOTE: Mac OS X 10.8.5 x86_64/Oracle Corporation 1.7.0_45 (64-bit)/cpus=2,threads=1,free=142441272,total=190840832
   [junit4]   2> NOTE: All tests run in this JVM: [TestDirectoryTaxonomyWriter, FacetResultTest,
TestTotalFacetCountsCache, TestTaxonomyCombined, TestSameRequestAccumulation, TestTopKResultsHandler,
FloatToObjectMapTest, TestFacetArrays, EncodingTest, OversampleWithDepthTest, TestFacetsAccumulatorWithComplement,
TestCategoryPath, SamplingWrapperTest, ObjectToIntMapTest, AssociationsFacetRequestTest, MultiCategoryListIteratorTest,
TestDrillSideways, TestFacetsPayloadMigrationReader, TestLRUHashMap, AdaptiveAccumulatorTest,
ObjectToFloatMapTest, FacetSearchParamsTest, IntToFloatMapTest, CountingFacetsAggregatorTest,
OrdinalsCacheTest]
   [junit4] Completed in 0.25s, 1 test, 1 failure <<< FAILURES!

[...truncated 102 lines...]
BUILD FAILED
/Users/jenkins/workspace/Lucene-Solr-trunk-MacOSX/build.xml:422: The following error occurred
while executing this line:
/Users/jenkins/workspace/Lucene-Solr-trunk-MacOSX/build.xml:402: The following error occurred
while executing this line:
/Users/jenkins/workspace/Lucene-Solr-trunk-MacOSX/build.xml:39: The following error occurred
while executing this line:
/Users/jenkins/workspace/Lucene-Solr-trunk-MacOSX/lucene/build.xml:562: The following error
occurred while executing this line:
/Users/jenkins/workspace/Lucene-Solr-trunk-MacOSX/lucene/common-build.xml:1916: The following
error occurred while executing this line:
/Users/jenkins/workspace/Lucene-Solr-trunk-MacOSX/lucene/module-build.xml:60: The following
error occurred while executing this line:
/Users/jenkins/workspace/Lucene-Solr-trunk-MacOSX/lucene/common-build.xml:1259: The following
error occurred while executing this line:
/Users/jenkins/workspace/Lucene-Solr-trunk-MacOSX/lucene/common-build.xml:902: There were
test failures: 56 suites, 246 tests, 1 failure

Total time: 32 minutes 36 seconds
Build step 'Invoke Ant' marked build as failure
Description set: Java: 64bit/jdk1.7.0 -XX:+UseCompressedOops -XX:+UseParallelGC
Archiving artifacts
Recording test results
Email was triggered for: Failure
Sending email for trigger: Failure



Mime
View raw message