lucene-dev mailing list archives

Site index · List index
Message view « Date » · « Thread »
Top « Date » · « Thread »
From Policeman Jenkins Server <jenk...@thetaphi.de>
Subject [JENKINS] Lucene-Solr-trunk-Linux (32bit/ibm-j9-jdk7) - Build # 8043 - Failure!
Date Sat, 26 Oct 2013 02:31:41 GMT
Build: http://jenkins.thetaphi.de/job/Lucene-Solr-trunk-Linux/8043/
Java: 32bit/ibm-j9-jdk7 -Xjit:exclude={org/apache/lucene/util/fst/FST.pack(IIF)Lorg/apache/lucene/util/fst/FST;}

2 tests failed.
REGRESSION:  org.apache.solr.cloud.BasicDistributedZk2Test.testDistribSearch

Error Message:
Expected content type application/octet-stream but got text/html;charset=ISO-8859-1. <html> <head> <meta http-equiv="Content-Type" content="text/html;charset=ISO-8859-1"/> <title>Error 404 Can not find: /z_qd/gp/onenodecollectioncore/update</title> </head> <body> <h2>HTTP ERROR: 404</h2> <p>Problem accessing /z_qd/gp/onenodecollectioncore/update. Reason: <pre>    Can not find: /z_qd/gp/onenodecollectioncore/update</pre></p> <hr /><i><small>Powered by Jetty://</small></i>                                                                                                                                                                                                                                                                                                                                                                                                                                                                                                                                                                                                                                                                                                                                                                                                                                                                                                                                                                                                                     </body> </html> 

Stack Trace:
org.apache.solr.client.solrj.impl.HttpSolrServer$RemoteSolrException: Expected content type application/octet-stream but got text/html;charset=ISO-8859-1. <html>
<head>
<meta http-equiv="Content-Type" content="text/html;charset=ISO-8859-1"/>
<title>Error 404 Can not find: /z_qd/gp/onenodecollectioncore/update</title>
</head>
<body>
<h2>HTTP ERROR: 404</h2>
<p>Problem accessing /z_qd/gp/onenodecollectioncore/update. Reason:
<pre>    Can not find: /z_qd/gp/onenodecollectioncore/update</pre></p>
<hr /><i><small>Powered by Jetty://</small></i>
                                                
                                                
                                                
                                                
                                                
                                                
                                                
                                                
                                                
                                                
                                                
                                                
                                                
                                                
                                                
                                                
                                                
                                                
                                                
                                                
</body>
</html>

	at __randomizedtesting.SeedInfo.seed([7E402D14147F6239:FFA6A30C63200205]:0)
	at org.apache.solr.client.solrj.impl.HttpSolrServer.request(HttpSolrServer.java:428)
	at org.apache.solr.client.solrj.impl.HttpSolrServer.request(HttpSolrServer.java:181)
	at org.apache.solr.client.solrj.request.AbstractUpdateRequest.process(AbstractUpdateRequest.java:117)
	at org.apache.solr.client.solrj.SolrServer.add(SolrServer.java:116)
	at org.apache.solr.client.solrj.SolrServer.add(SolrServer.java:102)
	at org.apache.solr.cloud.BasicDistributedZk2Test.testNodeWithoutCollectionForwarding(BasicDistributedZk2Test.java:196)
	at org.apache.solr.cloud.BasicDistributedZk2Test.doTest(BasicDistributedZk2Test.java:88)
	at org.apache.solr.BaseDistributedSearchTestCase.testDistribSearch(BaseDistributedSearchTestCase.java:835)
	at sun.reflect.NativeMethodAccessorImpl.invoke0(Native Method)
	at sun.reflect.NativeMethodAccessorImpl.invoke(NativeMethodAccessorImpl.java:88)
	at sun.reflect.DelegatingMethodAccessorImpl.invoke(DelegatingMethodAccessorImpl.java:55)
	at java.lang.reflect.Method.invoke(Method.java:613)
	at com.carrotsearch.randomizedtesting.RandomizedRunner.invoke(RandomizedRunner.java:1559)
	at com.carrotsearch.randomizedtesting.RandomizedRunner.access$600(RandomizedRunner.java:79)
	at com.carrotsearch.randomizedtesting.RandomizedRunner$6.evaluate(RandomizedRunner.java:737)
	at com.carrotsearch.randomizedtesting.RandomizedRunner$7.evaluate(RandomizedRunner.java:773)
	at com.carrotsearch.randomizedtesting.RandomizedRunner$8.evaluate(RandomizedRunner.java:787)
	at com.carrotsearch.randomizedtesting.rules.SystemPropertiesRestoreRule$1.evaluate(SystemPropertiesRestoreRule.java:53)
	at org.apache.lucene.util.TestRuleSetupTeardownChained$1.evaluate(TestRuleSetupTeardownChained.java:50)
	at org.apache.lucene.util.TestRuleFieldCacheSanity$1.evaluate(TestRuleFieldCacheSanity.java:51)
	at org.apache.lucene.util.AbstractBeforeAfterRule$1.evaluate(AbstractBeforeAfterRule.java:46)
	at com.carrotsearch.randomizedtesting.rules.SystemPropertiesInvariantRule$1.evaluate(SystemPropertiesInvariantRule.java:55)
	at org.apache.lucene.util.TestRuleThreadAndTestName$1.evaluate(TestRuleThreadAndTestName.java:49)
	at org.apache.lucene.util.TestRuleIgnoreAfterMaxFailures$1.evaluate(TestRuleIgnoreAfterMaxFailures.java:70)
	at org.apache.lucene.util.TestRuleMarkFailure$1.evaluate(TestRuleMarkFailure.java:48)
	at com.carrotsearch.randomizedtesting.rules.StatementAdapter.evaluate(StatementAdapter.java:36)
	at com.carrotsearch.randomizedtesting.ThreadLeakControl$StatementRunner.run(ThreadLeakControl.java:358)
	at com.carrotsearch.randomizedtesting.ThreadLeakControl.forkTimeoutingTask(ThreadLeakControl.java:782)
	at com.carrotsearch.randomizedtesting.ThreadLeakControl$3.evaluate(ThreadLeakControl.java:442)
	at com.carrotsearch.randomizedtesting.RandomizedRunner.runSingleTest(RandomizedRunner.java:746)
	at com.carrotsearch.randomizedtesting.RandomizedRunner$3.evaluate(RandomizedRunner.java:648)
	at com.carrotsearch.randomizedtesting.RandomizedRunner$4.evaluate(RandomizedRunner.java:682)
	at com.carrotsearch.randomizedtesting.RandomizedRunner$5.evaluate(RandomizedRunner.java:693)
	at com.carrotsearch.randomizedtesting.rules.StatementAdapter.evaluate(StatementAdapter.java:36)
	at com.carrotsearch.randomizedtesting.rules.SystemPropertiesRestoreRule$1.evaluate(SystemPropertiesRestoreRule.java:53)
	at org.apache.lucene.util.AbstractBeforeAfterRule$1.evaluate(AbstractBeforeAfterRule.java:46)
	at org.apache.lucene.util.TestRuleStoreClassName$1.evaluate(TestRuleStoreClassName.java:42)
	at com.carrotsearch.randomizedtesting.rules.SystemPropertiesInvariantRule$1.evaluate(SystemPropertiesInvariantRule.java:55)
	at com.carrotsearch.randomizedtesting.rules.NoShadowingOrOverridesOnMethodsRule$1.evaluate(NoShadowingOrOverridesOnMethodsRule.java:39)
	at com.carrotsearch.randomizedtesting.rules.NoShadowingOrOverridesOnMethodsRule$1.evaluate(NoShadowingOrOverridesOnMethodsRule.java:39)
	at com.carrotsearch.randomizedtesting.rules.StatementAdapter.evaluate(StatementAdapter.java:36)
	at org.apache.lucene.util.TestRuleAssertionsRequired$1.evaluate(TestRuleAssertionsRequired.java:43)
	at org.apache.lucene.util.TestRuleMarkFailure$1.evaluate(TestRuleMarkFailure.java:48)
	at org.apache.lucene.util.TestRuleIgnoreAfterMaxFailures$1.evaluate(TestRuleIgnoreAfterMaxFailures.java:70)
	at org.apache.lucene.util.TestRuleIgnoreTestSuites$1.evaluate(TestRuleIgnoreTestSuites.java:55)
	at com.carrotsearch.randomizedtesting.rules.StatementAdapter.evaluate(StatementAdapter.java:36)
	at com.carrotsearch.randomizedtesting.ThreadLeakControl$StatementRunner.run(ThreadLeakControl.java:358)
	at java.lang.Thread.run(Thread.java:780)


REGRESSION:  org.apache.solr.update.AutoCommitTest.testMaxTime

Error Message:
Exception during query

Stack Trace:
java.lang.RuntimeException: Exception during query
	at __randomizedtesting.SeedInfo.seed([7E402D14147F6239:E4B450F68AE5FE05]:0)
	at org.apache.solr.SolrTestCaseJ4.assertQ(SolrTestCaseJ4.java:637)
	at org.apache.solr.update.AutoCommitTest.testMaxTime(AutoCommitTest.java:227)
	at sun.reflect.NativeMethodAccessorImpl.invoke0(Native Method)
	at sun.reflect.NativeMethodAccessorImpl.invoke(NativeMethodAccessorImpl.java:88)
	at sun.reflect.DelegatingMethodAccessorImpl.invoke(DelegatingMethodAccessorImpl.java:55)
	at java.lang.reflect.Method.invoke(Method.java:613)
	at com.carrotsearch.randomizedtesting.RandomizedRunner.invoke(RandomizedRunner.java:1559)
	at com.carrotsearch.randomizedtesting.RandomizedRunner.access$600(RandomizedRunner.java:79)
	at com.carrotsearch.randomizedtesting.RandomizedRunner$6.evaluate(RandomizedRunner.java:737)
	at com.carrotsearch.randomizedtesting.RandomizedRunner$7.evaluate(RandomizedRunner.java:773)
	at com.carrotsearch.randomizedtesting.RandomizedRunner$8.evaluate(RandomizedRunner.java:787)
	at com.carrotsearch.randomizedtesting.rules.SystemPropertiesRestoreRule$1.evaluate(SystemPropertiesRestoreRule.java:53)
	at org.apache.lucene.util.TestRuleSetupTeardownChained$1.evaluate(TestRuleSetupTeardownChained.java:50)
	at org.apache.lucene.util.TestRuleFieldCacheSanity$1.evaluate(TestRuleFieldCacheSanity.java:51)
	at org.apache.lucene.util.AbstractBeforeAfterRule$1.evaluate(AbstractBeforeAfterRule.java:46)
	at com.carrotsearch.randomizedtesting.rules.SystemPropertiesInvariantRule$1.evaluate(SystemPropertiesInvariantRule.java:55)
	at org.apache.lucene.util.TestRuleThreadAndTestName$1.evaluate(TestRuleThreadAndTestName.java:49)
	at org.apache.lucene.util.TestRuleIgnoreAfterMaxFailures$1.evaluate(TestRuleIgnoreAfterMaxFailures.java:70)
	at org.apache.lucene.util.TestRuleMarkFailure$1.evaluate(TestRuleMarkFailure.java:48)
	at com.carrotsearch.randomizedtesting.rules.StatementAdapter.evaluate(StatementAdapter.java:36)
	at com.carrotsearch.randomizedtesting.ThreadLeakControl$StatementRunner.run(ThreadLeakControl.java:358)
	at com.carrotsearch.randomizedtesting.ThreadLeakControl.forkTimeoutingTask(ThreadLeakControl.java:782)
	at com.carrotsearch.randomizedtesting.ThreadLeakControl$3.evaluate(ThreadLeakControl.java:442)
	at com.carrotsearch.randomizedtesting.RandomizedRunner.runSingleTest(RandomizedRunner.java:746)
	at com.carrotsearch.randomizedtesting.RandomizedRunner$3.evaluate(RandomizedRunner.java:648)
	at com.carrotsearch.randomizedtesting.RandomizedRunner$4.evaluate(RandomizedRunner.java:682)
	at com.carrotsearch.randomizedtesting.RandomizedRunner$5.evaluate(RandomizedRunner.java:693)
	at com.carrotsearch.randomizedtesting.rules.StatementAdapter.evaluate(StatementAdapter.java:36)
	at com.carrotsearch.randomizedtesting.rules.SystemPropertiesRestoreRule$1.evaluate(SystemPropertiesRestoreRule.java:53)
	at org.apache.lucene.util.AbstractBeforeAfterRule$1.evaluate(AbstractBeforeAfterRule.java:46)
	at org.apache.lucene.util.TestRuleStoreClassName$1.evaluate(TestRuleStoreClassName.java:42)
	at com.carrotsearch.randomizedtesting.rules.SystemPropertiesInvariantRule$1.evaluate(SystemPropertiesInvariantRule.java:55)
	at com.carrotsearch.randomizedtesting.rules.NoShadowingOrOverridesOnMethodsRule$1.evaluate(NoShadowingOrOverridesOnMethodsRule.java:39)
	at com.carrotsearch.randomizedtesting.rules.NoShadowingOrOverridesOnMethodsRule$1.evaluate(NoShadowingOrOverridesOnMethodsRule.java:39)
	at com.carrotsearch.randomizedtesting.rules.StatementAdapter.evaluate(StatementAdapter.java:36)
	at org.apache.lucene.util.TestRuleAssertionsRequired$1.evaluate(TestRuleAssertionsRequired.java:43)
	at org.apache.lucene.util.TestRuleMarkFailure$1.evaluate(TestRuleMarkFailure.java:48)
	at org.apache.lucene.util.TestRuleIgnoreAfterMaxFailures$1.evaluate(TestRuleIgnoreAfterMaxFailures.java:70)
	at org.apache.lucene.util.TestRuleIgnoreTestSuites$1.evaluate(TestRuleIgnoreTestSuites.java:55)
	at com.carrotsearch.randomizedtesting.rules.StatementAdapter.evaluate(StatementAdapter.java:36)
	at com.carrotsearch.randomizedtesting.ThreadLeakControl$StatementRunner.run(ThreadLeakControl.java:358)
	at java.lang.Thread.run(Thread.java:780)
Caused by: java.lang.RuntimeException: REQUEST FAILED: xpath=//result[@numFound=0]
	xml response was: <?xml version="1.0" encoding="UTF-8"?>
<response>
<lst name="responseHeader"><int name="status">0</int><int name="QTime">2577</int></lst><result name="response" numFound="1" start="0"><doc><int name="id">529</int><int name="range_facet_si">529</int><arr name="range_facet_l"><long>529</long></arr><arr name="range_facet_sl"><long>529</long></arr><arr name="field_t"><str>what's inside?</str></arr><arr name="subject"><str>info</str></arr><long name="_version_">1449922339485515776</long><int name="intDefault">42</int><date name="timestamp">2013-10-26T02:14:55.951Z</date><arr name="multiDefault"><str>muLti-Default</str></arr></doc></result>
</response>

	request was:q=id:529&start=0&qt=standard&version=2.2&rows=20
	at org.apache.solr.SolrTestCaseJ4.assertQ(SolrTestCaseJ4.java:630)
	... 41 more




Build Log:
[...truncated 10194 lines...]
   [junit4] Suite: org.apache.solr.update.AutoCommitTest
   [junit4]   2> 349685 T1523 oas.SolrTestCaseJ4.initCore ####initCore
   [junit4]   2> Creating dataDir: /mnt/ssd/jenkins/workspace/Lucene-Solr-trunk-Linux/solr/build/solr-core/test/J0/./solrtest-AutoCommitTest-1382753693074
   [junit4]   2> 349686 T1523 oasc.SolrResourceLoader.<init> new SolrResourceLoader for directory: '/mnt/ssd/jenkins/workspace/Lucene-Solr-trunk-Linux/solr/build/solr-core/test-files/solr/collection1/'
   [junit4]   2> 349687 T1523 oasc.SolrResourceLoader.replaceClassLoader Adding 'file:/mnt/ssd/jenkins/workspace/Lucene-Solr-trunk-Linux/solr/build/solr-core/test-files/solr/collection1/lib/classes/' to classloader
   [junit4]   2> 349687 T1523 oasc.SolrResourceLoader.replaceClassLoader Adding 'file:/mnt/ssd/jenkins/workspace/Lucene-Solr-trunk-Linux/solr/build/solr-core/test-files/solr/collection1/lib/README' to classloader
   [junit4]   2> 349731 T1523 oasc.SolrConfig.<init> Using Lucene MatchVersion: LUCENE_50
   [junit4]   2> 349776 T1523 oasc.SolrConfig.<init> Loaded SolrConfig: solrconfig.xml
   [junit4]   2> 349777 T1523 oass.IndexSchema.readSchema Reading Solr Schema from schema.xml
   [junit4]   2> 349784 T1523 oass.IndexSchema.readSchema [null] Schema name=test
   [junit4]   2> 350111 T1523 oass.OpenExchangeRatesOrgProvider.init Initialized with rates=open-exchange-rates.json, refreshInterval=1440.
   [junit4]   2> 350116 T1523 oass.IndexSchema.readSchema default search field in schema is text
   [junit4]   2> 350119 T1523 oass.IndexSchema.readSchema unique key field: id
   [junit4]   2> 350125 T1523 oass.FileExchangeRateProvider.reload Reloading exchange rates from file currency.xml
   [junit4]   2> 350129 T1523 oass.FileExchangeRateProvider.reload Reloading exchange rates from file currency.xml
   [junit4]   2> 350134 T1523 oass.OpenExchangeRatesOrgProvider.reload Reloading exchange rates from open-exchange-rates.json
   [junit4]   2> 350135 T1523 oass.OpenExchangeRatesOrgProvider$OpenExchangeRates.<init> WARN Unknown key IMPORTANT NOTE
   [junit4]   2> 350135 T1523 oass.OpenExchangeRatesOrgProvider$OpenExchangeRates.<init> WARN Expected key, got STRING
   [junit4]   2> 350135 T1523 oass.OpenExchangeRatesOrgProvider.reload Reloading exchange rates from open-exchange-rates.json
   [junit4]   2> 350136 T1523 oass.OpenExchangeRatesOrgProvider$OpenExchangeRates.<init> WARN Unknown key IMPORTANT NOTE
   [junit4]   2> 350136 T1523 oass.OpenExchangeRatesOrgProvider$OpenExchangeRates.<init> WARN Expected key, got STRING
   [junit4]   2> 350137 T1523 oasc.SolrResourceLoader.locateSolrHome JNDI not configured for solr (NoInitialContextEx)
   [junit4]   2> 350137 T1523 oasc.SolrResourceLoader.locateSolrHome using system property solr.solr.home: /mnt/ssd/jenkins/workspace/Lucene-Solr-trunk-Linux/solr/build/solr-core/test-files/solr
   [junit4]   2> 350138 T1523 oasc.SolrResourceLoader.<init> new SolrResourceLoader for directory: '/mnt/ssd/jenkins/workspace/Lucene-Solr-trunk-Linux/solr/build/solr-core/test-files/solr/'
   [junit4]   2> 350145 T1523 oasc.SolrResourceLoader.locateSolrHome JNDI not configured for solr (NoInitialContextEx)
   [junit4]   2> 350146 T1523 oasc.SolrResourceLoader.locateSolrHome using system property solr.solr.home: /mnt/ssd/jenkins/workspace/Lucene-Solr-trunk-Linux/solr/build/solr-core/test-files/solr
   [junit4]   2> 350146 T1523 oasc.SolrResourceLoader.<init> new SolrResourceLoader for deduced Solr Home: '/mnt/ssd/jenkins/workspace/Lucene-Solr-trunk-Linux/solr/build/solr-core/test-files/solr/'
   [junit4]   2> 350184 T1523 oasc.CoreContainer.<init> New CoreContainer -31572879
   [junit4]   2> 350185 T1523 oasc.CoreContainer.load Loading cores into CoreContainer [instanceDir=/mnt/ssd/jenkins/workspace/Lucene-Solr-trunk-Linux/solr/build/solr-core/test-files/solr/]
   [junit4]   2> 350186 T1523 oashc.HttpShardHandlerFactory.getParameter Setting socketTimeout to: 0
   [junit4]   2> 350186 T1523 oashc.HttpShardHandlerFactory.getParameter Setting urlScheme to: http://
   [junit4]   2> 350187 T1523 oashc.HttpShardHandlerFactory.getParameter Setting connTimeout to: 0
   [junit4]   2> 350187 T1523 oashc.HttpShardHandlerFactory.getParameter Setting maxConnectionsPerHost to: 20
   [junit4]   2> 350187 T1523 oashc.HttpShardHandlerFactory.getParameter Setting corePoolSize to: 0
   [junit4]   2> 350188 T1523 oashc.HttpShardHandlerFactory.getParameter Setting maximumPoolSize to: 2147483647
   [junit4]   2> 350188 T1523 oashc.HttpShardHandlerFactory.getParameter Setting maxThreadIdleTime to: 5
   [junit4]   2> 350189 T1523 oashc.HttpShardHandlerFactory.getParameter Setting sizeOfQueue to: -1
   [junit4]   2> 350189 T1523 oashc.HttpShardHandlerFactory.getParameter Setting fairnessPolicy to: false
   [junit4]   2> 350190 T1523 oasl.LogWatcher.createWatcher SLF4J impl is org.slf4j.impl.Log4jLoggerFactory
   [junit4]   2> 350190 T1523 oasl.LogWatcher.newRegisteredLogWatcher Registering Log Listener [Log4j (org.slf4j.impl.Log4jLoggerFactory)]
   [junit4]   2> 350194 T1524 oasc.CoreContainer.create Creating SolrCore 'collection1' using instanceDir: /mnt/ssd/jenkins/workspace/Lucene-Solr-trunk-Linux/solr/build/solr-core/test-files/solr/collection1
   [junit4]   2> 350195 T1524 oasc.SolrResourceLoader.<init> new SolrResourceLoader for directory: '/mnt/ssd/jenkins/workspace/Lucene-Solr-trunk-Linux/solr/build/solr-core/test-files/solr/collection1/'
   [junit4]   2> 350196 T1524 oasc.SolrResourceLoader.replaceClassLoader Adding 'file:/mnt/ssd/jenkins/workspace/Lucene-Solr-trunk-Linux/solr/build/solr-core/test-files/solr/collection1/lib/classes/' to classloader
   [junit4]   2> 350196 T1524 oasc.SolrResourceLoader.replaceClassLoader Adding 'file:/mnt/ssd/jenkins/workspace/Lucene-Solr-trunk-Linux/solr/build/solr-core/test-files/solr/collection1/lib/README' to classloader
   [junit4]   2> 350252 T1524 oasc.SolrConfig.<init> Using Lucene MatchVersion: LUCENE_50
   [junit4]   2> 350299 T1524 oasc.SolrConfig.<init> Loaded SolrConfig: solrconfig.xml
   [junit4]   2> 350300 T1524 oass.IndexSchema.readSchema Reading Solr Schema from schema.xml
   [junit4]   2> 350307 T1524 oass.IndexSchema.readSchema [collection1] Schema name=test
   [junit4]   2> 350629 T1524 oass.OpenExchangeRatesOrgProvider.init Initialized with rates=open-exchange-rates.json, refreshInterval=1440.
   [junit4]   2> 350635 T1524 oass.IndexSchema.readSchema default search field in schema is text
   [junit4]   2> 350638 T1524 oass.IndexSchema.readSchema unique key field: id
   [junit4]   2> 350645 T1524 oass.FileExchangeRateProvider.reload Reloading exchange rates from file currency.xml
   [junit4]   2> 350648 T1524 oass.FileExchangeRateProvider.reload Reloading exchange rates from file currency.xml
   [junit4]   2> 350652 T1524 oass.OpenExchangeRatesOrgProvider.reload Reloading exchange rates from open-exchange-rates.json
   [junit4]   2> 350652 T1524 oass.OpenExchangeRatesOrgProvider$OpenExchangeRates.<init> WARN Unknown key IMPORTANT NOTE
   [junit4]   2> 350653 T1524 oass.OpenExchangeRatesOrgProvider$OpenExchangeRates.<init> WARN Expected key, got STRING
   [junit4]   2> 350653 T1524 oass.OpenExchangeRatesOrgProvider.reload Reloading exchange rates from open-exchange-rates.json
   [junit4]   2> 350654 T1524 oass.OpenExchangeRatesOrgProvider$OpenExchangeRates.<init> WARN Unknown key IMPORTANT NOTE
   [junit4]   2> 350654 T1524 oass.OpenExchangeRatesOrgProvider$OpenExchangeRates.<init> WARN Expected key, got STRING
   [junit4]   2> 350654 T1524 oasc.SolrCore.initDirectoryFactory org.apache.solr.core.MockDirectoryFactory
   [junit4]   2> 350655 T1524 oasc.SolrCore.<init> [collection1] Opening new SolrCore at /mnt/ssd/jenkins/workspace/Lucene-Solr-trunk-Linux/solr/build/solr-core/test-files/solr/collection1/, dataDir=/mnt/ssd/jenkins/workspace/Lucene-Solr-trunk-Linux/solr/build/solr-core/test/J0/./solrtest-AutoCommitTest-1382753693074/
   [junit4]   2> 350655 T1524 oasc.JmxMonitoredMap.<init> JMX monitoring is enabled. Adding Solr mbeans to JMX Server: com.sun.jmx.mbeanserver.JmxMBeanServer@fa2c4d2f
   [junit4]   2> 350656 T1524 oasc.CachingDirectoryFactory.get return new directory for /mnt/ssd/jenkins/workspace/Lucene-Solr-trunk-Linux/solr/build/solr-core/test/J0/./solrtest-AutoCommitTest-1382753693074
   [junit4]   2> 350656 T1524 oasc.SolrCore.getNewIndexDir New index directory detected: old=null new=/mnt/ssd/jenkins/workspace/Lucene-Solr-trunk-Linux/solr/build/solr-core/test/J0/./solrtest-AutoCommitTest-1382753693074/index/
   [junit4]   2> 350657 T1524 oasc.SolrCore.initIndex WARN [collection1] Solr index directory '/mnt/ssd/jenkins/workspace/Lucene-Solr-trunk-Linux/solr/build/solr-core/test/J0/./solrtest-AutoCommitTest-1382753693074/index' doesn't exist. Creating new index...
   [junit4]   2> 350657 T1524 oasc.CachingDirectoryFactory.get return new directory for /mnt/ssd/jenkins/workspace/Lucene-Solr-trunk-Linux/solr/build/solr-core/test/J0/./solrtest-AutoCommitTest-1382753693074/index
   [junit4]   2> 350658 T1524 oasu.RandomMergePolicy.<init> RandomMergePolicy wrapping class org.apache.lucene.index.TieredMergePolicy: [TieredMergePolicy: maxMergeAtOnce=17, maxMergeAtOnceExplicit=25, maxMergedSegmentMB=85.732421875, floorSegmentMB=0.310546875, forceMergeDeletesPctAllowed=14.038489394612721, segmentsPerTier=11.0, maxCFSSegmentSizeMB=8.796093022207999E12, noCFSRatio=0.0
   [junit4]   2> 350658 T1524 oasc.SolrDeletionPolicy.onCommit SolrDeletionPolicy.onCommit: commits: num=1
   [junit4]   2> 		commit{dir=RateLimitedDirectoryWrapper(MockDirectoryWrapper(org.apache.lucene.store.RAMDirectory@62a3c222 lockFactory=org.apache.lucene.store.SingleInstanceLockFactory@cbcc67c1)),segFN=segments_1,generation=1}
   [junit4]   2> 350659 T1524 oasc.SolrDeletionPolicy.updateCommits newest commit generation = 1
   [junit4]   2> 350659 T1524 oasc.SolrCore.initWriters created xml: solr.XMLResponseWriter
   [junit4]   2> 350664 T1524 oasup.UpdateRequestProcessorChain.init creating updateRequestProcessorChain "dedupe"
   [junit4]   2> 350664 T1524 oasup.UpdateRequestProcessorChain.init inserting DistributedUpdateProcessorFactory into updateRequestProcessorChain "dedupe"
   [junit4]   2> 350664 T1524 oasup.UpdateRequestProcessorChain.init creating updateRequestProcessorChain "dedupe-allfields"
   [junit4]   2> 350665 T1524 oasup.UpdateRequestProcessorChain.init inserting DistributedUpdateProcessorFactory into updateRequestProcessorChain "dedupe-allfields"
   [junit4]   2> 350665 T1524 oasup.UpdateRequestProcessorChain.init creating updateRequestProcessorChain "stored_sig"
   [junit4]   2> 350666 T1524 oasup.UpdateRequestProcessorChain.init inserting DistributedUpdateProcessorFactory into updateRequestProcessorChain "stored_sig"
   [junit4]   2> 350666 T1524 oasup.UpdateRequestProcessorChain.init creating updateRequestProcessorChain "uniq-fields"
   [junit4]   2> 350666 T1524 oasup.UpdateRequestProcessorChain.init inserting DistributedUpdateProcessorFactory into updateRequestProcessorChain "uniq-fields"
   [junit4]   2> 350667 T1524 oasup.UpdateRequestProcessorChain.init creating updateRequestProcessorChain "distrib-dup-test-chain-explicit"
   [junit4]   2> 350667 T1524 oasup.UpdateRequestProcessorChain.init creating updateRequestProcessorChain "distrib-dup-test-chain-implicit"
   [junit4]   2> 350668 T1524 oasup.UpdateRequestProcessorChain.init inserting DistributedUpdateProcessorFactory into updateRequestProcessorChain "distrib-dup-test-chain-implicit"
   [junit4]   2> 350668 T1524 oasc.SolrCore.loadUpdateProcessorChains no updateRequestProcessorChain defined as default, creating implicit default
   [junit4]   2> 350668 T1524 oasc.RequestHandlers.initHandlersFromConfig adding lazy requestHandler: solr.ReplicationHandler
   [junit4]   2> 350669 T1524 oasc.RequestHandlers.initHandlersFromConfig created /replication: solr.ReplicationHandler
   [junit4]   2> 350669 T1524 oasc.RequestHandlers.initHandlersFromConfig created standard: solr.StandardRequestHandler
   [junit4]   2> 350670 T1524 oasc.RequestHandlers.initHandlersFromConfig created /get: solr.RealTimeGetHandler
   [junit4]   2> 350670 T1524 oasc.RequestHandlers.initHandlersFromConfig created dismax: solr.SearchHandler
   [junit4]   2> 350671 T1524 oasc.RequestHandlers.initHandlersFromConfig created mock: org.apache.solr.core.MockQuerySenderListenerReqHandler
   [junit4]   2> 350671 T1524 oasc.RequestHandlers.initHandlersFromConfig created /admin/: org.apache.solr.handler.admin.AdminHandlers
   [junit4]   2> 350672 T1524 oasc.RequestHandlers.initHandlersFromConfig created defaults: solr.StandardRequestHandler
   [junit4]   2> 350672 T1524 oasc.RequestHandlers.initHandlersFromConfig adding lazy requestHandler: solr.StandardRequestHandler
   [junit4]   2> 350673 T1524 oasc.RequestHandlers.initHandlersFromConfig created lazy: solr.StandardRequestHandler
   [junit4]   2> 350673 T1524 oasc.RequestHandlers.initHandlersFromConfig created /update: solr.UpdateRequestHandler
   [junit4]   2> 350674 T1524 oasc.RequestHandlers.initHandlersFromConfig created /terms: org.apache.solr.handler.component.SearchHandler
   [junit4]   2> 350674 T1524 oasc.RequestHandlers.initHandlersFromConfig created spellCheckCompRH: org.apache.solr.handler.component.SearchHandler
   [junit4]   2> 350675 T1524 oasc.RequestHandlers.initHandlersFromConfig created spellCheckCompRH_Direct: org.apache.solr.handler.component.SearchHandler
   [junit4]   2> 350676 T1524 oasc.RequestHandlers.initHandlersFromConfig created spellCheckWithWordbreak: org.apache.solr.handler.component.SearchHandler
   [junit4]   2> 350676 T1524 oasc.RequestHandlers.initHandlersFromConfig created spellCheckWithWordbreak_Direct: org.apache.solr.handler.component.SearchHandler
   [junit4]   2> 350677 T1524 oasc.RequestHandlers.initHandlersFromConfig created spellCheckCompRH1: org.apache.solr.handler.component.SearchHandler
   [junit4]   2> 350677 T1524 oasc.RequestHandlers.initHandlersFromConfig created mltrh: org.apache.solr.handler.component.SearchHandler
   [junit4]   2> 350678 T1524 oasc.RequestHandlers.initHandlersFromConfig created tvrh: org.apache.solr.handler.component.SearchHandler
   [junit4]   2> 350678 T1524 oasc.RequestHandlers.initHandlersFromConfig created /mlt: solr.MoreLikeThisHandler
   [junit4]   2> 350679 T1524 oasc.RequestHandlers.initHandlersFromConfig created /debug/dump: solr.DumpRequestHandler
   [junit4]   2> 350680 T1524 oashl.XMLLoader.init xsltCacheLifetimeSeconds=60
   [junit4]   2> 350682 T1524 oasc.SolrCore.initDeprecatedSupport WARN solrconfig.xml uses deprecated <admin/gettableFiles>, Please update your config to use the ShowFileRequestHandler.
   [junit4]   2> 350683 T1524 oasc.SolrCore.initDeprecatedSupport WARN adding ShowFileRequestHandler with hidden files: [SCHEMA-REQUIRED-FIELDS.XML, SCHEMA11.XML, SCHEMA15.XML, SCHEMA-SIM.XML, BAD-SOLRCONFIG-UNEXPECTED-SCHEMA-ATTRIBUTE.XML, CONDITIONAL.UPDATEPROCESSOR.JS, SCHEMA-ID-AND-VERSION-FIELDS-ONLY.XML, BAD-SOLRCONFIG-WARMER-NO-REOPEN.XML, SOLRCONFIG-NOOPREGEN.XML, SOLRCONFIG-SPELLCHECKER.XML, SCHEMA-CHARFILTERS.XML, SCHEMA-EFF.XML, SOLRCONFIG_CODEC.XML, HYPHENATION.DTD, BAD-SCHEMA-EXTERNAL-FILEFIELD.XML, TRIVIAL.UPDATEPROCESSOR1.JS, SOLRCONFIG-SLAVE1.XML, SOLRCONFIG-BASIC.XML, SCHEMA-LMJELINEKMERCER.XML, BAD-SCHEMA-DUP-FIELD.XML, SCHEMA-ONE-FIELD-NO-DYNAMIC-FIELD-UNIQUE-KEY.XML, SOLRCONFIG-PARSING-UPDATE-PROCESSOR-CHAINS.XML, SOLRCONFIG-HIGHLIGHT.XML, SCHEMA-TFIDF.XML, STOPWITHBOM.TXT, SOLRCONFIG-ELEVATE.XML, SOLRCONFIG-QUERYSENDER.XML, WDFTYPES.TXT, SOLRCONFIG-COMPONENTS-NAME.XML, BAD-SCHEMA-CURRENCY-FT-OER-NORATES.XML, SOLRCONFIG-COLLAPSEQPARSER.XML, SOLRCONFIG-DELPOLICY1.XML, BAD-SCHEMA-UNSUPPORTED-DOCVALUES.XML, KEEP-2.TXT, SCHEMA-STOP-KEEP.XML, SCHEMA-ONE-FIELD-NO-DYNAMIC-FIELD.XML, STOP-SNOWBALL.TXT, BAD-SCHEMA-MULTIPLE-ASTERISK-COPYFIELD-DEST-SHOULD-FAIL-TEST.XML, SCHEMA-DOCVALUESMULTI.XML, SOLRCONFIG-INDEXCONFIG.XML, SCHEMA-CLASS-NAME-SHORTENING-ON-SERIALIZATION.XML, STOPWORDSWRONGENCODING.TXT, SOLRCONFIG-SPELLCHECKCOMPONENT.XML, SOLRCONFIG.SNIPPET.RANDOMINDEXCONFIG.XML, SOLRCONFIG-MINIMAL.XML, SOLRCONFIG-TLOG.XML, SCHEMA-DOCVALUESFACETING.XML, BAD-SOLRCONFIG-INVALID-SCRIPTFILE.XML, OPEN-EXCHANGE-RATES.JSON, BAD-SCHEMA-DUP-FIELDTYPE.XML, PHRASESUGGEST.TXT, OLD_SYNONYMS.TXT, SOLRCONFIG-INFOSTREAM-LOGGING.XML, SCHEMA-NOT-REQUIRED-UNIQUE-KEY.XML, SCHEMA-REVERSED.XML, SCHEMA-FOLDING.XML, BAD-SOLRCONFIG-MULTIPLE-DIRFACTORY.XML, SCHEMA-BM25.XML, BAD-SCHEMA-SWEETSPOT-BOTH-TF.XML, MISSING.FUNCTIONS.UPDATEPROCESSOR.JS, SOLRCONFIG-TRANSFORMERS.XML, SCHEMA-COPYFIELD-TEST.XML, BAD-SCHEMA-DUP-DYNAMICFIELD.XML, BAD-SCHEMA-SWEETSPOT-PARTIAL-BASELINE.XML, CURRENCY.XML, FUZZYSUGGEST.TXT, SCHEMA-POSTINGSHIGHLIGHT.XML, SOLRCONFIG-SOLR-749.XML, SOLRCONFIG_PERF.XML, SCHEMA-SWEETSPOT.XML, SCHEMA-TINY.XML, SOLRCONFIG-LAZYWRITER.XML, SOLRCONFIG-RESPONSE-LOG-COMPONENT.XML, SCHEMA-REPLICATION2.XML, BAD-SOLRCONFIG-MULTIPLE-CFS.XML, SCHEMA-SNIPPET-TYPE.XML, SOLRCONFIG-XINCLUDE.XML, SCHEMA-SPELLCHECKER.XML, SOLRCONFIG-WARMER.XML, SOLRCONFIG-TIEREDMERGEPOLICY.XML, KEEP-1.TXT, SCHEMA-TRIE.XML, BAD-SCHEMA-OMIT-TF-BUT-NOT-POS.XML, BAD-SCHEMA-CURRENCY-FT-BOGUS-CODE-IN-XML.XML, STOPTYPES-2.TXT, SCHEMA_CODEC.XML, SCHEMA-SYNONYM-TOKENIZER.XML, SOLRCONFIG-DEFAULTS.XML, SCHEMA-XINCLUDE.XML, SCHEMA-SNIPPET-FIELD.XML, SOLRCONFIG-REQHANDLER.INCL, SCHEMA-PHRASESUGGEST.XML, SCHEMA-DFR.XML, BAD-SCHEMA-DYNAMICFIELD-DEFAULT-VAL.XML, SOLRCONFIG-MASTER3.XML, SOLRCONFIG-UPDATE-PROCESSOR-CHAINS.XML, BAD-SCHEMA-MULTIPLE-ASTERISK-COPYFIELD-SOURCE-SHOULD-FAIL-TEST.XML, BAD-SCHEMA-CURRENCY-FT-BOGUS-DEFAULT-CODE.XML, ANALYZINGINFIXSUGGEST.TXT, BAD-SCHEMA-NOT-INDEXED-BUT-TF.XML, SOLRCONFIG-MANAGED-SCHEMA.XML, BAD-SOLRCONFIG-MULTIPLE-INDEXCONFIGS.XML, BAD-SOLRCONFIG-MANAGED-SCHEMA-NAMED-SCHEMA.XML.XML, SOLRCONFIG-MASTER1-KEEPONEBACKUP.XML, BAD-SCHEMA-NONTEXT-ANALYZER.XML, SCHEMA-BEHAVIOR.XML, SOLRCONFIG-MERGEPOLICY-DEFAULTS.XML, STOP-2.TXT, BAD-SCHEMA-UNIQUEKEY-USES-DEFAULT.XML, SCHEMA-DOCVALUES.XML, BAD-SOLRCONFIG-MISSING-SCRIPTFILE.XML, SOLRCONFIG-SCRIPT-UPDATEPROCESSOR.XML, SOLRCONFIG-REPEATER.XML, SOLRCONFIG-NOCACHE.XML, SOLRCONFIG-SOLCOREPROPERTIES.XML, SOLRCONFIG-IMPLICITPROPERTIES.XML, SOLRCONFIG-PHRASESUGGEST.XML, JASUGGEST.TXT, BAD-MP-SOLRCONFIG.XML, BAD-SCHEMA-UNIQUEKEY-MULTIVALUED.XML, SOLRCONFIG-MASTER.XML, SYNONYMS.TXT, SCHEMA-REPLICATION1.XML, SCHEMA-SNIPPET-TYPES.INCL, SOLRCONFIG-SNIPPET-PROCESSOR.XML, BAD_SOLRCONFIG.XML, HUNSPELL-TEST.DIC, SCHEMA-LUCENEMATCHVERSION.XML, SCHEMA-NUMERIC.XML, SCHEMA-IB.XML, BAD-SCHEMA-DYNAMICFIELD-REQUIRED.XML, SCHEMA-ADD-SCHEMA-FIELDS-UPDATE-PROCESSOR.XML, SOLRCONFIG-SLAVE.XML, BAD-SCHEMA-NOT-INDEXED-BUT-NORMS.XML, THROW.ERROR.ON.ADD.UPDATEPROCESSOR.JS, BAD-SCHEMA-MISPLACED-ASTERISK-COPYFIELD-SOURCE-SHOULD-FAIL-TEST.XML, STOPTYPES-1.TXT, REGEX-BOOST-PROCESSOR-TEST.TXT, COMPOUNDDICTIONARY.TXT, SOLRCONFIG-POSTINGSHIGHLIGHT.XML, DA_COMPOUNDDICTIONARY.TXT, BAD-SCHEMA-NON-GLOB-COPYFIELD-SOURCE-MATCHING-NOTHING-SHOULD-FAIL-TEST.XML, SOLRCONFIG-TEST-MISC.XML, SCHEMASURROUND.XML, BAD-SCHEMA-CURRENCY-FT-MULTIVALUED.XML, SOLRCONFIG-MASTER2.XML, BAD-SCHEMA-UNIQUEKEY-IS-COPYFIELD-DEST.XML, BAD-SCHEMA-CODEC-GLOBAL-VS-FT-MISMATCH.XML, SCHEMA-LMDIRICHLET.XML, BAD-SCHEMA-NOT-INDEXED-BUT-POS.XML, SOLRCONFIG-LOGMERGEPOLICY.XML, BAD-SCHEMA-CURRENCY-MULTIVALUED.XML, SOLRCONFIG-ADD-SCHEMA-FIELDS-UPDATE-PROCESSOR-CHAINS.XML, MAPPING-ISOLATIN1ACCENT.TXT, SOLRCONFIG-CACHING.XML, SCHEMA-DOCVALUESMISSING.XML, ADDFIELDS.UPDATEPROCESSOR.JS, BAD-CURRENCY.XML, STOP-1.TXT, SCHEMA-REST.XML, SCHEMA12.XML, DA_UTF8.XML, MISSLEADING.EXTENSION.UPDATEPROCESSOR.JS.TXT, STOPWORDS.TXT, BAD-SCHEMA-BOGUS-ANALYSIS-PARAMETERS.XML, HUNSPELL-TEST.AFF, BAD-SCHEMA-MISPLACED-ASTERISK-COPYFIELD-DEST-SHOULD-FAIL-TEST.XML, BAD-SCHEMA-SWEETSPOT-PARTIAL-NORMS.XML, FRENCHARTICLES.TXT, SCHEMA-SPATIAL.XML, BAD-SCHEMA-SWEETSPOT-PARTIAL-HYPERBOLIC.XML, XSLT, SOLRCONFIG-DELPOLICY2.XML, TRIVIAL.UPDATEPROCESSOR0.JS, BAD-SCHEMA-CURRENCY-DYNAMIC-MULTIVALUED.XML, SCHEMA-BINARYFIELD.XML, SCHEMA-REST-LUCENE-MATCH-VERSION.XML, SCHEMA-MINIMAL.XML, STEMDICT.TXT, ELEVATE.XML, SCHEMA-COLLATE.XML, PROTWORDS.TXT, BAD-SCHEMA-ANALYZER-CLASS-AND-NESTED.XML, SOLRCONFIG-MASTER1.XML, BAD-SOLRCONFIG-SCHEMA-MUTABLE-BUT-NOT-MANAGED.XML, SOLRCONFIG-FUNCTIONQUERY.XML, SOLRCONFIG-ALTDIRECTORY.XML, BAD-SCHEMA-SIM-GLOBAL-VS-FT-MISMATCH.XML, SOLRCONFIG-QUERYSENDER-NOQUERY.XML, SOLRCONFIG-MERGEPOLICY-LEGACY.XML, BAD-SOLRCONFIG-BOGUS-SCRIPTENGINE-NAME.XML, BAD-SCHEMA-BOGUS-FIELD-PARAMETERS.XML]
   [junit4]   2> 350685 T1524 oasu.CommitTracker.<init> Hard AutoCommit: disabled
   [junit4]   2> 350686 T1524 oasu.CommitTracker.<init> Soft AutoCommit: disabled
   [junit4]   2> 350686 T1524 oasu.RandomMergePolicy.<init> RandomMergePolicy wrapping class org.apache.lucene.index.TieredMergePolicy: [TieredMergePolicy: maxMergeAtOnce=24, maxMergeAtOnceExplicit=23, maxMergedSegmentMB=45.7294921875, floorSegmentMB=0.916015625, forceMergeDeletesPctAllowed=21.381872615861703, segmentsPerTier=13.0, maxCFSSegmentSizeMB=8.796093022207999E12, noCFSRatio=0.39052144326529203
   [junit4]   2> 350687 T1524 oasc.SolrDeletionPolicy.onInit SolrDeletionPolicy.onInit: commits: num=1
   [junit4]   2> 		commit{dir=RateLimitedDirectoryWrapper(MockDirectoryWrapper(org.apache.lucene.store.RAMDirectory@62a3c222 lockFactory=org.apache.lucene.store.SingleInstanceLockFactory@cbcc67c1)),segFN=segments_1,generation=1}
   [junit4]   2> 350688 T1524 oasc.SolrDeletionPolicy.updateCommits newest commit generation = 1
   [junit4]   2> 350688 T1524 oass.SolrIndexSearcher.<init> Opening Searcher@219bed39 main
   [junit4]   2> 350688 T1524 oashc.SpellCheckComponent.inform Initializing spell checkers
   [junit4]   2> 350797 T1524 oass.DirectSolrSpellChecker.init init: {name=direct,classname=DirectSolrSpellChecker,field=lowerfilt,minQueryLength=3}
   [junit4]   2> 350815 T1525 oasc.SolrCore.registerSearcher [collection1] Registered new searcher Searcher@219bed39 main{StandardDirectoryReader(segments_1:1:nrt)}
   [junit4]   2> 350823 T1524 oasc.CoreContainer.registerCore registering core: collection1
   [junit4]   2> 350826 T1523 oas.SolrTestCaseJ4.initCore ####initCore end
   [junit4]   2> 350829 T1523 oas.SolrTestCaseJ4.setUp ###Starting testMaxTime
   [junit4]   2> ASYNC  NEW_CORE C878 name=collection1 org.apache.solr.core.SolrCore@82b5bb8f
   [junit4]   2> 350836 T1523 C878 oasup.LogUpdateProcessor.finish [collection1] webapp=null path=null params={} {deleteByQuery=*:* (-1449922337673576448)} 0 1
   [junit4]   2> 350840 T1523 oasc.CoreContainer.reload Reloading SolrCore 'collection1' using instanceDir: /mnt/ssd/jenkins/workspace/Lucene-Solr-trunk-Linux/solr/build/solr-core/test-files/solr/collection1
   [junit4]   2> 350840 T1523 oasc.SolrResourceLoader.<init> new SolrResourceLoader for directory: '/mnt/ssd/jenkins/workspace/Lucene-Solr-trunk-Linux/solr/build/solr-core/test-files/solr/collection1/'
   [junit4]   2> 350841 T1523 oasc.SolrResourceLoader.replaceClassLoader Adding 'file:/mnt/ssd/jenkins/workspace/Lucene-Solr-trunk-Linux/solr/build/solr-core/test-files/solr/collection1/lib/classes/' to classloader
   [junit4]   2> 350842 T1523 oasc.SolrResourceLoader.replaceClassLoader Adding 'file:/mnt/ssd/jenkins/workspace/Lucene-Solr-trunk-Linux/solr/build/solr-core/test-files/solr/collection1/lib/README' to classloader
   [junit4]   2> 350878 T1523 oasc.SolrConfig.<init> Using Lucene MatchVersion: LUCENE_50
   [junit4]   2> 350922 T1523 oasc.SolrConfig.<init> Loaded SolrConfig: solrconfig.xml
   [junit4]   2> 350923 T1523 oass.IndexSchema.readSchema Reading Solr Schema from schema.xml
   [junit4]   2> 350930 T1523 oass.IndexSchema.readSchema [collection1] Schema name=test
   [junit4]   2> 351260 T1523 oass.OpenExchangeRatesOrgProvider.init Initialized with rates=open-exchange-rates.json, refreshInterval=1440.
   [junit4]   2> 351266 T1523 oass.IndexSchema.readSchema default search field in schema is text
   [junit4]   2> 351269 T1523 oass.IndexSchema.readSchema unique key field: id
   [junit4]   2> 351275 T1523 oass.FileExchangeRateProvider.reload Reloading exchange rates from file currency.xml
   [junit4]   2> 351278 T1523 oass.FileExchangeRateProvider.reload Reloading exchange rates from file currency.xml
   [junit4]   2> 351282 T1523 oass.OpenExchangeRatesOrgProvider.reload Reloading exchange rates from open-exchange-rates.json
   [junit4]   2> 351283 T1523 oass.OpenExchangeRatesOrgProvider$OpenExchangeRates.<init> WARN Unknown key IMPORTANT NOTE
   [junit4]   2> 351283 T1523 oass.OpenExchangeRatesOrgProvider$OpenExchangeRates.<init> WARN Expected key, got STRING
   [junit4]   2> 351284 T1523 oass.OpenExchangeRatesOrgProvider.reload Reloading exchange rates from open-exchange-rates.json
   [junit4]   2> 351285 T1523 oass.OpenExchangeRatesOrgProvider$OpenExchangeRates.<init> WARN Unknown key IMPORTANT NOTE
   [junit4]   2> 351285 T1523 oass.OpenExchangeRatesOrgProvider$OpenExchangeRates.<init> WARN Expected key, got STRING
   [junit4]   2> 351286 T1523 oasc.SolrCore.<init> [collection1] Opening new SolrCore at /mnt/ssd/jenkins/workspace/Lucene-Solr-trunk-Linux/solr/build/solr-core/test-files/solr/collection1/, dataDir=/mnt/ssd/jenkins/workspace/Lucene-Solr-trunk-Linux/solr/build/solr-core/test/J0/./solrtest-AutoCommitTest-1382753693074/
   [junit4]   2> 351286 T1523 oasc.JmxMonitoredMap.<init> JMX monitoring is enabled. Adding Solr mbeans to JMX Server: com.sun.jmx.mbeanserver.JmxMBeanServer@fa2c4d2f
   [junit4]   2> 351287 T1523 oasc.SolrCore.getNewIndexDir New index directory detected: old=null new=/mnt/ssd/jenkins/workspace/Lucene-Solr-trunk-Linux/solr/build/solr-core/test/J0/./solrtest-AutoCommitTest-1382753693074/index/
   [junit4]   2> 351287 T1523 oasc.SolrCore.initWriters created xml: solr.XMLResponseWriter
   [junit4]   2> 351292 T1523 oasup.UpdateRequestProcessorChain.init creating updateRequestProcessorChain "dedupe"
   [junit4]   2> 351293 T1523 oasup.UpdateRequestProcessorChain.init inserting DistributedUpdateProcessorFactory into updateRequestProcessorChain "dedupe"
   [junit4]   2> 351293 T1523 oasup.UpdateRequestProcessorChain.init creating updateRequestProcessorChain "dedupe-allfields"
   [junit4]   2> 351294 T1523 oasup.UpdateRequestProcessorChain.init inserting DistributedUpdateProcessorFactory into updateRequestProcessorChain "dedupe-allfields"
   [junit4]   2> 351294 T1523 oasup.UpdateRequestProcessorChain.init creating updateRequestProcessorChain "stored_sig"
   [junit4]   2> 351295 T1523 oasup.UpdateRequestProcessorChain.init inserting DistributedUpdateProcessorFactory into updateRequestProcessorChain "stored_sig"
   [junit4]   2> 351295 T1523 oasup.UpdateRequestProcessorChain.init creating updateRequestProcessorChain "uniq-fields"
   [junit4]   2> 351296 T1523 oasup.UpdateRequestProcessorChain.init inserting DistributedUpdateProcessorFactory into updateRequestProcessorChain "uniq-fields"
   [junit4]   2> 351296 T1523 oasup.UpdateRequestProcessorChain.init creating updateRequestProcessorChain "distrib-dup-test-chain-explicit"
   [junit4]   2> 351297 T1523 oasup.UpdateRequestProcessorChain.init creating updateRequestProcessorChain "distrib-dup-test-chain-implicit"
   [junit4]   2> 351297 T1523 oasup.UpdateRequestProcessorChain.init inserting DistributedUpdateProcessorFactory into updateRequestProcessorChain "distrib-dup-test-chain-implicit"
   [junit4]   2> 351298 T1523 oasc.SolrCore.loadUpdateProcessorChains no updateRequestProcessorChain defined as default, creating implicit default
   [junit4]   2> 351298 T1523 oasc.RequestHandlers.initHandlersFromConfig adding lazy requestHandler: solr.ReplicationHandler
   [junit4]   2> 351299 T1523 oasc.RequestHandlers.initHandlersFromConfig created /replication: solr.ReplicationHandler
   [junit4]   2> 351300 T1523 oasc.RequestHandlers.initHandlersFromConfig created standard: solr.StandardRequestHandler
   [junit4]   2> 351300 T1523 oasc.RequestHandlers.initHandlersFromConfig created /get: solr.RealTimeGetHandler
   [junit4]   2> 351301 T1523 oasc.RequestHandlers.initHandlersFromConfig created dismax: solr.SearchHandler
   [junit4]   2> 351302 T1523 oasc.RequestHandlers.initHandlersFromConfig created mock: org.apache.solr.core.MockQuerySenderListenerReqHandler
   [junit4]   2> 351303 T1523 oasc.RequestHandlers.initHandlersFromConfig created /admin/: org.apache.solr.handler.admin.AdminHandlers
   [junit4]   2> 351303 T1523 oasc.RequestHandlers.initHandlersFromConfig created defaults: solr.StandardRequestHandler
   [junit4]   2> 351304 T1523 oasc.RequestHandlers.initHandlersFromConfig adding lazy requestHandler: solr.StandardRequestHandler
   [junit4]   2> 351304 T1523 oasc.RequestHandlers.initHandlersFromConfig created lazy: solr.StandardRequestHandler
   [junit4]   2> 351305 T1523 oasc.RequestHandlers.initHandlersFromConfig created /update: solr.UpdateRequestHandler
   [junit4]   2> 351306 T1523 oasc.RequestHandlers.initHandlersFromConfig created /terms: org.apache.solr.handler.component.SearchHandler
   [junit4]   2> 351307 T1523 oasc.RequestHandlers.initHandlersFromConfig created spellCheckCompRH: org.apache.solr.handler.component.SearchHandler
   [junit4]   2> 351308 T1523 oasc.RequestHandlers.initHandlersFromConfig created spellCheckCompRH_Direct: org.apache.solr.handler.component.SearchHandler
   [junit4]   2> 351308 T1523 oasc.RequestHandlers.initHandlersFromConfig created spellCheckWithWordbreak: org.apache.solr.handler.component.SearchHandler
   [junit4]   2> 351309 T1523 oasc.RequestHandlers.initHandlersFromConfig created spellCheckWithWordbreak_Direct: org.apache.solr.handler.component.SearchHandler
   [junit4]   2> 351310 T1523 oasc.RequestHandlers.initHandlersFromConfig created spellCheckCompRH1: org.apache.solr.handler.component.SearchHandler
   [junit4]   2> 351311 T1523 oasc.RequestHandlers.initHandlersFromConfig created mltrh: org.apache.solr.handler.component.SearchHandler
   [junit4]   2> 351312 T1523 oasc.RequestHandlers.initHandlersFromConfig created tvrh: org.apache.solr.handler.component.SearchHandler
   [junit4]   2> 351312 T1523 oasc.RequestHandlers.initHandlersFromConfig created /mlt: solr.MoreLikeThisHandler
   [junit4]   2> 351313 T1523 oasc.RequestHandlers.initHandlersFromConfig created /debug/dump: solr.DumpRequestHandler
   [junit4]   2> 351315 T1523 oashl.XMLLoader.init xsltCacheLifetimeSeconds=60
   [junit4]   2> 351316 T1523 oasc.SolrCore.initDeprecatedSupport WARN solrconfig.xml uses deprecated <admin/gettableFiles>, Please update your config to use the ShowFileRequestHandler.
   [junit4]   2> 351318 T1523 oasc.SolrCore.initDeprecatedSupport WARN adding ShowFileRequestHandler with hidden files: [SCHEMA-REQUIRED-FIELDS.XML, SCHEMA11.XML, SCHEMA15.XML, SCHEMA-SIM.XML, BAD-SOLRCONFIG-UNEXPECTED-SCHEMA-ATTRIBUTE.XML, CONDITIONAL.UPDATEPROCESSOR.JS, SCHEMA-ID-AND-VERSION-FIELDS-ONLY.XML, BAD-SOLRCONFIG-WARMER-NO-REOPEN.XML, SOLRCONFIG-NOOPREGEN.XML, SOLRCONFIG-SPELLCHECKER.XML, SCHEMA-CHARFILTERS.XML, SCHEMA-EFF.XML, SOLRCONFIG_CODEC.XML, HYPHENATION.DTD, BAD-SCHEMA-EXTERNAL-FILEFIELD.XML, TRIVIAL.UPDATEPROCESSOR1.JS, SOLRCONFIG-SLAVE1.XML, SOLRCONFIG-BASIC.XML, SCHEMA-LMJELINEKMERCER.XML, BAD-SCHEMA-DUP-FIELD.XML, SCHEMA-ONE-FIELD-NO-DYNAMIC-FIELD-UNIQUE-KEY.XML, SOLRCONFIG-PARSING-UPDATE-PROCESSOR-CHAINS.XML, SOLRCONFIG-HIGHLIGHT.XML, SCHEMA-TFIDF.XML, STOPWITHBOM.TXT, SOLRCONFIG-ELEVATE.XML, SOLRCONFIG-QUERYSENDER.XML, WDFTYPES.TXT, SOLRCONFIG-COMPONENTS-NAME.XML, BAD-SCHEMA-CURRENCY-FT-OER-NORATES.XML, SOLRCONFIG-COLLAPSEQPARSER.XML, SOLRCONFIG-DELPOLICY1.XML, BAD-SCHEMA-UNSUPPORTED-DOCVALUES.XML, KEEP-2.TXT, SCHEMA-STOP-KEEP.XML, SCHEMA-ONE-FIELD-NO-DYNAMIC-FIELD.XML, STOP-SNOWBALL.TXT, BAD-SCHEMA-MULTIPLE-ASTERISK-COPYFIELD-DEST-SHOULD-FAIL-TEST.XML, SCHEMA-DOCVALUESMULTI.XML, SOLRCONFIG-INDEXCONFIG.XML, SCHEMA-CLASS-NAME-SHORTENING-ON-SERIALIZATION.XML, STOPWORDSWRONGENCODING.TXT, SOLRCONFIG-SPELLCHECKCOMPONENT.XML, SOLRCONFIG.SNIPPET.RANDOMINDEXCONFIG.XML, SOLRCONFIG-MINIMAL.XML, SOLRCONFIG-TLOG.XML, SCHEMA-DOCVALUESFACETING.XML, BAD-SOLRCONFIG-INVALID-SCRIPTFILE.XML, OPEN-EXCHANGE-RATES.JSON, BAD-SCHEMA-DUP-FIELDTYPE.XML, PHRASESUGGEST.TXT, OLD_SYNONYMS.TXT, SOLRCONFIG-INFOSTREAM-LOGGING.XML, SCHEMA-NOT-REQUIRED-UNIQUE-KEY.XML, SCHEMA-REVERSED.XML, SCHEMA-FOLDING.XML, BAD-SOLRCONFIG-MULTIPLE-DIRFACTORY.XML, SCHEMA-BM25.XML, BAD-SCHEMA-SWEETSPOT-BOTH-TF.XML, MISSING.FUNCTIONS.UPDATEPROCESSOR.JS, SOLRCONFIG-TRANSFORMERS.XML, SCHEMA-COPYFIELD-TEST.XML, BAD-SCHEMA-DUP-DYNAMICFIELD.XML, BAD-SCHEMA-SWEETSPOT-PARTIAL-BASELINE.XML, CURRENCY.XML, FUZZYSUGGEST.TXT, SCHEMA-POSTINGSHIGHLIGHT.XML, SOLRCONFIG-SOLR-749.XML, SOLRCONFIG_PERF.XML, SCHEMA-SWEETSPOT.XML, SCHEMA-TINY.XML, SOLRCONFIG-LAZYWRITER.XML, SOLRCONFIG-RESPONSE-LOG-COMPONENT.XML, SCHEMA-REPLICATION2.XML, BAD-SOLRCONFIG-MULTIPLE-CFS.XML, SCHEMA-SNIPPET-TYPE.XML, SOLRCONFIG-XINCLUDE.XML, SCHEMA-SPELLCHECKER.XML, SOLRCONFIG-WARMER.XML, SOLRCONFIG-TIEREDMERGEPOLICY.XML, KEEP-1.TXT, SCHEMA-TRIE.XML, BAD-SCHEMA-OMIT-TF-BUT-NOT-POS.XML, BAD-SCHEMA-CURRENCY-FT-BOGUS-CODE-IN-XML.XML, STOPTYPES-2.TXT, SCHEMA_CODEC.XML, SCHEMA-SYNONYM-TOKENIZER.XML, SOLRCONFIG-DEFAULTS.XML, SCHEMA-XINCLUDE.XML, SCHEMA-SNIPPET-FIELD.XML, SOLRCONFIG-REQHANDLER.INCL, SCHEMA-PHRASESUGGEST.XML, SCHEMA-DFR.XML, BAD-SCHEMA-DYNAMICFIELD-DEFAULT-VAL.XML, SOLRCONFIG-MASTER3.XML, SOLRCONFIG-UPDATE-PROCESSOR-CHAINS.XML, BAD-SCHEMA-MULTIPLE-ASTERISK-COPYFIELD-SOURCE-SHOULD-FAIL-TEST.XML, BAD-SCHEMA-CURRENCY-FT-BOGUS-DEFAULT-CODE.XML, ANALYZINGINFIXSUGGEST.TXT, BAD-SCHEMA-NOT-INDEXED-BUT-TF.XML, SOLRCONFIG-MANAGED-SCHEMA.XML, BAD-SOLRCONFIG-MULTIPLE-INDEXCONFIGS.XML, BAD-SOLRCONFIG-MANAGED-SCHEMA-NAMED-SCHEMA.XML.XML, SOLRCONFIG-MASTER1-KEEPONEBACKUP.XML, BAD-SCHEMA-NONTEXT-ANALYZER.XML, SCHEMA-BEHAVIOR.XML, SOLRCONFIG-MERGEPOLICY-DEFAULTS.XML, STOP-2.TXT, BAD-SCHEMA-UNIQUEKEY-USES-DEFAULT.XML, SCHEMA-DOCVALUES.XML, BAD-SOLRCONFIG-MISSING-SCRIPTFILE.XML, SOLRCONFIG-SCRIPT-UPDATEPROCESSOR.XML, SOLRCONFIG-REPEATER.XML, SOLRCONFIG-NOCACHE.XML, SOLRCONFIG-SOLCOREPROPERTIES.XML, SOLRCONFIG-IMPLICITPROPERTIES.XML, SOLRCONFIG-PHRASESUGGEST.XML, JASUGGEST.TXT, BAD-MP-SOLRCONFIG.XML, BAD-SCHEMA-UNIQUEKEY-MULTIVALUED.XML, SOLRCONFIG-MASTER.XML, SYNONYMS.TXT, SCHEMA-REPLICATION1.XML, SCHEMA-SNIPPET-TYPES.INCL, SOLRCONFIG-SNIPPET-PROCESSOR.XML, BAD_SOLRCONFIG.XML, HUNSPELL-TEST.DIC, SCHEMA-LUCENEMATCHVERSION.XML, SCHEMA-NUMERIC.XML, SCHEMA-IB.XML, BAD-SCHEMA-DYNAMICFIELD-REQUIRED.XML, SCHEMA-ADD-SCHEMA-FIELDS-UPDATE-PROCESSOR.XML, SOLRCONFIG-SLAVE.XML, BAD-SCHEMA-NOT-INDEXED-BUT-NORMS.XML, THROW.ERROR.ON.ADD.UPDATEPROCESSOR.JS, BAD-SCHEMA-MISPLACED-ASTERISK-COPYFIELD-SOURCE-SHOULD-FAIL-TEST.XML, STOPTYPES-1.TXT, REGEX-BOOST-PROCESSOR-TEST.TXT, COMPOUNDDICTIONARY.TXT, SOLRCONFIG-POSTINGSHIGHLIGHT.XML, DA_COMPOUNDDICTIONARY.TXT, BAD-SCHEMA-NON-GLOB-COPYFIELD-SOURCE-MATCHING-NOTHING-SHOULD-FAIL-TEST.XML, SOLRCONFIG-TEST-MISC.XML, SCHEMASURROUND.XML, BAD-SCHEMA-CURRENCY-FT-MULTIVALUED.XML, SOLRCONFIG-MASTER2.XML, BAD-SCHEMA-UNIQUEKEY-IS-COPYFIELD-DEST.XML, BAD-SCHEMA-CODEC-GLOBAL-VS-FT-MISMATCH.XML, SCHEMA-LMDIRICHLET.XML, BAD-SCHEMA-NOT-INDEXED-BUT-POS.XML, SOLRCONFIG-LOGMERGEPOLICY.XML, BAD-SCHEMA-CURRENCY-MULTIVALUED.XML, SOLRCONFIG-ADD-SCHEMA-FIELDS-UPDATE-PROCESSOR-CHAINS.XML, MAPPING-ISOLATIN1ACCENT.TXT, SOLRCONFIG-CACHING.XML, SCHEMA-DOCVALUESMISSING.XML, ADDFIELDS.UPDATEPROCESSOR.JS, BAD-CURRENCY.XML, STOP-1.TXT, SCHEMA-REST.XML, SCHEMA12.XML, DA_UTF8.XML, MISSLEADING.EXTENSION.UPDATEPROCESSOR.JS.TXT, STOPWORDS.TXT, BAD-SCHEMA-BOGUS-ANALYSIS-PARAMETERS.XML, HUNSPELL-TEST.AFF, BAD-SCHEMA-MISPLACED-ASTERISK-COPYFIELD-DEST-SHOULD-FAIL-TEST.XML, BAD-SCHEMA-SWEETSPOT-PARTIAL-NORMS.XML, FRENCHARTICLES.TXT, SCHEMA-SPATIAL.XML, BAD-SCHEMA-SWEETSPOT-PARTIAL-HYPERBOLIC.XML, XSLT, SOLRCONFIG-DELPOLICY2.XML, TRIVIAL.UPDATEPROCESSOR0.JS, BAD-SCHEMA-CURRENCY-DYNAMIC-MULTIVALUED.XML, SCHEMA-BINARYFIELD.XML, SCHEMA-REST-LUCENE-MATCH-VERSION.XML, SCHEMA-MINIMAL.XML, STEMDICT.TXT, ELEVATE.XML, SCHEMA-COLLATE.XML, PROTWORDS.TXT, BAD-SCHEMA-ANALYZER-CLASS-AND-NESTED.XML, SOLRCONFIG-MASTER1.XML, BAD-SOLRCONFIG-SCHEMA-MUTABLE-BUT-NOT-MANAGED.XML, SOLRCONFIG-FUNCTIONQUERY.XML, SOLRCONFIG-ALTDIRECTORY.XML, BAD-SCHEMA-SIM-GLOBAL-VS-FT-MISMATCH.XML, SOLRCONFIG-QUERYSENDER-NOQUERY.XML, SOLRCONFIG-MERGEPOLICY-LEGACY.XML, BAD-SOLRCONFIG-BOGUS-SCRIPTENGINE-NAME.XML, BAD-SCHEMA-BOGUS-FIELD-PARAMETERS.XML]
   [junit4]   2> 351320 T1523 oasu.CommitTracker.<init> Hard AutoCommit: disabled
   [junit4]   2> 351321 T1523 oasu.CommitTracker.<init> Soft AutoCommit: disabled
   [junit4]   2> 351321 T1523 oass.SolrIndexSearcher.<init> Opening Searcher@2e9f547d main
   [junit4]   2> 351322 T1523 oashc.SpellCheckComponent.inform Initializing spell checkers
   [junit4]   2> 351323 T1523 oass.DirectSolrSpellChecker.init init: {name=direct,classname=DirectSolrSpellChecker,field=lowerfilt,minQueryLength=3}
   [junit4]   2> 351332 T1527 oasc.SolrCore.registerSearcher [collection1] Registered new searcher Searcher@2e9f547d main{StandardDirectoryReader(segments_1:1:nrt)}
   [junit4]   2> 351340 T1523 oasu.DefaultSolrCoreState.newIndexWriter Creating new IndexWriter...
   [junit4]   2> 351341 T1523 oasu.DefaultSolrCoreState.newIndexWriter Waiting until IndexWriter is unused... core=collection1
   [junit4]   2> 351341 T1523 oasu.DefaultSolrCoreState.newIndexWriter Closing old IndexWriter... core=collection1
   [junit4]   2> 351342 T1523 oasu.RandomMergePolicy.<init> RandomMergePolicy wrapping class org.apache.lucene.index.TieredMergePolicy: [TieredMergePolicy: maxMergeAtOnce=3, maxMergeAtOnceExplicit=6, maxMergedSegmentMB=43.201171875, floorSegmentMB=1.154296875, forceMergeDeletesPctAllowed=16.806749596203886, segmentsPerTier=30.0, maxCFSSegmentSizeMB=8.796093022207999E12, noCFSRatio=0.717306974284395
   [junit4]   2> 351343 T1523 oasc.SolrDeletionPolicy.onInit SolrDeletionPolicy.onInit: commits: num=1
   [junit4]   2> 		commit{dir=RateLimitedDirectoryWrapper(MockDirectoryWrapper(org.apache.lucene.store.RAMDirectory@62a3c222 lockFactory=org.apache.lucene.store.SingleInstanceLockFactory@cbcc67c1)),segFN=segments_1,generation=1}
   [junit4]   2> 351343 T1523 oasc.SolrDeletionPolicy.updateCommits newest commit generation = 1
   [junit4]   2> 351344 T1523 oasu.DefaultSolrCoreState.newIndexWriter New IndexWriter is ready to be used.
   [junit4]   2> 351344 T1523 oass.SolrIndexSearcher.<init> Opening Searcher@1e4b5e15 main
   [junit4]   2> 351345 T1523 oasc.CoreContainer.registerCore replacing core: collection1
   [junit4]   2> 351345 T1523 oasc.SolrCore.close [collection1]  CLOSING SolrCore org.apache.solr.core.SolrCore@82b5bb8f
   [junit4]   2> 351347 T1527 oasc.SolrCore.registerSearcher [collection1] Registered new searcher Searcher@1e4b5e15 main{StandardDirectoryReader(segments_1:1:nrt)}
   [junit4]   2> 351355 T1523 oasu.DirectUpdateHandler2.close closing DirectUpdateHandler2{commits=0,autocommits=0,soft autocommits=0,optimizes=0,rollbacks=0,expungeDeletes=0,docsPending=0,adds=0,deletesById=0,deletesByQuery=1,errors=0,cumulative_adds=0,cumulative_deletesById=0,cumulative_deletesByQuery=1,cumulative_errors=0}
   [junit4]   2> 351356 T1523 oasc.SolrCore.closeSearcher [collection1] Closing main searcher on request.
   [junit4]   2> 352564 T1523 oasup.LogUpdateProcessor.finish [collection1] {add=[529 (1449922339485515776)]} 0 1206
   [junit4]   2> 353564 T1528 oasu.DirectUpdateHandler2.commit start commit{,optimize=false,openSearcher=true,waitSearcher=true,expungeDeletes=false,softCommit=true,prepareCommit=false}
   [junit4]   2> 353567 T1528 oass.SolrIndexSearcher.<init> Opening Searcher@3de947ba main
   [junit4]   2> 353568 T1528 oasu.DirectUpdateHandler2.commit end_commit_flush
   [junit4]   2> 353571 T1527 oasc.SolrCore.registerSearcher [collection1] Registered new searcher Searcher@3de947ba main{StandardDirectoryReader(segments_1:3:nrt _0(5.0):c1)}
   [junit4]   2> ASYNC  NEW_CORE C879 name=collection1 org.apache.solr.core.SolrCore@122c2a6e
   [junit4]   2> 355142 T1523 C879 oasc.SolrCore.execute [collection1] webapp=null path=null params={q=id:529&start=0&qt=standard&version=2.2&rows=20} hits=1 status=0 QTime=2577 
   [junit4]   2> 355186 T1523 oas.SolrTestCaseJ4.assertQ ERROR REQUEST FAILED: xpath=//result[@numFound=0]
   [junit4]   2> 		xml response was: <?xml version="1.0" encoding="UTF-8"?>
   [junit4]   2> 	<response>
   [junit4]   2> 	<lst name="responseHeader"><int name="status">0</int><int name="QTime">2577</int></lst><result name="response" numFound="1" start="0"><doc><int name="id">529</int><int name="range_facet_si">529</int><arr name="range_facet_l"><long>529</long></arr><arr name="range_facet_sl"><long>529</long></arr><arr name="field_t"><str>what's inside?</str></arr><arr name="subject"><str>info</str></arr><long name="_version_">1449922339485515776</long><int name="intDefault">42</int><date name="timestamp">2013-10-26T02:14:55.951Z</date><arr name="multiDefault"><str>muLti-Default</str></arr></doc></result>
   [junit4]   2> 	</response>
   [junit4]   2> 	
   [junit4]   2> 		request was:q=id:529&start=0&qt=standard&version=2.2&rows=20
   [junit4]   2> 355188 T1523 oasc.SolrException.log ERROR REQUEST FAILED: q=id:529&start=0&qt=standard&version=2.2&rows=20:java.lang.RuntimeException: REQUEST FAILED: xpath=//result[@numFound=0]
   [junit4]   2> 		xml response was: <?xml version="1.0" encoding="UTF-8"?>
   [junit4]   2> 	<response>
   [junit4]   2> 	<lst name="responseHeader"><int name="status">0</int><int name="QTime">2577</int></lst><result name="response" numFound="1" start="0"><doc><int name="id">529</int><int name="range_facet_si">529</int><arr name="range_facet_l"><long>529</long></arr><arr name="range_facet_sl"><long>529</long></arr><arr name="field_t"><str>what's inside?</str></arr><arr name="subject"><str>info</str></arr><long name="_version_">1449922339485515776</long><int name="intDefault">42</int><date name="timestamp">2013-10-26T02:14:55.951Z</date><arr name="multiDefault"><str>muLti-Default</str></arr></doc></result>
   [junit4]   2> 	</response>
   [junit4]   2> 	
   [junit4]   2> 		request was:q=id:529&start=0&qt=standard&version=2.2&rows=20
   [junit4]   2> 		at org.apache.solr.SolrTestCaseJ4.assertQ(SolrTestCaseJ4.java:630)
   [junit4]   2> 		at org.apache.solr.update.AutoCommitTest.testMaxTime(AutoCommitTest.java:227)
   [junit4]   2> 		at sun.reflect.NativeMethodAccessorImpl.invoke0(Native Method)
   [junit4]   2> 		at sun.reflect.NativeMethodAccessorImpl.invoke(NativeMethodAccessorImpl.java:88)
   [junit4]   2> 		at sun.reflect.DelegatingMethodAccessorImpl.invoke(DelegatingMethodAccessorImpl.java:55)
   [junit4]   2> 		at java.lang.reflect.Method.invoke(Method.java:613)
   [junit4]   2> 		at com.carrotsearch.randomizedtesting.RandomizedRunner.invoke(RandomizedRunner.java:1559)
   [junit4]   2> 		at com.carrotsearch.randomizedtesting.RandomizedRunner.access$600(RandomizedRunner.java:79)
   [junit4]   2> 		at com.carrotsearch.randomizedtesting.RandomizedRunner$6.evaluate(RandomizedRunner.java:737)
   [junit4]   2> 		at com.carrotsearch.randomizedtesting.RandomizedRunner$7.evaluate(RandomizedRunner.java:773)
   [junit4]   2> 		at com.carrotsearch.randomizedtesting.RandomizedRunner$8.evaluate(RandomizedRunner.java:787)
   [junit4]   2> 		at com.carrotsearch.randomizedtesting.rules.SystemPropertiesRestoreRule$1.evaluate(SystemPropertiesRestoreRule.java:53)
   [junit4]   2> 		at org.apache.lucene.util.TestRuleSetupTeardownChained$1.evaluate(TestRuleSetupTeardownChained.java:50)
   [junit4]   2> 		at org.apache.lucene.util.TestRuleFieldCacheSanity$1.evaluate(TestRuleFieldCacheSanity.java:51)
   [junit4]   2> 		at org.apache.lucene.util.AbstractBeforeAfterRule$1.evaluate(AbstractBeforeAfterRule.java:46)
   [junit4]   2> 		at com.carrotsearch.randomizedtesting.rules.SystemPropertiesInvariantRule$1.evaluate(SystemPropertiesInvariantRule.java:55)
   [junit4]   2> 		at org.apache.lucene.util.TestRuleThreadAndTestName$1.evaluate(TestRuleThreadAndTestName.java:49)
   [junit4]   2> 		at org.apache.lucene.util.TestRuleIgnoreAfterMaxFailures$1.evaluate(TestRuleIgnoreAfterMaxFailures.java:70)
   [junit4]   2> 		at org.apache.lucene.util.TestRuleMarkFailure$1.evaluate(TestRuleMarkFailure.java:48)
   [junit4]   2> 		at com.carrotsearch.randomizedtesting.rules.StatementAdapter.evaluate(StatementAdapter.java:36)
   [junit4]   2> 		at com.carrotsearch.randomizedtesting.ThreadLeakControl$StatementRunner.run(ThreadLeakControl.java:358)
   [junit4]   2> 		at com.carrotsearch.randomizedtesting.ThreadLeakControl.forkTimeoutingTask(ThreadLeakControl.java:782)
   [junit4]   2> 		at com.carrotsearch.randomizedtesting.ThreadLeakControl$3.evaluate(ThreadLeakControl.java:442)
   [junit4]   2> 		at com.carrotsearch.randomizedtesting.RandomizedRunner.runSingleTest(RandomizedRunner.java:746)
   [junit4]   2> 		at com.carrotsearch.randomizedtesting.RandomizedRunner$3.evaluate(RandomizedRunner.java:648)
   [junit4]   2> 		at com.carrotsearch.randomizedtesting.RandomizedRunner$4.evaluate(RandomizedRunner.java:682)
   [junit4]   2> 		at com.carrotsearch.randomizedtesting.RandomizedRunner$5.evaluate(RandomizedRunner.java:693)
   [junit4]   2> 		at com.carrotsearch.randomizedtesting.rules.StatementAdapter.evaluate(StatementAdapter.java:36)
   [junit4]   2> 		at com.carrotsearch.randomizedtesting.rules.SystemPropertiesRestoreRule$1.evaluate(SystemPropertiesRestoreRule.java:53)
   [junit4]   2> 		at org.apache.lucene.util.AbstractBeforeAfterRule$1.evaluate(AbstractBeforeAfterRule.java:46)
   [junit4]   2> 		at org.apache.lucene.util.TestRuleStoreClassName$1.evaluate(TestRuleStoreClassName.java:42)
   [junit4]   2> 		at com.carrotsearch.randomizedtesting.rules.SystemPropertiesInvariantRule$1.evaluate(SystemPropertiesInvariantRule.java:55)
   [junit4]   2> 		at com.carrotsearch.randomizedtesting.rules.NoShadowingOrOverridesOnMethodsRule$1.evaluate(NoShadowingOrOverridesOnMethodsRule.java:39)
   [junit4]   2> 		at com.carrotsearch.randomizedtesting.rules.NoShadowingOrOverridesOnMethodsRule$1.evaluate(NoShadowingOrOverridesOnMethodsRule.java:39)
   [junit4]   2> 		at com.carrotsearch.randomizedtesting.rules.StatementAdapter.evaluate(StatementAdapter.java:36)
   [junit4]   2> 		at org.apache.lucene.util.TestRuleAssertionsRequired$1.evaluate(TestRuleAssertionsRequired.java:43)
   [junit4]   2> 		at org.apache.lucene.util.TestRuleMarkFailure$1.evaluate(TestRuleMarkFailure.java:48)
   [junit4]   2> 		at org.apache.lucene.util.TestRuleIgnoreAfterMaxFailures$1.evaluate(TestRuleIgnoreAfterMaxFailures.java:70)
   [junit4]   2> 		at org.apache.lucene.util.TestRuleIgnoreTestSuites$1.evaluate(TestRuleIgnoreTestSuites.java:55)
   [junit4]   2> 		at com.carrotsearch.randomizedtesting.rules.StatementAdapter.evaluate(StatementAdapter.java:36)
   [junit4]   2> 		at com.carrotsearch.randomizedtesting.ThreadLeakControl$StatementRunner.run(ThreadLeakControl.java:358)
   [junit4]   2> 		at java.lang.Thread.run(Thread.java:780)
   [junit4]   2> 	
   [junit4]   2> 355188 T1523 oas.SolrTestCaseJ4.tearDown ###Ending testMaxTime
   [junit4]   2> NOTE: reproduce with: ant test  -Dtestcase=AutoCommitTest -Dtests.method=testMaxTime -Dtests.seed=7E402D14147F6239 -Dtests.multiplier=3 -Dtests.slow=true -Dtests.locale=es_HN -Dtests.timezone=Pacific/Tarawa -Dtests.file.encoding=US-ASCII
   [junit4] ERROR   4.37s J0 | AutoCommitTest.testMaxTime <<<
   [junit4]    > Throwable #1: java.lang.RuntimeException: Exception during query
   [junit4]    > 	at __randomizedtesting.SeedInfo.seed([7E402D14147F6239:E4B450F68AE5FE05]:0)
   [junit4]    > 	at org.apache.solr.SolrTestCaseJ4.assertQ(SolrTestCaseJ4.java:637)
   [junit4]    > 	at org.apache.solr.update.AutoCommitTest.testMaxTime(AutoCommitTest.java:227)
   [junit4]    > 	at java.lang.Thread.run(Thread.java:780)
   [junit4]    > Caused by: java.lang.RuntimeException: REQUEST FAILED: xpath=//result[@numFound=0]
   [junit4]    > 	xml response was: <?xml version="1.0" encoding="UTF-8"?>
   [junit4]    > <response>
   [junit4]    > <lst name="responseHeader"><int name="status">0</int><int name="QTime">2577</int></lst><result name="response" numFound="1" start="0"><doc><int name="id">529</int><int name="range_facet_si">529</int><arr name="range_facet_l"><long>529</long></arr><arr name="range_facet_sl"><long>529</long></arr><arr name="field_t"><str>what's inside?</str></arr><arr name="subject"><str>info</str></arr><long name="_version_">1449922339485515776</long><int name="intDefault">42</int><date name="timestamp">2013-10-26T02:14:55.951Z</date><arr name="multiDefault"><str>muLti-Default</str></arr></doc></result>
   [junit4]    > </response>
   [junit4]    > 	request was:q=id:529&start=0&qt=standard&version=2.2&rows=20
   [junit4]    > 	at org.apache.solr.SolrTestCaseJ4.assertQ(SolrTestCaseJ4.java:630)
   [junit4]    > 	... 41 more
   [junit4]   2> 355199 T1523 oas.SolrTestCaseJ4.setUp ###Starting testMaxDocs
   [junit4]   2> 355233 T1523 C879 oass.SolrIndexSearcher.<init> Opening Searcher@c47b476e realtime
   [junit4]   2> 355234 T1523 C879 oasup.LogUpdateProcessor.finish [collection1] webapp=null path=null params={} {deleteByQuery=*:* (-1449922342284165120)} 0 30
   [junit4]   2> 355249 T1523 oasc.CoreContainer.reload Reloading SolrCore 'collection1' using instanceDir: /mnt/ssd/jenkins/workspace/Lucene-Solr-trunk-Linux/solr/build/solr-core/test-files/solr/collection1
   [junit4]   2> 355249 T1523 oasc.SolrResourceLoader.<init> new SolrResourceLoader for directory: '/mnt/ssd/jenkins/workspace/Lucene-Solr-trunk-Linux/solr/build/solr-core/test-files/solr/collection1/'
   [junit4]   2> 355250 T1523 oasc.SolrResourceLoader.replaceClassLoader Adding 'file:/mnt/ssd/jenkins/workspace/Lucene-Solr-trunk-Linux/solr/build/solr-core/test-files/solr/collection1/lib/classes/' to classloader
   [junit4]   2> 355251 T1523 oasc.SolrResourceLoader.replaceClassLoader Adding 'file:/mnt/ssd/jenkins/workspace/Lucene-Solr-trunk-Linux/solr/build/solr-core/test-files/solr/collection1/lib/README' to classloader
   [junit4]   2> 355287 T1523 oasc.SolrConfig.<init> Using Lucene MatchVersion: LUCENE_50
   [junit4]   2> 355332 T1523 oasc.SolrConfig.<init> Loaded SolrConfig: solrconfig.xml
   [junit4]   2> 355332 T1523 oass.IndexSchema.readSchema Reading Solr Schema from schema.xml
   [junit4]   2> 355339 T1523 oass.IndexSchema.readSchema [collection1] Schema name=test
   [junit4]   2> 355694 T1523 oass.OpenExchangeRatesOrgProvider.init Initialized with rates=open-exchange-rates.json, refreshInterval=1440.
   [junit4]   2> 355699 T1523 oass.IndexSchema.readSchema default search field in schema is text
   [junit4]   2> 355702 T1523 oass.IndexSchema.readSchema unique key field: id
   [junit4]   2> 355708 T1523 oass.FileExchangeRateProvider.reload Reloading exchange rates from file currency.xml
   [junit4]   2> 355712 T1523 oass.FileExchangeRateProvider.reload Reloading exchange rates from file currency.xml
   [junit4]   2> 355715 T1523 oass.OpenExchangeRatesOrgProvider.reload Reloading exchange rates from open-exchange-rates.json
   [junit4]   2> 355716 T1523 oass.OpenExchangeRatesOrgProvider$OpenExchangeRates.<init> WARN Unknown key IMPORTANT NOTE
   [junit4]   2> 355716 T1523 oass.OpenExchangeRatesOrgProvider$OpenExchangeRates.<init> WARN Expected key, got STRING
   [junit4]   2> 355717 T1523 oass.OpenExchangeRatesOrgProvider.reload Reloading exchange rates from open-exchange-rates.json
   [junit4]   2> 355718 T1523 oass.OpenExchangeRatesOrgProvider$OpenExchangeRates.<init> WARN Unknown key IMPORTANT NOTE
   [junit4]   2> 355718 T1523 oass.OpenExchangeRatesOrgProvider$OpenExchangeRates.<init> WARN Expected key, got STRING
   [junit4]   2> 355719 T1523 oasc.SolrCore.<init> [collection1] Opening new SolrCore at /mnt/ssd/jenkins/workspace/Lucene-Solr-trunk-Linux/solr/build/solr-core/test-files/solr/collection1/, dataDir=/mnt/ssd/jenkins/workspace/Lucene-Solr-trunk-Linux/solr/build/solr-core/test/J0/./solrtest-AutoCommitTest-1382753693074/
   [junit4]   2> 355719 T1523 oasc.JmxMonitoredMap.<init> JMX monitoring is enabled. Adding Solr mbeans to JMX Server: com.sun.jmx.mbeanserver.JmxMBeanServer@fa2c4d2f
   [junit4]   2> 355720 T1523 oasc.SolrCore.getNewIndexDir New index directory detected: old=null new=/mnt/ssd/jenkins/workspace/Lucene-Solr-trunk-Linux/solr/build/solr-core/test/J0/./solrtest-AutoCommitTest-1382753693074/index/
   [junit4]   2> 355721 T1523 oasc.SolrCore.initWriters created xml: solr.XMLResponseWriter
   [junit4]   2> 355725 T1523 oasup.UpdateRequestProcessorChain.init creating updateRequestProcessorChain "dedupe"
   [junit4]   2> 355726 T1523 oasup.UpdateRequestProcessorChain.init inserting DistributedUpdateProcessorFactory into updateRequestProcessorChain "dedupe"
   [junit4]   2> 355726 T1523 oasup.UpdateRequestProcessorChain.init creating updateRequestProcessorChain "dedupe-allfields"
   [junit4]   2> 355727 T1523 oasup.UpdateRequestProcessorChain.init inserting DistributedUpdateProcessorFactory into updateRequestProcessorChain "dedupe-allfields"
   [junit4]   2> 355727 T1523 oasup.UpdateRequestProcessorChain.init creating updateRequestProcessorChain "stored_sig"
   [junit4]   2> 355728 T1523 oasup.UpdateRequestProcessorChain.init inserting DistributedUpdateProcessorFactory into updateRequestProcessorChain "stored_sig"
   [junit4]   2> 355728 T1523 oasup.UpdateRequestProcessorChain.init creating updateRequestProcessorChain "uniq-fields"
   [junit4]   2> 355729 T1523 oasup.UpdateRequestProcessorChain.init inserting DistributedUpdateProcessorFactory into updateRequestProcessorChain "uniq-fields"
   [junit4]   2> 355729 T1523 oasup.UpdateRequestProcessorChain.init creating updateRequestProcessorChain "distrib-dup-test-chain-explicit"
   [junit4]   2> 355730 T1523 oasup.UpdateRequestProcessorChain.init creating updateRequestProcessorChain "distrib-dup-test-chain-implicit"
   [junit4]   2> 355730 T1523 oasup.UpdateRequestProcessorChain.init inserting DistributedUpdateProcessorFactory into updateRequestProcessorChain "distrib-dup-test-chain-implicit"
   [junit4]   2> 355731 T1523 oasc.SolrCore.loadUpdateProcessorChains no updateRequestProcessorChain defined as default, creating implicit default
   [junit4]   2> 355731 T1523 oasc.RequestHandlers.initHandlersFromConfig adding lazy requestHandler: solr.ReplicationHandler
   [junit4]   2> 355732 T1523 oasc.RequestHandlers.initHandlersFromConfig created /replication: solr.ReplicationHandler
   [junit4]   2> 355733 T1523 oasc.RequestHandlers.initHandlersFromConfig created standard: solr.StandardRequestHandler
   [junit4]   2> 355734 T1523 oasc.RequestHandlers.initHandlersFromConfig created /get: solr.RealTimeGetHandler
   [junit4]   2> 355735 T1523 oasc.RequestHandlers.initHandlersFromConfig created dismax: solr.SearchHandler
   [junit4]   2> 355737 T1523 oasc.RequestHandlers.initHandlersFromConfig created mock: org.apache.solr.core.MockQuerySenderListenerReqHandler
   [junit4]   2> 355738 T1523 oasc.RequestHandlers.initHandlersFromConfig created /admin/: org.apache.solr.handler.admin.AdminHandlers
   [junit4]   2> 355739 T1523 oasc.RequestHandlers.initHandlersFromConfig created defaults: solr.StandardRequestHandler
   [junit4]   2> 355739 T1523 oasc.RequestHandlers.initHandlersFromConfig adding lazy requestHandler: solr.StandardRequestHandler
   [junit4]   2> 355740 T1523 oasc.RequestHandlers.initHandlersFromConfig created lazy: solr.StandardRequestHandler
   [junit4]   2> 355741 T1523 oasc.RequestHandlers.initHandlersFromConfig created /update: solr.UpdateRequestHandler
   [junit4]   2> 355742 T1523 oasc.RequestHandlers.initHandlersFromConfig created /terms: org.apache.solr.handler.component.SearchHandler
   [junit4]   2> 355743 T1523 oasc.RequestHandlers.initHandlersFromConfig created spellCheckCompRH: org.apache.solr.handler.component.SearchHandler
   [junit4]   2> 355744 T1523 oasc.RequestHandlers.initHandlersFromConfig created spellCheckCompRH_Direct: org.apache.solr.handler.component.SearchHandler
   [junit4]   2> 355745 T1523 oasc.RequestHandlers.initHandlersFromConfig created spellCheckWithWordbreak: org.apache.solr.handler.component.SearchHandler
   [junit4]   2> 355746 T1523 oasc.RequestHandlers.initHandlersFromConfig created spellCheckWithWordbreak_Direct: org.apache.solr.handler.component.SearchHandler
   [junit4]   2> 355747 T1523 oasc.RequestHandlers.initHandlersFromConfig created spellCheckCompRH1: org.apache.solr.handler.component.SearchHandler
   [junit4]   2> 355748 T1523 oasc.RequestHandlers.initHandlersFromConfig created mltrh: org.apache.solr.handler.component.SearchHandler
   [junit4]   2> 355749 T1523 oasc.RequestHandlers.initHandlersFromConfig created tvrh: org.apache.solr.handler.component.SearchHandler
   [junit4]   2> 355749 T1523 oasc.RequestHandlers.initHandlersFromConfig created /mlt: solr.MoreLikeThisHandler
   [junit4]   2> 355750 T1523 oasc.RequestHandlers.initHandlersFromConfig created /debug/dump: solr.DumpRequestHandler
   [junit4]   2> 355752 T1523 oashl.XMLLoader.init xsltCacheLifetimeSeconds=60
   [junit4]   2> 355753 T1523 oasc.SolrCore.initDeprecatedSupport WARN solrconfig.xml uses deprecated <admin/gettableFiles>, Please update your config to use the ShowFileRequestHandler.
   [junit4]   2> 355755 T1523 oasc.SolrCore.initDeprecatedSupport WARN adding ShowFileRequestHandler with hidden files: [SCHEMA-REQUIRED-FIELDS.XML, SCHEMA11.XML, SCHEMA15.XML, SCHEMA-SIM.XML, BAD-SOLRCONFIG-UNEXPECTED-SCHEMA-ATTRIBUTE.XML, CONDITIONAL.UPDATEPROCESSOR.JS, SCHEMA-ID-AND-VERSION-FIELDS-ONLY.XML, BAD-SOLRCONFIG-WARMER-NO-REOPEN.XML, SOLRCONFIG-NOOPREGEN.XML, SOLRCONFIG-SPELLCHECKER.XML, SCHEMA-CHARFILTERS.XML, SCHEMA-EFF.XML, SOLRCONFIG_CODEC.XML, HYPHENATION.DTD, BAD-SCHEMA-EXTERNAL-FILEFIELD.XML, TRIVIAL.UPDATEPROCESSOR1.JS, SOLRCONFIG-SLAVE1.XML, SOLRCONFIG-BASIC.XML, SCHEMA-LMJELINEKMERCER.XML, BAD-SCHEMA-DUP-FIELD.XML, SCHEMA-ONE-FIELD-NO-DYNAMIC-FIELD-UNIQUE-KEY.XML, SOLRCONFIG-PARSING-UPDATE-PROCESSOR-CHAINS.XML, SOLRCONFIG-HIGHLIGHT.XML, SCHEMA-TFIDF.XML, STOPWITHBOM.TXT, SOLRCONFIG-ELEVATE.XML, SOLRCONFIG-QUERYSENDER.XML, WDFTYPES.TXT, SOLRCONFIG-COMPONENTS-NAME.XML, BAD-SCHEMA-CURRENCY-FT-OER-NORATES.XML, SOLRCONFIG-COLLAPSEQPARSER.XML, SOLRCONFIG-DELPOLICY1.XML, BAD-SCHEMA-UNSUPPORTED-DOCVALUES.XML, KEEP-2.TXT, SCHEMA-STOP-KEEP.XML, SCHEMA-ONE-FIELD-NO-DYNAMIC-FIELD.XML, STOP-SNOWBALL.TXT, BAD-SCHEMA-MULTIPLE-ASTERISK-COPYFIELD-DEST-SHOULD-FAIL-TEST.XML, SCHEMA-DOCVALUESMULTI.XML, SOLRCONFIG-INDEXCONFIG.XML, SCHEMA-CLASS-NAME-SHORTENING-ON-SERIALIZATION.XML, STOPWORDSWRONGENCODING.TXT, SOLRCONFIG-SPELLCHECKCOMPONENT.XML, SOLRCONFIG.SNIPPET.RANDOMINDEXCONFIG.XML, SOLRCONFIG-MINIMAL.XML, SOLRCONFIG-TLOG.XML, SCHEMA-DOCVALUESFACETING.XML, BAD-SOLRCONFIG-INVALID-SCRIPTFILE.XML, OPEN-EXCHANGE-RATES.JSON, BAD-SCHEMA-DUP-FIELDTYPE.XML, PHRASESUGGEST.TXT, OLD_SYNONYMS.TXT, SOLRCONFIG-INFOSTREAM-LOGGING.XML, SCHEMA-NOT-REQUIRED-UNIQUE-KEY.XML, SCHEMA-REVERSED.XML, SCHEMA-FOLDING.XML, BAD-SOLRCONFIG-MULTIPLE-DIRFACTORY.XML, SCHEMA-BM25.XML, BAD-SCHEMA-SWEETSPOT-BOTH-TF.XML, MISSING.FUNCTIONS.UPDATEPROCESSOR.JS, SOLRCONFIG-TRANSFORMERS.XML, SCHEMA-COPYFIELD-TEST.XML, BAD-SCHEMA-DUP-DYNAMICFIELD.XML, BAD-SCHEMA-SWEETSPOT-PARTIAL-BASELINE.XML, CURRENCY.XML, FUZZYSUGGEST.TXT, SCHEMA-POSTINGSHIGHLIGHT.XML, SOLRCONFIG-SOLR-749.XML, SOLRCONFIG_PERF.XML, SCHEMA-SWEETSPOT.XML, SCHEMA-TINY.XML, SOLRCONFIG-LAZYWRITER.XML, SOLRCONFIG-RESPONSE-LOG-COMPONENT.XML, SCHEMA-REPLICATION2.XML, BAD-SOLRCONFIG-MULTIPLE-CFS.XML, SCHEMA-SNIPPET-TYPE.XML, SOLRCONFIG-XINCLUDE.XML, SCHEMA-SPELLCHECKER.XML, SOLRCONFIG-WARMER.XML, SOLRCONFIG-TIEREDMERGEPOLICY.XML, KEEP-1.TXT, SCHEMA-TRIE.XML, BAD-SCHEMA-OMIT-TF-BUT-NOT-POS.XML, BAD-SCHEMA-CURRENCY-FT-BOGUS-CODE-IN-XML.XML, STOPTYPES-2.TXT, SCHEMA_CODEC.XML, SCHEMA-SYNONYM-TOKENIZER.XML, SOLRCONFIG-DEFAULTS.XML, SCHEMA-XINCLUDE.XML, SCHEMA-SNIPPET-FIELD.XML, SOLRCONFIG-REQHANDLER.INCL, SCHEMA-PHRASESUGGEST.XML, SCHEMA-DFR.XML, BAD-SCHEMA-DYNAMICFIELD-DEFAULT-VAL.XML, SOLRCONFIG-MASTER3.XML, SOLRCONFIG-UPDATE-PROCESSOR-CHAINS.XML, BAD-SCHEMA-MULTIPLE-ASTERISK-COPYFIELD-SOURCE-SHOULD-FAIL-TEST.XML, BAD-SCHEMA-CURRENCY-FT-BOGUS-DEFAULT-CODE.XML, ANALYZINGINFIXSUGGEST.TXT, BAD-SCHEMA-NOT-INDEXED-BUT-TF.XML, SOLRCONFIG-MANAGED-SCHEMA.XML, BAD-SOLRCONFIG-MULTIPLE-INDEXCONFIGS.XML, BAD-SOLRCONFIG-MANAGED-SCHEMA-NAMED-SCHEMA.XML.XML, SOLRCONFIG-MASTER1-KEEPONEBACKUP.XML, BAD-SCHEMA-NONTEXT-ANALYZER.XML, SCHEMA-BEHAVIOR.XML, SOLRCONFIG-MERGEPOLICY-DEFAULTS.XML, STOP-2.TXT, BAD-SCHEMA-UNIQUEKEY-USES-DEFAULT.XML, SCHEMA-DOCVALUES.XML, BAD-SOLRCONFIG-MISSING-SCRIPTFILE.XML, SOLRCONFIG-SCRIPT-UPDATEPROCESSOR.XML, SOLRCONFIG-REPEATER.XML, SOLRCONFIG-NOCACHE.XML, SOLRCONFIG-SOLCOREPROPERTIES.XML, SOLRCONFIG-IMPLICITPROPERTIES.XML, SOLRCONFIG-PHRASESUGGEST.XML, JASUGGEST.TXT, BAD-MP-SOLRCONFIG.XML, BAD-SCHEMA-UNIQUEKEY-MULTIVALUED.XML, SOLRCONFIG-MASTER.XML, SYNONYMS.TXT, SCHEMA-REPLICATION1.XML, SCHEMA-SNIPPET-TYPES.INCL, SOLRCONFIG-SNIPPET-PROCESSOR.XML, BAD_SOLRCONFIG.XML, HUNSPELL-TEST.DIC, SCHEMA-LUCENEMATCHVERSION.XML, SCHEMA-NUMERIC.XML, SCHEMA-IB.XML, BAD-SCHEMA-DYNAMICFIELD-REQUIRED.XML, SCHEMA-ADD-SCHEMA-FIELDS-UPDATE-PROCESSOR.XML, SOLRCONFIG-SLAVE.XML, BAD-SCHEMA-NOT-INDEXED-BUT-NORMS.XML, THROW.ERROR.ON.ADD.UPDATEPROCESSOR.JS, BAD-SCHEMA-MISPLACED-ASTERISK-COPYFIELD-SOURCE-SHOULD-FAIL-TEST.XML, STOPTYPES-1.TXT, REGEX-BOOST-PROCESSOR-TEST.TXT, COMPOUNDDICTIONARY.TXT, SOLRCONFIG-POSTINGSHIGHLIGHT.XML, DA_COMPOUNDDICTIONARY.TXT, BAD-SCHEMA-NON-GLOB-COPYFIELD-SOURCE-MATCHING-NOTHING-SHOULD-FAIL-TEST.XML, SOLRCONFIG-TEST-MISC.XML, SCHEMASURROUND.XML, BAD-SCHEMA-CURRENCY-FT-MULTIVALUED.XML, SOLRCONFIG-MASTER2.XML, BAD-SCHEMA-UNIQUEKEY-IS-COPYFIELD-DEST.XML, BAD-SCHEMA-CODEC-GLOBAL-VS-FT-MISMATCH.XML, SCHEMA-LMDIRICHLET.XML, BAD-SCHEMA-NOT-INDEXED-BUT-POS.XML, SOLRCONFIG-LOGMERGEPOLICY.XML, BAD-SCHEMA-CURRENCY-MULTIVALUED.XML, SOLRCONFIG-ADD-SCHEMA-FIELDS-UPDATE-PROCESSOR-CHAINS.XML, MAPPING-ISOLATIN1ACCENT.TXT, SOLRCONFIG-CACHING.XML, SCHEMA-DOCVALUESMISSING.XML, ADDFIELDS.UPDATEPROCESSOR.JS, BAD-CURRENCY.XML, STOP-1.TXT, SCHEMA-REST.XML, SCHEMA12.XML, DA_UTF8.XML, MISSLEADING.EXTENSION.UPDATEPROCESSOR.JS.TXT, STOPWORDS.TXT, BAD-SCHEMA-BOGUS-ANALYSIS-PARAMETERS.XML, HUNSPELL-TEST.AFF, BAD-SCHEMA-MISPLACED-ASTERISK-COPYFIELD-DEST-SHOULD-FAIL-TEST.XML, BAD-SCHEMA-SWEETSPOT-PARTIAL-NORMS.XML, FRENCHARTICLES.TXT, SCHEMA-SPATIAL.XML, BAD-SCHEMA-SWEETSPOT-PARTIAL-HYPERBOLIC.XML, XSLT, SOLRCONFIG-DELPOLICY2.XML, TRIVIAL.UPDATEPROCESSOR0.JS, BAD-SCHEMA-CURRENCY-DYNAMIC-MULTIVALUED.XML, SCHEMA-BINARYFIELD.XML, SCHEMA-REST-LUCENE-MATCH-VERSION.XML, SCHEMA-MINIMAL.XML, STEMDICT.TXT, ELEVATE.XML, SCHEMA-COLLATE.XML, PROTWORDS.TXT, BAD-SCHEMA-ANALYZER-CLASS-AND-NESTED.XML, SOLRCONFIG-MASTER1.XML, BAD-SOLRCONFIG-SCHEMA-MUTABLE-BUT-NOT-MANAGED.XML, SOLRCONFIG-FUNCTIONQUERY.XML, SOLRCONFIG-ALTDIRECTORY.XML, BAD-SCHEMA-SIM-GLOBAL-VS-FT-MISMATCH.XML, SOLRCONFIG-QUERYSENDER-NOQUERY.XML, SOLRCONFIG-MERGEPOLICY-LEGACY.XML, BAD-SOLRCONFIG-BOGUS-SCRIPTENGINE-NAME.XML, BAD-SCHEMA-BOGUS-FIELD-PARAMETERS.XML]
   [junit4]   2> 355757 T1523 oasu.CommitTracker.<init> Hard AutoCommit: disabled
   [junit4]   2> 355758 T1523 oasu.CommitTracker.<init> Soft AutoCommit: disabled
   [junit4]   2> 355759 T1523 oass.SolrIndexSearcher.<init> Opening Searcher@5b70789d main
   [junit4]   2> 355759 T1523 oashc.SpellCheckComponent.inform Initializing spell checkers
   [junit4]   2> 355761 T1523 oass.DirectSolrSpellChecker.init init: {name=direct,classname=DirectSolrSpellChecker,field=lowerfilt,minQueryLength=3}
   [junit4]   2> 355771 T1529 oasc.SolrCore.registerSearcher [collection1] Registered new searcher Searcher@5b70789d main{StandardDirectoryReader(segments_1:5:nrt)}
   [junit4]   2> 355779 T1523 oasu.DefaultSolrCoreState.newIndexWriter Creating new IndexWriter...
   [junit4]   2> 355780 T1523 oasu.DefaultSolrCoreState.newIndexWriter Waiting until IndexWriter is unused... core=collection1
   [junit4]   2> 355780 T1523 oasu.DefaultSolrCoreState.newIndexWriter Closing old IndexWriter... core=collection1
   [junit4]   2> 355781 T1523 oasc.SolrDeletionPolicy.onCommit SolrDeletionPolicy.onCommit: commits: num=2
   [junit4]   2> 		commit{dir=RateLimitedDirectoryWrapper(MockDirectoryWrapper(org.apache.lucene.store.RAMDirectory@62a3c222 lockFactory=org.apache.lucene.store.SingleInstanceLockFactory@cbcc67c1)),segFN=segments_1,generation=1}
   [junit4]   2> 		commit{dir=RateLimitedDirectoryWrapper(MockDirectoryWrapper(org.apache.lucene.store.RAMDirectory@62a3c222 lockFactory=org.apache.lucene.store.SingleInstanceLockFactory@cbcc67c1)),segFN=segments_2,generation=2}
   [junit4]   2> 355781 T1523 oasc.SolrDeletionPolicy.updateCommits newest commit generation = 2
   [junit4]   2> 355782 T1523 oasu.RandomMergePolicy.<init> RandomMergePolicy wrapping class org.apache.lucene.index.LogByteSizeMergePolicy: [LogByteSizeMergePolicy: minMergeSize=1677721, mergeFactor=21, maxMergeSize=2147483648, maxMergeSizeForForcedMerge=9223372036854775807, calibrateSizeByDeletes=true, maxMergeDocs=2147483647, maxCFSSegmentSizeMB=8.796093022207999E12, noCFSRatio=0.7519811768175505]
   [junit4]   2> 355783 T1523 oasc.SolrDeletionPolicy.onInit SolrDeletionPolicy.onInit: commits: num=1
   [junit4]   2> 		commit{dir=RateLimitedDirectoryWrapper(MockDirectoryWrapper(org.apache.lucene.store.RAMDirectory@62a3c222 lockFactory=org.apache.lucene.store.SingleInstanceLockFactory@cbcc67c1)),segFN=segments_2,generation=2}
   [junit4]   2> 355783 T1523 oasc.SolrDeletionPolicy.updateCommits newest commit generation = 2
   [junit4]   2> 355784 T1523 oasu.DefaultSolrCoreState.newIndexWriter New IndexWriter is ready to be used.
   [junit4]   2> 355784 T1523 oass.SolrIndexSearcher.<init> Opening Searcher@57cc6851 main
   [junit4]   2> 355785 T1523 oasc.CoreContainer.registerCore replacing core: collection1
   [junit4]   2> 355786 T1523 oasc.SolrCore.close [collection1]  CLOSING SolrCore org.apache.solr.core.SolrCore@122c2a6e
   [junit4]   2> 355788 T1529 oasc.SolrCore.registerSearcher [collection1] Registered new searcher Searcher@57cc6851 main{StandardDirectoryReader(segments_2:5:nrt)}
   [junit4]   2> 355796 T1523 oasu.DirectUpdateHandler2.close closing DirectUpdateHandler2{commits=1,autocommits=0,soft autocommit maxTime=1000ms,soft autocommits=1,optimizes=0,rollbacks=0,expungeDeletes=0,docsPending=1,adds=0,deletesById=0,deletesByQuery=1,errors=0,cumulative_adds=1,cumulative_deletesById=0,cumulative_deletesByQuery=1,cumulative_errors=0}
   [junit4]   2> 355796 T1523 oasc.SolrCore.closeSearcher [collection1] Closing main searcher on request.
   [junit4]   2> 355809 T1523 oasup.LogUpdateProcessor.finish [collection1] {add=[0 (1449922342888144896)]} 0 11
   [junit4]   2> 355810 T1523 oasup.LogUpdateProcessor.finish [collection1] {add=[1 (1449922342890242048)]} 0 11
   [junit4]   2> 355811 T1523 oasup.LogUpdateProcessor.finish [collection1] {add=[2 (1449922342891290624)]} 0 11
   [junit4]   2> 355813 T1523 oasup.LogUpdateProcessor.finish [collection1] {add=[3 (1449922342892339200)]} 0 11
   [junit4]   2> 355814 T1523 oasup.LogUpdateProcessor.finish [collection1] {add=[4 (1449922342894436352)]} 0 11
   [junit4]   2> 355816 T1523 oasup.LogUpdateProcessor.finish [collection1] {add=[5 (1449922342895484928)]} 0 11
   [junit4]   2> 355817 T1523 oasup.LogUpdateProcessor.finish [collection1] {add=[6 (1449922342897582080)]} 0 11
   [junit4]   2> 355819 T1523 oasup.LogUpdateProcessor.finish [collection1] {add=[7 (1449922342898630656)]} 0 11
   [junit4]   2> 355820 T1523 oasup.LogUpdateProcessor.finish [collection1] {add=[8 (1449922342900727808)]} 0 11
   [junit4]   2> 355822 T1523 oasup.LogUpdateProcessor.finish [collection1] {add=[9 (1449922342901776384)]} 0 11
   [junit4]   2> 355823 T1523 oasup.LogUpdateProcessor.finish [collection1] {add=[10 (1449922342903873536)]} 0 11
   [junit4]   2> 355825 T1523 oasup.LogUpdateProcessor.finish [collection1] {add=[11 (1449922342904922112)]} 0 11
   [junit4]   2> 355826 T1523 oasup.LogUpdateProcessor.finish [collection1] {add=[12 (1449922342907019264)]} 0 11
   [junit4]   2> 355828 T1523 oasup.LogUpdateProcessor.finish [collection1] {add=[13 (1449922342908067840)]} 0 11
   [junit4]   2> ASYNC  NEW_CORE C880 name=collection1 org.apache.solr.core.SolrCore@8deebe58
   [junit4]   2> 355829 T1523 C880 oasc.SolrCore.execute [collection1] webapp=null path=null params={q=id:1&start=0&qt=standard&version=2.2&rows=20} hits=0 status=0 QTime=1 
   [junit4]   2> 355831 T1523 oasup.LogUpdateProcessor.finish [collection1] {add=[14 (1449922342911213568)]} 0 11
   [junit4]   2> 355832 T1530 oasu.DirectUpdateHandler2.commit start commit{,optimize=false,openSearcher=true,waitSearcher=true,expungeDeletes=false,softCommit=true,prepareCommit=false}
   [junit4]   2> 355835 T1530 oass.SolrIndexSearcher.<init> Opening Searcher@3f9e8ad4 main
   [junit4]   2> 355835 T1530 oasu.DirectUpdateHandler2.commit end_commit_flush
   [junit4]   2> 355837 T1529 oasc.SolrCore.registerSearcher [collection1] Registered new searcher Searcher@3f9e8ad4 main{StandardDirectoryReader(segments_2:7:nrt _1(5.0):c15)}
   [junit4]   2> 356083 T1523 oasup.LogUpdateProcessor.finish [collection1] {add=[15 (1449922343175454720)]} 0 11
   [junit4]   2> 356083 T1523 C880 oasc.SolrCore.execute [collection1] webapp=null path=null params={q=id:14&start=0&qt=standard&version=2.2&rows=20} hits=1 status=0 QTime=0 
   [junit4]   2> 356085 T1523 C880 oasc.SolrCore.execute [collection1] webapp=null path=null params={q=id:15&start=0&qt=standard&version=2.2&rows=20} hits=0 status=0 QTime=0 
   [junit4]   2> 356087 T1523 oas.SolrTestCaseJ4.tearDown ###Ending testMaxDocs
   [junit4]   2> 356093 T1523 oas.SolrTestCaseJ4.setUp ###Starting testCommitWithin
   [junit4]   2> 356103 T1523 C880 oass.SolrIndexSearcher.<init> Opening Searcher@5a40c814 realtime
   [junit4]   2> 356104 T1523 C880 oasup.LogUpdateProcessor.finish [collection1] webapp=null path=null params={} {deleteByQuery=*:* (-1449922343195377664)} 0 4
   [junit4]   2> 356106 T1523 oasc.CoreContainer.reload Reloading SolrCore 'collection1' using instanceDir: /mnt/ssd/jenkins/workspace/Lucene-Solr-trunk-Linux/solr/build/solr-core/test-files/solr/collection1
   [junit4]   2> 356106 T1523 oasc.SolrResourceLoader.<init> new SolrResourceLoader for directory: '/mnt/ssd/jenkins/workspace/Lucene-Solr-trunk-Linux/solr/build/solr-core/test-files/solr/collection1/'
   [junit4]   2> 356107 T1523 oasc.SolrResourceLoader.replaceClassLoader Adding 'file:/mnt/ssd/jenkins/workspace/Lucene-Solr-trunk-Linux/solr/build/solr-core/test-files/solr/collection1/lib/classes/' to classloader
   [junit4]   2> 356107 T1523 oasc.SolrResourceLoader.replaceClassLoader Adding 'file:/mnt/ssd/jenkins/workspace/Lucene-Solr-trunk-Linux/solr/build/solr-core/test-files/solr/collection1/lib/README' to classloader
   [junit4]   2> 356143 T1523 oasc.SolrConfig.<init> Using Lucene MatchVersion: LUCENE_50
   [junit4]   2> 356187 T1523 oasc.SolrConfig.<init> Loaded SolrConfig: solrconfig.xml
   [junit4]   2> 356188 T1523 oass.IndexSchema.readSchema Reading Solr Schema from schema.xml
   [junit4]   2> 356194 T1523 oass.IndexSchema.readSchema [collection1] Schema name=test
   [junit4]   2> 356545 T1523 oass.OpenExchangeRatesOrgProvider.init Initialized with rates=open-exchange-rates.json, refreshInterval=1440.
   [junit4]   2> 356552 T1523 oass.IndexSchema.readSchema default search field in schema is text
   [junit4]   2> 356555 T1523 oass.IndexSchema.readSchema unique key field: id
   [junit4]   2> 356562 T1523 oass.FileExchangeRateProvider.reload Reloading exchange rates from file currency.xml
   [junit4]   2> 356566 T1523 oass.FileExchangeRateProvider.reload Reloading exchange rates from file currency.xml
   [junit4]   2> 356570 T1523 oass.OpenExchangeRatesOrgProvider.reload Reloading exchange rates from open-exchange-rates.json
   [junit4]   2> 356570 T1523 oass.OpenExchangeRatesOrgProvider$OpenExchangeRates.<init> WARN Unknown key IMPORTANT NOTE
   [junit4]   2> 356571 T1523 oass.OpenExchangeRatesOrgProvider$OpenExchangeRates.<init> WARN Expected key, got STRING
   [junit4]   2> 356571 T1523 oass.OpenExchangeRatesOrgProvider.reload Reloading exchange rates from open-exchange-rates.json
   [junit4]   2> 356572 T1523 oass.OpenExchangeRatesOrgProvider$OpenExchangeRates.<init> WARN Unknown key IMPORTANT NOTE
   [junit4]   2> 356573 T1523 oass.OpenExchangeRatesOrgProvider$OpenExchangeRates.<init> WARN Expected key, got STRING
   [junit4]   2> 356573 T1523 oasc.SolrCore.<init> [collection1] Opening new SolrCore at /mnt/ssd/jenkins/workspace/Lucene-Solr-trunk-Linux/solr/build/solr-core/test-files/solr/collection1/, dataDir=/mnt/ssd/jenkins/workspace/Lucene-Solr-trunk-Linux/solr/build/solr-core/test/J0/./solrtest-AutoCommitTest-1382753693074/
   [junit4]   2> 356574 T1523 oasc.JmxMonitoredMap.<init> JMX monitoring is enabled. Adding Solr mbeans to JMX Server: com.sun.jmx.mbeanserver.JmxMBeanServer@fa2c4d2f
   [junit4]   2> 356575 T1523 oasc.SolrCore.getNewIndexDir New index directory detected: old=null new=/mnt/ssd/jenkins/workspace/Lucene-Solr-trunk-Linux/solr/build/solr-core/test/J0/./solrtest-AutoCommitTest-1382753693074/index/
   [junit4]   2> 356575 T1523 oasc.SolrCore.initWriters created xml: solr.XMLResponseWriter
   [junit4]   2> 356581 T1523 oasup.UpdateRequestProcessorChain.init creating updateRequestProcessorChain "dedupe"
   [junit4]   2> 356582 T1523 oasup.UpdateRequestProcessorChain.init inserting DistributedUpdateProcessorFactory into updateRequestProcessorChain "dedupe"
   [junit4]   2> 356582 T1523 oasup.UpdateRequestProcessorChain.init creating updateRequestProcessorChain "dedupe-allfields"
   [junit4]   2> 356583 T1523 oasup.UpdateRequestProcessorChain.init inserting DistributedUpdateProcessorFactory into updateRequestProcessorChain "dedupe-allfields"
   [junit4]   2> 356583 T1523 oasup.UpdateRequestProcessorChain.init creating updateRequestProcessorChain "stored_sig"
   [junit4]   2> 356584 T1523 oasup.UpdateRequestProcessorChain.init inserting DistributedUpdateProcessorFactory into updateRequestProcessorChain "stored_sig"
   [junit4]   2> 356584 T1523 oasup.UpdateRequestProcessorChain.init creating updateRequestProcessorChain "uniq-fields"
   [junit4]   2> 356585 T1523 oasup.UpdateRequestProcessorChain.init inserting DistributedUpdateProcessorFactory into updateRequestProcessorChain "uniq-fields"
   [junit4]   2> 356585 T1523 oasup.UpdateRequestProcessorChain.init creating updateRequestProcessorChain "distrib-dup-test-chain-explicit"
   [junit4]   2> 356586 T1523 oasup.UpdateRequestProcessorChain.init creating updateRequestProcessorChain "distrib-dup-test-chain-implicit"
   [junit4]   2> 356586 T1523 oasup.UpdateRequestProcessorChain.init inserting DistributedUpdateProcessorFactory into updateRequestProcessorChain "distrib-dup-test-chain-implicit"
   [junit4]   2> 356587 T1523 oasc.SolrCore.loadUpdateProcessorChains no updateRequestProcessorChain defined as default, creating implicit default
   [junit4]   2> 356587 T1523 oasc.RequestHandlers.initHandlersFromConfig adding lazy requestHandler: solr.ReplicationHandler
   [junit4]   2> 356588 T1523 oasc.RequestHandlers.initHandlersFromConfig created /replication: solr.ReplicationHandler
   [junit4]   2> 356589 T1523 oasc.RequestHandlers.initHandlersFromConfig created standard: solr.StandardRequestHandler
   [junit4]   2> 356590 T1523 oasc.RequestHandlers.initHandlersFromConfig created /get: solr.RealTimeGetHandler
   [junit4]   2> 356591 T1523 oasc.RequestHandlers.initHandlersFromConfig created dismax: solr.SearchHandler
   [junit4]   2> 356592 T1523 oasc.RequestHandlers.initHandlersFromConfig created mock: org.apache.solr.core.MockQuerySenderListenerReqHandler
   [junit4]   2> 356592 T1523 oasc.RequestHandlers.initHandlersFromConfig created /admin/: org.apache.solr.handler.admin.AdminHandlers
   [junit4]   2> 356593 T1523 oasc.RequestHandlers.initHandlersFromConfig created defaults: solr.StandardRequestHandler
   [junit4]   2> 356594 T1523 oasc.RequestHandlers.initHandlersFromConfig adding lazy requestHandler: solr.StandardRequestHandler
   [junit4]   2> 356594 T1523 oasc.RequestHandlers.initHandlersFromConfig created lazy: solr.StandardRequestHandler
   [junit4]   2> 356595 T1523 oasc.RequestHandlers.initHandlersFromConfig created /update: solr.UpdateRequestHandler
   [junit4]   2> 356596 T1523 oasc.RequestHandlers.initHandlersFromConfig created /terms: org.apache.solr.handler.component.SearchHandler
   [junit4]   2> 356597 T1523 oasc.RequestHandlers.initHandlersFromConfig created spellCheckCompRH: org.apache.solr.handler.component.SearchHandler
   [junit4]   2> 356598 T1523 oasc.RequestHandlers.initHandlersFromConfig created spellCheckCompRH_Direct: org.apache.solr.handler.component.SearchHandler
   [jun

[...truncated too long message...]

ore_node1":{
   [junit4]   1>                   "state":"active",
   [junit4]   1>                   "base_url":"http://127.0.0.1:41722/z_qd/gp",
   [junit4]   1>                   "core":"onenodecollectioncore",
   [junit4]   1>                   "roles":"none",
   [junit4]   1>                   "node_name":"127.0.0.1:41722_z_qd%2Fgp",
   [junit4]   1>                   "leader":"true"}}}},
   [junit4]   1>           "maxShardsPerNode":"1",
   [junit4]   1>           "router":{"name":"compositeId"},
   [junit4]   1>           "replicationFactor":"1"},
   [junit4]   1>         "collection1":{
   [junit4]   1>           "shards":{
   [junit4]   1>             "shard1":{
   [junit4]   1>               "range":"80000000-ffffffff",
   [junit4]   1>               "state":"active",
   [junit4]   1>               "replicas":{
   [junit4]   1>                 "core_node1":{
   [junit4]   1>                   "state":"active",
   [junit4]   1>                   "base_url":"http://127.0.0.1:41722/z_qd/gp",
   [junit4]   1>                   "core":"collection1",
   [junit4]   1>                   "node_name":"127.0.0.1:41722_z_qd%2Fgp",
   [junit4]   1>                   "leader":"true"},
   [junit4]   1>                 "core_node3":{
   [junit4]   1>                   "state":"active",
   [junit4]   1>                   "base_url":"http://127.0.0.1:51675/z_qd/gp",
   [junit4]   1>                   "core":"collection1",
   [junit4]   1>                   "node_name":"127.0.0.1:51675_z_qd%2Fgp"}}},
   [junit4]   1>             "shard2":{
   [junit4]   1>               "range":"0-7fffffff",
   [junit4]   1>               "state":"active",
   [junit4]   1>               "replicas":{
   [junit4]   1>                 "core_node2":{
   [junit4]   1>                   "state":"active",
   [junit4]   1>                   "base_url":"http://127.0.0.1:58649/z_qd/gp",
   [junit4]   1>                   "core":"collection1",
   [junit4]   1>                   "node_name":"127.0.0.1:58649_z_qd%2Fgp",
   [junit4]   1>                   "leader":"true"},
   [junit4]   1>                 "core_node4":{
   [junit4]   1>                   "state":"active",
   [junit4]   1>                   "base_url":"http://127.0.0.1:51860/z_qd/gp",
   [junit4]   1>                   "core":"collection1",
   [junit4]   1>                   "node_name":"127.0.0.1:51860_z_qd%2Fgp"}}}},
   [junit4]   1>           "maxShardsPerNode":"1",
   [junit4]   1>           "router":{"name":"compositeId"},
   [junit4]   1>           "replicationFactor":"1"}}
   [junit4]   1>  /zookeeper (1)
   [junit4]   1>  DATA:
   [junit4]   1>      
   [junit4]   1> 
   [junit4]   2> NOTE: reproduce with: ant test  -Dtestcase=BasicDistributedZk2Test -Dtests.method=testDistribSearch -Dtests.seed=7E402D14147F6239 -Dtests.multiplier=3 -Dtests.slow=true -Dtests.locale=ko_KR -Dtests.timezone=America/Port-au-Prince -Dtests.file.encoding=US-ASCII
   [junit4] ERROR   27.9s J0 | BasicDistributedZk2Test.testDistribSearch <<<
   [junit4]    > Throwable #1: org.apache.solr.client.solrj.impl.HttpSolrServer$RemoteSolrException: Expected content type application/octet-stream but got text/html;charset=ISO-8859-1. <html>
   [junit4]    > <head>
   [junit4]    > <meta http-equiv="Content-Type" content="text/html;charset=ISO-8859-1"/>
   [junit4]    > <title>Error 404 Can not find: /z_qd/gp/onenodecollectioncore/update</title>
   [junit4]    > </head>
   [junit4]    > <body>
   [junit4]    > <h2>HTTP ERROR: 404</h2>
   [junit4]    > <p>Problem accessing /z_qd/gp/onenodecollectioncore/update. Reason:
   [junit4]    > <pre>    Can not find: /z_qd/gp/onenodecollectioncore/update</pre></p>
   [junit4]    > <hr /><i><small>Powered by Jetty://</small></i>
   [junit4]    >                                                 
   [junit4]    >                                                 
   [junit4]    >                                                 
   [junit4]    >                                                 
   [junit4]    >                                                 
   [junit4]    >                                                 
   [junit4]    >                                                 
   [junit4]    >                                                 
   [junit4]    >                                                 
   [junit4]    >                                                 
   [junit4]    >                                                 
   [junit4]    >                                                 
   [junit4]    >                                                 
   [junit4]    >                                                 
   [junit4]    >                                                 
   [junit4]    >                                                 
   [junit4]    >                                                 
   [junit4]    >                                                 
   [junit4]    >                                                 
   [junit4]    >                                                 
   [junit4]    > </body>
   [junit4]    > </html>
   [junit4]    > 	at __randomizedtesting.SeedInfo.seed([7E402D14147F6239:FFA6A30C63200205]:0)
   [junit4]    > 	at org.apache.solr.client.solrj.impl.HttpSolrServer.request(HttpSolrServer.java:428)
   [junit4]    > 	at org.apache.solr.client.solrj.impl.HttpSolrServer.request(HttpSolrServer.java:181)
   [junit4]    > 	at org.apache.solr.client.solrj.request.AbstractUpdateRequest.process(AbstractUpdateRequest.java:117)
   [junit4]    > 	at org.apache.solr.client.solrj.SolrServer.add(SolrServer.java:116)
   [junit4]    > 	at org.apache.solr.client.solrj.SolrServer.add(SolrServer.java:102)
   [junit4]    > 	at org.apache.solr.cloud.BasicDistributedZk2Test.testNodeWithoutCollectionForwarding(BasicDistributedZk2Test.java:196)
   [junit4]    > 	at org.apache.solr.cloud.BasicDistributedZk2Test.doTest(BasicDistributedZk2Test.java:88)
   [junit4]    > 	at org.apache.solr.BaseDistributedSearchTestCase.testDistribSearch(BaseDistributedSearchTestCase.java:835)
   [junit4]    > 	at java.lang.Thread.run(Thread.java:780)
   [junit4]   2> 522844 T1972 oas.SolrTestCaseJ4.deleteCore ###deleteCore
   [junit4]   2> 27880 T1971 ccr.ThreadLeakControl.checkThreadLeaks WARNING Will linger awaiting termination of 1 leaked thread(s).
   [junit4]   2> 523952 T2063 oascc.ZkStateReader$3.process WARN ZooKeeper watch triggered, but Solr cannot talk to ZK
   [junit4]   2> NOTE: test params are: codec=Asserting, sim=RandomSimilarityProvider(queryNorm=true,coord=no): {}, locale=ko_KR, timezone=America/Port-au-Prince
   [junit4]   2> NOTE: Linux 3.8.0-32-generic x86/IBM Corporation 1.7.0 (32-bit)/cpus=8,threads=1,free=132910968,total=260702208
   [junit4]   2> NOTE: All tests run in this JVM: [TestSolrDeletionPolicy1, TestCoreContainer, TestDocumentBuilder, CopyFieldTest, TestFieldTypeCollectionResource, TestReversedWildcardFilterFactory, TestBM25SimilarityFactory, TestJoin, ExternalFileFieldSortTest, TestSuggestSpellingConverter, SolrIndexSplitterTest, LoggingHandlerTest, TestFaceting, DistributedSpellCheckComponentTest, TestReplicationHandler, HdfsBasicDistributedZkTest, TestLFUCache, TestClassNameShortening, ReturnFieldsTest, TestSchemaResource, RegexBoostProcessorTest, BlockDirectoryTest, SearchHandlerTest, PeerSyncTest, WordBreakSolrSpellCheckerTest, LegacyHTMLStripCharFilterTest, SolrCoreTest, HdfsCollectionsAPIDistributedZkTest, BasicFunctionalityTest, HdfsDirectoryTest, TestLuceneMatchVersion, QueryEqualityTest, ScriptEngineTest, CacheHeaderTest, UpdateRequestProcessorFactoryTest, SuggesterFSTTest, DirectUpdateHandlerOptimizeTest, SynonymTokenizerTest, TermsComponentTest, TestGroupingSearch, TestShardHandlerFactory, TestRealTimeGet, TestElisionMultitermQuery, TestLRUCache, IndexSchemaTest, AssignTest, SpatialFilterTest, DOMUtilTest, TestNRTOpen, StressHdfsTest, TestJmxMonitoredMap, LukeRequestHandlerTest, TestUniqueKeyFieldResource, DocValuesMissingTest, TestFieldCollectionResource, TestBadConfig, DateMathParserTest, TestCopyFieldCollectionResource, JsonLoaderTest, OverseerCollectionProcessorTest, TestPseudoReturnFields, ClusterStateUpdateTest, DocValuesTest, TestRemoteStreaming, TestSolrIndexConfig, BadComponentTest, BadCopyFieldTest, ClusterStateTest, TestSurroundQueryParser, CircularListTest, SolrXmlInZkTest, ResponseLogComponentTest, AutoCommitTest, TestSchemaVersionResource, TestDynamicFieldResource, DistributedQueryElevationComponentTest, TestImplicitCoreProperties, ResourceLoaderTest, HdfsUnloadDistributedZkTest, TestMaxScoreQueryParser, BasicDistributedZkTest, BasicDistributedZk2Test]
   [junit4] Completed on J0 in 29.16s, 1 test, 1 error <<< FAILURES!

[...truncated 585 lines...]
BUILD FAILED
/mnt/ssd/jenkins/workspace/Lucene-Solr-trunk-Linux/build.xml:422: The following error occurred while executing this line:
/mnt/ssd/jenkins/workspace/Lucene-Solr-trunk-Linux/build.xml:415: The following error occurred while executing this line:
/mnt/ssd/jenkins/workspace/Lucene-Solr-trunk-Linux/build.xml:39: The following error occurred while executing this line:
/mnt/ssd/jenkins/workspace/Lucene-Solr-trunk-Linux/solr/build.xml:189: The following error occurred while executing this line:
/mnt/ssd/jenkins/workspace/Lucene-Solr-trunk-Linux/solr/common-build.xml:483: The following error occurred while executing this line:
/mnt/ssd/jenkins/workspace/Lucene-Solr-trunk-Linux/lucene/common-build.xml:1259: The following error occurred while executing this line:
/mnt/ssd/jenkins/workspace/Lucene-Solr-trunk-Linux/lucene/common-build.xml:902: There were test failures: 327 suites, 1451 tests, 2 errors, 35 ignored (6 assumptions)

Total time: 46 minutes 17 seconds
Build step 'Invoke Ant' marked build as failure
Description set: Java: 32bit/ibm-j9-jdk7 -Xjit:exclude={org/apache/lucene/util/fst/FST.pack(IIF)Lorg/apache/lucene/util/fst/FST;}
Archiving artifacts
Recording test results
Email was triggered for: Failure
Sending email for trigger: Failure



Mime
View raw message