lucene-dev mailing list archives

Site index · List index
Message view « Date » · « Thread »
Top « Date » · « Thread »
From Chris Hostetter <hossman_luc...@fucit.org>
Subject Re: [JENKINS] Lucene-Solr-trunk-Windows (64bit/jdk1.7.0_40) - Build # 3290 - Still Failing!
Date Tue, 24 Sep 2013 15:45:56 GMT

Bah .... windows paths ... i'm on it.


: Date: Tue, 24 Sep 2013 15:38:32 +0000 (UTC)
: From: Policeman Jenkins Server <jenkins@thetaphi.de>
: Reply-To: dev@lucene.apache.org
: To: dev@lucene.apache.org
: Subject: [JENKINS] Lucene-Solr-trunk-Windows (64bit/jdk1.7.0_40) - Build #
:     3290 - Still Failing!
: 
: Build: http://jenkins.thetaphi.de/job/Lucene-Solr-trunk-Windows/3290/
: Java: 64bit/jdk1.7.0_40 -XX:+UseCompressedOops -XX:+UseConcMarkSweepGC
: 
: 1 tests failed.
: FAILED:  org.apache.solr.core.TestImplicitCoreProperties.testImplicitPropertiesAreSubstitutedInSolrConfig
: 
: Error Message:
: Exception during query
: 
: Stack Trace:
: java.lang.RuntimeException: Exception during query
: 	at __randomizedtesting.SeedInfo.seed([CAD1F05B500116E3:6309E82BD92B3376]:0)
: 	at org.apache.solr.SolrTestCaseJ4.assertQ(SolrTestCaseJ4.java:637)
: 	at org.apache.solr.SolrTestCaseJ4.assertQ(SolrTestCaseJ4.java:604)
: 	at org.apache.solr.core.TestImplicitCoreProperties.testImplicitPropertiesAreSubstitutedInSolrConfig(TestImplicitCoreProperties.java:33)
: 	at sun.reflect.NativeMethodAccessorImpl.invoke0(Native Method)
: 	at sun.reflect.NativeMethodAccessorImpl.invoke(NativeMethodAccessorImpl.java:57)
: 	at sun.reflect.DelegatingMethodAccessorImpl.invoke(DelegatingMethodAccessorImpl.java:43)
: 	at java.lang.reflect.Method.invoke(Method.java:606)
: 	at com.carrotsearch.randomizedtesting.RandomizedRunner.invoke(RandomizedRunner.java:1559)
: 	at com.carrotsearch.randomizedtesting.RandomizedRunner.access$600(RandomizedRunner.java:79)
: 	at com.carrotsearch.randomizedtesting.RandomizedRunner$6.evaluate(RandomizedRunner.java:737)
: 	at com.carrotsearch.randomizedtesting.RandomizedRunner$7.evaluate(RandomizedRunner.java:773)
: 	at com.carrotsearch.randomizedtesting.RandomizedRunner$8.evaluate(RandomizedRunner.java:787)
: 	at com.carrotsearch.randomizedtesting.rules.SystemPropertiesRestoreRule$1.evaluate(SystemPropertiesRestoreRule.java:53)
: 	at org.apache.lucene.util.TestRuleSetupTeardownChained$1.evaluate(TestRuleSetupTeardownChained.java:50)
: 	at org.apache.lucene.util.TestRuleFieldCacheSanity$1.evaluate(TestRuleFieldCacheSanity.java:51)
: 	at org.apache.lucene.util.AbstractBeforeAfterRule$1.evaluate(AbstractBeforeAfterRule.java:46)
: 	at com.carrotsearch.randomizedtesting.rules.SystemPropertiesInvariantRule$1.evaluate(SystemPropertiesInvariantRule.java:55)
: 	at org.apache.lucene.util.TestRuleThreadAndTestName$1.evaluate(TestRuleThreadAndTestName.java:49)
: 	at org.apache.lucene.util.TestRuleIgnoreAfterMaxFailures$1.evaluate(TestRuleIgnoreAfterMaxFailures.java:70)
: 	at org.apache.lucene.util.TestRuleMarkFailure$1.evaluate(TestRuleMarkFailure.java:48)
: 	at com.carrotsearch.randomizedtesting.rules.StatementAdapter.evaluate(StatementAdapter.java:36)
: 	at com.carrotsearch.randomizedtesting.ThreadLeakControl$StatementRunner.run(ThreadLeakControl.java:358)
: 	at com.carrotsearch.randomizedtesting.ThreadLeakControl.forkTimeoutingTask(ThreadLeakControl.java:782)
: 	at com.carrotsearch.randomizedtesting.ThreadLeakControl$3.evaluate(ThreadLeakControl.java:442)
: 	at com.carrotsearch.randomizedtesting.RandomizedRunner.runSingleTest(RandomizedRunner.java:746)
: 	at com.carrotsearch.randomizedtesting.RandomizedRunner$3.evaluate(RandomizedRunner.java:648)
: 	at com.carrotsearch.randomizedtesting.RandomizedRunner$4.evaluate(RandomizedRunner.java:682)
: 	at com.carrotsearch.randomizedtesting.RandomizedRunner$5.evaluate(RandomizedRunner.java:693)
: 	at com.carrotsearch.randomizedtesting.rules.StatementAdapter.evaluate(StatementAdapter.java:36)
: 	at com.carrotsearch.randomizedtesting.rules.SystemPropertiesRestoreRule$1.evaluate(SystemPropertiesRestoreRule.java:53)
: 	at org.apache.lucene.util.AbstractBeforeAfterRule$1.evaluate(AbstractBeforeAfterRule.java:46)
: 	at org.apache.lucene.util.TestRuleStoreClassName$1.evaluate(TestRuleStoreClassName.java:42)
: 	at com.carrotsearch.randomizedtesting.rules.SystemPropertiesInvariantRule$1.evaluate(SystemPropertiesInvariantRule.java:55)
: 	at com.carrotsearch.randomizedtesting.rules.NoShadowingOrOverridesOnMethodsRule$1.evaluate(NoShadowingOrOverridesOnMethodsRule.java:39)
: 	at com.carrotsearch.randomizedtesting.rules.NoShadowingOrOverridesOnMethodsRule$1.evaluate(NoShadowingOrOverridesOnMethodsRule.java:39)
: 	at com.carrotsearch.randomizedtesting.rules.StatementAdapter.evaluate(StatementAdapter.java:36)
: 	at org.apache.lucene.util.TestRuleAssertionsRequired$1.evaluate(TestRuleAssertionsRequired.java:43)
: 	at org.apache.lucene.util.TestRuleMarkFailure$1.evaluate(TestRuleMarkFailure.java:48)
: 	at org.apache.lucene.util.TestRuleIgnoreAfterMaxFailures$1.evaluate(TestRuleIgnoreAfterMaxFailures.java:70)
: 	at org.apache.lucene.util.TestRuleIgnoreTestSuites$1.evaluate(TestRuleIgnoreTestSuites.java:55)
: 	at com.carrotsearch.randomizedtesting.rules.StatementAdapter.evaluate(StatementAdapter.java:36)
: 	at com.carrotsearch.randomizedtesting.ThreadLeakControl$StatementRunner.run(ThreadLeakControl.java:358)
: 	at java.lang.Thread.run(Thread.java:724)
: Caused by: java.lang.RuntimeException: REQUEST FAILED: xpath=//str[@name='dummy2'][.='data/']
: 	xml response was: <?xml version="1.0" encoding="UTF-8"?>
: <response>
: <lst name="responseHeader"><int name="status">0</int><int name="QTime">1</int><lst
name="params"><str name="df">text</str><str name="echoParams">all</str><str
name="dummy2">data\</str><str name="dummy3">solrconfig-implicitproperties.xml</str><str
name="dummy1">collection1</str><str name="dummy4">schema.xml</str><str
name="dummy5">false</str><str name="q">*:*</str></lst></lst><result
name="response" numFound="0" start="0"></result>
: </response>
: 
: 	request was:q=*:*
: 	at org.apache.solr.SolrTestCaseJ4.assertQ(SolrTestCaseJ4.java:630)
: 	... 42 more
: 
: 
: 
: 
: Build Log:
: [...truncated 10517 lines...]
:    [junit4] Suite: org.apache.solr.core.TestImplicitCoreProperties
:    [junit4]   2> 2911924 T8257 oas.SolrTestCaseJ4.setUp ###Starting testImplicitPropertiesAreSubstitutedInSolrConfig
:    [junit4]   2> Creating dataDir: C:\Users\JenkinsSlave\workspace\Lucene-Solr-trunk-Windows\solr\build\solr-core\test\J0\.\solrtest-TestImplicitCoreProperties-1380036892382
:    [junit4]   2> 2911927 T8257 oasc.SolrResourceLoader.<init> new SolrResourceLoader
for directory: 'C:\Users\JenkinsSlave\workspace\Lucene-Solr-trunk-Windows\solr\build\solr-core\test-files\solr\'
:    [junit4]   2> 2911959 T8257 oasc.SolrResourceLoader.locateSolrHome JNDI not configured
for solr (NoInitialContextEx)
:    [junit4]   2> 2911959 T8257 oasc.SolrResourceLoader.locateSolrHome solr home defaulted
to 'solr/' (could not find system property or JNDI)
:    [junit4]   2> 2911959 T8257 oasc.SolrResourceLoader.<init> new SolrResourceLoader
for deduced Solr Home: 'solr/'
:    [junit4]   2> 2912066 T8257 oasc.CoreContainer.<init> New CoreContainer 1098831888
:    [junit4]   2> 2912066 T8257 oasc.CoreContainer.load Loading cores into CoreContainer
[instanceDir=C:\Users\JenkinsSlave\workspace\Lucene-Solr-trunk-Windows\solr\build\solr-core\test-files\solr\]
:    [junit4]   2> 2912068 T8257 oashc.HttpShardHandlerFactory.getParameter Setting socketTimeout
to: 0
:    [junit4]   2> 2912069 T8257 oashc.HttpShardHandlerFactory.getParameter Setting urlScheme
to: http://
:    [junit4]   2> 2912069 T8257 oashc.HttpShardHandlerFactory.getParameter Setting connTimeout
to: 0
:    [junit4]   2> 2912069 T8257 oashc.HttpShardHandlerFactory.getParameter Setting maxConnectionsPerHost
to: 20
:    [junit4]   2> 2912069 T8257 oashc.HttpShardHandlerFactory.getParameter Setting corePoolSize
to: 0
:    [junit4]   2> 2912069 T8257 oashc.HttpShardHandlerFactory.getParameter Setting maximumPoolSize
to: 2147483647
:    [junit4]   2> 2912069 T8257 oashc.HttpShardHandlerFactory.getParameter Setting maxThreadIdleTime
to: 5
:    [junit4]   2> 2912070 T8257 oashc.HttpShardHandlerFactory.getParameter Setting sizeOfQueue
to: -1
:    [junit4]   2> 2912070 T8257 oashc.HttpShardHandlerFactory.getParameter Setting fairnessPolicy
to: false
:    [junit4]   2> 2912070 T8257 oascsi.HttpClientUtil.createClient Creating new http client,
config:maxConnectionsPerHost=20&maxConnections=10000&socketTimeout=0&connTimeout=0&retry=false
:    [junit4]   2> 2912080 T8257 oasl.LogWatcher.createWatcher SLF4J impl is org.slf4j.impl.Log4jLoggerFactory
:    [junit4]   2> 2912080 T8257 oasl.LogWatcher.newRegisteredLogWatcher Registering Log
Listener [Log4j (org.slf4j.impl.Log4jLoggerFactory)]
:    [junit4]   2> 2912088 T8258 oasc.CoreContainer.create Creating SolrCore 'collection1'
using instanceDir: C:\Users\JenkinsSlave\workspace\Lucene-Solr-trunk-Windows\solr\build\solr-core\test-files\solr\collection1
:    [junit4]   2> 2912088 T8258 oasc.SolrResourceLoader.<init> new SolrResourceLoader
for directory: 'C:\Users\JenkinsSlave\workspace\Lucene-Solr-trunk-Windows\solr\build\solr-core\test-files\solr\collection1\'
:    [junit4]   2> 2912090 T8258 oasc.SolrResourceLoader.replaceClassLoader Adding 'file:/C:/Users/JenkinsSlave/workspace/Lucene-Solr-trunk-Windows/solr/build/solr-core/test-files/solr/collection1/lib/classes/'
to classloader
:    [junit4]   2> 2912091 T8258 oasc.SolrResourceLoader.replaceClassLoader Adding 'file:/C:/Users/JenkinsSlave/workspace/Lucene-Solr-trunk-Windows/solr/build/solr-core/test-files/solr/collection1/lib/README'
to classloader
:    [junit4]   2> 2912152 T8258 oasc.SolrConfig.<init> Using Lucene MatchVersion:
LUCENE_41
:    [junit4]   2> 2912218 T8258 oasc.SolrConfig.<init> Loaded SolrConfig: solrconfig-implicitproperties.xml
:    [junit4]   2> 2912219 T8258 oass.IndexSchema.readSchema Reading Solr Schema from schema.xml
:    [junit4]   2> 2912229 T8258 oass.IndexSchema.readSchema [null] Schema name=test
:    [junit4]   2> 2912949 T8258 oass.OpenExchangeRatesOrgProvider.init Initialized with
rates=open-exchange-rates.json, refreshInterval=1440.
:    [junit4]   2> 2912960 T8258 oass.IndexSchema.readSchema default search field in schema
is text
:    [junit4]   2> 2912964 T8258 oass.IndexSchema.readSchema unique key field: id
:    [junit4]   2> 2912974 T8258 oass.FileExchangeRateProvider.reload Reloading exchange
rates from file currency.xml
:    [junit4]   2> 2912978 T8258 oass.FileExchangeRateProvider.reload Reloading exchange
rates from file currency.xml
:    [junit4]   2> 2912982 T8258 oass.OpenExchangeRatesOrgProvider.reload Reloading exchange
rates from open-exchange-rates.json
:    [junit4]   2> 2912983 T8258 oass.OpenExchangeRatesOrgProvider$OpenExchangeRates.<init>
WARN Unknown key IMPORTANT NOTE
:    [junit4]   2> 2912983 T8258 oass.OpenExchangeRatesOrgProvider$OpenExchangeRates.<init>
WARN Expected key, got STRING
:    [junit4]   2> 2912983 T8258 oass.OpenExchangeRatesOrgProvider.reload Reloading exchange
rates from open-exchange-rates.json
:    [junit4]   2> 2912985 T8258 oass.OpenExchangeRatesOrgProvider$OpenExchangeRates.<init>
WARN Unknown key IMPORTANT NOTE
:    [junit4]   2> 2912985 T8258 oass.OpenExchangeRatesOrgProvider$OpenExchangeRates.<init>
WARN Expected key, got STRING
:    [junit4]   2> 2912985 T8258 oasc.SolrCore.initDirectoryFactory org.apache.solr.core.MockDirectoryFactory
:    [junit4]   2> 2912986 T8258 oasc.SolrCore.<init> [collection1] Opening new SolrCore
at C:\Users\JenkinsSlave\workspace\Lucene-Solr-trunk-Windows\solr\build\solr-core\test-files\solr\collection1\,
dataDir=C:\Users\JenkinsSlave\workspace\Lucene-Solr-trunk-Windows\solr\build\solr-core\test-files\solr\collection1\data\
:    [junit4]   2> 2912986 T8258 oasc.JmxMonitoredMap.<init> JMX monitoring is enabled.
Adding Solr mbeans to JMX Server: com.sun.jmx.mbeanserver.JmxMBeanServer@5d7072bf
:    [junit4]   2> 2912986 T8258 oasc.CachingDirectoryFactory.get return new directory
for C:\Users\JenkinsSlave\workspace\Lucene-Solr-trunk-Windows\solr\build\solr-core\test-files\solr\collection1\data\
:    [junit4]   2> 2912987 T8258 oasc.SolrCore.getNewIndexDir New index directory detected:
old=null new=C:\Users\JenkinsSlave\workspace\Lucene-Solr-trunk-Windows\solr\build\solr-core\test-files\solr\collection1\data\index/
:    [junit4]   2> 2912987 T8258 oasc.SolrCore.initIndex WARN [collection1] Solr index
directory 'C:\Users\JenkinsSlave\workspace\Lucene-Solr-trunk-Windows\solr\build\solr-core\test-files\solr\collection1\data\index'
doesn't exist. Creating new index...
:    [junit4]   2> 2912987 T8258 oasc.CachingDirectoryFactory.get return new directory
for C:\Users\JenkinsSlave\workspace\Lucene-Solr-trunk-Windows\solr\build\solr-core\test-files\solr\collection1\data\index
:    [junit4]   2> 2912988 T8258 oasu.RandomMergePolicy.<init> RandomMergePolicy
wrapping class org.apache.lucene.index.LogByteSizeMergePolicy: [LogByteSizeMergePolicy: minMergeSize=1677721,
mergeFactor=11, maxMergeSize=2147483648, maxMergeSizeForForcedMerge=9223372036854775807, calibrateSizeByDeletes=false,
maxMergeDocs=2147483647, maxCFSSegmentSizeMB=8.796093022207999E12, noCFSRatio=0.5100991889755551]
:    [junit4]   2> 2912988 T8258 oasc.SolrDeletionPolicy.onCommit SolrDeletionPolicy.onCommit:
commits: num=1
:    [junit4]   2> 		commit{dir=MockDirectoryWrapper(org.apache.lucene.store.RAMDirectory@33cd8fca
lockFactory=org.apache.lucene.store.SingleInstanceLockFactory@36651be9),segFN=segments_1,generation=1}
:    [junit4]   2> 2912989 T8258 oasc.SolrDeletionPolicy.updateCommits newest commit generation
= 1
:    [junit4]   2> 2912989 T8258 oasc.SolrCore.initWriters created json: solr.JSONResponseWriter
:    [junit4]   2> 2912992 T8258 oasc.SolrCore.loadUpdateProcessorChains no updateRequestProcessorChain
defined as default, creating implicit default
:    [junit4]   2> 2912992 T8258 oasc.RequestHandlers.initHandlersFromConfig created /admin/:
solr.admin.AdminHandlers
:    [junit4]   2> 2912993 T8258 oasc.RequestHandlers.initHandlersFromConfig created /select:
solr.SearchHandler
:    [junit4]   2> 2912993 T8258 oasc.RequestHandlers.initHandlersFromConfig created /update:
solr.UpdateRequestHandler
:    [junit4]   2> 2913002 T8258 oashl.XMLLoader.init xsltCacheLifetimeSeconds=60
:    [junit4]   2> 2913005 T8258 oasu.CommitTracker.<init> Hard AutoCommit: disabled
:    [junit4]   2> 2913005 T8258 oasu.CommitTracker.<init> Soft AutoCommit: disabled
:    [junit4]   2> 2913006 T8258 oasu.RandomMergePolicy.<init> RandomMergePolicy
wrapping class org.apache.lucene.index.TieredMergePolicy: [TieredMergePolicy: maxMergeAtOnce=22,
maxMergeAtOnceExplicit=49, maxMergedSegmentMB=84.166015625, floorSegmentMB=1.5146484375, forceMergeDeletesPctAllowed=25.117427303578587,
segmentsPerTier=14.0, maxCFSSegmentSizeMB=8.796093022207999E12, noCFSRatio=0.0
:    [junit4]   2> 2913006 T8258 oasc.SolrDeletionPolicy.onInit SolrDeletionPolicy.onInit:
commits: num=1
:    [junit4]   2> 		commit{dir=MockDirectoryWrapper(org.apache.lucene.store.RAMDirectory@33cd8fca
lockFactory=org.apache.lucene.store.SingleInstanceLockFactory@36651be9),segFN=segments_1,generation=1}
:    [junit4]   2> 2913007 T8258 oasc.SolrDeletionPolicy.updateCommits newest commit generation
= 1
:    [junit4]   2> 2913007 T8258 oass.SolrIndexSearcher.<init> Opening Searcher@32f636fd
main
:    [junit4]   2> 2913007 T8258 oasc.SolrCore.registerSearcher [collection1] Registered
new searcher Searcher@32f636fd main{StandardDirectoryReader(segments_1:1:nrt)}
:    [junit4]   2> 2913011 T8258 oasc.CoreContainer.registerCore registering core: collection1
:    [junit4]   2> 2913014 T8257 oasc.CoreContainer.load Loading cores into CoreContainer
[instanceDir=C:\Users\JenkinsSlave\workspace\Lucene-Solr-trunk-Windows\solr\build\solr-core\test-files\solr\]
:    [junit4]   2> 2913015 T8257 oashc.HttpShardHandlerFactory.getParameter Setting socketTimeout
to: 0
:    [junit4]   2> 2913015 T8257 oashc.HttpShardHandlerFactory.getParameter Setting urlScheme
to: http://
:    [junit4]   2> 2913016 T8257 oashc.HttpShardHandlerFactory.getParameter Setting connTimeout
to: 0
:    [junit4]   2> 2913016 T8257 oashc.HttpShardHandlerFactory.getParameter Setting maxConnectionsPerHost
to: 20
:    [junit4]   2> 2913016 T8257 oashc.HttpShardHandlerFactory.getParameter Setting corePoolSize
to: 0
:    [junit4]   2> 2913017 T8257 oashc.HttpShardHandlerFactory.getParameter Setting maximumPoolSize
to: 2147483647
:    [junit4]   2> 2913017 T8257 oashc.HttpShardHandlerFactory.getParameter Setting maxThreadIdleTime
to: 5
:    [junit4]   2> 2913017 T8257 oashc.HttpShardHandlerFactory.getParameter Setting sizeOfQueue
to: -1
:    [junit4]   2> 2913017 T8257 oashc.HttpShardHandlerFactory.getParameter Setting fairnessPolicy
to: false
:    [junit4]   2> 2913018 T8257 oascsi.HttpClientUtil.createClient Creating new http client,
config:maxConnectionsPerHost=20&maxConnections=10000&socketTimeout=0&connTimeout=0&retry=false
:    [junit4]   2> 2913021 T8257 oasl.LogWatcher.createWatcher SLF4J impl is org.slf4j.impl.Log4jLoggerFactory
:    [junit4]   2> 2913022 T8257 oasl.LogWatcher.newRegisteredLogWatcher Registering Log
Listener [Log4j (org.slf4j.impl.Log4jLoggerFactory)]
:    [junit4]   2> 2913028 T8261 oasc.CoreContainer.create Creating SolrCore 'collection1'
using instanceDir: C:\Users\JenkinsSlave\workspace\Lucene-Solr-trunk-Windows\solr\build\solr-core\test-files\solr\collection1
:    [junit4]   2> 2913028 T8261 oasc.SolrResourceLoader.<init> new SolrResourceLoader
for directory: 'C:\Users\JenkinsSlave\workspace\Lucene-Solr-trunk-Windows\solr\build\solr-core\test-files\solr\collection1\'
:    [junit4]   2> 2913029 T8261 oasc.SolrResourceLoader.replaceClassLoader Adding 'file:/C:/Users/JenkinsSlave/workspace/Lucene-Solr-trunk-Windows/solr/build/solr-core/test-files/solr/collection1/lib/classes/'
to classloader
:    [junit4]   2> 2913029 T8261 oasc.SolrResourceLoader.replaceClassLoader Adding 'file:/C:/Users/JenkinsSlave/workspace/Lucene-Solr-trunk-Windows/solr/build/solr-core/test-files/solr/collection1/lib/README'
to classloader
:    [junit4]   2> 2913088 T8261 oasc.SolrConfig.<init> Using Lucene MatchVersion:
LUCENE_41
:    [junit4]   2> 2913153 T8261 oasc.SolrConfig.<init> Loaded SolrConfig: solrconfig-implicitproperties.xml
:    [junit4]   2> 2913154 T8261 oass.IndexSchema.readSchema Reading Solr Schema from schema.xml
:    [junit4]   2> 2913166 T8261 oass.IndexSchema.readSchema [null] Schema name=test
:    [junit4]   2> 2913846 T8261 oass.OpenExchangeRatesOrgProvider.init Initialized with
rates=open-exchange-rates.json, refreshInterval=1440.
:    [junit4]   2> 2913852 T8261 oass.IndexSchema.readSchema default search field in schema
is text
:    [junit4]   2> 2913856 T8261 oass.IndexSchema.readSchema unique key field: id
:    [junit4]   2> 2913864 T8261 oass.FileExchangeRateProvider.reload Reloading exchange
rates from file currency.xml
:    [junit4]   2> 2913869 T8261 oass.FileExchangeRateProvider.reload Reloading exchange
rates from file currency.xml
:    [junit4]   2> 2913874 T8261 oass.OpenExchangeRatesOrgProvider.reload Reloading exchange
rates from open-exchange-rates.json
:    [junit4]   2> 2913874 T8261 oass.OpenExchangeRatesOrgProvider$OpenExchangeRates.<init>
WARN Unknown key IMPORTANT NOTE
:    [junit4]   2> 2913875 T8261 oass.OpenExchangeRatesOrgProvider$OpenExchangeRates.<init>
WARN Expected key, got STRING
:    [junit4]   2> 2913875 T8261 oass.OpenExchangeRatesOrgProvider.reload Reloading exchange
rates from open-exchange-rates.json
:    [junit4]   2> 2913876 T8261 oass.OpenExchangeRatesOrgProvider$OpenExchangeRates.<init>
WARN Unknown key IMPORTANT NOTE
:    [junit4]   2> 2913876 T8261 oass.OpenExchangeRatesOrgProvider$OpenExchangeRates.<init>
WARN Expected key, got STRING
:    [junit4]   2> 2913877 T8261 oasc.SolrCore.initDirectoryFactory org.apache.solr.core.MockDirectoryFactory
:    [junit4]   2> 2913877 T8261 oasc.SolrCore.<init> [collection1] Opening new SolrCore
at C:\Users\JenkinsSlave\workspace\Lucene-Solr-trunk-Windows\solr\build\solr-core\test-files\solr\collection1\,
dataDir=C:\Users\JenkinsSlave\workspace\Lucene-Solr-trunk-Windows\solr\build\solr-core\test-files\solr\collection1\data\
:    [junit4]   2> 2913877 T8261 oasc.JmxMonitoredMap.<init> JMX monitoring is enabled.
Adding Solr mbeans to JMX Server: com.sun.jmx.mbeanserver.JmxMBeanServer@5d7072bf
:    [junit4]   2> 2913878 T8261 oasc.CachingDirectoryFactory.get return new directory
for C:\Users\JenkinsSlave\workspace\Lucene-Solr-trunk-Windows\solr\build\solr-core\test-files\solr\collection1\data\
:    [junit4]   2> 2913878 T8261 oasc.SolrCore.getNewIndexDir New index directory detected:
old=null new=C:\Users\JenkinsSlave\workspace\Lucene-Solr-trunk-Windows\solr\build\solr-core\test-files\solr\collection1\data\index/
:    [junit4]   2> 2913878 T8261 oasc.SolrCore.initIndex WARN [collection1] Solr index
directory 'C:\Users\JenkinsSlave\workspace\Lucene-Solr-trunk-Windows\solr\build\solr-core\test-files\solr\collection1\data\index'
doesn't exist. Creating new index...
:    [junit4]   2> 2913878 T8261 oasc.CachingDirectoryFactory.get return new directory
for C:\Users\JenkinsSlave\workspace\Lucene-Solr-trunk-Windows\solr\build\solr-core\test-files\solr\collection1\data\index
:    [junit4]   2> 2913879 T8261 oasu.RandomMergePolicy.<init> RandomMergePolicy
wrapping class org.apache.lucene.index.LogByteSizeMergePolicy: [LogByteSizeMergePolicy: minMergeSize=1677721,
mergeFactor=11, maxMergeSize=2147483648, maxMergeSizeForForcedMerge=9223372036854775807, calibrateSizeByDeletes=false,
maxMergeDocs=2147483647, maxCFSSegmentSizeMB=8.796093022207999E12, noCFSRatio=0.5100991889755551]
:    [junit4]   2> 2913880 T8261 oasc.SolrDeletionPolicy.onCommit SolrDeletionPolicy.onCommit:
commits: num=1
:    [junit4]   2> 		commit{dir=MockDirectoryWrapper(org.apache.lucene.store.RAMDirectory@3686cd10
lockFactory=org.apache.lucene.store.SingleInstanceLockFactory@9adeab7),segFN=segments_1,generation=1}
:    [junit4]   2> 2913880 T8261 oasc.SolrDeletionPolicy.updateCommits newest commit generation
= 1
:    [junit4]   2> 2913881 T8261 oasc.SolrCore.initWriters created json: solr.JSONResponseWriter
:    [junit4]   2> 2913884 T8261 oasc.SolrCore.loadUpdateProcessorChains no updateRequestProcessorChain
defined as default, creating implicit default
:    [junit4]   2> 2913884 T8261 oasc.RequestHandlers.initHandlersFromConfig created /admin/:
solr.admin.AdminHandlers
:    [junit4]   2> 2913885 T8261 oasc.RequestHandlers.initHandlersFromConfig created /select:
solr.SearchHandler
:    [junit4]   2> 2913885 T8261 oasc.RequestHandlers.initHandlersFromConfig created /update:
solr.UpdateRequestHandler
:    [junit4]   2> 2913888 T8261 oashl.XMLLoader.init xsltCacheLifetimeSeconds=60
:    [junit4]   2> 2913891 T8261 oasu.CommitTracker.<init> Hard AutoCommit: disabled
:    [junit4]   2> 2913892 T8261 oasu.CommitTracker.<init> Soft AutoCommit: disabled
:    [junit4]   2> 2913892 T8261 oasu.RandomMergePolicy.<init> RandomMergePolicy
wrapping class org.apache.lucene.index.TieredMergePolicy: [TieredMergePolicy: maxMergeAtOnce=22,
maxMergeAtOnceExplicit=49, maxMergedSegmentMB=84.166015625, floorSegmentMB=1.5146484375, forceMergeDeletesPctAllowed=25.117427303578587,
segmentsPerTier=14.0, maxCFSSegmentSizeMB=8.796093022207999E12, noCFSRatio=0.0
:    [junit4]   2> 2913893 T8261 oasc.SolrDeletionPolicy.onInit SolrDeletionPolicy.onInit:
commits: num=1
:    [junit4]   2> 		commit{dir=MockDirectoryWrapper(org.apache.lucene.store.RAMDirectory@3686cd10
lockFactory=org.apache.lucene.store.SingleInstanceLockFactory@9adeab7),segFN=segments_1,generation=1}
:    [junit4]   2> 2913893 T8261 oasc.SolrDeletionPolicy.updateCommits newest commit generation
= 1
:    [junit4]   2> 2913893 T8261 oass.SolrIndexSearcher.<init> Opening Searcher@1739e2d9
main
:    [junit4]   2> 2913893 T8261 oasc.SolrCore.registerSearcher [collection1] Registered
new searcher Searcher@1739e2d9 main{StandardDirectoryReader(segments_1:1:nrt)}
:    [junit4]   2> 2913898 T8261 oasc.CoreContainer.registerCore replacing core: collection1
:    [junit4]   2> 2913898 T8261 oasc.SolrCore.close [collection1]  CLOSING SolrCore org.apache.solr.core.SolrCore@5ee67948
:    [junit4]   2> 2913901 T8261 oasu.DirectUpdateHandler2.close closing DirectUpdateHandler2{commits=0,autocommits=0,soft
autocommits=0,optimizes=0,rollbacks=0,expungeDeletes=0,docsPending=0,adds=0,deletesById=0,deletesByQuery=0,errors=0,cumulative_adds=0,cumulative_deletesById=0,cumulative_deletesByQuery=0,cumulative_errors=0}
:    [junit4]   2> 2913901 T8261 oasu.SolrCoreState.decrefSolrCoreState Closing SolrCoreState
:    [junit4]   2> 2913901 T8261 oasu.DefaultSolrCoreState.closeIndexWriter SolrCoreState
ref count has reached 0 - closing IndexWriter
:    [junit4]   2> 2913901 T8261 oasu.DefaultSolrCoreState.closeIndexWriter closing IndexWriter
with IndexWriterCloser
:    [junit4]   2> 2913902 T8261 oasc.SolrCore.closeSearcher [collection1] Closing main
searcher on request.
:    [junit4]   2> 2913902 T8261 oasc.CachingDirectoryFactory.close Closing MockDirectoryFactory
- 2 directories currently being tracked
:    [junit4]   2> 2913902 T8261 oasc.CachingDirectoryFactory.closeCacheValue looking to
close C:\Users\JenkinsSlave\workspace\Lucene-Solr-trunk-Windows\solr\build\solr-core\test-files\solr\collection1\data\index
[CachedDir<<refCount=0;path=C:\Users\JenkinsSlave\workspace\Lucene-Solr-trunk-Windows\solr\build\solr-core\test-files\solr\collection1\data\index;done=false>>]
:    [junit4]   2> 2913902 T8261 oasc.CachingDirectoryFactory.close Closing directory:
C:\Users\JenkinsSlave\workspace\Lucene-Solr-trunk-Windows\solr\build\solr-core\test-files\solr\collection1\data\index
:    [junit4]   2> 2913902 T8261 oasc.CachingDirectoryFactory.closeCacheValue looking to
close C:\Users\JenkinsSlave\workspace\Lucene-Solr-trunk-Windows\solr\build\solr-core\test-files\solr\collection1\data\
[CachedDir<<refCount=0;path=C:\Users\JenkinsSlave\workspace\Lucene-Solr-trunk-Windows\solr\build\solr-core\test-files\solr\collection1\data\;done=false>>]
:    [junit4]   2> 2913903 T8261 oasc.CachingDirectoryFactory.close Closing directory:
C:\Users\JenkinsSlave\workspace\Lucene-Solr-trunk-Windows\solr\build\solr-core\test-files\solr\collection1\data\
:    [junit4]   2> ASYNC  NEW_CORE C4194 name=collection1 org.apache.solr.core.SolrCore@e606c03
:    [junit4]   2> 2913905 T8257 C4194 oasc.SolrCore.execute [collection1] webapp=null
path=null params={q=*:*} hits=0 status=0 QTime=1 
:    [junit4]   2> 2913910 T8257 oas.SolrTestCaseJ4.assertQ ERROR REQUEST FAILED: xpath=//str[@name='dummy2'][.='data/']
:    [junit4]   2> 		xml response was: <?xml version="1.0" encoding="UTF-8"?>
:    [junit4]   2> 	<response>
:    [junit4]   2> 	<lst name="responseHeader"><int name="status">0</int><int
name="QTime">1</int><lst name="params"><str name="df">text</str><str
name="echoParams">all</str><str name="dummy2">data\</str><str name="dummy3">solrconfig-implicitproperties.xml</str><str
name="dummy1">collection1</str><str name="dummy4">schema.xml</str><str
name="dummy5">false</str><str name="q">*:*</str></lst></lst><result
name="response" numFound="0" start="0"></result>
:    [junit4]   2> 	</response>
:    [junit4]   2> 	
:    [junit4]   2> 		request was:q=*:*
:    [junit4]   2> 2913911 T8257 oasc.SolrException.log ERROR REQUEST FAILED: q=*:*:java.lang.RuntimeException:
REQUEST FAILED: xpath=//str[@name='dummy2'][.='data/']
:    [junit4]   2> 		xml response was: <?xml version="1.0" encoding="UTF-8"?>
:    [junit4]   2> 	<response>
:    [junit4]   2> 	<lst name="responseHeader"><int name="status">0</int><int
name="QTime">1</int><lst name="params"><str name="df">text</str><str
name="echoParams">all</str><str name="dummy2">data\</str><str name="dummy3">solrconfig-implicitproperties.xml</str><str
name="dummy1">collection1</str><str name="dummy4">schema.xml</str><str
name="dummy5">false</str><str name="q">*:*</str></lst></lst><result
name="response" numFound="0" start="0"></result>
:    [junit4]   2> 	</response>
:    [junit4]   2> 	
:    [junit4]   2> 		request was:q=*:*
:    [junit4]   2> 		at org.apache.solr.SolrTestCaseJ4.assertQ(SolrTestCaseJ4.java:630)
:    [junit4]   2> 		at org.apache.solr.SolrTestCaseJ4.assertQ(SolrTestCaseJ4.java:604)
:    [junit4]   2> 		at org.apache.solr.core.TestImplicitCoreProperties.testImplicitPropertiesAreSubstitutedInSolrConfig(TestImplicitCoreProperties.java:33)
:    [junit4]   2> 		at sun.reflect.NativeMethodAccessorImpl.invoke0(Native Method)
:    [junit4]   2> 		at sun.reflect.NativeMethodAccessorImpl.invoke(NativeMethodAccessorImpl.java:57)
:    [junit4]   2> 		at sun.reflect.DelegatingMethodAccessorImpl.invoke(DelegatingMethodAccessorImpl.java:43)
:    [junit4]   2> 		at java.lang.reflect.Method.invoke(Method.java:606)
:    [junit4]   2> 		at com.carrotsearch.randomizedtesting.RandomizedRunner.invoke(RandomizedRunner.java:1559)
:    [junit4]   2> 		at com.carrotsearch.randomizedtesting.RandomizedRunner.access$600(RandomizedRunner.java:79)
:    [junit4]   2> 		at com.carrotsearch.randomizedtesting.RandomizedRunner$6.evaluate(RandomizedRunner.java:737)
:    [junit4]   2> 		at com.carrotsearch.randomizedtesting.RandomizedRunner$7.evaluate(RandomizedRunner.java:773)
:    [junit4]   2> 		at com.carrotsearch.randomizedtesting.RandomizedRunner$8.evaluate(RandomizedRunner.java:787)
:    [junit4]   2> 		at com.carrotsearch.randomizedtesting.rules.SystemPropertiesRestoreRule$1.evaluate(SystemPropertiesRestoreRule.java:53)
:    [junit4]   2> 		at org.apache.lucene.util.TestRuleSetupTeardownChained$1.evaluate(TestRuleSetupTeardownChained.java:50)
:    [junit4]   2> 		at org.apache.lucene.util.TestRuleFieldCacheSanity$1.evaluate(TestRuleFieldCacheSanity.java:51)
:    [junit4]   2> 		at org.apache.lucene.util.AbstractBeforeAfterRule$1.evaluate(AbstractBeforeAfterRule.java:46)
:    [junit4]   2> 		at com.carrotsearch.randomizedtesting.rules.SystemPropertiesInvariantRule$1.evaluate(SystemPropertiesInvariantRule.java:55)
:    [junit4]   2> 		at org.apache.lucene.util.TestRuleThreadAndTestName$1.evaluate(TestRuleThreadAndTestName.java:49)
:    [junit4]   2> 		at org.apache.lucene.util.TestRuleIgnoreAfterMaxFailures$1.evaluate(TestRuleIgnoreAfterMaxFailures.java:70)
:    [junit4]   2> 		at org.apache.lucene.util.TestRuleMarkFailure$1.evaluate(TestRuleMarkFailure.java:48)
:    [junit4]   2> 		at com.carrotsearch.randomizedtesting.rules.StatementAdapter.evaluate(StatementAdapter.java:36)
:    [junit4]   2> 		at com.carrotsearch.randomizedtesting.ThreadLeakControl$StatementRunner.run(ThreadLeakControl.java:358)
:    [junit4]   2> 		at com.carrotsearch.randomizedtesting.ThreadLeakControl.forkTimeoutingTask(ThreadLeakControl.java:782)
:    [junit4]   2> 		at com.carrotsearch.randomizedtesting.ThreadLeakControl$3.evaluate(ThreadLeakControl.java:442)
:    [junit4]   2> 		at com.carrotsearch.randomizedtesting.RandomizedRunner.runSingleTest(RandomizedRunner.java:746)
:    [junit4]   2> 		at com.carrotsearch.randomizedtesting.RandomizedRunner$3.evaluate(RandomizedRunner.java:648)
:    [junit4]   2> 		at com.carrotsearch.randomizedtesting.RandomizedRunner$4.evaluate(RandomizedRunner.java:682)
:    [junit4]   2> 		at com.carrotsearch.randomizedtesting.RandomizedRunner$5.evaluate(RandomizedRunner.java:693)
:    [junit4]   2> 		at com.carrotsearch.randomizedtesting.rules.StatementAdapter.evaluate(StatementAdapter.java:36)
:    [junit4]   2> 		at com.carrotsearch.randomizedtesting.rules.SystemPropertiesRestoreRule$1.evaluate(SystemPropertiesRestoreRule.java:53)
:    [junit4]   2> 		at org.apache.lucene.util.AbstractBeforeAfterRule$1.evaluate(AbstractBeforeAfterRule.java:46)
:    [junit4]   2> 		at org.apache.lucene.util.TestRuleStoreClassName$1.evaluate(TestRuleStoreClassName.java:42)
:    [junit4]   2> 		at com.carrotsearch.randomizedtesting.rules.SystemPropertiesInvariantRule$1.evaluate(SystemPropertiesInvariantRule.java:55)
:    [junit4]   2> 		at com.carrotsearch.randomizedtesting.rules.NoShadowingOrOverridesOnMethodsRule$1.evaluate(NoShadowingOrOverridesOnMethodsRule.java:39)
:    [junit4]   2> 		at com.carrotsearch.randomizedtesting.rules.NoShadowingOrOverridesOnMethodsRule$1.evaluate(NoShadowingOrOverridesOnMethodsRule.java:39)
:    [junit4]   2> 		at com.carrotsearch.randomizedtesting.rules.StatementAdapter.evaluate(StatementAdapter.java:36)
:    [junit4]   2> 		at org.apache.lucene.util.TestRuleAssertionsRequired$1.evaluate(TestRuleAssertionsRequired.java:43)
:    [junit4]   2> 		at org.apache.lucene.util.TestRuleMarkFailure$1.evaluate(TestRuleMarkFailure.java:48)
:    [junit4]   2> 		at org.apache.lucene.util.TestRuleIgnoreAfterMaxFailures$1.evaluate(TestRuleIgnoreAfterMaxFailures.java:70)
:    [junit4]   2> 		at org.apache.lucene.util.TestRuleIgnoreTestSuites$1.evaluate(TestRuleIgnoreTestSuites.java:55)
:    [junit4]   2> 		at com.carrotsearch.randomizedtesting.rules.StatementAdapter.evaluate(StatementAdapter.java:36)
:    [junit4]   2> 		at com.carrotsearch.randomizedtesting.ThreadLeakControl$StatementRunner.run(ThreadLeakControl.java:358)
:    [junit4]   2> 		at java.lang.Thread.run(Thread.java:724)
:    [junit4]   2> 	
:    [junit4]   2> 2913911 T8257 oasc.CoreContainer.shutdown Shutting down CoreContainer
instance=1098831888
:    [junit4]   2> 2913913 T8257 oasc.SolrCore.close [collection1]  CLOSING SolrCore org.apache.solr.core.SolrCore@e606c03
:    [junit4]   2> 2913918 T8257 oasu.DirectUpdateHandler2.close closing DirectUpdateHandler2{commits=0,autocommits=0,soft
autocommits=0,optimizes=0,rollbacks=0,expungeDeletes=0,docsPending=0,adds=0,deletesById=0,deletesByQuery=0,errors=0,cumulative_adds=0,cumulative_deletesById=0,cumulative_deletesByQuery=0,cumulative_errors=0}
:    [junit4]   2> 2913918 T8257 oasu.SolrCoreState.decrefSolrCoreState Closing SolrCoreState
:    [junit4]   2> 2913918 T8257 oasu.DefaultSolrCoreState.closeIndexWriter SolrCoreState
ref count has reached 0 - closing IndexWriter
:    [junit4]   2> 2913918 T8257 oasu.DefaultSolrCoreState.closeIndexWriter closing IndexWriter
with IndexWriterCloser
:    [junit4]   2> 2913920 T8257 oasc.SolrCore.closeSearcher [collection1] Closing main
searcher on request.
:    [junit4]   2> 2913920 T8257 oasc.CachingDirectoryFactory.close Closing MockDirectoryFactory
- 2 directories currently being tracked
:    [junit4]   2> 2913921 T8257 oasc.CachingDirectoryFactory.closeCacheValue looking to
close C:\Users\JenkinsSlave\workspace\Lucene-Solr-trunk-Windows\solr\build\solr-core\test-files\solr\collection1\data\
[CachedDir<<refCount=0;path=C:\Users\JenkinsSlave\workspace\Lucene-Solr-trunk-Windows\solr\build\solr-core\test-files\solr\collection1\data\;done=false>>]
:    [junit4]   2> 2913921 T8257 oasc.CachingDirectoryFactory.close Closing directory:
C:\Users\JenkinsSlave\workspace\Lucene-Solr-trunk-Windows\solr\build\solr-core\test-files\solr\collection1\data\
:    [junit4]   2> 2913921 T8257 oasc.CachingDirectoryFactory.closeCacheValue looking to
close C:\Users\JenkinsSlave\workspace\Lucene-Solr-trunk-Windows\solr\build\solr-core\test-files\solr\collection1\data\index
[CachedDir<<refCount=0;path=C:\Users\JenkinsSlave\workspace\Lucene-Solr-trunk-Windows\solr\build\solr-core\test-files\solr\collection1\data\index;done=false>>]
:    [junit4]   2> 2913921 T8257 oasc.CachingDirectoryFactory.close Closing directory:
C:\Users\JenkinsSlave\workspace\Lucene-Solr-trunk-Windows\solr\build\solr-core\test-files\solr\collection1\data\index
:    [junit4]   2> 2913922 T8257 oas.SolrTestCaseJ4.tearDown ###Ending testImplicitPropertiesAreSubstitutedInSolrConfig
:    [junit4]   2> NOTE: reproduce with: ant test  -Dtestcase=TestImplicitCoreProperties
-Dtests.method=testImplicitPropertiesAreSubstitutedInSolrConfig -Dtests.seed=CAD1F05B500116E3
-Dtests.slow=true -Dtests.locale=en_IE -Dtests.timezone=America/Denver -Dtests.file.encoding=ISO-8859-1
:    [junit4] ERROR   2.01s | TestImplicitCoreProperties.testImplicitPropertiesAreSubstitutedInSolrConfig
<<<
:    [junit4]    > Throwable #1: java.lang.RuntimeException: Exception during query
:    [junit4]    > 	at __randomizedtesting.SeedInfo.seed([CAD1F05B500116E3:6309E82BD92B3376]:0)
:    [junit4]    > 	at org.apache.solr.SolrTestCaseJ4.assertQ(SolrTestCaseJ4.java:637)
:    [junit4]    > 	at org.apache.solr.SolrTestCaseJ4.assertQ(SolrTestCaseJ4.java:604)
:    [junit4]    > 	at org.apache.solr.core.TestImplicitCoreProperties.testImplicitPropertiesAreSubstitutedInSolrConfig(TestImplicitCoreProperties.java:33)
:    [junit4]    > 	at java.lang.Thread.run(Thread.java:724)
:    [junit4]    > Caused by: java.lang.RuntimeException: REQUEST FAILED: xpath=//str[@name='dummy2'][.='data/']
:    [junit4]    > 	xml response was: <?xml version="1.0" encoding="UTF-8"?>
:    [junit4]    > <response>
:    [junit4]    > <lst name="responseHeader"><int name="status">0</int><int
name="QTime">1</int><lst name="params"><str name="df">text</str><str
name="echoParams">all</str><str name="dummy2">data\</str><str name="dummy3">solrconfig-implicitproperties.xml</str><str
name="dummy1">collection1</str><str name="dummy4">schema.xml</str><str
name="dummy5">false</str><str name="q">*:*</str></lst></lst><result
name="response" numFound="0" start="0"></result>
:    [junit4]    > </response>
:    [junit4]    > 	request was:q=*:*
:    [junit4]    > 	at org.apache.solr.SolrTestCaseJ4.assertQ(SolrTestCaseJ4.java:630)
:    [junit4]    > 	... 42 more
:    [junit4]   2> 2913930 T8257 oas.SolrTestCaseJ4.deleteCore ###deleteCore
:    [junit4]   2> 2913930 T8257 oasc.CoreContainer.shutdown Shutting down CoreContainer
instance=1098831888
:    [junit4]   2> NOTE: test params are: codec=Asserting, sim=DefaultSimilarity, locale=en_IE,
timezone=America/Denver
:    [junit4]   2> NOTE: Windows 7 6.1 amd64/Oracle Corporation 1.7.0_40 (64-bit)/cpus=2,threads=1,free=417885560,total=519438336
:    [junit4]   2> NOTE: All tests run in this JVM: [SliceStateTest, TestUpdate, TestSerializedLuceneMatchVersion,
TestSort, TestQuerySenderListener, QueryEqualityTest, NumericFieldsTest, ConvertedLegacyTest,
SolrXmlInZkTest, DOMUtilTest, TestFuzzyAnalyzedSuggestions, AnalysisAfterCoreReloadTest, PreAnalyzedUpdateProcessorTest,
TestSolrCoreProperties, HdfsSyncSliceTest, TestNonNRTOpen, UpdateRequestProcessorFactoryTest,
TestSolrQueryParserDefaultOperatorResource, SuggesterTest, TestSearchPerf, SpellCheckComponentTest,
BasicFunctionalityTest, DistributedTermsComponentTest, TestQueryTypes, TestCSVResponseWriter,
CSVRequestHandlerTest, PathHierarchyTokenizerFactoryTest, HdfsCollectionsAPIDistributedZkTest,
TestDistributedSearch, CollectionsAPIDistributedZkTest, TestUniqueKeyFieldResource, DistanceFunctionTest,
TestFastWriter, HighlighterConfigTest, TermsComponentTest, TestFastOutputStream, TestPostingsSolrHighlighter,
PreAnalyzedFieldTest, PluginInfoTest, FileUtilsTest, TestNumberUtils,
  ParsingFieldUpdateProcessorsTest, TestStressVersions, TestMultiCoreConfBootstrap, SearchHandlerTest,
TestFieldTypeCollectionResource, OutputWriterTest, TestDefaultSimilarityFactory, HdfsBasicDistributedZkTest,
UniqFieldsUpdateProcessorFactoryTest, TestNRTOpen, TestStressLucene, HdfsRecoveryZkTest, DirectUpdateHandlerOptimizeTest,
DirectSolrConnectionTest, TestSolrXmlPersistence, TestShardHandlerFactory, StressHdfsTest,
StandardRequestHandlerTest, SpellPossibilityIteratorTest, OverseerTest, SynonymTokenizerTest,
LoggingHandlerTest, TestDefaultSearchFieldResource, TestValueSourceCache, SolrRequestParserTest,
ChaosMonkeySafeLeaderTest, TestSolrXml, TestRTGBase, TestSolrXmlPersistor, CoreAdminCreateDiscoverTest,
TestAddFieldRealTimeGet, RegexBoostProcessorTest, SampleTest, PeerSyncTest, DeleteShardTest,
TestPerFieldSimilarity, CurrencyFieldOpenExchangeTest, HdfsChaosMonkeySafeLeaderTest, NotRequiredUniqueKeyTest,
TestManagedSchemaFieldResource, QueryElevationComponentTest, TestSuggestS
 pellingConverter, ExternalFileFieldSortTest, RecoveryZkTest, FileBasedSpellCheckerTest, AliasIntegrationTest,
MultiTermTest, TestDFRSimilarityFactory, DocValuesMultiTest, URLClassifyProcessorTest, TestFoldingMultitermQuery,
FieldMutatingUpdateProcessorTest, TestBinaryResponseWriter, LukeRequestHandlerTest, SOLR749Test,
RAMDirectoryFactoryTest, SolrPluginUtilsTest, SolrCoreTest, TestFiltering, TestRemoteStreaming,
TestZkChroot, EchoParamsTest, TestSchemaSimilarityResource, TestFaceting, DocumentBuilderTest,
HdfsBasicDistributedZk2Test, SimplePostToolTest, ShardRoutingCustomTest, TestGroupingSearch,
DateMathParserTest, BlockCacheTest, SliceStateUpdateTest, TestIBSimilarityFactory, TestReloadAndDeleteDocs,
TestSolrQueryParser, LegacyHTMLStripCharFilterTest, TestPHPSerializedResponseWriter, HdfsUnloadDistributedZkTest,
IndexSchemaTest, TestSolrDeletionPolicy2, TestQuerySenderNoQuery, DateFieldTest, OpenCloseCoreStressTest,
TestAtomicUpdateErrorCases, DistributedQueryElevationComponentTe
 st, CoreAdminHandlerTest, TestLMJelinekMercerSimilarityFactory, TestExtendedDismaxParser,
TestOmitPositions, TimeZoneUtilsTest, TestReload, OverseerCollectionProcessorTest, TestFieldResource,
BinaryUpdateRequestHandlerTest, ZkControllerTest, ShardRoutingTest, AddBlockUpdateTest, InfoHandlerTest,
TestComponentsName, CustomCollectionTest, IndexBasedSpellCheckerTest, ResourceLoaderTest,
TestLFUCache, TestUtils, HighlighterTest, TestSolrQueryParserResource, SuggesterFSTTest, TestDynamicFieldCollectionResource,
TestMaxScoreQueryParser, QueryResultKeyTest, RequestHandlersTest, FullSolrCloudDistribCmdsTest,
ShardSplitTest, BasicDistributedZkTest, BasicDistributedZk2Test, UnloadDistributedZkTest,
SyncSliceTest, LeaderElectionIntegrationTest, BasicZkTest, TestReplicationHandler, ClusterStateUpdateTest,
TestRandomFaceting, LeaderElectionTest, ZkSolrClientTest, TestRandomDVFaceting, ZkCLITest,
AutoCommitTest, TestDistributedGrouping, TestRecovery, TestHashPartitioner, DistributedSpellCheckComp
 onentTest, TermVectorComponentDistributedTest, TestRealTimeGet, TestStressReorder, TestJoin,
HardAutoCommitTest, TestRangeQuery, TestCoreContainer, SimpleFacetsTest, TestSolr4Spatial,
StatsComponentTest, SolrCmdDistributorTest, BadIndexSchemaTest, TestFunctionQuery, TestLazyCores,
DirectUpdateHandlerTest, TestBadConfig, TestIndexSearcher, SoftAutoCommitTest, ShowFileRequestHandlerTest,
CurrencyFieldXmlFileTest, SolrIndexSplitterTest, TestCoreDiscovery, SignatureUpdateProcessorFactoryTest,
SpellCheckCollatorTest, DocValuesTest, SuggesterTSTTest, TestTrie, SpatialFilterTest, SuggesterWFSTTest,
TestCSVLoader, PolyFieldTest, NoCacheHeaderTest, WordBreakSolrSpellCheckerTest, SchemaVersionSpecificBehaviorTest,
SolrCoreCheckLockOnStartupTest, TestPseudoReturnFields, TestWordDelimiterFilterFactory, DefaultValueUpdateProcessorTest,
StatelessScriptUpdateProcessorFactoryTest, SortByFunctionTest, TestSolrDeletionPolicy1, SolrInfoMBeanTest,
XsltUpdateRequestHandlerTest, DebugComponentTest, Cache
 HeaderTest, TestSurroundQueryParser, DisMaxRequestHandlerTest, TestQueryUtils, TestWriterPerf,
DirectSolrSpellCheckerTest, TestReversedWildcardFilterFactory, DocumentAnalysisRequestHandlerTest,
PrimitiveFieldTypeTest, XmlUpdateRequestHandlerTest, TermVectorComponentTest, TestIndexingPerformance,
MoreLikeThisHandlerTest, RequiredFieldsTest, FieldAnalysisRequestHandlerTest, TestArbitraryIndexDir,
FastVectorHighlighterTest, IndexSchemaRuntimeFieldTest, TestJmxIntegration, TestCollationField,
ReturnFieldsTest, JSONWriterTest, MBeansHandlerTest, QueryParsingTest, TestAnalyzedSuggestions,
JsonLoaderTest, TestPartialUpdateDeduplication, PingRequestHandlerTest, CoreContainerCoreInitFailuresTest,
UpdateParamsTest, AlternateDirectoryTest, TestSolrIndexConfig, CopyFieldTest, ResponseLogComponentTest,
SolrIndexConfigTest, BadComponentTest, TestStressRecovery, TestMergePolicyConfig, TestDocSet,
TestBinaryField, MinimalSchemaTest, TestElisionMultitermQuery, TestConfig, TestLuceneMatchVersion,
Tes
 tPhraseSuggestions, TestCharFilters, TestCodecSupport, TestXIncludeConfig, TestSweetSpotSimilarityFactory,
TestLMDirichletSimilarityFactory, TestBM25SimilarityFactory, TestJmxMonitoredMap, ScriptEngineTest,
OpenExchangeRatesOrgProviderTest, TestFastLRUCache, ChaosMonkeyNothingIsSafeTest, TestSolrXMLSerializer,
TestSystemIdResolver, PrimUtilsTest, SpellingQueryConverterTest, ClusterStateTest, TestSolrJ,
TestLRUCache, TestDocumentBuilder, ZkNodePropsTest, SystemInfoHandlerTest, UUIDFieldTest,
CircularListTest, SolrTestCaseJ4Test, AssignTest, CachingDirectoryFactoryTest, TestImplicitCoreProperties]
:    [junit4] Completed in 2.03s, 1 test, 1 error <<< FAILURES!
: 
: [...truncated 82 lines...]
: BUILD FAILED
: C:\Users\JenkinsSlave\workspace\Lucene-Solr-trunk-Windows\build.xml:421: The following error
occurred while executing this line:
: C:\Users\JenkinsSlave\workspace\Lucene-Solr-trunk-Windows\build.xml:401: The following error
occurred while executing this line:
: C:\Users\JenkinsSlave\workspace\Lucene-Solr-trunk-Windows\build.xml:39: The following error
occurred while executing this line:
: C:\Users\JenkinsSlave\workspace\Lucene-Solr-trunk-Windows\solr\build.xml:189: The following
error occurred while executing this line:
: C:\Users\JenkinsSlave\workspace\Lucene-Solr-trunk-Windows\solr\common-build.xml:455: The
following error occurred while executing this line:
: C:\Users\JenkinsSlave\workspace\Lucene-Solr-trunk-Windows\lucene\common-build.xml:1230:
The following error occurred while executing this line:
: C:\Users\JenkinsSlave\workspace\Lucene-Solr-trunk-Windows\lucene\common-build.xml:873: There
were test failures: 326 suites, 1449 tests, 1 error, 39 ignored (11 assumptions)
: 
: Total time: 78 minutes 0 seconds
: Build step 'Invoke Ant' marked build as failure
: Description set: Java: 64bit/jdk1.7.0_40 -XX:+UseCompressedOops -XX:+UseConcMarkSweepGC
: Archiving artifacts
: Recording test results
: Email was triggered for: Failure
: Sending email for trigger: Failure
: 
: 
: 

-Hoss

Mime
View raw message