lucene-dev mailing list archives

Site index · List index
Message view « Date » · « Thread »
Top « Date » · « Thread »
From Michael McCandless <luc...@mikemccandless.com>
Subject Re: [JENKINS] Lucene-trunk-Linux-Java7-64-test-only - Build # 58093 - Failure!
Date Mon, 23 Sep 2013 20:28:55 GMT
I opened https://issues.apache.org/jira/browse/LUCENE-5239 for this
... we need to get to the bottom of it asap.

Mike McCandless

http://blog.mikemccandless.com


On Mon, Sep 23, 2013 at 8:38 AM, Simon Willnauer
<simon.willnauer@gmail.com> wrote:
> hmm could this be related to updateable doc values?
>
> simon
>
> On Mon, Sep 23, 2013 at 2:31 PM, Michael McCandless
> <lucene@mikemccandless.com> wrote:
>> This is a bad failure.
>>
>> It means we somehow deleted the wrong document.
>>
>> But I'm unable to repro so far ...
>>
>> Mike McCandless
>>
>> http://blog.mikemccandless.com
>>
>>
>> On Mon, Sep 23, 2013 at 8:11 AM,  <builder@flonkings.com> wrote:
>>> Build: builds.flonkings.com/job/Lucene-trunk-Linux-Java7-64-test-only/58093/
>>>
>>> 5 tests failed.
>>> REGRESSION:  org.apache.lucene.search.TestSearcherManager.testSearcherManager
>>>
>>> Error Message:
>>>
>>>
>>> Stack Trace:
>>> java.lang.AssertionError
>>>         at __randomizedtesting.SeedInfo.seed([6A8BC03A6E804E02:66A48880D8892FFF]:0)
>>>         at org.junit.Assert.fail(Assert.java:92)
>>>         at org.junit.Assert.assertTrue(Assert.java:43)
>>>         at org.junit.Assert.assertFalse(Assert.java:68)
>>>         at org.junit.Assert.assertFalse(Assert.java:79)
>>>         at org.apache.lucene.index.ThreadedIndexingAndSearchingTestCase.runTest(ThreadedIndexingAndSearchingTestCase.java:607)
>>>         at org.apache.lucene.search.TestSearcherManager.testSearcherManager(TestSearcherManager.java:56)
>>>         at sun.reflect.NativeMethodAccessorImpl.invoke0(Native Method)
>>>         at sun.reflect.NativeMethodAccessorImpl.invoke(NativeMethodAccessorImpl.java:57)
>>>         at sun.reflect.DelegatingMethodAccessorImpl.invoke(DelegatingMethodAccessorImpl.java:43)
>>>         at java.lang.reflect.Method.invoke(Method.java:601)
>>>         at com.carrotsearch.randomizedtesting.RandomizedRunner.invoke(RandomizedRunner.java:1559)
>>>         at com.carrotsearch.randomizedtesting.RandomizedRunner.access$600(RandomizedRunner.java:79)
>>>         at com.carrotsearch.randomizedtesting.RandomizedRunner$6.evaluate(RandomizedRunner.java:737)
>>>         at com.carrotsearch.randomizedtesting.RandomizedRunner$7.evaluate(RandomizedRunner.java:773)
>>>         at com.carrotsearch.randomizedtesting.RandomizedRunner$8.evaluate(RandomizedRunner.java:787)
>>>         at org.apache.lucene.util.TestRuleSetupTeardownChained$1.evaluate(TestRuleSetupTeardownChained.java:50)
>>>         at org.apache.lucene.util.TestRuleFieldCacheSanity$1.evaluate(TestRuleFieldCacheSanity.java:51)
>>>         at org.apache.lucene.util.AbstractBeforeAfterRule$1.evaluate(AbstractBeforeAfterRule.java:46)
>>>         at com.carrotsearch.randomizedtesting.rules.SystemPropertiesInvariantRule$1.evaluate(SystemPropertiesInvariantRule.java:55)
>>>         at org.apache.lucene.util.TestRuleThreadAndTestName$1.evaluate(TestRuleThreadAndTestName.java:49)
>>>         at org.apache.lucene.util.TestRuleIgnoreAfterMaxFailures$1.evaluate(TestRuleIgnoreAfterMaxFailures.java:70)
>>>         at org.apache.lucene.util.TestRuleMarkFailure$1.evaluate(TestRuleMarkFailure.java:48)
>>>         at com.carrotsearch.randomizedtesting.rules.StatementAdapter.evaluate(StatementAdapter.java:36)
>>>         at com.carrotsearch.randomizedtesting.ThreadLeakControl$StatementRunner.run(ThreadLeakControl.java:358)
>>>         at com.carrotsearch.randomizedtesting.ThreadLeakControl.forkTimeoutingTask(ThreadLeakControl.java:782)
>>>         at com.carrotsearch.randomizedtesting.ThreadLeakControl$3.evaluate(ThreadLeakControl.java:442)
>>>         at com.carrotsearch.randomizedtesting.RandomizedRunner.runSingleTest(RandomizedRunner.java:746)
>>>         at com.carrotsearch.randomizedtesting.RandomizedRunner$3.evaluate(RandomizedRunner.java:648)
>>>         at com.carrotsearch.randomizedtesting.RandomizedRunner$4.evaluate(RandomizedRunner.java:682)
>>>         at com.carrotsearch.randomizedtesting.RandomizedRunner$5.evaluate(RandomizedRunner.java:693)
>>>         at org.apache.lucene.util.AbstractBeforeAfterRule$1.evaluate(AbstractBeforeAfterRule.java:46)
>>>         at org.apache.lucene.util.TestRuleStoreClassName$1.evaluate(TestRuleStoreClassName.java:42)
>>>         at com.carrotsearch.randomizedtesting.rules.SystemPropertiesInvariantRule$1.evaluate(SystemPropertiesInvariantRule.java:55)
>>>         at com.carrotsearch.randomizedtesting.rules.NoShadowingOrOverridesOnMethodsRule$1.evaluate(NoShadowingOrOverridesOnMethodsRule.java:39)
>>>         at com.carrotsearch.randomizedtesting.rules.NoShadowingOrOverridesOnMethodsRule$1.evaluate(NoShadowingOrOverridesOnMethodsRule.java:39)
>>>         at com.carrotsearch.randomizedtesting.rules.StatementAdapter.evaluate(StatementAdapter.java:36)
>>>         at org.apache.lucene.util.TestRuleAssertionsRequired$1.evaluate(TestRuleAssertionsRequired.java:43)
>>>         at org.apache.lucene.util.TestRuleMarkFailure$1.evaluate(TestRuleMarkFailure.java:48)
>>>         at org.apache.lucene.util.TestRuleIgnoreAfterMaxFailures$1.evaluate(TestRuleIgnoreAfterMaxFailures.java:70)
>>>         at org.apache.lucene.util.TestRuleIgnoreTestSuites$1.evaluate(TestRuleIgnoreTestSuites.java:55)
>>>         at com.carrotsearch.randomizedtesting.rules.StatementAdapter.evaluate(StatementAdapter.java:36)
>>>         at com.carrotsearch.randomizedtesting.ThreadLeakControl$StatementRunner.run(ThreadLeakControl.java:358)
>>>         at java.lang.Thread.run(Thread.java:722)
>>>
>>>
>>> FAILED:  junit.framework.TestSuite.org.apache.lucene.search.TestSearcherManager
>>>
>>> Error Message:
>>> 8 threads leaked from SUITE scope at org.apache.lucene.search.TestSearcherManager:     1) Thread[id=219, name=TestSearcherManager-1-thread-6, state=TIMED_WAITING, group=TGRP-TestSearcherManager]         at sun.misc.Unsafe.park(Native Method)         at java.util.concurrent.locks.LockSupport.parkNanos(LockSupport.java:226)         at java.util.concurrent.SynchronousQueue$TransferStack.awaitFulfill(SynchronousQueue.java:460)         at java.util.concurrent.SynchronousQueue$TransferStack.transfer(SynchronousQueue.java:359)         at java.util.concurrent.SynchronousQueue.poll(SynchronousQueue.java:942)         at java.util.concurrent.ThreadPoolExecutor.getTask(ThreadPoolExecutor.java:1043)         at java.util.concurrent.ThreadPoolExecutor.runWorker(ThreadPoolExecutor.java:1103)         at java.util.concurrent.ThreadPoolExecutor$Worker.run(ThreadPoolExecutor.java:603)         at java.lang.Thread.run(Thread.java:722)    2) Thread[id=220, name=TestSearcherManager-1-thread-7, state=TIMED_WAITING, group=TGRP-TestSearcherManager]         at sun.misc.Unsafe.park(Native Method)         at java.util.concurrent.locks.LockSupport.parkNanos(LockSupport.java:226)         at java.util.concurrent.SynchronousQueue$TransferStack.awaitFulfill(SynchronousQueue.java:460)         at java.util.concurrent.SynchronousQueue$TransferStack.transfer(SynchronousQueue.java:359)         at java.util.concurrent.SynchronousQueue.poll(SynchronousQueue.java:942)         at java.util.concurrent.ThreadPoolExecutor.getTask(ThreadPoolExecutor.java:1043)         at java.util.concurrent.ThreadPoolExecutor.runWorker(ThreadPoolExecutor.java:1103)         at java.util.concurrent.ThreadPoolExecutor$Worker.run(ThreadPoolExecutor.java:603)         at java.lang.Thread.run(Thread.java:722)    3) Thread[id=217, name=TestSearcherManager-1-thread-4, state=TIMED_WAITING, group=TGRP-TestSearcherManager]         at sun.misc.Unsafe.park(Native Method)         at java.util.concurrent.locks.LockSupport.parkNanos(LockSupport.java:226)         at java.util.concurrent.SynchronousQueue$TransferStack.awaitFulfill(SynchronousQueue.java:460)         at java.util.concurrent.SynchronousQueue$TransferStack.transfer(SynchronousQueue.java:359)         at java.util.concurrent.SynchronousQueue.poll(SynchronousQueue.java:942)         at java.util.concurrent.ThreadPoolExecutor.getTask(ThreadPoolExecutor.java:1043)         at java.util.concurrent.ThreadPoolExecutor.runWorker(ThreadPoolExecutor.java:1103)         at java.util.concurrent.ThreadPoolExecutor$Worker.run(ThreadPoolExecutor.java:603)         at java.lang.Thread.run(Thread.java:722)    4) Thread[id=218, name=TestSearcherManager-1-thread-5, state=TIMED_WAITING, group=TGRP-TestSearcherManager]         at sun.misc.Unsafe.park(Native Method)         at java.util.concurrent.locks.LockSupport.parkNanos(LockSupport.java:226)         at java.util.concurrent.SynchronousQueue$TransferStack.awaitFulfill(SynchronousQueue.java:460)         at java.util.concurrent.SynchronousQueue$TransferStack.transfer(SynchronousQueue.java:359)         at java.util.concurrent.SynchronousQueue.poll(SynchronousQueue.java:942)         at java.util.concurrent.ThreadPoolExecutor.getTask(ThreadPoolExecutor.java:1043)         at java.util.concurrent.ThreadPoolExecutor.runWorker(ThreadPoolExecutor.java:1103)         at java.util.concurrent.ThreadPoolExecutor$Worker.run(ThreadPoolExecutor.java:603)         at java.lang.Thread.run(Thread.java:722)    5) Thread[id=213, name=TestSearcherManager-1-thread-1, state=TIMED_WAITING, group=TGRP-TestSearcherManager]         at sun.misc.Unsafe.park(Native Method)         at java.util.concurrent.locks.LockSupport.parkNanos(LockSupport.java:226)         at java.util.concurrent.SynchronousQueue$TransferStack.awaitFulfill(SynchronousQueue.java:460)         at java.util.concurrent.SynchronousQueue$TransferStack.transfer(SynchronousQueue.java:359)         at java.util.concurrent.SynchronousQueue.poll(SynchronousQueue.java:942)         at java.util.concurrent.ThreadPoolExecutor.getTask(ThreadPoolExecutor.java:1043)         at java.util.concurrent.ThreadPoolExecutor.runWorker(ThreadPoolExecutor.java:1103)         at java.util.concurrent.ThreadPoolExecutor$Worker.run(ThreadPoolExecutor.java:603)         at java.lang.Thread.run(Thread.java:722)    6) Thread[id=214, name=TestSearcherManager-1-thread-2, state=TIMED_WAITING, group=TGRP-TestSearcherManager]         at sun.misc.Unsafe.park(Native Method)         at java.util.concurrent.locks.LockSupport.parkNanos(LockSupport.java:226)         at java.util.concurrent.SynchronousQueue$TransferStack.awaitFulfill(SynchronousQueue.java:460)         at java.util.concurrent.SynchronousQueue$TransferStack.transfer(SynchronousQueue.java:359)         at java.util.concurrent.SynchronousQueue.poll(SynchronousQueue.java:942)         at java.util.concurrent.ThreadPoolExecutor.getTask(ThreadPoolExecutor.java:1043)         at java.util.concurrent.ThreadPoolExecutor.runWorker(ThreadPoolExecutor.java:1103)         at java.util.concurrent.ThreadPoolExecutor$Worker.run(ThreadPoolExecutor.java:603)         at java.lang.Thread.run(Thread.java:722)    7) Thread[id=216, name=TestSearcherManager-1-thread-3, state=TIMED_WAITING, group=TGRP-TestSearcherManager]         at sun.misc.Unsafe.park(Native Method)         at java.util.concurrent.locks.LockSupport.parkNanos(LockSupport.java:226)         at java.util.concurrent.SynchronousQueue$TransferStack.awaitFulfill(SynchronousQueue.java:460)         at java.util.concurrent.SynchronousQueue$TransferStack.transfer(SynchronousQueue.java:359)         at java.util.concurrent.SynchronousQueue.poll(SynchronousQueue.java:942)         at java.util.concurrent.ThreadPoolExecutor.getTask(ThreadPoolExecutor.java:1043)         at java.util.concurrent.ThreadPoolExecutor.runWorker(ThreadPoolExecutor.java:1103)         at java.util.concurrent.ThreadPoolExecutor$Worker.run(ThreadPoolExecutor.java:603)         at java.lang.Thread.run(Thread.java:722)    8) Thread[id=221, name=TestSearcherManager-1-thread-8, state=TIMED_WAITING, group=TGRP-TestSearcherManager]         at sun.misc.Unsafe.park(Native Method)         at java.util.concurrent.locks.LockSupport.parkNanos(LockSupport.java:226)         at java.util.concurrent.SynchronousQueue$TransferStack.awaitFulfill(SynchronousQueue.java:460)         at java.util.concurrent.SynchronousQueue$TransferStack.transfer(SynchronousQueue.java:359)         at java.util.concurrent.SynchronousQueue.poll(SynchronousQueue.java:942)         at java.util.concurrent.ThreadPoolExecutor.getTask(ThreadPoolExecutor.java:1043)         at java.util.concurrent.ThreadPoolExecutor.runWorker(ThreadPoolExecutor.java:1103)         at java.util.concurrent.ThreadPoolExecutor$Worker.run(ThreadPoolExecutor.java:603)         at java.lang.Thread.run(Thread.java:722)
>>>
>>> Stack Trace:
>>> com.carrotsearch.randomizedtesting.ThreadLeakError: 8 threads leaked from SUITE scope at org.apache.lucene.search.TestSearcherManager:
>>>    1) Thread[id=219, name=TestSearcherManager-1-thread-6, state=TIMED_WAITING, group=TGRP-TestSearcherManager]
>>>         at sun.misc.Unsafe.park(Native Method)
>>>         at java.util.concurrent.locks.LockSupport.parkNanos(LockSupport.java:226)
>>>         at java.util.concurrent.SynchronousQueue$TransferStack.awaitFulfill(SynchronousQueue.java:460)
>>>         at java.util.concurrent.SynchronousQueue$TransferStack.transfer(SynchronousQueue.java:359)
>>>         at java.util.concurrent.SynchronousQueue.poll(SynchronousQueue.java:942)
>>>         at java.util.concurrent.ThreadPoolExecutor.getTask(ThreadPoolExecutor.java:1043)
>>>         at java.util.concurrent.ThreadPoolExecutor.runWorker(ThreadPoolExecutor.java:1103)
>>>         at java.util.concurrent.ThreadPoolExecutor$Worker.run(ThreadPoolExecutor.java:603)
>>>         at java.lang.Thread.run(Thread.java:722)
>>>    2) Thread[id=220, name=TestSearcherManager-1-thread-7, state=TIMED_WAITING, group=TGRP-TestSearcherManager]
>>>         at sun.misc.Unsafe.park(Native Method)
>>>         at java.util.concurrent.locks.LockSupport.parkNanos(LockSupport.java:226)
>>>         at java.util.concurrent.SynchronousQueue$TransferStack.awaitFulfill(SynchronousQueue.java:460)
>>>         at java.util.concurrent.SynchronousQueue$TransferStack.transfer(SynchronousQueue.java:359)
>>>         at java.util.concurrent.SynchronousQueue.poll(SynchronousQueue.java:942)
>>>         at java.util.concurrent.ThreadPoolExecutor.getTask(ThreadPoolExecutor.java:1043)
>>>         at java.util.concurrent.ThreadPoolExecutor.runWorker(ThreadPoolExecutor.java:1103)
>>>         at java.util.concurrent.ThreadPoolExecutor$Worker.run(ThreadPoolExecutor.java:603)
>>>         at java.lang.Thread.run(Thread.java:722)
>>>    3) Thread[id=217, name=TestSearcherManager-1-thread-4, state=TIMED_WAITING, group=TGRP-TestSearcherManager]
>>>         at sun.misc.Unsafe.park(Native Method)
>>>         at java.util.concurrent.locks.LockSupport.parkNanos(LockSupport.java:226)
>>>         at java.util.concurrent.SynchronousQueue$TransferStack.awaitFulfill(SynchronousQueue.java:460)
>>>         at java.util.concurrent.SynchronousQueue$TransferStack.transfer(SynchronousQueue.java:359)
>>>         at java.util.concurrent.SynchronousQueue.poll(SynchronousQueue.java:942)
>>>         at java.util.concurrent.ThreadPoolExecutor.getTask(ThreadPoolExecutor.java:1043)
>>>         at java.util.concurrent.ThreadPoolExecutor.runWorker(ThreadPoolExecutor.java:1103)
>>>         at java.util.concurrent.ThreadPoolExecutor$Worker.run(ThreadPoolExecutor.java:603)
>>>         at java.lang.Thread.run(Thread.java:722)
>>>    4) Thread[id=218, name=TestSearcherManager-1-thread-5, state=TIMED_WAITING, group=TGRP-TestSearcherManager]
>>>         at sun.misc.Unsafe.park(Native Method)
>>>         at java.util.concurrent.locks.LockSupport.parkNanos(LockSupport.java:226)
>>>         at java.util.concurrent.SynchronousQueue$TransferStack.awaitFulfill(SynchronousQueue.java:460)
>>>         at java.util.concurrent.SynchronousQueue$TransferStack.transfer(SynchronousQueue.java:359)
>>>         at java.util.concurrent.SynchronousQueue.poll(SynchronousQueue.java:942)
>>>         at java.util.concurrent.ThreadPoolExecutor.getTask(ThreadPoolExecutor.java:1043)
>>>         at java.util.concurrent.ThreadPoolExecutor.runWorker(ThreadPoolExecutor.java:1103)
>>>         at java.util.concurrent.ThreadPoolExecutor$Worker.run(ThreadPoolExecutor.java:603)
>>>         at java.lang.Thread.run(Thread.java:722)
>>>    5) Thread[id=213, name=TestSearcherManager-1-thread-1, state=TIMED_WAITING, group=TGRP-TestSearcherManager]
>>>         at sun.misc.Unsafe.park(Native Method)
>>>         at java.util.concurrent.locks.LockSupport.parkNanos(LockSupport.java:226)
>>>         at java.util.concurrent.SynchronousQueue$TransferStack.awaitFulfill(SynchronousQueue.java:460)
>>>         at java.util.concurrent.SynchronousQueue$TransferStack.transfer(SynchronousQueue.java:359)
>>>         at java.util.concurrent.SynchronousQueue.poll(SynchronousQueue.java:942)
>>>         at java.util.concurrent.ThreadPoolExecutor.getTask(ThreadPoolExecutor.java:1043)
>>>         at java.util.concurrent.ThreadPoolExecutor.runWorker(ThreadPoolExecutor.java:1103)
>>>         at java.util.concurrent.ThreadPoolExecutor$Worker.run(ThreadPoolExecutor.java:603)
>>>         at java.lang.Thread.run(Thread.java:722)
>>>    6) Thread[id=214, name=TestSearcherManager-1-thread-2, state=TIMED_WAITING, group=TGRP-TestSearcherManager]
>>>         at sun.misc.Unsafe.park(Native Method)
>>>         at java.util.concurrent.locks.LockSupport.parkNanos(LockSupport.java:226)
>>>         at java.util.concurrent.SynchronousQueue$TransferStack.awaitFulfill(SynchronousQueue.java:460)
>>>         at java.util.concurrent.SynchronousQueue$TransferStack.transfer(SynchronousQueue.java:359)
>>>         at java.util.concurrent.SynchronousQueue.poll(SynchronousQueue.java:942)
>>>         at java.util.concurrent.ThreadPoolExecutor.getTask(ThreadPoolExecutor.java:1043)
>>>         at java.util.concurrent.ThreadPoolExecutor.runWorker(ThreadPoolExecutor.java:1103)
>>>         at java.util.concurrent.ThreadPoolExecutor$Worker.run(ThreadPoolExecutor.java:603)
>>>         at java.lang.Thread.run(Thread.java:722)
>>>    7) Thread[id=216, name=TestSearcherManager-1-thread-3, state=TIMED_WAITING, group=TGRP-TestSearcherManager]
>>>         at sun.misc.Unsafe.park(Native Method)
>>>         at java.util.concurrent.locks.LockSupport.parkNanos(LockSupport.java:226)
>>>         at java.util.concurrent.SynchronousQueue$TransferStack.awaitFulfill(SynchronousQueue.java:460)
>>>         at java.util.concurrent.SynchronousQueue$TransferStack.transfer(SynchronousQueue.java:359)
>>>         at java.util.concurrent.SynchronousQueue.poll(SynchronousQueue.java:942)
>>>         at java.util.concurrent.ThreadPoolExecutor.getTask(ThreadPoolExecutor.java:1043)
>>>         at java.util.concurrent.ThreadPoolExecutor.runWorker(ThreadPoolExecutor.java:1103)
>>>         at java.util.concurrent.ThreadPoolExecutor$Worker.run(ThreadPoolExecutor.java:603)
>>>         at java.lang.Thread.run(Thread.java:722)
>>>    8) Thread[id=221, name=TestSearcherManager-1-thread-8, state=TIMED_WAITING, group=TGRP-TestSearcherManager]
>>>         at sun.misc.Unsafe.park(Native Method)
>>>         at java.util.concurrent.locks.LockSupport.parkNanos(LockSupport.java:226)
>>>         at java.util.concurrent.SynchronousQueue$TransferStack.awaitFulfill(SynchronousQueue.java:460)
>>>         at java.util.concurrent.SynchronousQueue$TransferStack.transfer(SynchronousQueue.java:359)
>>>         at java.util.concurrent.SynchronousQueue.poll(SynchronousQueue.java:942)
>>>         at java.util.concurrent.ThreadPoolExecutor.getTask(ThreadPoolExecutor.java:1043)
>>>         at java.util.concurrent.ThreadPoolExecutor.runWorker(ThreadPoolExecutor.java:1103)
>>>         at java.util.concurrent.ThreadPoolExecutor$Worker.run(ThreadPoolExecutor.java:603)
>>>         at java.lang.Thread.run(Thread.java:722)
>>>         at __randomizedtesting.SeedInfo.seed([6A8BC03A6E804E02]:0)
>>>
>>>
>>> FAILED:  junit.framework.TestSuite.org.apache.lucene.search.TestSearcherManager
>>>
>>> Error Message:
>>> There are still zombie threads that couldn't be terminated:    1) Thread[id=219, name=TestSearcherManager-1-thread-6, state=TIMED_WAITING, group=TGRP-TestSearcherManager]         at sun.misc.Unsafe.park(Native Method)         at java.util.concurrent.locks.LockSupport.parkNanos(LockSupport.java:226)         at java.util.concurrent.SynchronousQueue$TransferStack.awaitFulfill(SynchronousQueue.java:460)         at java.util.concurrent.SynchronousQueue$TransferStack.transfer(SynchronousQueue.java:359)         at java.util.concurrent.SynchronousQueue.poll(SynchronousQueue.java:942)         at java.util.concurrent.ThreadPoolExecutor.getTask(ThreadPoolExecutor.java:1043)         at java.util.concurrent.ThreadPoolExecutor.runWorker(ThreadPoolExecutor.java:1103)         at java.util.concurrent.ThreadPoolExecutor$Worker.run(ThreadPoolExecutor.java:603)         at java.lang.Thread.run(Thread.java:722)    2) Thread[id=220, name=TestSearcherManager-1-thread-7, state=TIMED_WAITING, group=TGRP-TestSearcherManager]         at sun.misc.Unsafe.park(Native Method)         at java.util.concurrent.locks.LockSupport.parkNanos(LockSupport.java:226)         at java.util.concurrent.SynchronousQueue$TransferStack.awaitFulfill(SynchronousQueue.java:460)         at java.util.concurrent.SynchronousQueue$TransferStack.transfer(SynchronousQueue.java:359)         at java.util.concurrent.SynchronousQueue.poll(SynchronousQueue.java:942)         at java.util.concurrent.ThreadPoolExecutor.getTask(ThreadPoolExecutor.java:1043)         at java.util.concurrent.ThreadPoolExecutor.runWorker(ThreadPoolExecutor.java:1103)         at java.util.concurrent.ThreadPoolExecutor$Worker.run(ThreadPoolExecutor.java:603)         at java.lang.Thread.run(Thread.java:722)    3) Thread[id=217, name=TestSearcherManager-1-thread-4, state=TIMED_WAITING, group=TGRP-TestSearcherManager]         at sun.misc.Unsafe.park(Native Method)         at java.util.concurrent.locks.LockSupport.parkNanos(LockSupport.java:226)         at java.util.concurrent.SynchronousQueue$TransferStack.awaitFulfill(SynchronousQueue.java:460)         at java.util.concurrent.SynchronousQueue$TransferStack.transfer(SynchronousQueue.java:359)         at java.util.concurrent.SynchronousQueue.poll(SynchronousQueue.java:942)         at java.util.concurrent.ThreadPoolExecutor.getTask(ThreadPoolExecutor.java:1043)         at java.util.concurrent.ThreadPoolExecutor.runWorker(ThreadPoolExecutor.java:1103)         at java.util.concurrent.ThreadPoolExecutor$Worker.run(ThreadPoolExecutor.java:603)         at java.lang.Thread.run(Thread.java:722)    4) Thread[id=218, name=TestSearcherManager-1-thread-5, state=TIMED_WAITING, group=TGRP-TestSearcherManager]         at sun.misc.Unsafe.park(Native Method)         at java.util.concurrent.locks.LockSupport.parkNanos(LockSupport.java:226)         at java.util.concurrent.SynchronousQueue$TransferStack.awaitFulfill(SynchronousQueue.java:460)         at java.util.concurrent.SynchronousQueue$TransferStack.transfer(SynchronousQueue.java:359)         at java.util.concurrent.SynchronousQueue.poll(SynchronousQueue.java:942)         at java.util.concurrent.ThreadPoolExecutor.getTask(ThreadPoolExecutor.java:1043)         at java.util.concurrent.ThreadPoolExecutor.runWorker(ThreadPoolExecutor.java:1103)         at java.util.concurrent.ThreadPoolExecutor$Worker.run(ThreadPoolExecutor.java:603)         at java.lang.Thread.run(Thread.java:722)    5) Thread[id=213, name=TestSearcherManager-1-thread-1, state=TIMED_WAITING, group=TGRP-TestSearcherManager]         at sun.misc.Unsafe.park(Native Method)         at java.util.concurrent.locks.LockSupport.parkNanos(LockSupport.java:226)         at java.util.concurrent.SynchronousQueue$TransferStack.awaitFulfill(SynchronousQueue.java:460)         at java.util.concurrent.SynchronousQueue$TransferStack.transfer(SynchronousQueue.java:359)         at java.util.concurrent.SynchronousQueue.poll(SynchronousQueue.java:942)         at java.util.concurrent.ThreadPoolExecutor.getTask(ThreadPoolExecutor.java:1043)         at java.util.concurrent.ThreadPoolExecutor.runWorker(ThreadPoolExecutor.java:1103)         at java.util.concurrent.ThreadPoolExecutor$Worker.run(ThreadPoolExecutor.java:603)         at java.lang.Thread.run(Thread.java:722)    6) Thread[id=214, name=TestSearcherManager-1-thread-2, state=TIMED_WAITING, group=TGRP-TestSearcherManager]         at sun.misc.Unsafe.park(Native Method)         at java.util.concurrent.locks.LockSupport.parkNanos(LockSupport.java:226)         at java.util.concurrent.SynchronousQueue$TransferStack.awaitFulfill(SynchronousQueue.java:460)         at java.util.concurrent.SynchronousQueue$TransferStack.transfer(SynchronousQueue.java:359)         at java.util.concurrent.SynchronousQueue.poll(SynchronousQueue.java:942)         at java.util.concurrent.ThreadPoolExecutor.getTask(ThreadPoolExecutor.java:1043)         at java.util.concurrent.ThreadPoolExecutor.runWorker(ThreadPoolExecutor.java:1103)         at java.util.concurrent.ThreadPoolExecutor$Worker.run(ThreadPoolExecutor.java:603)         at java.lang.Thread.run(Thread.java:722)    7) Thread[id=216, name=TestSearcherManager-1-thread-3, state=TIMED_WAITING, group=TGRP-TestSearcherManager]         at sun.misc.Unsafe.park(Native Method)         at java.util.concurrent.locks.LockSupport.parkNanos(LockSupport.java:226)         at java.util.concurrent.SynchronousQueue$TransferStack.awaitFulfill(SynchronousQueue.java:460)         at java.util.concurrent.SynchronousQueue$TransferStack.transfer(SynchronousQueue.java:359)         at java.util.concurrent.SynchronousQueue.poll(SynchronousQueue.java:942)         at java.util.concurrent.ThreadPoolExecutor.getTask(ThreadPoolExecutor.java:1043)         at java.util.concurrent.ThreadPoolExecutor.runWorker(ThreadPoolExecutor.java:1103)         at java.util.concurrent.ThreadPoolExecutor$Worker.run(ThreadPoolExecutor.java:603)         at java.lang.Thread.run(Thread.java:722)    8) Thread[id=221, name=TestSearcherManager-1-thread-8, state=TIMED_WAITING, group=TGRP-TestSearcherManager]         at sun.misc.Unsafe.park(Native Method)         at java.util.concurrent.locks.LockSupport.parkNanos(LockSupport.java:226)         at java.util.concurrent.SynchronousQueue$TransferStack.awaitFulfill(SynchronousQueue.java:460)         at java.util.concurrent.SynchronousQueue$TransferStack.transfer(SynchronousQueue.java:359)         at java.util.concurrent.SynchronousQueue.poll(SynchronousQueue.java:942)         at java.util.concurrent.ThreadPoolExecutor.getTask(ThreadPoolExecutor.java:1043)         at java.util.concurrent.ThreadPoolExecutor.runWorker(ThreadPoolExecutor.java:1103)         at java.util.concurrent.ThreadPoolExecutor$Worker.run(ThreadPoolExecutor.java:603)         at java.lang.Thread.run(Thread.java:722)
>>>
>>> Stack Trace:
>>> com.carrotsearch.randomizedtesting.ThreadLeakError: There are still zombie threads that couldn't be terminated:
>>>    1) Thread[id=219, name=TestSearcherManager-1-thread-6, state=TIMED_WAITING, group=TGRP-TestSearcherManager]
>>>         at sun.misc.Unsafe.park(Native Method)
>>>         at java.util.concurrent.locks.LockSupport.parkNanos(LockSupport.java:226)
>>>         at java.util.concurrent.SynchronousQueue$TransferStack.awaitFulfill(SynchronousQueue.java:460)
>>>         at java.util.concurrent.SynchronousQueue$TransferStack.transfer(SynchronousQueue.java:359)
>>>         at java.util.concurrent.SynchronousQueue.poll(SynchronousQueue.java:942)
>>>         at java.util.concurrent.ThreadPoolExecutor.getTask(ThreadPoolExecutor.java:1043)
>>>         at java.util.concurrent.ThreadPoolExecutor.runWorker(ThreadPoolExecutor.java:1103)
>>>         at java.util.concurrent.ThreadPoolExecutor$Worker.run(ThreadPoolExecutor.java:603)
>>>         at java.lang.Thread.run(Thread.java:722)
>>>    2) Thread[id=220, name=TestSearcherManager-1-thread-7, state=TIMED_WAITING, group=TGRP-TestSearcherManager]
>>>         at sun.misc.Unsafe.park(Native Method)
>>>         at java.util.concurrent.locks.LockSupport.parkNanos(LockSupport.java:226)
>>>         at java.util.concurrent.SynchronousQueue$TransferStack.awaitFulfill(SynchronousQueue.java:460)
>>>         at java.util.concurrent.SynchronousQueue$TransferStack.transfer(SynchronousQueue.java:359)
>>>         at java.util.concurrent.SynchronousQueue.poll(SynchronousQueue.java:942)
>>>         at java.util.concurrent.ThreadPoolExecutor.getTask(ThreadPoolExecutor.java:1043)
>>>         at java.util.concurrent.ThreadPoolExecutor.runWorker(ThreadPoolExecutor.java:1103)
>>>         at java.util.concurrent.ThreadPoolExecutor$Worker.run(ThreadPoolExecutor.java:603)
>>>         at java.lang.Thread.run(Thread.java:722)
>>>    3) Thread[id=217, name=TestSearcherManager-1-thread-4, state=TIMED_WAITING, group=TGRP-TestSearcherManager]
>>>         at sun.misc.Unsafe.park(Native Method)
>>>         at java.util.concurrent.locks.LockSupport.parkNanos(LockSupport.java:226)
>>>         at java.util.concurrent.SynchronousQueue$TransferStack.awaitFulfill(SynchronousQueue.java:460)
>>>         at java.util.concurrent.SynchronousQueue$TransferStack.transfer(SynchronousQueue.java:359)
>>>         at java.util.concurrent.SynchronousQueue.poll(SynchronousQueue.java:942)
>>>         at java.util.concurrent.ThreadPoolExecutor.getTask(ThreadPoolExecutor.java:1043)
>>>         at java.util.concurrent.ThreadPoolExecutor.runWorker(ThreadPoolExecutor.java:1103)
>>>         at java.util.concurrent.ThreadPoolExecutor$Worker.run(ThreadPoolExecutor.java:603)
>>>         at java.lang.Thread.run(Thread.java:722)
>>>    4) Thread[id=218, name=TestSearcherManager-1-thread-5, state=TIMED_WAITING, group=TGRP-TestSearcherManager]
>>>         at sun.misc.Unsafe.park(Native Method)
>>>         at java.util.concurrent.locks.LockSupport.parkNanos(LockSupport.java:226)
>>>         at java.util.concurrent.SynchronousQueue$TransferStack.awaitFulfill(SynchronousQueue.java:460)
>>>         at java.util.concurrent.SynchronousQueue$TransferStack.transfer(SynchronousQueue.java:359)
>>>         at java.util.concurrent.SynchronousQueue.poll(SynchronousQueue.java:942)
>>>         at java.util.concurrent.ThreadPoolExecutor.getTask(ThreadPoolExecutor.java:1043)
>>>         at java.util.concurrent.ThreadPoolExecutor.runWorker(ThreadPoolExecutor.java:1103)
>>>         at java.util.concurrent.ThreadPoolExecutor$Worker.run(ThreadPoolExecutor.java:603)
>>>         at java.lang.Thread.run(Thread.java:722)
>>>    5) Thread[id=213, name=TestSearcherManager-1-thread-1, state=TIMED_WAITING, group=TGRP-TestSearcherManager]
>>>         at sun.misc.Unsafe.park(Native Method)
>>>         at java.util.concurrent.locks.LockSupport.parkNanos(LockSupport.java:226)
>>>         at java.util.concurrent.SynchronousQueue$TransferStack.awaitFulfill(SynchronousQueue.java:460)
>>>         at java.util.concurrent.SynchronousQueue$TransferStack.transfer(SynchronousQueue.java:359)
>>>         at java.util.concurrent.SynchronousQueue.poll(SynchronousQueue.java:942)
>>>         at java.util.concurrent.ThreadPoolExecutor.getTask(ThreadPoolExecutor.java:1043)
>>>         at java.util.concurrent.ThreadPoolExecutor.runWorker(ThreadPoolExecutor.java:1103)
>>>         at java.util.concurrent.ThreadPoolExecutor$Worker.run(ThreadPoolExecutor.java:603)
>>>         at java.lang.Thread.run(Thread.java:722)
>>>    6) Thread[id=214, name=TestSearcherManager-1-thread-2, state=TIMED_WAITING, group=TGRP-TestSearcherManager]
>>>         at sun.misc.Unsafe.park(Native Method)
>>>         at java.util.concurrent.locks.LockSupport.parkNanos(LockSupport.java:226)
>>>         at java.util.concurrent.SynchronousQueue$TransferStack.awaitFulfill(SynchronousQueue.java:460)
>>>         at java.util.concurrent.SynchronousQueue$TransferStack.transfer(SynchronousQueue.java:359)
>>>         at java.util.concurrent.SynchronousQueue.poll(SynchronousQueue.java:942)
>>>         at java.util.concurrent.ThreadPoolExecutor.getTask(ThreadPoolExecutor.java:1043)
>>>         at java.util.concurrent.ThreadPoolExecutor.runWorker(ThreadPoolExecutor.java:1103)
>>>         at java.util.concurrent.ThreadPoolExecutor$Worker.run(ThreadPoolExecutor.java:603)
>>>         at java.lang.Thread.run(Thread.java:722)
>>>    7) Thread[id=216, name=TestSearcherManager-1-thread-3, state=TIMED_WAITING, group=TGRP-TestSearcherManager]
>>>         at sun.misc.Unsafe.park(Native Method)
>>>         at java.util.concurrent.locks.LockSupport.parkNanos(LockSupport.java:226)
>>>         at java.util.concurrent.SynchronousQueue$TransferStack.awaitFulfill(SynchronousQueue.java:460)
>>>         at java.util.concurrent.SynchronousQueue$TransferStack.transfer(SynchronousQueue.java:359)
>>>         at java.util.concurrent.SynchronousQueue.poll(SynchronousQueue.java:942)
>>>         at java.util.concurrent.ThreadPoolExecutor.getTask(ThreadPoolExecutor.java:1043)
>>>         at java.util.concurrent.ThreadPoolExecutor.runWorker(ThreadPoolExecutor.java:1103)
>>>         at java.util.concurrent.ThreadPoolExecutor$Worker.run(ThreadPoolExecutor.java:603)
>>>         at java.lang.Thread.run(Thread.java:722)
>>>    8) Thread[id=221, name=TestSearcherManager-1-thread-8, state=TIMED_WAITING, group=TGRP-TestSearcherManager]
>>>         at sun.misc.Unsafe.park(Native Method)
>>>         at java.util.concurrent.locks.LockSupport.parkNanos(LockSupport.java:226)
>>>         at java.util.concurrent.SynchronousQueue$TransferStack.awaitFulfill(SynchronousQueue.java:460)
>>>         at java.util.concurrent.SynchronousQueue$TransferStack.transfer(SynchronousQueue.java:359)
>>>         at java.util.concurrent.SynchronousQueue.poll(SynchronousQueue.java:942)
>>>         at java.util.concurrent.ThreadPoolExecutor.getTask(ThreadPoolExecutor.java:1043)
>>>         at java.util.concurrent.ThreadPoolExecutor.runWorker(ThreadPoolExecutor.java:1103)
>>>         at java.util.concurrent.ThreadPoolExecutor$Worker.run(ThreadPoolExecutor.java:603)
>>>         at java.lang.Thread.run(Thread.java:722)
>>>         at __randomizedtesting.SeedInfo.seed([6A8BC03A6E804E02]:0)
>>>
>>>
>>> REGRESSION:  org.apache.lucene.util.junitcompat.TestFailIfDirectoryNotClosed.testFailIfDirectoryNotClosed
>>>
>>> Error Message:
>>> expected:<1> but was:<0>
>>>
>>> Stack Trace:
>>> java.lang.AssertionError: expected:<1> but was:<0>
>>>         at org.junit.Assert.fail(Assert.java:93)
>>>         at org.junit.Assert.failNotEquals(Assert.java:647)
>>>         at org.junit.Assert.assertEquals(Assert.java:128)
>>>         at org.junit.Assert.assertEquals(Assert.java:472)
>>>         at org.junit.Assert.assertEquals(Assert.java:456)
>>>         at org.apache.lucene.util.junitcompat.TestFailIfDirectoryNotClosed.testFailIfDirectoryNotClosed(TestFailIfDirectoryNotClosed.java:45)
>>>         at sun.reflect.NativeMethodAccessorImpl.invoke0(Native Method)
>>>         at sun.reflect.NativeMethodAccessorImpl.invoke(NativeMethodAccessorImpl.java:57)
>>>         at sun.reflect.DelegatingMethodAccessorImpl.invoke(DelegatingMethodAccessorImpl.java:43)
>>>         at java.lang.reflect.Method.invoke(Method.java:601)
>>>         at org.junit.runners.model.FrameworkMethod$1.runReflectiveCall(FrameworkMethod.java:45)
>>>         at org.junit.internal.runners.model.ReflectiveCallable.run(ReflectiveCallable.java:15)
>>>         at org.junit.runners.model.FrameworkMethod.invokeExplosively(FrameworkMethod.java:42)
>>>         at org.junit.internal.runners.statements.InvokeMethod.evaluate(InvokeMethod.java:20)
>>>         at org.junit.internal.runners.statements.RunBefores.evaluate(RunBefores.java:28)
>>>         at org.junit.internal.runners.statements.RunAfters.evaluate(RunAfters.java:30)
>>>         at org.apache.lucene.util.TestRuleMarkFailure$1.evaluate(TestRuleMarkFailure.java:48)
>>>         at com.carrotsearch.randomizedtesting.rules.StatementAdapter.evaluate(StatementAdapter.java:36)
>>>         at com.carrotsearch.randomizedtesting.rules.SystemPropertiesRestoreRule$1.evaluate(SystemPropertiesRestoreRule.java:53)
>>>         at org.junit.rules.RunRules.evaluate(RunRules.java:18)
>>>         at org.junit.runners.ParentRunner.runLeaf(ParentRunner.java:263)
>>>         at org.junit.runners.BlockJUnit4ClassRunner.runChild(BlockJUnit4ClassRunner.java:68)
>>>         at org.junit.runners.BlockJUnit4ClassRunner.runChild(BlockJUnit4ClassRunner.java:47)
>>>         at org.junit.runners.ParentRunner$3.run(ParentRunner.java:231)
>>>         at org.junit.runners.ParentRunner$1.schedule(ParentRunner.java:60)
>>>         at org.junit.runners.ParentRunner.runChildren(ParentRunner.java:229)
>>>         at org.junit.runners.ParentRunner.access$000(ParentRunner.java:50)
>>>         at org.junit.runners.ParentRunner$2.evaluate(ParentRunner.java:222)
>>>         at com.carrotsearch.randomizedtesting.rules.StatementAdapter.evaluate(StatementAdapter.java:36)
>>>         at org.junit.rules.RunRules.evaluate(RunRules.java:18)
>>>         at org.junit.runners.ParentRunner.run(ParentRunner.java:300)
>>>         at com.carrotsearch.ant.tasks.junit4.slave.SlaveMain.execute(SlaveMain.java:180)
>>>         at com.carrotsearch.ant.tasks.junit4.slave.SlaveMain.main(SlaveMain.java:275)
>>>         at com.carrotsearch.ant.tasks.junit4.slave.SlaveMainSafe.main(SlaveMainSafe.java:12)
>>>
>>>
>>> REGRESSION:  org.apache.lucene.util.junitcompat.TestFailIfUnreferencedFiles.testFailIfUnreferencedFiles
>>>
>>> Error Message:
>>> expected:<1> but was:<0>
>>>
>>> Stack Trace:
>>> java.lang.AssertionError: expected:<1> but was:<0>
>>>         at org.junit.Assert.fail(Assert.java:93)
>>>         at org.junit.Assert.failNotEquals(Assert.java:647)
>>>         at org.junit.Assert.assertEquals(Assert.java:128)
>>>         at org.junit.Assert.assertEquals(Assert.java:472)
>>>         at org.junit.Assert.assertEquals(Assert.java:456)
>>>         at org.apache.lucene.util.junitcompat.TestFailIfUnreferencedFiles.testFailIfUnreferencedFiles(TestFailIfUnreferencedFiles.java:56)
>>>         at sun.reflect.NativeMethodAccessorImpl.invoke0(Native Method)
>>>         at sun.reflect.NativeMethodAccessorImpl.invoke(NativeMethodAccessorImpl.java:57)
>>>         at sun.reflect.DelegatingMethodAccessorImpl.invoke(DelegatingMethodAccessorImpl.java:43)
>>>         at java.lang.reflect.Method.invoke(Method.java:601)
>>>         at org.junit.runners.model.FrameworkMethod$1.runReflectiveCall(FrameworkMethod.java:45)
>>>         at org.junit.internal.runners.model.ReflectiveCallable.run(ReflectiveCallable.java:15)
>>>         at org.junit.runners.model.FrameworkMethod.invokeExplosively(FrameworkMethod.java:42)
>>>         at org.junit.internal.runners.statements.InvokeMethod.evaluate(InvokeMethod.java:20)
>>>         at org.junit.internal.runners.statements.RunBefores.evaluate(RunBefores.java:28)
>>>         at org.junit.internal.runners.statements.RunAfters.evaluate(RunAfters.java:30)
>>>         at org.apache.lucene.util.TestRuleMarkFailure$1.evaluate(TestRuleMarkFailure.java:48)
>>>         at com.carrotsearch.randomizedtesting.rules.StatementAdapter.evaluate(StatementAdapter.java:36)
>>>         at com.carrotsearch.randomizedtesting.rules.SystemPropertiesRestoreRule$1.evaluate(SystemPropertiesRestoreRule.java:53)
>>>         at org.junit.rules.RunRules.evaluate(RunRules.java:18)
>>>         at org.junit.runners.ParentRunner.runLeaf(ParentRunner.java:263)
>>>         at org.junit.runners.BlockJUnit4ClassRunner.runChild(BlockJUnit4ClassRunner.java:68)
>>>         at org.junit.runners.BlockJUnit4ClassRunner.runChild(BlockJUnit4ClassRunner.java:47)
>>>         at org.junit.runners.ParentRunner$3.run(ParentRunner.java:231)
>>>         at org.junit.runners.ParentRunner$1.schedule(ParentRunner.java:60)
>>>         at org.junit.runners.ParentRunner.runChildren(ParentRunner.java:229)
>>>         at org.junit.runners.ParentRunner.access$000(ParentRunner.java:50)
>>>         at org.junit.runners.ParentRunner$2.evaluate(ParentRunner.java:222)
>>>         at com.carrotsearch.randomizedtesting.rules.StatementAdapter.evaluate(StatementAdapter.java:36)
>>>         at org.junit.rules.RunRules.evaluate(RunRules.java:18)
>>>         at org.junit.runners.ParentRunner.run(ParentRunner.java:300)
>>>         at com.carrotsearch.ant.tasks.junit4.slave.SlaveMain.execute(SlaveMain.java:180)
>>>         at com.carrotsearch.ant.tasks.junit4.slave.SlaveMain.main(SlaveMain.java:275)
>>>         at com.carrotsearch.ant.tasks.junit4.slave.SlaveMainSafe.main(SlaveMainSafe.java:12)
>>>
>>>
>>>
>>>
>>> Build Log:
>>> [...truncated 890 lines...]
>>>    [junit4] Suite: org.apache.lucene.search.TestSearcherManager
>>>    [junit4]   1> doc id=0 is not supposed to be deleted, but got hitCount=0
>>>    [junit4]   2> NOTE: reproduce with: ant test  -Dtestcase=TestSearcherManager -Dtests.method=testSearcherManager -Dtests.seed=6A8BC03A6E804E02 -Dtests.slow=true -Dtests.locale=fr_LU -Dtests.timezone=Africa/Algiers -Dtests.file.encoding=UTF-8
>>>    [junit4] FAILURE 4.98s J2 | TestSearcherManager.testSearcherManager <<<
>>>    [junit4]    > Throwable #1: java.lang.AssertionError
>>>    [junit4]    >        at __randomizedtesting.SeedInfo.seed([6A8BC03A6E804E02:66A48880D8892FFF]:0)
>>>    [junit4]    >        at org.apache.lucene.index.ThreadedIndexingAndSearchingTestCase.runTest(ThreadedIndexingAndSearchingTestCase.java:607)
>>>    [junit4]    >        at org.apache.lucene.search.TestSearcherManager.testSearcherManager(TestSearcherManager.java:56)
>>>    [junit4]    >        at java.lang.Thread.run(Thread.java:722)
>>>    [junit4]   2> Sep 23, 2013 2:10:14 PM com.carrotsearch.randomizedtesting.ThreadLeakControl checkThreadLeaks
>>>    [junit4]   2> WARNING: Will linger awaiting termination of 8 leaked thread(s).
>>>    [junit4]   2> Sep 23, 2013 2:10:34 PM com.carrotsearch.randomizedtesting.ThreadLeakControl checkThreadLeaks
>>>    [junit4]   2> SEVERE: 8 threads leaked from SUITE scope at org.apache.lucene.search.TestSearcherManager:
>>>    [junit4]   2>    1) Thread[id=219, name=TestSearcherManager-1-thread-6, state=TIMED_WAITING, group=TGRP-TestSearcherManager]
>>>    [junit4]   2>         at sun.misc.Unsafe.park(Native Method)
>>>    [junit4]   2>         at java.util.concurrent.locks.LockSupport.parkNanos(LockSupport.java:226)
>>>    [junit4]   2>         at java.util.concurrent.SynchronousQueue$TransferStack.awaitFulfill(SynchronousQueue.java:460)
>>>    [junit4]   2>         at java.util.concurrent.SynchronousQueue$TransferStack.transfer(SynchronousQueue.java:359)
>>>    [junit4]   2>         at java.util.concurrent.SynchronousQueue.poll(SynchronousQueue.java:942)
>>>    [junit4]   2>         at java.util.concurrent.ThreadPoolExecutor.getTask(ThreadPoolExecutor.java:1043)
>>>    [junit4]   2>         at java.util.concurrent.ThreadPoolExecutor.runWorker(ThreadPoolExecutor.java:1103)
>>>    [junit4]   2>         at java.util.concurrent.ThreadPoolExecutor$Worker.run(ThreadPoolExecutor.java:603)
>>>    [junit4]   2>         at java.lang.Thread.run(Thread.java:722)
>>>    [junit4]   2>    2) Thread[id=220, name=TestSearcherManager-1-thread-7, state=TIMED_WAITING, group=TGRP-TestSearcherManager]
>>>    [junit4]   2>         at sun.misc.Unsafe.park(Native Method)
>>>    [junit4]   2>         at java.util.concurrent.locks.LockSupport.parkNanos(LockSupport.java:226)
>>>    [junit4]   2>         at java.util.concurrent.SynchronousQueue$TransferStack.awaitFulfill(SynchronousQueue.java:460)
>>>    [junit4]   2>         at java.util.concurrent.SynchronousQueue$TransferStack.transfer(SynchronousQueue.java:359)
>>>    [junit4]   2>         at java.util.concurrent.SynchronousQueue.poll(SynchronousQueue.java:942)
>>>    [junit4]   2>         at java.util.concurrent.ThreadPoolExecutor.getTask(ThreadPoolExecutor.java:1043)
>>>    [junit4]   2>         at java.util.concurrent.ThreadPoolExecutor.runWorker(ThreadPoolExecutor.java:1103)
>>>    [junit4]   2>         at java.util.concurrent.ThreadPoolExecutor$Worker.run(ThreadPoolExecutor.java:603)
>>>    [junit4]   2>         at java.lang.Thread.run(Thread.java:722)
>>>    [junit4]   2>    3) Thread[id=217, name=TestSearcherManager-1-thread-4, state=TIMED_WAITING, group=TGRP-TestSearcherManager]
>>>    [junit4]   2>         at sun.misc.Unsafe.park(Native Method)
>>>    [junit4]   2>         at java.util.concurrent.locks.LockSupport.parkNanos(LockSupport.java:226)
>>>    [junit4]   2>         at java.util.concurrent.SynchronousQueue$TransferStack.awaitFulfill(SynchronousQueue.java:460)
>>>    [junit4]   2>         at java.util.concurrent.SynchronousQueue$TransferStack.transfer(SynchronousQueue.java:359)
>>>    [junit4]   2>         at java.util.concurrent.SynchronousQueue.poll(SynchronousQueue.java:942)
>>>    [junit4]   2>         at java.util.concurrent.ThreadPoolExecutor.getTask(ThreadPoolExecutor.java:1043)
>>>    [junit4]   2>         at java.util.concurrent.ThreadPoolExecutor.runWorker(ThreadPoolExecutor.java:1103)
>>>    [junit4]   2>         at java.util.concurrent.ThreadPoolExecutor$Worker.run(ThreadPoolExecutor.java:603)
>>>    [junit4]   2>         at java.lang.Thread.run(Thread.java:722)
>>>    [junit4]   2>    4) Thread[id=218, name=TestSearcherManager-1-thread-5, state=TIMED_WAITING, group=TGRP-TestSearcherManager]
>>>    [junit4]   2>         at sun.misc.Unsafe.park(Native Method)
>>>    [junit4]   2>         at java.util.concurrent.locks.LockSupport.parkNanos(LockSupport.java:226)
>>>    [junit4]   2>         at java.util.concurrent.SynchronousQueue$TransferStack.awaitFulfill(SynchronousQueue.java:460)
>>>    [junit4]   2>         at java.util.concurrent.SynchronousQueue$TransferStack.transfer(SynchronousQueue.java:359)
>>>    [junit4]   2>         at java.util.concurrent.SynchronousQueue.poll(SynchronousQueue.java:942)
>>>    [junit4]   2>         at java.util.concurrent.ThreadPoolExecutor.getTask(ThreadPoolExecutor.java:1043)
>>>    [junit4]   2>         at java.util.concurrent.ThreadPoolExecutor.runWorker(ThreadPoolExecutor.java:1103)
>>>    [junit4]   2>         at java.util.concurrent.ThreadPoolExecutor$Worker.run(ThreadPoolExecutor.java:603)
>>>    [junit4]   2>         at java.lang.Thread.run(Thread.java:722)
>>>    [junit4]   2>    5) Thread[id=213, name=TestSearcherManager-1-thread-1, state=TIMED_WAITING, group=TGRP-TestSearcherManager]
>>>    [junit4]   2>         at sun.misc.Unsafe.park(Native Method)
>>>    [junit4]   2>         at java.util.concurrent.locks.LockSupport.parkNanos(LockSupport.java:226)
>>>    [junit4]   2>         at java.util.concurrent.SynchronousQueue$TransferStack.awaitFulfill(SynchronousQueue.java:460)
>>>    [junit4]   2>         at java.util.concurrent.SynchronousQueue$TransferStack.transfer(SynchronousQueue.java:359)
>>>    [junit4]   2>         at java.util.concurrent.SynchronousQueue.poll(SynchronousQueue.java:942)
>>>    [junit4]   2>         at java.util.concurrent.ThreadPoolExecutor.getTask(ThreadPoolExecutor.java:1043)
>>>    [junit4]   2>         at java.util.concurrent.ThreadPoolExecutor.runWorker(ThreadPoolExecutor.java:1103)
>>>    [junit4]   2>         at java.util.concurrent.ThreadPoolExecutor$Worker.run(ThreadPoolExecutor.java:603)
>>>    [junit4]   2>         at java.lang.Thread.run(Thread.java:722)
>>>    [junit4]   2>    6) Thread[id=214, name=TestSearcherManager-1-thread-2, state=TIMED_WAITING, group=TGRP-TestSearcherManager]
>>>    [junit4]   2>         at sun.misc.Unsafe.park(Native Method)
>>>    [junit4]   2>         at java.util.concurrent.locks.LockSupport.parkNanos(LockSupport.java:226)
>>>    [junit4]   2>         at java.util.concurrent.SynchronousQueue$TransferStack.awaitFulfill(SynchronousQueue.java:460)
>>>    [junit4]   2>         at java.util.concurrent.SynchronousQueue$TransferStack.transfer(SynchronousQueue.java:359)
>>>    [junit4]   2>         at java.util.concurrent.SynchronousQueue.poll(SynchronousQueue.java:942)
>>>    [junit4]   2>         at java.util.concurrent.ThreadPoolExecutor.getTask(ThreadPoolExecutor.java:1043)
>>>    [junit4]   2>         at java.util.concurrent.ThreadPoolExecutor.runWorker(ThreadPoolExecutor.java:1103)
>>>    [junit4]   2>         at java.util.concurrent.ThreadPoolExecutor$Worker.run(ThreadPoolExecutor.java:603)
>>>    [junit4]   2>         at java.lang.Thread.run(Thread.java:722)
>>>    [junit4]   2>    7) Thread[id=216, name=TestSearcherManager-1-thread-3, state=TIMED_WAITING, group=TGRP-TestSearcherManager]
>>>    [junit4]   2>         at sun.misc.Unsafe.park(Native Method)
>>>    [junit4]   2>         at java.util.concurrent.locks.LockSupport.parkNanos(LockSupport.java:226)
>>>    [junit4]   2>         at java.util.concurrent.SynchronousQueue$TransferStack.awaitFulfill(SynchronousQueue.java:460)
>>>    [junit4]   2>         at java.util.concurrent.SynchronousQueue$TransferStack.transfer(SynchronousQueue.java:359)
>>>    [junit4]   2>         at java.util.concurrent.SynchronousQueue.poll(SynchronousQueue.java:942)
>>>    [junit4]   2>         at java.util.concurrent.ThreadPoolExecutor.getTask(ThreadPoolExecutor.java:1043)
>>>    [junit4]   2>         at java.util.concurrent.ThreadPoolExecutor.runWorker(ThreadPoolExecutor.java:1103)
>>>    [junit4]   2>         at java.util.concurrent.ThreadPoolExecutor$Worker.run(ThreadPoolExecutor.java:603)
>>>    [junit4]   2>         at java.lang.Thread.run(Thread.java:722)
>>>    [junit4]   2>    8) Thread[id=221, name=TestSearcherManager-1-thread-8, state=TIMED_WAITING, group=TGRP-TestSearcherManager]
>>>    [junit4]   2>         at sun.misc.Unsafe.park(Native Method)
>>>    [junit4]   2>         at java.util.concurrent.locks.LockSupport.parkNanos(LockSupport.java:226)
>>>    [junit4]   2>         at java.util.concurrent.SynchronousQueue$TransferStack.awaitFulfill(SynchronousQueue.java:460)
>>>    [junit4]   2>         at java.util.concurrent.SynchronousQueue$TransferStack.transfer(SynchronousQueue.java:359)
>>>    [junit4]   2>         at java.util.concurrent.SynchronousQueue.poll(SynchronousQueue.java:942)
>>>    [junit4]   2>         at java.util.concurrent.ThreadPoolExecutor.getTask(ThreadPoolExecutor.java:1043)
>>>    [junit4]   2>         at java.util.concurrent.ThreadPoolExecutor.runWorker(ThreadPoolExecutor.java:1103)
>>>    [junit4]   2>         at java.util.concurrent.ThreadPoolExecutor$Worker.run(ThreadPoolExecutor.java:603)
>>>    [junit4]   2>         at java.lang.Thread.run(Thread.java:722)
>>>    [junit4]   2> Sep 23, 2013 2:10:34 PM com.carrotsearch.randomizedtesting.ThreadLeakControl tryToInterruptAll
>>>    [junit4]   2> INFO: Starting to interrupt leaked threads:
>>>    [junit4]   2>    1) Thread[id=219, name=TestSearcherManager-1-thread-6, state=TIMED_WAITING, group=TGRP-TestSearcherManager]
>>>    [junit4]   2>    2) Thread[id=220, name=TestSearcherManager-1-thread-7, state=TIMED_WAITING, group=TGRP-TestSearcherManager]
>>>    [junit4]   2>    3) Thread[id=217, name=TestSearcherManager-1-thread-4, state=TIMED_WAITING, group=TGRP-TestSearcherManager]
>>>    [junit4]   2>    4) Thread[id=218, name=TestSearcherManager-1-thread-5, state=TIMED_WAITING, group=TGRP-TestSearcherManager]
>>>    [junit4]   2>    5) Thread[id=213, name=TestSearcherManager-1-thread-1, state=TIMED_WAITING, group=TGRP-TestSearcherManager]
>>>    [junit4]   2>    6) Thread[id=214, name=TestSearcherManager-1-thread-2, state=TIMED_WAITING, group=TGRP-TestSearcherManager]
>>>    [junit4]   2>    7) Thread[id=216, name=TestSearcherManager-1-thread-3, state=TIMED_WAITING, group=TGRP-TestSearcherManager]
>>>    [junit4]   2>    8) Thread[id=221, name=TestSearcherManager-1-thread-8, state=TIMED_WAITING, group=TGRP-TestSearcherManager]
>>>    [junit4]   2> Sep 23, 2013 2:10:37 PM com.carrotsearch.randomizedtesting.ThreadLeakControl tryToInterruptAll
>>>    [junit4]   2> SEVERE: There are still zombie threads that couldn't be terminated:
>>>    [junit4]   2>    1) Thread[id=219, name=TestSearcherManager-1-thread-6, state=TIMED_WAITING, group=TGRP-TestSearcherManager]
>>>    [junit4]   2>         at sun.misc.Unsafe.park(Native Method)
>>>    [junit4]   2>         at java.util.concurrent.locks.LockSupport.parkNanos(LockSupport.java:226)
>>>    [junit4]   2>         at java.util.concurrent.SynchronousQueue$TransferStack.awaitFulfill(SynchronousQueue.java:460)
>>>    [junit4]   2>         at java.util.concurrent.SynchronousQueue$TransferStack.transfer(SynchronousQueue.java:359)
>>>    [junit4]   2>         at java.util.concurrent.SynchronousQueue.poll(SynchronousQueue.java:942)
>>>    [junit4]   2>         at java.util.concurrent.ThreadPoolExecutor.getTask(ThreadPoolExecutor.java:1043)
>>>    [junit4]   2>         at java.util.concurrent.ThreadPoolExecutor.runWorker(ThreadPoolExecutor.java:1103)
>>>    [junit4]   2>         at java.util.concurrent.ThreadPoolExecutor$Worker.run(ThreadPoolExecutor.java:603)
>>>    [junit4]   2>         at java.lang.Thread.run(Thread.java:722)
>>>    [junit4]   2>    2) Thread[id=220, name=TestSearcherManager-1-thread-7, state=TIMED_WAITING, group=TGRP-TestSearcherManager]
>>>    [junit4]   2>         at sun.misc.Unsafe.park(Native Method)
>>>    [junit4]   2>         at java.util.concurrent.locks.LockSupport.parkNanos(LockSupport.java:226)
>>>    [junit4]   2>         at java.util.concurrent.SynchronousQueue$TransferStack.awaitFulfill(SynchronousQueue.java:460)
>>>    [junit4]   2>         at java.util.concurrent.SynchronousQueue$TransferStack.transfer(SynchronousQueue.java:359)
>>>    [junit4]   2>         at java.util.concurrent.SynchronousQueue.poll(SynchronousQueue.java:942)
>>>    [junit4]   2>         at java.util.concurrent.ThreadPoolExecutor.getTask(ThreadPoolExecutor.java:1043)
>>>    [junit4]   2>         at java.util.concurrent.ThreadPoolExecutor.runWorker(ThreadPoolExecutor.java:1103)
>>>    [junit4]   2>         at java.util.concurrent.ThreadPoolExecutor$Worker.run(ThreadPoolExecutor.java:603)
>>>    [junit4]   2>         at java.lang.Thread.run(Thread.java:722)
>>>    [junit4]   2>    3) Thread[id=217, name=TestSearcherManager-1-thread-4, state=TIMED_WAITING, group=TGRP-TestSearcherManager]
>>>    [junit4]   2>         at sun.misc.Unsafe.park(Native Method)
>>>    [junit4]   2>         at java.util.concurrent.locks.LockSupport.parkNanos(LockSupport.java:226)
>>>    [junit4]   2>         at java.util.concurrent.SynchronousQueue$TransferStack.awaitFulfill(SynchronousQueue.java:460)
>>>    [junit4]   2>         at java.util.concurrent.SynchronousQueue$TransferStack.transfer(SynchronousQueue.java:359)
>>>    [junit4]   2>         at java.util.concurrent.SynchronousQueue.poll(SynchronousQueue.java:942)
>>>    [junit4]   2>         at java.util.concurrent.ThreadPoolExecutor.getTask(ThreadPoolExecutor.java:1043)
>>>    [junit4]   2>         at java.util.concurrent.ThreadPoolExecutor.runWorker(ThreadPoolExecutor.java:1103)
>>>    [junit4]   2>         at java.util.concurrent.ThreadPoolExecutor$Worker.run(ThreadPoolExecutor.java:603)
>>>    [junit4]   2>         at java.lang.Thread.run(Thread.java:722)
>>>    [junit4]   2>    4) Thread[id=218, name=TestSearcherManager-1-thread-5, state=TIMED_WAITING, group=TGRP-TestSearcherManager]
>>>    [junit4]   2>         at sun.misc.Unsafe.park(Native Method)
>>>    [junit4]   2>         at java.util.concurrent.locks.LockSupport.parkNanos(LockSupport.java:226)
>>>    [junit4]   2>         at java.util.concurrent.SynchronousQueue$TransferStack.awaitFulfill(SynchronousQueue.java:460)
>>>    [junit4]   2>         at java.util.concurrent.SynchronousQueue$TransferStack.transfer(SynchronousQueue.java:359)
>>>    [junit4]   2>         at java.util.concurrent.SynchronousQueue.poll(SynchronousQueue.java:942)
>>>    [junit4]   2>         at java.util.concurrent.ThreadPoolExecutor.getTask(ThreadPoolExecutor.java:1043)
>>>    [junit4]   2>         at java.util.concurrent.ThreadPoolExecutor.runWorker(ThreadPoolExecutor.java:1103)
>>>    [junit4]   2>         at java.util.concurrent.ThreadPoolExecutor$Worker.run(ThreadPoolExecutor.java:603)
>>>    [junit4]   2>         at java.lang.Thread.run(Thread.java:722)
>>>    [junit4]   2>    5) Thread[id=213, name=TestSearcherManager-1-thread-1, state=TIMED_WAITING, group=TGRP-TestSearcherManager]
>>>    [junit4]   2>         at sun.misc.Unsafe.park(Native Method)
>>>    [junit4]   2>         at java.util.concurrent.locks.LockSupport.parkNanos(LockSupport.java:226)
>>>    [junit4]   2>         at java.util.concurrent.SynchronousQueue$TransferStack.awaitFulfill(SynchronousQueue.java:460)
>>>    [junit4]   2>         at java.util.concurrent.SynchronousQueue$TransferStack.transfer(SynchronousQueue.java:359)
>>>    [junit4]   2>         at java.util.concurrent.SynchronousQueue.poll(SynchronousQueue.java:942)
>>>    [junit4]   2>         at java.util.concurrent.ThreadPoolExecutor.getTask(ThreadPoolExecutor.java:1043)
>>>    [junit4]   2>         at java.util.concurrent.ThreadPoolExecutor.runWorker(ThreadPoolExecutor.java:1103)
>>>    [junit4]   2>         at java.util.concurrent.ThreadPoolExecutor$Worker.run(ThreadPoolExecutor.java:603)
>>>    [junit4]   2>         at java.lang.Thread.run(Thread.java:722)
>>>    [junit4]   2>    6) Thread[id=214, name=TestSearcherManager-1-thread-2, state=TIMED_WAITING, group=TGRP-TestSearcherManager]
>>>    [junit4]   2>         at sun.misc.Unsafe.park(Native Method)
>>>    [junit4]   2>         at java.util.concurrent.locks.LockSupport.parkNanos(LockSupport.java:226)
>>>    [junit4]   2>         at java.util.concurrent.SynchronousQueue$TransferStack.awaitFulfill(SynchronousQueue.java:460)
>>>    [junit4]   2>         at java.util.concurrent.SynchronousQueue$TransferStack.transfer(SynchronousQueue.java:359)
>>>    [junit4]   2>         at java.util.concurrent.SynchronousQueue.poll(SynchronousQueue.java:942)
>>>    [junit4]   2>         at java.util.concurrent.ThreadPoolExecutor.getTask(ThreadPoolExecutor.java:1043)
>>>    [junit4]   2>         at java.util.concurrent.ThreadPoolExecutor.runWorker(ThreadPoolExecutor.java:1103)
>>>    [junit4]   2>         at java.util.concurrent.ThreadPoolExecutor$Worker.run(ThreadPoolExecutor.java:603)
>>>    [junit4]   2>         at java.lang.Thread.run(Thread.java:722)
>>>    [junit4]   2>    7) Thread[id=216, name=TestSearcherManager-1-thread-3, state=TIMED_WAITING, group=TGRP-TestSearcherManager]
>>>    [junit4]   2>         at sun.misc.Unsafe.park(Native Method)
>>>    [junit4]   2>         at java.util.concurrent.locks.LockSupport.parkNanos(LockSupport.java:226)
>>>    [junit4]   2>         at java.util.concurrent.SynchronousQueue$TransferStack.awaitFulfill(SynchronousQueue.java:460)
>>>    [junit4]   2>         at java.util.concurrent.SynchronousQueue$TransferStack.transfer(SynchronousQueue.java:359)
>>>    [junit4]   2>         at java.util.concurrent.SynchronousQueue.poll(SynchronousQueue.java:942)
>>>    [junit4]   2>         at java.util.concurrent.ThreadPoolExecutor.getTask(ThreadPoolExecutor.java:1043)
>>>    [junit4]   2>         at java.util.concurrent.ThreadPoolExecutor.runWorker(ThreadPoolExecutor.java:1103)
>>>    [junit4]   2>         at java.util.concurrent.ThreadPoolExecutor$Worker.run(ThreadPoolExecutor.java:603)
>>>    [junit4]   2>         at java.lang.Thread.run(Thread.java:722)
>>>    [junit4]   2>    8) Thread[id=221, name=TestSearcherManager-1-thread-8, state=TIMED_WAITING, group=TGRP-TestSearcherManager]
>>>    [junit4]   2>         at sun.misc.Unsafe.park(Native Method)
>>>    [junit4]   2>         at java.util.concurrent.locks.LockSupport.parkNanos(LockSupport.java:226)
>>>    [junit4]   2>         at java.util.concurrent.SynchronousQueue$TransferStack.awaitFulfill(SynchronousQueue.java:460)
>>>    [junit4]   2>         at java.util.concurrent.SynchronousQueue$TransferStack.transfer(SynchronousQueue.java:359)
>>>    [junit4]   2>         at java.util.concurrent.SynchronousQueue.poll(SynchronousQueue.java:942)
>>>    [junit4]   2>         at java.util.concurrent.ThreadPoolExecutor.getTask(ThreadPoolExecutor.java:1043)
>>>    [junit4]   2>         at java.util.concurrent.ThreadPoolExecutor.runWorker(ThreadPoolExecutor.java:1103)
>>>    [junit4]   2>         at java.util.concurrent.ThreadPoolExecutor$Worker.run(ThreadPoolExecutor.java:603)
>>>    [junit4]   2>         at java.lang.Thread.run(Thread.java:722)
>>>    [junit4]   2> NOTE: test params are: codec=Lucene42, sim=DefaultSimilarity, locale=fr_LU, timezone=Africa/Algiers
>>>    [junit4]   2> NOTE: Linux 3.2.0-26-generic amd64/Oracle Corporation 1.7.0_05 (64-bit)/cpus=8,threads=9,free=186577648,total=278331392
>>>    [junit4]   2> NOTE: All tests run in this JVM: [TestMultiLevelSkipList, TestTryDelete, TestFieldValueFilter, TestPayloadTermQuery, TestRollingBuffer, TestDocumentsWriterStallControl, TestBagOfPositions, TestExplanations, TestMultiThreadTermVectors, TestPayloadSpans, TestParallelTermEnum, TestFlushByRamOrCountsPolicy, TestLucene45DocValuesFormat, TestIdentityHashSet, TestSloppyPhraseQuery2, TestOmitPositions, TestShardSearching, TestSimpleExplanationsOfNonMatches, TestRamUsageEstimatorOnWildAnimals, TestElevationComparator, TestPhrasePrefixQuery, NestedSetupChain, NestedTeardownChain, Test2BPositions, TestIndexWriter, TestLucene42DocValuesFormat, TestSearcherManager]
>>>    [junit4]   2> NOTE: reproduce with: ant test  -Dtestcase=TestSearcherManager -Dtests.seed=6A8BC03A6E804E02 -Dtests.slow=true -Dtests.locale=fr_LU -Dtests.timezone=Africa/Algiers -Dtests.file.encoding=UTF-8
>>>    [junit4] ERROR   0.00s J2 | TestSearcherManager (suite) <<<
>>>    [junit4]    > Throwable #1: com.carrotsearch.randomizedtesting.ThreadLeakError: 8 threads leaked from SUITE scope at org.apache.lucene.search.TestSearcherManager:
>>>    [junit4]    >    1) Thread[id=219, name=TestSearcherManager-1-thread-6, state=TIMED_WAITING, group=TGRP-TestSearcherManager]
>>>    [junit4]    >         at sun.misc.Unsafe.park(Native Method)
>>>    [junit4]    >         at java.util.concurrent.locks.LockSupport.parkNanos(LockSupport.java:226)
>>>    [junit4]    >         at java.util.concurrent.SynchronousQueue$TransferStack.awaitFulfill(SynchronousQueue.java:460)
>>>    [junit4]    >         at java.util.concurrent.SynchronousQueue$TransferStack.transfer(SynchronousQueue.java:359)
>>>    [junit4]    >         at java.util.concurrent.SynchronousQueue.poll(SynchronousQueue.java:942)
>>>    [junit4]    >         at java.util.concurrent.ThreadPoolExecutor.getTask(ThreadPoolExecutor.java:1043)
>>>    [junit4]    >         at java.util.concurrent.ThreadPoolExecutor.runWorker(ThreadPoolExecutor.java:1103)
>>>    [junit4]    >         at java.util.concurrent.ThreadPoolExecutor$Worker.run(ThreadPoolExecutor.java:603)
>>>    [junit4]    >         at java.lang.Thread.run(Thread.java:722)
>>>    [junit4]    >    2) Thread[id=220, name=TestSearcherManager-1-thread-7, state=TIMED_WAITING, group=TGRP-TestSearcherManager]
>>>    [junit4]    >         at sun.misc.Unsafe.park(Native Method)
>>>    [junit4]    >         at java.util.concurrent.locks.LockSupport.parkNanos(LockSupport.java:226)
>>>    [junit4]    >         at java.util.concurrent.SynchronousQueue$TransferStack.awaitFulfill(SynchronousQueue.java:460)
>>>    [junit4]    >         at java.util.concurrent.SynchronousQueue$TransferStack.transfer(SynchronousQueue.java:359)
>>>    [junit4]    >         at java.util.concurrent.SynchronousQueue.poll(SynchronousQueue.java:942)
>>>    [junit4]    >         at java.util.concurrent.ThreadPoolExecutor.getTask(ThreadPoolExecutor.java:1043)
>>>    [junit4]    >         at java.util.concurrent.ThreadPoolExecutor.runWorker(ThreadPoolExecutor.java:1103)
>>>    [junit4]    >         at java.util.concurrent.ThreadPoolExecutor$Worker.run(ThreadPoolExecutor.java:603)
>>>    [junit4]    >         at java.lang.Thread.run(Thread.java:722)
>>>    [junit4]    >    3) Thread[id=217, name=TestSearcherManager-1-thread-4, state=TIMED_WAITING, group=TGRP-TestSearcherManager]
>>>    [junit4]    >         at sun.misc.Unsafe.park(Native Method)
>>>    [junit4]    >         at java.util.concurrent.locks.LockSupport.parkNanos(LockSupport.java:226)
>>>    [junit4]    >         at java.util.concurrent.SynchronousQueue$TransferStack.awaitFulfill(SynchronousQueue.java:460)
>>>    [junit4]    >         at java.util.concurrent.SynchronousQueue$TransferStack.transfer(SynchronousQueue.java:359)
>>>    [junit4]    >         at java.util.concurrent.SynchronousQueue.poll(SynchronousQueue.java:942)
>>>    [junit4]    >         at java.util.concurrent.ThreadPoolExecutor.getTask(ThreadPoolExecutor.java:1043)
>>>    [junit4]    >         at java.util.concurrent.ThreadPoolExecutor.runWorker(ThreadPoolExecutor.java:1103)
>>>    [junit4]    >         at java.util.concurrent.ThreadPoolExecutor$Worker.run(ThreadPoolExecutor.java:603)
>>>    [junit4]    >         at java.lang.Thread.run(Thread.java:722)
>>>    [junit4]    >    4) Thread[id=218, name=TestSearcherManager-1-thread-5, state=TIMED_WAITING, group=TGRP-TestSearcherManager]
>>>    [junit4]    >         at sun.misc.Unsafe.park(Native Method)
>>>    [junit4]    >         at java.util.concurrent.locks.LockSupport.parkNanos(LockSupport.java:226)
>>>    [junit4]    >         at java.util.concurrent.SynchronousQueue$TransferStack.awaitFulfill(SynchronousQueue.java:460)
>>>    [junit4]    >         at java.util.concurrent.SynchronousQueue$TransferStack.transfer(SynchronousQueue.java:359)
>>>    [junit4]    >         at java.util.concurrent.SynchronousQueue.poll(SynchronousQueue.java:942)
>>>    [junit4]    >         at java.util.concurrent.ThreadPoolExecutor.getTask(ThreadPoolExecutor.java:1043)
>>>    [junit4]    >         at java.util.concurrent.ThreadPoolExecutor.runWorker(ThreadPoolExecutor.java:1103)
>>>    [junit4]    >         at java.util.concurrent.ThreadPoolExecutor$Worker.run(ThreadPoolExecutor.java:603)
>>>    [junit4]    >         at java.lang.Thread.run(Thread.java:722)
>>>    [junit4]    >    5) Thread[id=213, name=TestSearcherManager-1-thread-1, state=TIMED_WAITING, group=TGRP-TestSearcherManager]
>>>    [junit4]    >         at sun.misc.Unsafe.park(Native Method)
>>>    [junit4]    >         at java.util.concurrent.locks.LockSupport.parkNanos(LockSupport.java:226)
>>>    [junit4]    >         at java.util.concurrent.SynchronousQueue$TransferStack.awaitFulfill(SynchronousQueue.java:460)
>>>    [junit4]    >         at java.util.concurrent.SynchronousQueue$TransferStack.transfer(SynchronousQueue.java:359)
>>>    [junit4]    >         at java.util.concurrent.SynchronousQueue.poll(SynchronousQueue.java:942)
>>>    [junit4]    >         at java.util.concurrent.ThreadPoolExecutor.getTask(ThreadPoolExecutor.java:1043)
>>>    [junit4]    >         at java.util.concurrent.ThreadPoolExecutor.runWorker(ThreadPoolExecutor.java:1103)
>>>    [junit4]    >         at java.util.concurrent.ThreadPoolExecutor$Worker.run(ThreadPoolExecutor.java:603)
>>>    [junit4]    >         at java.lang.Thread.run(Thread.java:722)
>>>    [junit4]    >    6) Thread[id=214, name=TestSearcherManager-1-thread-2, state=TIMED_WAITING, group=TGRP-TestSearcherManager]
>>>    [junit4]    >         at sun.misc.Unsafe.park(Native Method)
>>>    [junit4]    >         at java.util.concurrent.locks.LockSupport.parkNanos(LockSupport.java:226)
>>>    [junit4]    >         at java.util.concurrent.SynchronousQueue$TransferStack.awaitFulfill(SynchronousQueue.java:460)
>>>    [junit4]    >         at java.util.concurrent.SynchronousQueue$TransferStack.transfer(SynchronousQueue.java:359)
>>>    [junit4]    >         at java.util.concurrent.SynchronousQueue.poll(SynchronousQueue.java:942)
>>>    [junit4]    >         at java.util.concurrent.ThreadPoolExecutor.getTask(ThreadPoolExecutor.java:1043)
>>>    [junit4]    >         at java.util.concurrent.ThreadPoolExecutor.runWorker(ThreadPoolExecutor.java:1103)
>>>    [junit4]    >         at java.util.concurrent.ThreadPoolExecutor$Worker.run(ThreadPoolExecutor.java:603)
>>>    [junit4]    >         at java.lang.Thread.run(Thread.java:722)
>>>    [junit4]    >    7) Thread[id=216, name=TestSearcherManager-1-thread-3, state=TIMED_WAITING, group=TGRP-TestSearcherManager]
>>>    [junit4]    >         at sun.misc.Unsafe.park(Native Method)
>>>    [junit4]    >         at java.util.concurrent.locks.LockSupport.parkNanos(LockSupport.java:226)
>>>    [junit4]    >         at java.util.concurrent.SynchronousQueue$TransferStack.awaitFulfill(SynchronousQueue.java:460)
>>>    [junit4]    >         at java.util.concurrent.SynchronousQueue$TransferStack.transfer(SynchronousQueue.java:359)
>>>    [junit4]    >         at java.util.concurrent.SynchronousQueue.poll(SynchronousQueue.java:942)
>>>    [junit4]    >         at java.util.concurrent.ThreadPoolExecutor.getTask(ThreadPoolExecutor.java:1043)
>>>    [junit4]    >         at java.util.concurrent.ThreadPoolExecutor.runWorker(ThreadPoolExecutor.java:1103)
>>>    [junit4]    >         at java.util.concurrent.ThreadPoolExecutor$Worker.run(ThreadPoolExecutor.java:603)
>>>    [junit4]    >         at java.lang.Thread.run(Thread.java:722)
>>>    [junit4]    >    8) Thread[id=221, name=TestSearcherManager-1-thread-8, state=TIMED_WAITING, group=TGRP-TestSearcherManager]
>>>    [junit4]    >         at sun.misc.Unsafe.park(Native Method)
>>>    [junit4]    >         at java.util.concurrent.locks.LockSupport.parkNanos(LockSupport.java:226)
>>>    [junit4]    >         at java.util.concurrent.SynchronousQueue$TransferStack.awaitFulfill(SynchronousQueue.java:460)
>>>    [junit4]    >         at java.util.concurrent.SynchronousQueue$TransferStack.transfer(SynchronousQueue.java:359)
>>>    [junit4]    >         at java.util.concurrent.SynchronousQueue.poll(SynchronousQueue.java:942)
>>>    [junit4]    >         at java.util.concurrent.ThreadPoolExecutor.getTask(ThreadPoolExecutor.java:1043)
>>>    [junit4]    >         at java.util.concurrent.ThreadPoolExecutor.runWorker(ThreadPoolExecutor.java:1103)
>>>    [junit4]    >         at java.util.concurrent.ThreadPoolExecutor$Worker.run(ThreadPoolExecutor.java:603)
>>>    [junit4]    >         at java.lang.Thread.run(Thread.java:722)
>>>    [junit4]    >        at __randomizedtesting.SeedInfo.seed([6A8BC03A6E804E02]:0)Throwable #2: com.carrotsearch.randomizedtesting.ThreadLeakError: There are still zombie threads that couldn't be terminated:
>>>    [junit4]    >    1) Thread[id=219, name=TestSearcherManager-1-thread-6, state=TIMED_WAITING, group=TGRP-TestSearcherManager]
>>>    [junit4]    >         at sun.misc.Unsafe.park(Native Method)
>>>    [junit4]    >         at java.util.concurrent.locks.LockSupport.parkNanos(LockSupport.java:226)
>>>    [junit4]    >         at java.util.concurrent.SynchronousQueue$TransferStack.awaitFulfill(SynchronousQueue.java:460)
>>>    [junit4]    >         at java.util.concurrent.SynchronousQueue$TransferStack.transfer(SynchronousQueue.java:359)
>>>    [junit4]    >         at java.util.concurrent.SynchronousQueue.poll(SynchronousQueue.java:942)
>>>    [junit4]    >         at java.util.concurrent.ThreadPoolExecutor.getTask(ThreadPoolExecutor.java:1043)
>>>    [junit4]    >         at java.util.concurrent.ThreadPoolExecutor.runWorker(ThreadPoolExecutor.java:1103)
>>>    [junit4]    >         at java.util.concurrent.ThreadPoolExecutor$Worker.run(ThreadPoolExecutor.java:603)
>>>    [junit4]    >         at java.lang.Thread.run(Thread.java:722)
>>>    [junit4]    >    2) Thread[id=220, name=TestSearcherManager-1-thread-7, state=TIMED_WAITING, group=TGRP-TestSearcherManager]
>>>    [junit4]    >         at sun.misc.Unsafe.park(Native Method)
>>>    [junit4]    >         at java.util.concurrent.locks.LockSupport.parkNanos(LockSupport.java:226)
>>>    [junit4]    >         at java.util.concurrent.SynchronousQueue$TransferStack.awaitFulfill(SynchronousQueue.java:460)
>>>    [junit4]    >         at java.util.concurrent.SynchronousQueue$TransferStack.transfer(SynchronousQueue.java:359)
>>>    [junit4]    >         at java.util.concurrent.SynchronousQueue.poll(SynchronousQueue.java:942)
>>>    [junit4]    >         at java.util.concurrent.ThreadPoolExecutor.getTask(ThreadPoolExecutor.java:1043)
>>>    [junit4]    >         at java.util.concurrent.ThreadPoolExecutor.runWorker(ThreadPoolExecutor.java:1103)
>>>    [junit4]    >         at java.util.concurrent.ThreadPoolExecutor$Worker.run(ThreadPoolExecutor.java:603)
>>>    [junit4]    >         at java.lang.Thread.run(Thread.java:722)
>>>    [junit4]    >    3) Thread[id=217, name=TestSearcherManager-1-thread-4, state=TIMED_WAITING, group=TGRP-TestSearcherManager]
>>>    [junit4]    >         at sun.misc.Unsafe.park(Native Method)
>>>    [junit4]    >         at java.util.concurrent.locks.LockSupport.parkNanos(LockSupport.java:226)
>>>    [junit4]    >         at java.util.concurrent.SynchronousQueue$TransferStack.awaitFulfill(SynchronousQueue.java:460)
>>>    [junit4]    >         at java.util.concurrent.SynchronousQueue$TransferStack.transfer(SynchronousQueue.java:359)
>>>    [junit4]    >         at java.util.concurrent.SynchronousQueue.poll(SynchronousQueue.java:942)
>>>    [junit4]    >         at java.util.concurrent.ThreadPoolExecutor.getTask(ThreadPoolExecutor.java:1043)
>>>    [junit4]    >         at java.util.concurrent.ThreadPoolExecutor.runWorker(ThreadPoolExecutor.java:1103)
>>>    [junit4]    >         at java.util.concurrent.ThreadPoolExecutor$Worker.run(ThreadPoolExecutor.java:603)
>>>    [junit4]    >         at java.lang.Thread.run(Thread.java:722)
>>>    [junit4]    >    4) Thread[id=218, name=TestSearcherManager-1-thread-5, state=TIMED_WAITING, group=TGRP-TestSearcherManager]
>>>    [junit4]    >         at sun.misc.Unsafe.park(Native Method)
>>>    [junit4]    >         at java.util.concurrent.locks.LockSupport.parkNanos(LockSupport.java:226)
>>>    [junit4]    >         at java.util.concurrent.SynchronousQueue$TransferStack.awaitFulfill(SynchronousQueue.java:460)
>>>    [junit4]    >         at java.util.concurrent.SynchronousQueue$TransferStack.transfer(SynchronousQueue.java:359)
>>>    [junit4]    >         at java.util.concurrent.SynchronousQueue.poll(SynchronousQueue.java:942)
>>>    [junit4]    >         at java.util.concurrent.ThreadPoolExecutor.getTask(ThreadPoolExecutor.java:1043)
>>>    [junit4]    >         at java.util.concurrent.ThreadPoolExecutor.runWorker(ThreadPoolExecutor.java:1103)
>>>    [junit4]    >         at java.util.concurrent.ThreadPoolExecutor$Worker.run(ThreadPoolExecutor.java:603)
>>>    [junit4]    >         at java.lang.Thread.run(Thread.java:722)
>>>    [junit4]    >    5) Thread[id=213, name=TestSearcherManager-1-thread-1, state=TIMED_WAITING, group=TGRP-TestSearcherManager]
>>>    [junit4]    >         at sun.misc.Unsafe.park(Native Method)
>>>    [junit4]    >         at java.util.concurrent.locks.LockSupport.parkNanos(LockSupport.java:226)
>>>    [junit4]    >         at java.util.concurrent.SynchronousQueue$TransferStack.awaitFulfill(SynchronousQueue.java:460)
>>>    [junit4]    >         at java.util.concurrent.SynchronousQueue$TransferStack.transfer(SynchronousQueue.java:359)
>>>    [junit4]    >         at java.util.concurrent.SynchronousQueue.poll(SynchronousQueue.java:942)
>>>    [junit4]    >         at java.util.concurrent.ThreadPoolExecutor.getTask(ThreadPoolExecutor.java:1043)
>>>    [junit4]    >         at java.util.concurrent.ThreadPoolExecutor.runWorker(ThreadPoolExecutor.java:1103)
>>>    [junit4]    >         at java.util.concurrent.ThreadPoolExecutor$Worker.run(ThreadPoolExecutor.java:603)
>>>    [junit4]    >         at java.lang.Thread.run(Thread.java:722)
>>>    [junit4]    >    6) Thread[id=214, name=TestSearcherManager-1-thread-2, state=TIMED_WAITING, group=TGRP-TestSearcherManager]
>>>    [junit4]    >         at sun.misc.Unsafe.park(Native Method)
>>>    [junit4]    >         at java.util.concurrent.locks.LockSupport.parkNanos(LockSupport.java:226)
>>>    [junit4]    >         at java.util.concurrent.SynchronousQueue$TransferStack.awaitFulfill(SynchronousQueue.java:460)
>>>    [junit4]    >         at java.util.concurrent.SynchronousQueue$TransferStack.transfer(SynchronousQueue.java:359)
>>>    [junit4]    >         at java.util.concurrent.SynchronousQueue.poll(SynchronousQueue.java:942)
>>>    [junit4]    >         at java.util.concurrent.ThreadPoolExecutor.getTask(ThreadPoolExecutor.java:1043)
>>>    [junit4]    >         at java.util.concurrent.ThreadPoolExecutor.runWorker(ThreadPoolExecutor.java:1103)
>>>    [junit4]    >         at java.util.concurrent.ThreadPoolExecutor$Worker.run(ThreadPoolExecutor.java:603)
>>>    [junit4]    >         at java.lang.Thread.run(Thread.java:722)
>>>    [junit4]    >    7) Thread[id=216, name=TestSearcherManager-1-thread-3, state=TIMED_WAITING, group=TGRP-TestSearcherManager]
>>>    [junit4]    >         at sun.misc.Unsafe.park(Native Method)
>>>    [junit4]    >         at java.util.concurrent.locks.LockSupport.parkNanos(LockSupport.java:226)
>>>    [junit4]    >         at java.util.concurrent.SynchronousQueue$TransferStack.awaitFulfill(SynchronousQueue.java:460)
>>>    [junit4]    >         at java.util.concurrent.SynchronousQueue$TransferStack.transfer(SynchronousQueue.java:359)
>>>    [junit4]    >         at java.util.concurrent.SynchronousQueue.poll(SynchronousQueue.java:942)
>>>    [junit4]    >         at java.util.concurrent.ThreadPoolExecutor.getTask(ThreadPoolExecutor.java:1043)
>>>    [junit4]    >         at java.util.concurrent.ThreadPoolExecutor.runWorker(ThreadPoolExecutor.java:1103)
>>>    [junit4]    >         at java.util.concurrent.ThreadPoolExecutor$Worker.run(ThreadPoolExecutor.java:603)
>>>    [junit4]    >         at java.lang.Thread.run(Thread.java:722)
>>>    [junit4]    >    8) Thread[id=221, name=TestSearcherManager-1-thread-8, state=TIMED_WAITING, group=TGRP-TestSearcherManager]
>>>    [junit4]    >         at sun.misc.Unsafe.park(Native Method)
>>>    [junit4]    >         at java.util.concurrent.locks.LockSupport.parkNanos(LockSupport.java:226)
>>>    [junit4]    >         at java.util.concurrent.SynchronousQueue$TransferStack.awaitFulfill(SynchronousQueue.java:460)
>>>    [junit4]    >         at java.util.concurrent.SynchronousQueue$TransferStack.transfer(SynchronousQueue.java:359)
>>>    [junit4]    >         at java.util.concurrent.SynchronousQueue.poll(SynchronousQueue.java:942)
>>>    [junit4]    >         at java.util.concurrent.ThreadPoolExecutor.getTask(ThreadPoolExecutor.java:1043)
>>>    [junit4]    >         at java.util.concurrent.ThreadPoolExecutor.runWorker(ThreadPoolExecutor.java:1103)
>>>    [junit4]    >         at java.util.concurrent.ThreadPoolExecutor$Worker.run(ThreadPoolExecutor.java:603)
>>>    [junit4]    >         at java.lang.Thread.run(Thread.java:722)
>>>    [junit4]    >        at __randomizedtesting.SeedInfo.seed([6A8BC03A6E804E02]:0)
>>>    [junit4] Completed on J2 in 28.86s, 7 tests, 1 failure, 2 errors <<< FAILURES!
>>>
>>> [...truncated 343 lines...]
>>>    [junit4] Suite: org.apache.lucene.util.junitcompat.TestFailIfUnreferencedFiles
>>>    [junit4]   1> sysout from nested test:
>>>    [junit4]   1>
>>>    [junit4]   1> syserr from nested test:
>>>    [junit4] FAILURE 0.05s J2 | TestFailIfUnreferencedFiles.testFailIfUnreferencedFiles <<<
>>>    [junit4]    > Throwable #1: java.lang.AssertionError: expected:<1> but was:<0>
>>>    [junit4]    >        at org.apache.lucene.util.junitcompat.TestFailIfUnreferencedFiles.testFailIfUnreferencedFiles(TestFailIfUnreferencedFiles.java:56)
>>>    [junit4] Completed on J2 in 0.06s, 1 test, 1 failure <<< FAILURES!
>>>
>>> [...truncated 63 lines...]
>>>    [junit4] Suite: org.apache.lucene.util.junitcompat.TestFailIfDirectoryNotClosed
>>>    [junit4]   1> sysout from nested test:
>>>    [junit4]   1>
>>>    [junit4]   1> syserr from nested test:
>>>    [junit4] FAILURE 0.04s J2 | TestFailIfDirectoryNotClosed.testFailIfDirectoryNotClosed <<<
>>>    [junit4]    > Throwable #1: java.lang.AssertionError: expected:<1> but was:<0>
>>>    [junit4]    >        at org.apache.lucene.util.junitcompat.TestFailIfDirectoryNotClosed.testFailIfDirectoryNotClosed(TestFailIfDirectoryNotClosed.java:45)
>>>    [junit4] Completed on J2 in 0.05s, 1 test, 1 failure <<< FAILURES!
>>>
>>> [...truncated 110 lines...]
>>> BUILD FAILED
>>> /var/lib/jenkins/workspace/Lucene-trunk-Linux-Java7-64-test-only/checkout/lucene/build.xml:49: The following error occurred while executing this line:
>>> /var/lib/jenkins/workspace/Lucene-trunk-Linux-Java7-64-test-only/checkout/lucene/common-build.xml:1230: The following error occurred while executing this line:
>>> /var/lib/jenkins/workspace/Lucene-trunk-Linux-Java7-64-test-only/checkout/lucene/common-build.xml:873: There were test failures: 368 suites, 2606 tests, 2 suite-level errors, 3 failures, 520 ignored (83 assumptions)
>>>
>>> Total time: 4 minutes 28 seconds
>>> Build step 'Invoke Ant' marked build as failure
>>> Archiving artifacts
>>> Recording test results
>>> Email was triggered for: Failure
>>> Sending email for trigger: Failure
>>>
>>>
>>>
>>>
>>> ---------------------------------------------------------------------
>>> To unsubscribe, e-mail: dev-unsubscribe@lucene.apache.org
>>> For additional commands, e-mail: dev-help@lucene.apache.org
>>
>> ---------------------------------------------------------------------
>> To unsubscribe, e-mail: dev-unsubscribe@lucene.apache.org
>> For additional commands, e-mail: dev-help@lucene.apache.org
>>
>
> ---------------------------------------------------------------------
> To unsubscribe, e-mail: dev-unsubscribe@lucene.apache.org
> For additional commands, e-mail: dev-help@lucene.apache.org
>

---------------------------------------------------------------------
To unsubscribe, e-mail: dev-unsubscribe@lucene.apache.org
For additional commands, e-mail: dev-help@lucene.apache.org


Mime
View raw message