lucene-dev mailing list archives

Site index · List index
Message view « Date » · « Thread »
Top « Date » · « Thread »
From Policeman Jenkins Server <jenk...@thetaphi.de>
Subject [JENKINS] Lucene-Solr-4.x-Linux (64bit/jdk1.7.0_25) - Build # 7308 - Failure!
Date Tue, 10 Sep 2013 05:55:26 GMT
Build: http://jenkins.thetaphi.de/job/Lucene-Solr-4.x-Linux/7308/
Java: 64bit/jdk1.7.0_25 -XX:+UseCompressedOops -XX:+UseParallelGC

1 tests failed.
REGRESSION:  org.apache.solr.cloud.SliceStateUpdateTest.testSliceStateUpdate

Error Message:
expected:<[in]active> but was:<[]active>

Stack Trace:
org.junit.ComparisonFailure: expected:<[in]active> but was:<[]active>
	at __randomizedtesting.SeedInfo.seed([6C37A80B5C2F9E03:BC55254702FA4487]:0)
	at org.junit.Assert.assertEquals(Assert.java:125)
	at org.junit.Assert.assertEquals(Assert.java:147)
	at org.apache.solr.cloud.SliceStateUpdateTest.testSliceStateUpdate(SliceStateUpdateTest.java:183)
	at sun.reflect.NativeMethodAccessorImpl.invoke0(Native Method)
	at sun.reflect.NativeMethodAccessorImpl.invoke(NativeMethodAccessorImpl.java:57)
	at sun.reflect.DelegatingMethodAccessorImpl.invoke(DelegatingMethodAccessorImpl.java:43)
	at java.lang.reflect.Method.invoke(Method.java:606)
	at com.carrotsearch.randomizedtesting.RandomizedRunner.invoke(RandomizedRunner.java:1559)
	at com.carrotsearch.randomizedtesting.RandomizedRunner.access$600(RandomizedRunner.java:79)
	at com.carrotsearch.randomizedtesting.RandomizedRunner$6.evaluate(RandomizedRunner.java:737)
	at com.carrotsearch.randomizedtesting.RandomizedRunner$7.evaluate(RandomizedRunner.java:773)
	at com.carrotsearch.randomizedtesting.RandomizedRunner$8.evaluate(RandomizedRunner.java:787)
	at com.carrotsearch.randomizedtesting.rules.SystemPropertiesRestoreRule$1.evaluate(SystemPropertiesRestoreRule.java:53)
	at org.apache.lucene.util.TestRuleSetupTeardownChained$1.evaluate(TestRuleSetupTeardownChained.java:50)
	at org.apache.lucene.util.TestRuleFieldCacheSanity$1.evaluate(TestRuleFieldCacheSanity.java:51)
	at org.apache.lucene.util.AbstractBeforeAfterRule$1.evaluate(AbstractBeforeAfterRule.java:46)
	at com.carrotsearch.randomizedtesting.rules.SystemPropertiesInvariantRule$1.evaluate(SystemPropertiesInvariantRule.java:55)
	at org.apache.lucene.util.TestRuleThreadAndTestName$1.evaluate(TestRuleThreadAndTestName.java:49)
	at org.apache.lucene.util.TestRuleIgnoreAfterMaxFailures$1.evaluate(TestRuleIgnoreAfterMaxFailures.java:70)
	at org.apache.lucene.util.TestRuleMarkFailure$1.evaluate(TestRuleMarkFailure.java:48)
	at com.carrotsearch.randomizedtesting.rules.StatementAdapter.evaluate(StatementAdapter.java:36)
	at com.carrotsearch.randomizedtesting.ThreadLeakControl$StatementRunner.run(ThreadLeakControl.java:358)
	at com.carrotsearch.randomizedtesting.ThreadLeakControl.forkTimeoutingTask(ThreadLeakControl.java:782)
	at com.carrotsearch.randomizedtesting.ThreadLeakControl$3.evaluate(ThreadLeakControl.java:442)
	at com.carrotsearch.randomizedtesting.RandomizedRunner.runSingleTest(RandomizedRunner.java:746)
	at com.carrotsearch.randomizedtesting.RandomizedRunner$3.evaluate(RandomizedRunner.java:648)
	at com.carrotsearch.randomizedtesting.RandomizedRunner$4.evaluate(RandomizedRunner.java:682)
	at com.carrotsearch.randomizedtesting.RandomizedRunner$5.evaluate(RandomizedRunner.java:693)
	at com.carrotsearch.randomizedtesting.rules.StatementAdapter.evaluate(StatementAdapter.java:36)
	at com.carrotsearch.randomizedtesting.rules.SystemPropertiesRestoreRule$1.evaluate(SystemPropertiesRestoreRule.java:53)
	at org.apache.lucene.util.AbstractBeforeAfterRule$1.evaluate(AbstractBeforeAfterRule.java:46)
	at org.apache.lucene.util.TestRuleStoreClassName$1.evaluate(TestRuleStoreClassName.java:42)
	at com.carrotsearch.randomizedtesting.rules.SystemPropertiesInvariantRule$1.evaluate(SystemPropertiesInvariantRule.java:55)
	at com.carrotsearch.randomizedtesting.rules.NoShadowingOrOverridesOnMethodsRule$1.evaluate(NoShadowingOrOverridesOnMethodsRule.java:39)
	at com.carrotsearch.randomizedtesting.rules.NoShadowingOrOverridesOnMethodsRule$1.evaluate(NoShadowingOrOverridesOnMethodsRule.java:39)
	at com.carrotsearch.randomizedtesting.rules.StatementAdapter.evaluate(StatementAdapter.java:36)
	at org.apache.lucene.util.TestRuleAssertionsRequired$1.evaluate(TestRuleAssertionsRequired.java:43)
	at org.apache.lucene.util.TestRuleMarkFailure$1.evaluate(TestRuleMarkFailure.java:48)
	at org.apache.lucene.util.TestRuleIgnoreAfterMaxFailures$1.evaluate(TestRuleIgnoreAfterMaxFailures.java:70)
	at org.apache.lucene.util.TestRuleIgnoreTestSuites$1.evaluate(TestRuleIgnoreTestSuites.java:55)
	at com.carrotsearch.randomizedtesting.rules.StatementAdapter.evaluate(StatementAdapter.java:36)
	at com.carrotsearch.randomizedtesting.ThreadLeakControl$StatementRunner.run(ThreadLeakControl.java:358)
	at java.lang.Thread.run(Thread.java:724)




Build Log:
[...truncated 9918 lines...]
   [junit4] Suite: org.apache.solr.cloud.SliceStateUpdateTest
   [junit4]   2> 389496 T2226 oas.SolrTestCaseJ4.setUp ###Starting testSliceStateUpdate
   [junit4]   2> Creating dataDir: /mnt/ssd/jenkins/workspace/Lucene-Solr-4.x-Linux/solr/build/solr-core/test/J0/./solrtest-SliceStateUpdateTest-1378791635166
   [junit4]   2> 389497 T2226 oasc.ZkTestServer.run STARTING ZK TEST SERVER
   [junit4]   2> 389497 T2227 oasc.ZkTestServer$ZKServerMain.runFromConfig Starting server
   [junit4]   2> 389597 T2226 oasc.ZkTestServer.run start zk server on port:60127
   [junit4]   2> 389598 T2226 oascc.ConnectionManager.waitForConnected Waiting for client to connect to ZooKeeper
   [junit4]   2> 389680 T2233 oascc.ConnectionManager.process Watcher org.apache.solr.common.cloud.ConnectionManager@ac69cfe name:ZooKeeperConnection Watcher:127.0.0.1:60127 got event WatchedEvent state:SyncConnected type:None path:null path:null type:None
   [junit4]   2> 389680 T2226 oascc.ConnectionManager.waitForConnected Client is connected to ZooKeeper
   [junit4]   2> 389680 T2226 oascc.SolrZkClient.makePath makePath: /solr
   [junit4]   2> 389684 T2226 oascc.ConnectionManager.waitForConnected Waiting for client to connect to ZooKeeper
   [junit4]   2> 389686 T2235 oascc.ConnectionManager.process Watcher org.apache.solr.common.cloud.ConnectionManager@18e206c8 name:ZooKeeperConnection Watcher:127.0.0.1:60127/solr got event WatchedEvent state:SyncConnected type:None path:null path:null type:None
   [junit4]   2> 389686 T2226 oascc.ConnectionManager.waitForConnected Client is connected to ZooKeeper
   [junit4]   2> 389686 T2226 oascc.SolrZkClient.makePath makePath: /collections/collection1
   [junit4]   2> 389688 T2226 oascc.SolrZkClient.makePath makePath: /collections/collection1/shards
   [junit4]   2> 389689 T2226 oascc.SolrZkClient.makePath makePath: /collections/control_collection
   [junit4]   2> 389691 T2226 oascc.SolrZkClient.makePath makePath: /collections/control_collection/shards
   [junit4]   2> 389692 T2226 oasc.AbstractZkTestCase.putConfig put /mnt/ssd/jenkins/workspace/Lucene-Solr-4.x-Linux/solr/build/solr-core/test-files/solr/collection1/conf/solrconfig.xml to /configs/conf1/solrconfig.xml
   [junit4]   2> 389692 T2226 oascc.SolrZkClient.makePath makePath: /configs/conf1/solrconfig.xml
   [junit4]   2> 389695 T2226 oasc.AbstractZkTestCase.putConfig put /mnt/ssd/jenkins/workspace/Lucene-Solr-4.x-Linux/solr/build/solr-core/test-files/solr/collection1/conf/schema.xml to /configs/conf1/schema.xml
   [junit4]   2> 389695 T2226 oascc.SolrZkClient.makePath makePath: /configs/conf1/schema.xml
   [junit4]   2> 389699 T2226 oasc.AbstractZkTestCase.putConfig put /mnt/ssd/jenkins/workspace/Lucene-Solr-4.x-Linux/solr/build/solr-core/test-files/solr/collection1/conf/solrconfig.snippet.randomindexconfig.xml to /configs/conf1/solrconfig.snippet.randomindexconfig.xml
   [junit4]   2> 389700 T2226 oascc.SolrZkClient.makePath makePath: /configs/conf1/solrconfig.snippet.randomindexconfig.xml
   [junit4]   2> 389701 T2226 oasc.AbstractZkTestCase.putConfig put /mnt/ssd/jenkins/workspace/Lucene-Solr-4.x-Linux/solr/build/solr-core/test-files/solr/collection1/conf/stopwords.txt to /configs/conf1/stopwords.txt
   [junit4]   2> 389702 T2226 oascc.SolrZkClient.makePath makePath: /configs/conf1/stopwords.txt
   [junit4]   2> 389703 T2226 oasc.AbstractZkTestCase.putConfig put /mnt/ssd/jenkins/workspace/Lucene-Solr-4.x-Linux/solr/build/solr-core/test-files/solr/collection1/conf/protwords.txt to /configs/conf1/protwords.txt
   [junit4]   2> 389703 T2226 oascc.SolrZkClient.makePath makePath: /configs/conf1/protwords.txt
   [junit4]   2> 389705 T2226 oasc.AbstractZkTestCase.putConfig put /mnt/ssd/jenkins/workspace/Lucene-Solr-4.x-Linux/solr/build/solr-core/test-files/solr/collection1/conf/currency.xml to /configs/conf1/currency.xml
   [junit4]   2> 389705 T2226 oascc.SolrZkClient.makePath makePath: /configs/conf1/currency.xml
   [junit4]   2> 389706 T2226 oasc.AbstractZkTestCase.putConfig put /mnt/ssd/jenkins/workspace/Lucene-Solr-4.x-Linux/solr/build/solr-core/test-files/solr/collection1/conf/open-exchange-rates.json to /configs/conf1/open-exchange-rates.json
   [junit4]   2> 389707 T2226 oascc.SolrZkClient.makePath makePath: /configs/conf1/open-exchange-rates.json
   [junit4]   2> 389708 T2226 oasc.AbstractZkTestCase.putConfig put /mnt/ssd/jenkins/workspace/Lucene-Solr-4.x-Linux/solr/build/solr-core/test-files/solr/collection1/conf/mapping-ISOLatin1Accent.txt to /configs/conf1/mapping-ISOLatin1Accent.txt
   [junit4]   2> 389709 T2226 oascc.SolrZkClient.makePath makePath: /configs/conf1/mapping-ISOLatin1Accent.txt
   [junit4]   2> 389710 T2226 oasc.AbstractZkTestCase.putConfig put /mnt/ssd/jenkins/workspace/Lucene-Solr-4.x-Linux/solr/build/solr-core/test-files/solr/collection1/conf/old_synonyms.txt to /configs/conf1/old_synonyms.txt
   [junit4]   2> 389710 T2226 oascc.SolrZkClient.makePath makePath: /configs/conf1/old_synonyms.txt
   [junit4]   2> 389712 T2226 oasc.AbstractZkTestCase.putConfig put /mnt/ssd/jenkins/workspace/Lucene-Solr-4.x-Linux/solr/build/solr-core/test-files/solr/collection1/conf/synonyms.txt to /configs/conf1/synonyms.txt
   [junit4]   2> 389712 T2226 oascc.SolrZkClient.makePath makePath: /configs/conf1/synonyms.txt
   [junit4]   2> 389714 T2226 oasc.SliceStateUpdateTest.setUp ####SETUP_START testSliceStateUpdate
   [junit4]   2> 389714 T2226 oascc.ConnectionManager.waitForConnected Waiting for client to connect to ZooKeeper
   [junit4]   2> 389715 T2237 oascc.ConnectionManager.process Watcher org.apache.solr.common.cloud.ConnectionManager@60f5b1db name:ZooKeeperConnection Watcher:127.0.0.1:60127/solr got event WatchedEvent state:SyncConnected type:None path:null path:null type:None
   [junit4]   2> 389716 T2226 oascc.ConnectionManager.waitForConnected Client is connected to ZooKeeper
   [junit4]   2> 389716 T2226 oascc.SolrZkClient.makePath makePath: /collections/testcore
   [junit4]   2> 389717 T2226 oascc.SolrZkClient.makePath makePath: /collections/testcore/shards
   [junit4]   2> 389720 T2226 oasc.SolrResourceLoader.locateSolrHome JNDI not configured for solr (NoInitialContextEx)
   [junit4]   2> 389720 T2226 oasc.SolrResourceLoader.locateSolrHome using system property solr.solr.home: /mnt/ssd/jenkins/workspace/Lucene-Solr-4.x-Linux/solr/build/solr-core/test-files/solr
   [junit4]   2> 389720 T2226 oasc.SolrResourceLoader.<init> new SolrResourceLoader for directory: '/mnt/ssd/jenkins/workspace/Lucene-Solr-4.x-Linux/solr/build/solr-core/test-files/solr/'
   [junit4]   2> 389729 T2226 oasc.ConfigSolr.fromFile Loading container configuration from /mnt/ssd/jenkins/workspace/Lucene-Solr-4.x-Linux/solr/build/solr-core/test-files/solr/solr.xml
   [junit4]   2> 389756 T2226 oasc.CoreContainer.<init> New CoreContainer 537389349
   [junit4]   2> 389756 T2226 oasc.SolrResourceLoader.locateSolrHome JNDI not configured for solr (NoInitialContextEx)
   [junit4]   2> 389757 T2226 oasc.SolrResourceLoader.locateSolrHome using system property solr.solr.home: /mnt/ssd/jenkins/workspace/Lucene-Solr-4.x-Linux/solr/build/solr-core/test-files/solr
   [junit4]   2> 389757 T2226 oasc.SolrResourceLoader.<init> new SolrResourceLoader for directory: '/mnt/ssd/jenkins/workspace/Lucene-Solr-4.x-Linux/solr/build/solr-core/test-files/solr/'
   [junit4]   2> 389764 T2226 oasc.ConfigSolr.fromFile Loading container configuration from /mnt/ssd/jenkins/workspace/Lucene-Solr-4.x-Linux/solr/build/solr-core/test-files/solr/solr.xml
   [junit4]   2> 389797 T2226 oasc.CoreContainer.<init> New CoreContainer 1462515663
   [junit4]   2> 389797 T2226 oasc.CoreContainer.load Loading cores into CoreContainer [instanceDir=/mnt/ssd/jenkins/workspace/Lucene-Solr-4.x-Linux/solr/build/solr-core/test-files/solr/]
   [junit4]   2> 389798 T2226 oashc.HttpShardHandlerFactory.getParameter Setting socketTimeout to: 120000
   [junit4]   2> 389798 T2226 oashc.HttpShardHandlerFactory.getParameter Setting urlScheme to: http://
   [junit4]   2> 389798 T2226 oashc.HttpShardHandlerFactory.getParameter Setting connTimeout to: 15000
   [junit4]   2> 389798 T2226 oashc.HttpShardHandlerFactory.getParameter Setting maxConnectionsPerHost to: 20
   [junit4]   2> 389799 T2226 oashc.HttpShardHandlerFactory.getParameter Setting corePoolSize to: 0
   [junit4]   2> 389799 T2226 oashc.HttpShardHandlerFactory.getParameter Setting maximumPoolSize to: 2147483647
   [junit4]   2> 389799 T2226 oashc.HttpShardHandlerFactory.getParameter Setting maxThreadIdleTime to: 5
   [junit4]   2> 389799 T2226 oashc.HttpShardHandlerFactory.getParameter Setting sizeOfQueue to: -1
   [junit4]   2> 389799 T2226 oashc.HttpShardHandlerFactory.getParameter Setting fairnessPolicy to: false
   [junit4]   2> 389800 T2226 oascsi.HttpClientUtil.createClient Creating new http client, config:maxConnectionsPerHost=20&maxConnections=10000&socketTimeout=120000&connTimeout=15000&retry=false
   [junit4]   2> 389802 T2226 oasl.LogWatcher.createWatcher SLF4J impl is org.slf4j.impl.Log4jLoggerFactory
   [junit4]   2> 389803 T2226 oasl.LogWatcher.newRegisteredLogWatcher Registering Log Listener [Log4j (org.slf4j.impl.Log4jLoggerFactory)]
   [junit4]   2> 389803 T2226 oasc.ZkContainer.initZooKeeper Zookeeper client=127.0.0.1:60127/solr
   [junit4]   2> 389803 T2226 oasc.ZkController.checkChrootPath zkHost includes chroot
   [junit4]   2> 389804 T2226 oascc.ConnectionManager.waitForConnected Waiting for client to connect to ZooKeeper
   [junit4]   2> 389806 T2239 oascc.ConnectionManager.process Watcher org.apache.solr.common.cloud.ConnectionManager@60d1a341 name:ZooKeeperConnection Watcher:127.0.0.1:60127 got event WatchedEvent state:SyncConnected type:None path:null path:null type:None
   [junit4]   2> 389807 T2226 oascc.ConnectionManager.waitForConnected Client is connected to ZooKeeper
   [junit4]   2> 389808 T2226 oascsi.HttpClientUtil.createClient Creating new http client, config:maxConnections=500&maxConnectionsPerHost=16&socketTimeout=120000&connTimeout=15000
   [junit4]   2> 389810 T2226 oascc.ConnectionManager.waitForConnected Waiting for client to connect to ZooKeeper
   [junit4]   2> 389811 T2241 oascc.ConnectionManager.process Watcher org.apache.solr.common.cloud.ConnectionManager@131ede8b name:ZooKeeperConnection Watcher:127.0.0.1:60127/solr got event WatchedEvent state:SyncConnected type:None path:null path:null type:None
   [junit4]   2> 389812 T2226 oascc.ConnectionManager.waitForConnected Client is connected to ZooKeeper
   [junit4]   2> 389813 T2226 oascc.SolrZkClient.makePath makePath: /overseer/queue
   [junit4]   2> 389814 T2226 oascc.SolrZkClient.makePath makePath: /overseer/collection-queue-work
   [junit4]   2> 389816 T2226 oascc.SolrZkClient.makePath makePath: /live_nodes
   [junit4]   2> 389817 T2226 oasc.ZkController.createEphemeralLiveNode Register node as live in ZooKeeper:/live_nodes/127.0.0.1:8983_solr
   [junit4]   2> 389817 T2226 oascc.SolrZkClient.makePath makePath: /live_nodes/127.0.0.1:8983_solr
   [junit4]   2> 389819 T2226 oascc.SolrZkClient.makePath makePath: /overseer_elect/election
   [junit4]   2> 389821 T2226 oascc.SolrZkClient.makePath makePath: /overseer_elect/leader
   [junit4]   2> 389822 T2226 oasc.Overseer.start Overseer (id=90360488602370052-127.0.0.1:8983_solr-n_0000000000) starting
   [junit4]   2> 389824 T2226 oascc.SolrZkClient.makePath makePath: /overseer/queue-work
   [junit4]   2> 389826 T2243 oasc.OverseerCollectionProcessor.run Process current queue of collection creations
   [junit4]   2> 389826 T2226 oascc.SolrZkClient.makePath makePath: /clusterstate.json
   [junit4]   2> 389827 T2226 oascc.SolrZkClient.makePath makePath: /aliases.json
   [junit4]   2> 389829 T2226 oascc.ZkStateReader.createClusterStateWatchersAndUpdate Updating cluster state from ZooKeeper... 
   [junit4]   2> 389831 T2242 oasc.Overseer$ClusterStateUpdater.run Starting to work on the main queue
   [junit4]   2> 389833 T2244 oasc.ZkController.publish publishing core=collection1 state=down
   [junit4]   2> 389834 T2244 oasc.ZkController.publish numShards not found on descriptor - reading it from system property
   [junit4]   2> 389836 T2244 oasc.ZkController.waitForCoreNodeName look for our core node name
   [junit4]   2> 391335 T2242 oascc.ZkStateReader.updateClusterState Updating cloud state from ZooKeeper... 
   [junit4]   2> 391336 T2242 oasc.Overseer$ClusterStateUpdater.updateState Update state numShards=null message={
   [junit4]   2> 	  "operation":"state",
   [junit4]   2> 	  "core_node_name":"core_node1",
   [junit4]   2> 	  "numShards":null,
   [junit4]   2> 	  "shard":null,
   [junit4]   2> 	  "roles":null,
   [junit4]   2> 	  "state":"down",
   [junit4]   2> 	  "shard_state":"active",
   [junit4]   2> 	  "core":"collection1",
   [junit4]   2> 	  "collection":"collection1",
   [junit4]   2> 	  "shard_range":null,
   [junit4]   2> 	  "node_name":"127.0.0.1:8983_solr",
   [junit4]   2> 	  "base_url":"http://127.0.0.1:8983/solr"}
   [junit4]   2> 391336 T2242 oasc.Overseer$ClusterStateUpdater.updateState Assigning new node to shard shard=shard1
   [junit4]   2> 391341 T2241 oascc.ZkStateReader$2.process A cluster state change: WatchedEvent state:SyncConnected type:NodeDataChanged path:/clusterstate.json, has occurred - updating... (live nodes size: 1)
   [junit4]   2> 391836 T2244 oasc.ZkController.waitForShardId waiting to find shard id in clusterstate for collection1
   [junit4]   2> 391836 T2244 oasc.CoreContainer.create Creating SolrCore 'collection1' using instanceDir: /mnt/ssd/jenkins/workspace/Lucene-Solr-4.x-Linux/solr/build/solr-core/test-files/solr/collection1
   [junit4]   2> 391837 T2244 oasc.ZkController.createCollectionZkNode Check for collection zkNode:collection1
   [junit4]   2> 391837 T2244 oasc.ZkController.createCollectionZkNode Collection zkNode exists
   [junit4]   2> 391837 T2244 oasc.ZkController.readConfigName Load collection config from:/collections/collection1
   [junit4]   2> 391838 T2244 oasc.SolrResourceLoader.<init> new SolrResourceLoader for directory: '/mnt/ssd/jenkins/workspace/Lucene-Solr-4.x-Linux/solr/build/solr-core/test-files/solr/collection1/'
   [junit4]   2> 391839 T2244 oasc.SolrResourceLoader.replaceClassLoader Adding 'file:/mnt/ssd/jenkins/workspace/Lucene-Solr-4.x-Linux/solr/build/solr-core/test-files/solr/collection1/lib/classes/' to classloader
   [junit4]   2> 391839 T2244 oasc.SolrResourceLoader.replaceClassLoader Adding 'file:/mnt/ssd/jenkins/workspace/Lucene-Solr-4.x-Linux/solr/build/solr-core/test-files/solr/collection1/lib/README' to classloader
   [junit4]   2> 391872 T2244 oasc.SolrConfig.<init> Using Lucene MatchVersion: LUCENE_45
   [junit4]   2> 391909 T2244 oasc.SolrConfig.<init> Loaded SolrConfig: solrconfig.xml
   [junit4]   2> 391910 T2244 oass.IndexSchema.readSchema Reading Solr Schema from schema.xml
   [junit4]   2> 391916 T2244 oass.IndexSchema.readSchema [null] Schema name=test
   [junit4]   2> 392191 T2244 oass.ByteField.init WARN ByteField is deprecated and will be removed in 5.0. You should use TrieIntField instead.
   [junit4]   2> 392192 T2244 oass.ShortField.init WARN ShortField is deprecated and will be removed in 5.0. You should use TrieIntField instead.
   [junit4]   2> 392192 T2244 oass.OpenExchangeRatesOrgProvider.init Initialized with rates=open-exchange-rates.json, refreshInterval=1440.
   [junit4]   2> 392197 T2244 oass.IndexSchema.readSchema default search field in schema is text
   [junit4]   2> 392199 T2244 oass.IndexSchema.readSchema unique key field: id
   [junit4]   2> 392209 T2244 oass.FileExchangeRateProvider.reload Reloading exchange rates from file currency.xml
   [junit4]   2> 392211 T2244 oass.FileExchangeRateProvider.reload Reloading exchange rates from file currency.xml
   [junit4]   2> 392214 T2244 oass.OpenExchangeRatesOrgProvider.reload Reloading exchange rates from open-exchange-rates.json
   [junit4]   2> 392214 T2244 oass.OpenExchangeRatesOrgProvider$OpenExchangeRates.<init> WARN Unknown key IMPORTANT NOTE
   [junit4]   2> 392214 T2244 oass.OpenExchangeRatesOrgProvider$OpenExchangeRates.<init> WARN Expected key, got STRING
   [junit4]   2> 392215 T2244 oass.OpenExchangeRatesOrgProvider.reload Reloading exchange rates from open-exchange-rates.json
   [junit4]   2> 392215 T2244 oass.OpenExchangeRatesOrgProvider$OpenExchangeRates.<init> WARN Unknown key IMPORTANT NOTE
   [junit4]   2> 392215 T2244 oass.OpenExchangeRatesOrgProvider$OpenExchangeRates.<init> WARN Expected key, got STRING
   [junit4]   2> 392215 T2244 oasc.SolrCore.initDirectoryFactory org.apache.solr.core.MockDirectoryFactory
   [junit4]   2> 392216 T2244 oasc.SolrCore.<init> [collection1] Opening new SolrCore at /mnt/ssd/jenkins/workspace/Lucene-Solr-4.x-Linux/solr/build/solr-core/test-files/solr/collection1/, dataDir=/mnt/ssd/jenkins/workspace/Lucene-Solr-4.x-Linux/solr/build/solr-core/test/J0/./solrtest-SliceStateUpdateTest-1378791635166/data2/
   [junit4]   2> 392216 T2244 oasc.JmxMonitoredMap.<init> JMX monitoring is enabled. Adding Solr mbeans to JMX Server: com.sun.jmx.mbeanserver.JmxMBeanServer@29200a7a
   [junit4]   2> 392216 T2244 oasc.CachingDirectoryFactory.get return new directory for /mnt/ssd/jenkins/workspace/Lucene-Solr-4.x-Linux/solr/build/solr-core/test/J0/./solrtest-SliceStateUpdateTest-1378791635166/data2
   [junit4]   2> 392217 T2244 oasc.SolrCore.getNewIndexDir New index directory detected: old=null new=/mnt/ssd/jenkins/workspace/Lucene-Solr-4.x-Linux/solr/build/solr-core/test/J0/./solrtest-SliceStateUpdateTest-1378791635166/data2/index/
   [junit4]   2> 392217 T2244 oasc.SolrCore.initIndex WARN [collection1] Solr index directory '/mnt/ssd/jenkins/workspace/Lucene-Solr-4.x-Linux/solr/build/solr-core/test/J0/./solrtest-SliceStateUpdateTest-1378791635166/data2/index' doesn't exist. Creating new index...
   [junit4]   2> 392217 T2244 oasc.CachingDirectoryFactory.get return new directory for /mnt/ssd/jenkins/workspace/Lucene-Solr-4.x-Linux/solr/build/solr-core/test/J0/./solrtest-SliceStateUpdateTest-1378791635166/data2/index
   [junit4]   2> 392217 T2244 oasu.RandomMergePolicy.<init> RandomMergePolicy wrapping class org.apache.lucene.index.LogDocMergePolicy: [LogDocMergePolicy: minMergeSize=1000, mergeFactor=32, maxMergeSize=9223372036854775807, maxMergeSizeForForcedMerge=9223372036854775807, calibrateSizeByDeletes=false, maxMergeDocs=2147483647, maxCFSSegmentSizeMB=8.796093022207999E12, noCFSRatio=1.0]
   [junit4]   2> 392218 T2244 oasc.SolrDeletionPolicy.onCommit SolrDeletionPolicy.onCommit: commits: num=1
   [junit4]   2> 		commit{dir=RateLimitedDirectoryWrapper(MockDirWrapper(org.apache.lucene.store.RAMDirectory@3b35dc09 lockFactory=org.apache.lucene.store.SingleInstanceLockFactory@37a9eb9d)),segFN=segments_1,generation=1}
   [junit4]   2> 392218 T2244 oasc.SolrDeletionPolicy.updateCommits newest commit generation = 1
   [junit4]   2> 392218 T2244 oasc.SolrCore.initWriters created xml: solr.XMLResponseWriter
   [junit4]   2> 392221 T2244 oasup.UpdateRequestProcessorChain.init creating updateRequestProcessorChain "dedupe"
   [junit4]   2> 392222 T2244 oasup.UpdateRequestProcessorChain.init inserting DistributedUpdateProcessorFactory into updateRequestProcessorChain "dedupe"
   [junit4]   2> 392222 T2244 oasup.UpdateRequestProcessorChain.init creating updateRequestProcessorChain "dedupe-allfields"
   [junit4]   2> 392222 T2244 oasup.UpdateRequestProcessorChain.init inserting DistributedUpdateProcessorFactory into updateRequestProcessorChain "dedupe-allfields"
   [junit4]   2> 392222 T2244 oasup.UpdateRequestProcessorChain.init creating updateRequestProcessorChain "stored_sig"
   [junit4]   2> 392223 T2244 oasup.UpdateRequestProcessorChain.init inserting DistributedUpdateProcessorFactory into updateRequestProcessorChain "stored_sig"
   [junit4]   2> 392223 T2244 oasup.UpdateRequestProcessorChain.init creating updateRequestProcessorChain "uniq-fields"
   [junit4]   2> 392223 T2244 oasup.UniqFieldsUpdateProcessorFactory.init WARN Use of the 'fields' init param in UniqFieldsUpdateProcessorFactory is deprecated, please use 'fieldName' (or another FieldMutatingUpdateProcessorFactory selector option) instead
   [junit4]   2> 392223 T2244 oasup.UniqFieldsUpdateProcessorFactory.init Replacing 'fields' init param with (individual) 'fieldName' params
   [junit4]   2> 392224 T2244 oasup.UpdateRequestProcessorChain.init inserting DistributedUpdateProcessorFactory into updateRequestProcessorChain "uniq-fields"
   [junit4]   2> 392224 T2244 oasup.UpdateRequestProcessorChain.init creating updateRequestProcessorChain "distrib-dup-test-chain-explicit"
   [junit4]   2> 392225 T2244 oasup.UpdateRequestProcessorChain.init creating updateRequestProcessorChain "distrib-dup-test-chain-implicit"
   [junit4]   2> 392225 T2244 oasup.UpdateRequestProcessorChain.init inserting DistributedUpdateProcessorFactory into updateRequestProcessorChain "distrib-dup-test-chain-implicit"
   [junit4]   2> 392225 T2244 oasc.SolrCore.loadUpdateProcessorChains no updateRequestProcessorChain defined as default, creating implicit default
   [junit4]   2> 392225 T2244 oasc.RequestHandlers.initHandlersFromConfig adding lazy requestHandler: solr.ReplicationHandler
   [junit4]   2> 392226 T2244 oasc.RequestHandlers.initHandlersFromConfig created /replication: solr.ReplicationHandler
   [junit4]   2> 392226 T2244 oasc.RequestHandlers.initHandlersFromConfig created standard: solr.StandardRequestHandler
   [junit4]   2> 392227 T2244 oasc.RequestHandlers.initHandlersFromConfig created /get: solr.RealTimeGetHandler
   [junit4]   2> 392227 T2244 oasc.RequestHandlers.initHandlersFromConfig created dismax: solr.SearchHandler
   [junit4]   2> 392228 T2244 oasc.RequestHandlers.initHandlersFromConfig created mock: org.apache.solr.core.MockQuerySenderListenerReqHandler
   [junit4]   2> 392228 T2244 oasc.RequestHandlers.initHandlersFromConfig created /admin/: org.apache.solr.handler.admin.AdminHandlers
   [junit4]   2> 392229 T2244 oasc.RequestHandlers.initHandlersFromConfig created defaults: solr.StandardRequestHandler
   [junit4]   2> 392229 T2244 oasc.RequestHandlers.initHandlersFromConfig adding lazy requestHandler: solr.StandardRequestHandler
   [junit4]   2> 392229 T2244 oasc.RequestHandlers.initHandlersFromConfig created lazy: solr.StandardRequestHandler
   [junit4]   2> 392230 T2244 oasc.RequestHandlers.initHandlersFromConfig created /update: solr.UpdateRequestHandler
   [junit4]   2> 392230 T2244 oasc.RequestHandlers.initHandlersFromConfig created /terms: org.apache.solr.handler.component.SearchHandler
   [junit4]   2> 392230 T2244 oasc.RequestHandlers.initHandlersFromConfig created spellCheckCompRH: org.apache.solr.handler.component.SearchHandler
   [junit4]   2> 392231 T2244 oasc.RequestHandlers.initHandlersFromConfig created spellCheckCompRH_Direct: org.apache.solr.handler.component.SearchHandler
   [junit4]   2> 392231 T2244 oasc.RequestHandlers.initHandlersFromConfig created spellCheckWithWordbreak: org.apache.solr.handler.component.SearchHandler
   [junit4]   2> 392232 T2244 oasc.RequestHandlers.initHandlersFromConfig created spellCheckWithWordbreak_Direct: org.apache.solr.handler.component.SearchHandler
   [junit4]   2> 392232 T2244 oasc.RequestHandlers.initHandlersFromConfig created spellCheckCompRH1: org.apache.solr.handler.component.SearchHandler
   [junit4]   2> 392233 T2244 oasc.RequestHandlers.initHandlersFromConfig created mltrh: org.apache.solr.handler.component.SearchHandler
   [junit4]   2> 392233 T2244 oasc.RequestHandlers.initHandlersFromConfig created tvrh: org.apache.solr.handler.component.SearchHandler
   [junit4]   2> 392234 T2244 oasc.RequestHandlers.initHandlersFromConfig created /mlt: solr.MoreLikeThisHandler
   [junit4]   2> 392234 T2244 oasc.RequestHandlers.initHandlersFromConfig created /debug/dump: solr.DumpRequestHandler
   [junit4]   2> 392237 T2244 oashl.XMLLoader.init xsltCacheLifetimeSeconds=60
   [junit4]   2> 392238 T2244 oasc.SolrCore.initDeprecatedSupport WARN solrconfig.xml uses deprecated <admin/gettableFiles>, Please update your config to use the ShowFileRequestHandler.
   [junit4]   2> 392239 T2244 oasc.SolrCore.initDeprecatedSupport WARN adding ShowFileRequestHandler with hidden files: [OLD_SYNONYMS.TXT, STOPWORDS.TXT, PROTWORDS.TXT, OPEN-EXCHANGE-RATES.JSON, SYNONYMS.TXT, CURRENCY.XML, MAPPING-ISOLATIN1ACCENT.TXT, SOLRCONFIG.SNIPPET.RANDOMINDEXCONFIG.XML]
   [junit4]   2> 392241 T2244 oasu.CommitTracker.<init> Hard AutoCommit: disabled
   [junit4]   2> 392241 T2244 oasu.CommitTracker.<init> Soft AutoCommit: disabled
   [junit4]   2> 392241 T2244 oasu.RandomMergePolicy.<init> RandomMergePolicy wrapping class org.apache.lucene.index.LogByteSizeMergePolicy: [LogByteSizeMergePolicy: minMergeSize=1677721, mergeFactor=49, maxMergeSize=2147483648, maxMergeSizeForForcedMerge=9223372036854775807, calibrateSizeByDeletes=false, maxMergeDocs=2147483647, maxCFSSegmentSizeMB=8.796093022207999E12, noCFSRatio=0.4442224112501265]
   [junit4]   2> 392242 T2244 oasc.SolrDeletionPolicy.onInit SolrDeletionPolicy.onInit: commits: num=1
   [junit4]   2> 		commit{dir=RateLimitedDirectoryWrapper(MockDirWrapper(org.apache.lucene.store.RAMDirectory@3b35dc09 lockFactory=org.apache.lucene.store.SingleInstanceLockFactory@37a9eb9d)),segFN=segments_1,generation=1}
   [junit4]   2> 392242 T2244 oasc.SolrDeletionPolicy.updateCommits newest commit generation = 1
   [junit4]   2> 392242 T2244 oass.SolrIndexSearcher.<init> Opening Searcher@4d6c6653 main
   [junit4]   2> 392242 T2244 oashc.SpellCheckComponent.inform Initializing spell checkers
   [junit4]   2> 392245 T2244 oass.DirectSolrSpellChecker.init init: {name=direct,classname=DirectSolrSpellChecker,field=lowerfilt,minQueryLength=3}
   [junit4]   2> 392263 T2245 oasc.SolrCore.registerSearcher [collection1] Registered new searcher Searcher@4d6c6653 main{StandardDirectoryReader(segments_1:1:nrt)}
   [junit4]   2> 392267 T2244 oasc.CoreContainer.registerCore registering core: collection1
   [junit4]   2> 392267 T2244 oasc.ZkController.register Register replica - core:collection1 address:http://127.0.0.1:8983/solr collection:collection1 shard:shard1
   [junit4]   2> 392267 T2244 oascsi.HttpClientUtil.createClient Creating new http client, config:maxConnections=10000&maxConnectionsPerHost=20&connTimeout=15000&socketTimeout=30000&retry=false
   [junit4]   2> 392270 T2244 oascc.SolrZkClient.makePath makePath: /collections/collection1/leader_elect/shard1/election
   [junit4]   2> 392275 T2244 oasc.ShardLeaderElectionContext.runLeaderProcess Running the leader process for shard shard1
   [junit4]   2> 392276 T2244 oasc.ShardLeaderElectionContext.waitForReplicasToComeUp Enough replicas found to continue.
   [junit4]   2> 392277 T2244 oasc.ShardLeaderElectionContext.runLeaderProcess I may be the new leader - try and sync
   [junit4]   2> 392277 T2244 oasc.ShardLeaderElectionContext.runLeaderProcess I am the new leader: http://127.0.0.1:8983/solr/collection1/ shard1
   [junit4]   2> 392277 T2244 oascc.SolrZkClient.makePath makePath: /collections/collection1/leaders/shard1
   [junit4]   2> 392846 T2242 oascc.ZkStateReader.updateClusterState Updating cloud state from ZooKeeper... 
   [junit4]   2> 392855 T2241 oascc.ZkStateReader$2.process A cluster state change: WatchedEvent state:SyncConnected type:NodeDataChanged path:/clusterstate.json, has occurred - updating... (live nodes size: 1)
   [junit4]   2> 392882 T2244 oasc.ZkController.register We are http://127.0.0.1:8983/solr/collection1/ and leader is http://127.0.0.1:8983/solr/collection1/
   [junit4]   2> 392882 T2244 oasc.ZkController.register No LogReplay needed for core=collection1 baseURL=http://127.0.0.1:8983/solr
   [junit4]   2> 392883 T2244 oasc.ZkController.checkRecovery WARN Skipping recovery according to sys prop solrcloud.skip.autorecovery
   [junit4]   2> 392883 T2244 oasc.ZkController.publish publishing core=collection1 state=active
   [junit4]   2> 392883 T2244 oasc.ZkController.publish numShards not found on descriptor - reading it from system property
   [junit4]   2> 392886 T2244 oascc.ZkStateReader.updateClusterState Updating cloud state from ZooKeeper... 
   [junit4]   2> 392887 T2226 oasc.CoreContainer.load Loading cores into CoreContainer [instanceDir=/mnt/ssd/jenkins/workspace/Lucene-Solr-4.x-Linux/solr/build/solr-core/test-files/solr/]
   [junit4]   2> 392890 T2226 oashc.HttpShardHandlerFactory.getParameter Setting socketTimeout to: 120000
   [junit4]   2> 392890 T2226 oashc.HttpShardHandlerFactory.getParameter Setting urlScheme to: http://
   [junit4]   2> 392890 T2226 oashc.HttpShardHandlerFactory.getParameter Setting connTimeout to: 15000
   [junit4]   2> 392891 T2226 oashc.HttpShardHandlerFactory.getParameter Setting maxConnectionsPerHost to: 20
   [junit4]   2> 392891 T2226 oashc.HttpShardHandlerFactory.getParameter Setting corePoolSize to: 0
   [junit4]   2> 392892 T2226 oashc.HttpShardHandlerFactory.getParameter Setting maximumPoolSize to: 2147483647
   [junit4]   2> 392892 T2226 oashc.HttpShardHandlerFactory.getParameter Setting maxThreadIdleTime to: 5
   [junit4]   2> 392892 T2226 oashc.HttpShardHandlerFactory.getParameter Setting sizeOfQueue to: -1
   [junit4]   2> 392893 T2226 oashc.HttpShardHandlerFactory.getParameter Setting fairnessPolicy to: false
   [junit4]   2> 392893 T2226 oascsi.HttpClientUtil.createClient Creating new http client, config:maxConnectionsPerHost=20&maxConnections=10000&socketTimeout=120000&connTimeout=15000&retry=false
   [junit4]   2> 392897 T2226 oasl.LogWatcher.createWatcher SLF4J impl is org.slf4j.impl.Log4jLoggerFactory
   [junit4]   2> 392898 T2226 oasl.LogWatcher.newRegisteredLogWatcher Registering Log Listener [Log4j (org.slf4j.impl.Log4jLoggerFactory)]
   [junit4]   2> 392898 T2226 oasc.ZkContainer.initZooKeeper Zookeeper client=127.0.0.1:60127/solr
   [junit4]   2> 392899 T2226 oasc.ZkController.checkChrootPath zkHost includes chroot
   [junit4]   2> 392900 T2226 oascc.ConnectionManager.waitForConnected Waiting for client to connect to ZooKeeper
   [junit4]   2> 392902 T2248 oascc.ConnectionManager.process Watcher org.apache.solr.common.cloud.ConnectionManager@6e8c4e19 name:ZooKeeperConnection Watcher:127.0.0.1:60127 got event WatchedEvent state:SyncConnected type:None path:null path:null type:None
   [junit4]   2> 392902 T2226 oascc.ConnectionManager.waitForConnected Client is connected to ZooKeeper
   [junit4]   2> 392904 T2226 oascsi.HttpClientUtil.createClient Creating new http client, config:maxConnections=500&maxConnectionsPerHost=16&socketTimeout=120000&connTimeout=15000
   [junit4]   2> 392908 T2226 oascc.ConnectionManager.waitForConnected Waiting for client to connect to ZooKeeper
   [junit4]   2> 392910 T2250 oascc.ConnectionManager.process Watcher org.apache.solr.common.cloud.ConnectionManager@1b3870a5 name:ZooKeeperConnection Watcher:127.0.0.1:60127/solr got event WatchedEvent state:SyncConnected type:None path:null path:null type:None
   [junit4]   2> 392910 T2226 oascc.ConnectionManager.waitForConnected Client is connected to ZooKeeper
   [junit4]   2> 392915 T2226 oascc.ZkStateReader.createClusterStateWatchersAndUpdate Updating cluster state from ZooKeeper... 
   [junit4]   2> 393918 T2226 oasc.ZkController.createEphemeralLiveNode Register node as live in ZooKeeper:/live_nodes/127.0.0.1:8983_solr
   [junit4]   2> 393920 T2226 oasc.ZkController.createEphemeralLiveNode Found a previous node that still exists while trying to register a new live node /live_nodes/127.0.0.1:8983_solr - removing existing node to create another.
   [junit4]   2> 393920 T2241 oascc.ZkStateReader$3.process Updating live nodes... (0)
   [junit4]   2> 393920 T2226 oascc.SolrZkClient.makePath makePath: /live_nodes/127.0.0.1:8983_solr
   [junit4]   2> 393920 T2250 oascc.ZkStateReader$3.process Updating live nodes... (0)
   [junit4]   2> 393921 T2241 oascc.ZkStateReader$2.process A cluster state change: WatchedEvent state:SyncConnected type:NodeChildrenChanged path:/live_nodes, has occurred - updating... (live nodes size: 0)
   [junit4]   2> 393922 T2241 oascc.ZkStateReader$3.process Updating live nodes... (1)
   [junit4]   2> 393922 T2250 oascc.ZkStateReader$3.process Updating live nodes... (1)
   [junit4]   2> 393922 T2241 oascc.ZkStateReader$2.process A cluster state change: WatchedEvent state:SyncConnected type:NodeChildrenChanged path:/live_nodes, has occurred - updating... (live nodes size: 1)
   [junit4]   2> 393926 T2251 oasc.ZkController.publish publishing core=collection1 state=down
   [junit4]   2> 393927 T2251 oasc.ZkController.publish numShards not found on descriptor - reading it from system property
   [junit4]   2> 393927 T2251 oasc.ZkController.waitForCoreNodeName look for our core node name
   [junit4]   2> 393927 T2251 oasc.ZkController.waitForShardId waiting to find shard id in clusterstate for collection1
   [junit4]   2> 393928 T2251 oasc.CoreContainer.create Creating SolrCore 'collection1' using instanceDir: /mnt/ssd/jenkins/workspace/Lucene-Solr-4.x-Linux/solr/build/solr-core/test-files/solr/collection1
   [junit4]   2> 393928 T2251 oasc.ZkController.createCollectionZkNode Check for collection zkNode:collection1
   [junit4]   2> 393928 T2251 oasc.ZkController.createCollectionZkNode Collection zkNode exists
   [junit4]   2> 393928 T2251 oasc.ZkController.readConfigName Load collection config from:/collections/collection1
   [junit4]   2> 393929 T2251 oasc.SolrResourceLoader.<init> new SolrResourceLoader for directory: '/mnt/ssd/jenkins/workspace/Lucene-Solr-4.x-Linux/solr/build/solr-core/test-files/solr/collection1/'
   [junit4]   2> 393929 T2251 oasc.SolrResourceLoader.replaceClassLoader Adding 'file:/mnt/ssd/jenkins/workspace/Lucene-Solr-4.x-Linux/solr/build/solr-core/test-files/solr/collection1/lib/classes/' to classloader
   [junit4]   2> 393930 T2251 oasc.SolrResourceLoader.replaceClassLoader Adding 'file:/mnt/ssd/jenkins/workspace/Lucene-Solr-4.x-Linux/solr/build/solr-core/test-files/solr/collection1/lib/README' to classloader
   [junit4]   2> 393966 T2251 oasc.SolrConfig.<init> Using Lucene MatchVersion: LUCENE_45
   [junit4]   2> 394009 T2251 oasc.SolrConfig.<init> Loaded SolrConfig: solrconfig.xml
   [junit4]   2> 394010 T2251 oass.IndexSchema.readSchema Reading Solr Schema from schema.xml
   [junit4]   2> 394016 T2251 oass.IndexSchema.readSchema [null] Schema name=test
   [junit4]   2> 394295 T2251 oass.ByteField.init WARN ByteField is deprecated and will be removed in 5.0. You should use TrieIntField instead.
   [junit4]   2> 394295 T2251 oass.ShortField.init WARN ShortField is deprecated and will be removed in 5.0. You should use TrieIntField instead.
   [junit4]   2> 394296 T2251 oass.OpenExchangeRatesOrgProvider.init Initialized with rates=open-exchange-rates.json, refreshInterval=1440.
   [junit4]   2> 394300 T2251 oass.IndexSchema.readSchema default search field in schema is text
   [junit4]   2> 394302 T2251 oass.IndexSchema.readSchema unique key field: id
   [junit4]   2> 394312 T2251 oass.FileExchangeRateProvider.reload Reloading exchange rates from file currency.xml
   [junit4]   2> 394315 T2251 oass.FileExchangeRateProvider.reload Reloading exchange rates from file currency.xml
   [junit4]   2> 394317 T2251 oass.OpenExchangeRatesOrgProvider.reload Reloading exchange rates from open-exchange-rates.json
   [junit4]   2> 394318 T2251 oass.OpenExchangeRatesOrgProvider$OpenExchangeRates.<init> WARN Unknown key IMPORTANT NOTE
   [junit4]   2> 394318 T2251 oass.OpenExchangeRatesOrgProvider$OpenExchangeRates.<init> WARN Expected key, got STRING
   [junit4]   2> 394318 T2251 oass.OpenExchangeRatesOrgProvider.reload Reloading exchange rates from open-exchange-rates.json
   [junit4]   2> 394319 T2251 oass.OpenExchangeRatesOrgProvider$OpenExchangeRates.<init> WARN Unknown key IMPORTANT NOTE
   [junit4]   2> 394319 T2251 oass.OpenExchangeRatesOrgProvider$OpenExchangeRates.<init> WARN Expected key, got STRING
   [junit4]   2> 394320 T2251 oasc.SolrCore.initDirectoryFactory org.apache.solr.core.MockDirectoryFactory
   [junit4]   2> 394320 T2251 oasc.SolrCore.<init> [collection1] Opening new SolrCore at /mnt/ssd/jenkins/workspace/Lucene-Solr-4.x-Linux/solr/build/solr-core/test-files/solr/collection1/, dataDir=/mnt/ssd/jenkins/workspace/Lucene-Solr-4.x-Linux/solr/build/solr-core/test/J0/./solrtest-SliceStateUpdateTest-1378791635166/data2/
   [junit4]   2> 394320 T2251 oasc.JmxMonitoredMap.<init> JMX monitoring is enabled. Adding Solr mbeans to JMX Server: com.sun.jmx.mbeanserver.JmxMBeanServer@29200a7a
   [junit4]   2> 394321 T2251 oasc.CachingDirectoryFactory.get return new directory for /mnt/ssd/jenkins/workspace/Lucene-Solr-4.x-Linux/solr/build/solr-core/test/J0/./solrtest-SliceStateUpdateTest-1378791635166/data2
   [junit4]   2> 394321 T2251 oasc.SolrCore.getNewIndexDir New index directory detected: old=null new=/mnt/ssd/jenkins/workspace/Lucene-Solr-4.x-Linux/solr/build/solr-core/test/J0/./solrtest-SliceStateUpdateTest-1378791635166/data2/index/
   [junit4]   2> 394321 T2251 oasc.SolrCore.initIndex WARN [collection1] Solr index directory '/mnt/ssd/jenkins/workspace/Lucene-Solr-4.x-Linux/solr/build/solr-core/test/J0/./solrtest-SliceStateUpdateTest-1378791635166/data2/index' doesn't exist. Creating new index...
   [junit4]   2> 394321 T2251 oasc.CachingDirectoryFactory.get return new directory for /mnt/ssd/jenkins/workspace/Lucene-Solr-4.x-Linux/solr/build/solr-core/test/J0/./solrtest-SliceStateUpdateTest-1378791635166/data2/index
   [junit4]   2> 394321 T2251 oasu.RandomMergePolicy.<init> RandomMergePolicy wrapping class org.apache.lucene.index.LogDocMergePolicy: [LogDocMergePolicy: minMergeSize=1000, mergeFactor=32, maxMergeSize=9223372036854775807, maxMergeSizeForForcedMerge=9223372036854775807, calibrateSizeByDeletes=false, maxMergeDocs=2147483647, maxCFSSegmentSizeMB=8.796093022207999E12, noCFSRatio=1.0]
   [junit4]   2> 394322 T2251 oasc.SolrDeletionPolicy.onCommit SolrDeletionPolicy.onCommit: commits: num=1
   [junit4]   2> 		commit{dir=RateLimitedDirectoryWrapper(MockDirWrapper(org.apache.lucene.store.RAMDirectory@5176d1f2 lockFactory=org.apache.lucene.store.SingleInstanceLockFactory@74529179)),segFN=segments_1,generation=1}
   [junit4]   2> 394322 T2251 oasc.SolrDeletionPolicy.updateCommits newest commit generation = 1
   [junit4]   2> 394322 T2251 oasc.SolrCore.initWriters created xml: solr.XMLResponseWriter
   [junit4]   2> 394325 T2251 oasup.UpdateRequestProcessorChain.init creating updateRequestProcessorChain "dedupe"
   [junit4]   2> 394325 T2251 oasup.UpdateRequestProcessorChain.init inserting DistributedUpdateProcessorFactory into updateRequestProcessorChain "dedupe"
   [junit4]   2> 394326 T2251 oasup.UpdateRequestProcessorChain.init creating updateRequestProcessorChain "dedupe-allfields"
   [junit4]   2> 394326 T2251 oasup.UpdateRequestProcessorChain.init inserting DistributedUpdateProcessorFactory into updateRequestProcessorChain "dedupe-allfields"
   [junit4]   2> 394326 T2251 oasup.UpdateRequestProcessorChain.init creating updateRequestProcessorChain "stored_sig"
   [junit4]   2> 394326 T2251 oasup.UpdateRequestProcessorChain.init inserting DistributedUpdateProcessorFactory into updateRequestProcessorChain "stored_sig"
   [junit4]   2> 394326 T2251 oasup.UpdateRequestProcessorChain.init creating updateRequestProcessorChain "uniq-fields"
   [junit4]   2> 394326 T2251 oasup.UniqFieldsUpdateProcessorFactory.init WARN Use of the 'fields' init param in UniqFieldsUpdateProcessorFactory is deprecated, please use 'fieldName' (or another FieldMutatingUpdateProcessorFactory selector option) instead
   [junit4]   2> 394327 T2251 oasup.UniqFieldsUpdateProcessorFactory.init Replacing 'fields' init param with (individual) 'fieldName' params
   [junit4]   2> 394327 T2251 oasup.UpdateRequestProcessorChain.init inserting DistributedUpdateProcessorFactory into updateRequestProcessorChain "uniq-fields"
   [junit4]   2> 394327 T2251 oasup.UpdateRequestProcessorChain.init creating updateRequestProcessorChain "distrib-dup-test-chain-explicit"
   [junit4]   2> 394327 T2251 oasup.UpdateRequestProcessorChain.init creating updateRequestProcessorChain "distrib-dup-test-chain-implicit"
   [junit4]   2> 394327 T2251 oasup.UpdateRequestProcessorChain.init inserting DistributedUpdateProcessorFactory into updateRequestProcessorChain "distrib-dup-test-chain-implicit"
   [junit4]   2> 394328 T2251 oasc.SolrCore.loadUpdateProcessorChains no updateRequestProcessorChain defined as default, creating implicit default
   [junit4]   2> 394328 T2251 oasc.RequestHandlers.initHandlersFromConfig adding lazy requestHandler: solr.ReplicationHandler
   [junit4]   2> 394328 T2251 oasc.RequestHandlers.initHandlersFromConfig created /replication: solr.ReplicationHandler
   [junit4]   2> 394328 T2251 oasc.RequestHandlers.initHandlersFromConfig created standard: solr.StandardRequestHandler
   [junit4]   2> 394329 T2251 oasc.RequestHandlers.initHandlersFromConfig created /get: solr.RealTimeGetHandler
   [junit4]   2> 394329 T2251 oasc.RequestHandlers.initHandlersFromConfig created dismax: solr.SearchHandler
   [junit4]   2> 394330 T2251 oasc.RequestHandlers.initHandlersFromConfig created mock: org.apache.solr.core.MockQuerySenderListenerReqHandler
   [junit4]   2> 394330 T2251 oasc.RequestHandlers.initHandlersFromConfig created /admin/: org.apache.solr.handler.admin.AdminHandlers
   [junit4]   2> 394330 T2251 oasc.RequestHandlers.initHandlersFromConfig created defaults: solr.StandardRequestHandler
   [junit4]   2> 394330 T2251 oasc.RequestHandlers.initHandlersFromConfig adding lazy requestHandler: solr.StandardRequestHandler
   [junit4]   2> 394331 T2251 oasc.RequestHandlers.initHandlersFromConfig created lazy: solr.StandardRequestHandler
   [junit4]   2> 394331 T2251 oasc.RequestHandlers.initHandlersFromConfig created /update: solr.UpdateRequestHandler
   [junit4]   2> 394331 T2251 oasc.RequestHandlers.initHandlersFromConfig created /terms: org.apache.solr.handler.component.SearchHandler
   [junit4]   2> 394332 T2251 oasc.RequestHandlers.initHandlersFromConfig created spellCheckCompRH: org.apache.solr.handler.component.SearchHandler
   [junit4]   2> 394332 T2251 oasc.RequestHandlers.initHandlersFromConfig created spellCheckCompRH_Direct: org.apache.solr.handler.component.SearchHandler
   [junit4]   2> 394332 T2251 oasc.RequestHandlers.initHandlersFromConfig created spellCheckWithWordbreak: org.apache.solr.handler.component.SearchHandler
   [junit4]   2> 394333 T2251 oasc.RequestHandlers.initHandlersFromConfig created spellCheckWithWordbreak_Direct: org.apache.solr.handler.component.SearchHandler
   [junit4]   2> 394333 T2251 oasc.RequestHandlers.initHandlersFromConfig created spellCheckCompRH1: org.apache.solr.handler.component.SearchHandler
   [junit4]   2> 394334 T2251 oasc.RequestHandlers.initHandlersFromConfig created mltrh: org.apache.solr.handler.component.SearchHandler
   [junit4]   2> 394334 T2251 oasc.RequestHandlers.initHandlersFromConfig created tvrh: org.apache.solr.handler.component.SearchHandler
   [junit4]   2> 394334 T2251 oasc.RequestHandlers.initHandlersFromConfig created /mlt: solr.MoreLikeThisHandler
   [junit4]   2> 394335 T2251 oasc.RequestHandlers.initHandlersFromConfig created /debug/dump: solr.DumpRequestHandler
   [junit4]   2> 394337 T2251 oashl.XMLLoader.init xsltCacheLifetimeSeconds=60
   [junit4]   2> 394338 T2251 oasc.SolrCore.initDeprecatedSupport WARN solrconfig.xml uses deprecated <admin/gettableFiles>, Please update your config to use the ShowFileRequestHandler.
   [junit4]   2> 394339 T2251 oasc.SolrCore.initDeprecatedSupport WARN adding ShowFileRequestHandler with hidden files: [OLD_SYNONYMS.TXT, STOPWORDS.TXT, PROTWORDS.TXT, OPEN-EXCHANGE-RATES.JSON, SYNONYMS.TXT, CURRENCY.XML, MAPPING-ISOLATIN1ACCENT.TXT, SOLRCONFIG.SNIPPET.RANDOMINDEXCONFIG.XML]
   [junit4]   2> 394340 T2251 oasu.CommitTracker.<init> Hard AutoCommit: disabled
   [junit4]   2> 394341 T2251 oasu.CommitTracker.<init> Soft AutoCommit: disabled
   [junit4]   2> 394341 T2251 oasu.RandomMergePolicy.<init> RandomMergePolicy wrapping class org.apache.lucene.index.LogByteSizeMergePolicy: [LogByteSizeMergePolicy: minMergeSize=1677721, mergeFactor=49, maxMergeSize=2147483648, maxMergeSizeForForcedMerge=9223372036854775807, calibrateSizeByDeletes=false, maxMergeDocs=2147483647, maxCFSSegmentSizeMB=8.796093022207999E12, noCFSRatio=0.4442224112501265]
   [junit4]   2> 394342 T2251 oasc.SolrDeletionPolicy.onInit SolrDeletionPolicy.onInit: commits: num=1
   [junit4]   2> 		commit{dir=RateLimitedDirectoryWrapper(MockDirWrapper(org.apache.lucene.store.RAMDirectory@5176d1f2 lockFactory=org.apache.lucene.store.SingleInstanceLockFactory@74529179)),segFN=segments_1,generation=1}
   [junit4]   2> 394342 T2251 oasc.SolrDeletionPolicy.updateCommits newest commit generation = 1
   [junit4]   2> 394342 T2251 oass.SolrIndexSearcher.<init> Opening Searcher@251e7a79 main
   [junit4]   2> 394342 T2251 oashc.SpellCheckComponent.inform Initializing spell checkers
   [junit4]   2> 394343 T2251 oass.DirectSolrSpellChecker.init init: {name=direct,classname=DirectSolrSpellChecker,field=lowerfilt,minQueryLength=3}
   [junit4]   2> 394350 T2252 oasc.SolrCore.registerSearcher [collection1] Registered new searcher Searcher@251e7a79 main{StandardDirectoryReader(segments_1:1:nrt)}
   [junit4]   2> 394355 T2251 oasc.CoreContainer.registerCore registering core: collection1
   [junit4]   2> 394355 T2251 oasc.ZkController.register Register replica - core:collection1 address:http://127.0.0.1:8983/solr collection:collection1 shard:shard1
   [junit4]   2> 394355 T2251 oascsi.HttpClientUtil.createClient Creating new http client, config:maxConnections=10000&maxConnectionsPerHost=20&connTimeout=15000&socketTimeout=30000&retry=false
   [junit4]   2> 394359 T2251 oasc.ZkController.register We are http://127.0.0.1:8983/solr/collection1/ and leader is http://127.0.0.1:8983/solr/collection1/
   [junit4]   2> 394359 T2251 oasc.ZkController.register No LogReplay needed for core=collection1 baseURL=http://127.0.0.1:8983/solr
   [junit4]   2> 394360 T2251 oasc.ZkController.checkRecovery WARN Skipping recovery according to sys prop solrcloud.skip.autorecovery
   [junit4]   2> 394360 T2251 oasc.ZkController.publish publishing core=collection1 state=active
   [junit4]   2> 394360 T2251 oasc.ZkController.publish numShards not found on descriptor - reading it from system property
   [junit4]   2> 394361 T2242 oascc.ZkStateReader.updateClusterState Updating cloud state from ZooKeeper... 
   [junit4]   2> 394361 T2251 oascc.ZkStateReader.updateClusterState Updating cloud state from ZooKeeper... 
   [junit4]   2> 394361 T2242 oasc.Overseer$ClusterStateUpdater.updateState Update state numShards=null message={
   [junit4]   2> 	  "operation":"state",
   [junit4]   2> 	  "core_node_name":"core_node1",
   [junit4]   2> 	  "numShards":null,
   [junit4]   2> 	  "shard":"shard1",
   [junit4]   2> 	  "roles":null,
   [junit4]   2> 	  "state":"active",
   [junit4]   2> 	  "shard_state":"active",
   [junit4]   2> 	  "core":"collection1",
   [junit4]   2> 	  "collection":"collection1",
   [junit4]   2> 	  "shard_range":null,
   [junit4]   2> 	  "node_name":"127.0.0.1:8983_solr",
   [junit4]   2> 	  "base_url":"http://127.0.0.1:8983/solr"}
   [junit4]   2> 394362 T2226 oasc.SliceStateUpdateTest.setUp ####SETUP_END testSliceStateUpdate
   [junit4]   2> 394362 T2226 oascc.ConnectionManager.waitForConnected Waiting for client to connect to ZooKeeper
   [junit4]   2> 394364 T2255 oascc.ConnectionManager.process Watcher org.apache.solr.common.cloud.ConnectionManager@235755a8 name:ZooKeeperConnection Watcher:127.0.0.1:60127/solr got event WatchedEvent state:SyncConnected type:None path:null path:null type:None
   [junit4]   2> 394364 T2226 oascc.ConnectionManager.waitForConnected Client is connected to ZooKeeper
   [junit4]   2> 394364 T2242 oasc.Overseer$ClusterStateUpdater.updateState node=core_node1 is already registered
   [junit4]   2> 394364 T2242 oasc.Overseer$ClusterStateUpdater.updateState Update state numShards=null message={
   [junit4]   2> 	  "operation":"state",
   [junit4]   2> 	  "core_node_name":"core_node1",
   [junit4]   2> 	  "numShards":null,
   [junit4]   2> 	  "shard":null,
   [junit4]   2> 	  "roles":null,
   [junit4]   2> 	  "state":"down",
   [junit4]   2> 	  "shard_state":"active",
   [junit4]   2> 	  "core":"collection1",
   [junit4]   2> 	  "collection":"collection1",
   [junit4]   2> 	  "shard_range":null,
   [junit4]   2> 	  "node_name":"127.0.0.1:8983_solr",
   [junit4]   2> 	  "base_url":"http://127.0.0.1:8983/solr"}
   [junit4]   2> 394364 T2242 oasc.Overseer$ClusterStateUpdater.updateState shard=shard1 is already registered
   [junit4]   2> 394365 T2241 oascc.ZkStateReader$2.process A cluster state change: WatchedEvent state:SyncConnected type:NodeDataChanged path:/clusterstate.json, has occurred - updating... (live nodes size: 1)
   [junit4]   2> 394365 T2250 oascc.ZkStateReader$2.process A cluster state change: WatchedEvent state:SyncConnected type:NodeDataChanged path:/clusterstate.json, has occurred - updating... (live nodes size: 1)
   [junit4]   2> 394366 T2242 oasc.Overseer$ClusterStateUpdater.updateState Update state numShards=null message={
   [junit4]   2> 	  "operation":"state",
   [junit4]   2> 	  "core_node_name":"core_node1",
   [junit4]   2> 	  "numShards":null,
   [junit4]   2> 	  "shard":"shard1",
   [junit4]   2> 	  "roles":null,
   [junit4]   2> 	  "state":"active",
   [junit4]   2> 	  "shard_state":"active",
   [junit4]   2> 	  "core":"collection1",
   [junit4]   2> 	  "collection":"collection1",
   [junit4]   2> 	  "shard_range":null,
   [junit4]   2> 	  "node_name":"127.0.0.1:8983_solr",
   [junit4]   2> 	  "base_url":"http://127.0.0.1:8983/solr"}
   [junit4]   2> 394372 T2250 oascc.ZkStateReader$2.process A cluster state change: WatchedEvent state:SyncConnected type:NodeDataChanged path:/clusterstate.json, has occurred - updating... (live nodes size: 1)
   [junit4]   2> 431877 T2226 oasc.CoreContainer.shutdown Shutting down CoreContainer instance=537389349
   [junit4]   2> 431910 T2242 oascc.ZkStateReader.updateClusterState Updating cloud state from ZooKeeper... 
   [junit4]   2> 431911 T2242 oasc.Overseer$ClusterStateUpdater.updateState Update state numShards=null message={
   [junit4]   2> 	  "operation":"state",
   [junit4]   2> 	  "core_node_name":"core_node1",
   [junit4]   2> 	  "shard":null,
   [junit4]   2> 	  "roles":null,
   [junit4]   2> 	  "state":"down",
   [junit4]   2> 	  "core":"collection1",
   [junit4]   2> 	  "collection":"collection1",
   [junit4]   2> 	  "node_name":"127.0.0.1:8983_solr",
   [junit4]   2> 	  "base_url":"http://127.0.0.1:8983/solr"}
   [junit4]   2> 431911 T2242 oasc.Overseer$ClusterStateUpdater.updateState shard=shard1 is already registered
   [junit4]   2> 431913 T2241 oascc.ZkStateReader$2.process A cluster state change: WatchedEvent state:SyncConnected type:NodeDataChanged path:/clusterstate.json, has occurred - updating... (live nodes size: 1)
   [junit4]   2> 431913 T2250 oascc.ZkStateReader$2.process A cluster state change: WatchedEvent state:SyncConnected type:NodeDataChanged path:/clusterstate.json, has occurred - updating... (live nodes size: 1)
   [junit4]   2> 433880 T2226 oasc.ZkController.publish publishing core=collection1 state=down
   [junit4]   2> 433880 T2226 oasc.ZkController.publish numShards not found on descriptor - reading it from system property
   [junit4]   2> 433882 T2226 oasc.SolrCore.close [collection1]  CLOSING SolrCore org.apache.solr.core.SolrCore@98e02a7
   [junit4]   2> 433888 T2226 oasu.DirectUpdateHandler2.close closing DirectUpdateHandler2{commits=0,autocommits=0,soft autocommits=0,optimizes=0,rollbacks=0,expungeDeletes=0,docsPending=0,adds=0,deletesById=0,deletesByQuery=0,errors=0,cumulative_adds=0,cumulative_deletesById=0,cumulative_deletesByQuery=0,cumulative_errors=0}
   [junit4]   2> 433889 T2226 oasu.SolrCoreState.decrefSolrCoreState Closing SolrCoreState
   [junit4]   2> 433889 T2226 oasu.DefaultSolrCoreState.closeIndexWriter SolrCoreState ref count has reached 0 - closing IndexWriter
   [junit4]   2> 433889 T2226 oasu.DefaultSolrCoreState.closeIndexWriter closing IndexWriter with IndexWriterCloser
   [junit4]   2> 433890 T2226 oasc.SolrCore.closeSearcher [collection1] Closing main searcher on request.
   [junit4]   2> 433891 T2226 oasc.CachingDirectoryFactory.close Closing MockDirectoryFactory - 2 directories currently being tracked
   [junit4]   2> 433891 T2226 oasc.CachingDirectoryFactory.closeCacheValue looking to close /mnt/ssd/jenkins/workspace/Lucene-Solr-4.x-Linux/solr/build/solr-core/test/J0/./solrtest-SliceStateUpdateTest-1378791635166/data2 [CachedDir<<refCount=0;path=/mnt/ssd/jenkins/workspace/Lucene-Solr-4.x-Linux/solr/build/solr-core/test/J0/./solrtest-SliceStateUpdateTest-1378791635166/data2;done=false>>]
   [junit4]   2> 433891 T2226 oasc.CachingDirectoryFactory.close Closing directory: /mnt/ssd/jenkins/workspace/Lucene-Solr-4.x-Linux/solr/build/solr-core/test/J0/./solrtest-SliceStateUpdateTest-1378791635166/data2
   [junit4]   2> 433891 T2226 oasc.CachingDirectoryFactory.closeCacheValue looking to close /mnt/ssd/jenkins/workspace/Lucene-Solr-4.x-Linux/solr/build/solr-core/test/J0/./solrtest-SliceStateUpdateTest-1378791635166/data2/index [CachedDir<<refCount=0;path=/mnt/ssd/jenkins/workspace/Lucene-Solr-4.x-Linux/solr/build/solr-core/test/J0/./solrtest-SliceStateUpdateTest-1378791635166/data2/index;done=false>>]
   [junit4]   2> 433892 T2226 oasc.CachingDirectoryFactory.close Closing directory: /mnt/ssd/jenkins/workspace/Lucene-Solr-4.x-Linux/solr/build/solr-core/test/J0/./solrtest-SliceStateUpdateTest-1378791635166/data2/index
   [junit4]   2> 433893 T2242 oasc.Overseer$ClusterStateUpdater.amILeader According to ZK I (id=90360488602370052-127.0.0.1:8983_solr-n_0000000000) am no longer a leader.
   [junit4]   2> 433894 T2226 oasc.CoreContainer.shutdown Shutting down CoreContainer instance=1462515663
   [junit4]   2> 433894 T2250 oascc.SolrZkClient.makePath makePath: /overseer_elect/leader
   [junit4]   2> 433898 T2250 oasc.Overseer.start Overseer (id=90360488602370054-127.0.0.1:8983_solr-n_0000000001) starting
   [junit4]   2> 433900 T2257 oasc.OverseerCollectionProcessor.run Process current queue of collection creations
   [junit4]   2> 433901 T2250 oasc.ShardLeaderElectionContext.runLeaderProcess Running the leader process for shard shard1
   [junit4]   2> 433902 T2256 oasc.Overseer$ClusterStateUpdater.run Starting to work on the main queue
   [junit4]   2> 433903 T2250 oasc.ShardLeaderElectionContext.shouldIBeLeader Checking if I should try and be the leader.
   [junit4]   2> 433903 T2250 oasc.ShardLeaderElectionContext.shouldIBeLeader My last published State was Active, it's okay to be the leader.
   [junit4]   2> 433903 T2250 oasc.ShardLeaderElectionContext.runLeaderProcess I may be the new leader - try and sync
   [junit4]   2> 433903 T2250 oasc.ShardLeaderElectionContext.runLeaderProcess I am the new leader: http://127.0.0.1:8983/solr/collection1/ shard1
   [junit4]   2> 433903 T2250 oascc.SolrZkClient.makePath makePath: /collections/collection1/leaders/shard1
   [junit4]   2> 433903 T2256 oascc.ZkStateReader.updateClusterState Updating cloud state from ZooKeeper... 
   [junit4]   2> 433904 T2256 oasc.Overseer$ClusterStateUpdater.updateState Update state numShards=null message={
   [junit4]   2> 	  "operation":"state",
   [junit4]   2> 	  "core_node_name":"core_node1",
   [junit4]   2> 	  "numShards":null,
   [junit4]   2> 	  "shard":"shard1",
   [junit4]   2> 	  "roles":null,
   [junit4]   2> 	  "state":"down",
   [junit4]   2> 	  "shard_state":"active",
   [junit4]   2> 	  "core":"collection1",
   [junit4]   2> 	  "collection":"collection1",
   [junit4]   2> 	  "shard_range":null,
   [junit4]   2> 	  "node_name":"127.0.0.1:8983_solr",
   [junit4]   2> 	  "base_url":"http://127.0.0.1:8983/solr"}
   [junit4]   2> 433911 T2250 oascc.ZkStateReader$2.process A cluster state change: WatchedEvent state:SyncConnected type:NodeDataChanged path:/clusterstate.json, has occurred - updating... (live nodes size: 1)
   [junit4]   2> 434894 T2226 oasc.ZkController.publish publishing core=collection1 state=down
   [junit4]   2> 434895 T2226 oasc.ZkController.publish numShards not found on descriptor - reading it from system property
   [junit4]   2> 434897 T2226 oasc.SolrCore.close [collection1]  CLOSING SolrCore org.apache.solr.core.SolrCore@4ea11eff
   [junit4]   2> 434913 T2226 oasu.DirectUpdateHandler2.close closing DirectUpdateHandler2{commits=0,autocommits=0,soft autocommits=0,optimizes=0,rollbacks=0,expungeDeletes=0,docsPending=0,adds=0,deletesById=0,deletesByQuery=0,errors=0,cumulative_adds=0,cumulative_deletesById=0,cumulative_deletesByQuery=0,cumulative_errors=0}
   [junit4]   2> 434914 T2226 oasu.SolrCoreState.decrefSolrCoreState Closing SolrCoreState
   [junit4]   2> 434914 T2226 oasu.DefaultSolrCoreState.closeIndexWriter SolrCoreState ref count has reached 0 - closing IndexWriter
   [junit4]   2> 434914 T2226 oasu.DefaultSolrCoreState.closeIndexWriter closing IndexWriter with IndexWriterCloser
   [junit4]   2> 434915 T2226 oasc.SolrCore.closeSearcher [collection1] Closing main searcher on request.
   [junit4]   2> 434916 T2226 oasc.CachingDirectoryFactory.close Closing MockDirectoryFactory - 2 directories currently being tracked
   [junit4]   2> 434916 T2226 oasc.CachingDirectoryFactory.closeCacheValue looking to close /mnt/ssd/jenkins/workspace/Lucene-Solr-4.x-Linux/solr/build/solr-core/test/J0/./solrtest-SliceStateUpdateTest-1378791635166/data2/index [CachedDir<<refCount=0;path=/mnt/ssd/jenkins/workspace/Lucene-Solr-4.x-Linux/solr/build/solr-core/test/J0/./solrtest-SliceStateUpdateTest-1378791635166/data2/index;done=false>>]
   [junit4]   2> 434917 T2226 oasc.CachingDirectoryFactory.close Closing directory: /mnt/ssd/jenkins/workspace/Lucene-Solr-4.x-Linux/solr/build/solr-core/test/J0/./solrtest-SliceStateUpdateTest-1378791635166/data2/index
   [junit4]   2> 434917 T2226 oasc.CachingDirectoryFactory.closeCacheValue looking to close /mnt/ssd/jenkins/workspace/Lucene-Solr-4.x-Linux/solr/build/solr-core/test/J0/./solrtest-SliceStateUpdateTest-1378791635166/data2 [CachedDir<<refCount=0;path=/mnt/ssd/jenkins/workspace/Lucene-Solr-4.x-Linux/solr/build/solr-core/test/J0/./solrtest-SliceStateUpdateTest-1378791635166/data2;done=false>>]
   [junit4]   2> 434917 T2226 oasc.CachingDirectoryFactory.close Closing directory: /mnt/ssd/jenkins/workspace/Lucene-Solr-4.x-Linux/solr/build/solr-core/test/J0/./solrtest-SliceStateUpdateTest-1378791635166/data2
   [junit4]   2> 434918 T2256 oasc.Overseer$ClusterStateUpdater.amILeader According to ZK I (id=90360488602370054-127.0.0.1:8983_solr-n_0000000001) am no longer a leader.
   [junit4]   2> 434919 T2250 oascc.ZkStateReader$2.process A cluster state change: WatchedEvent state:SyncConnected type:NodeChildrenChanged path:/live_nodes, has occurred - updating... (live nodes size: 1)
   [junit4]   2> 434919 T2250 oascc.ZkStateReader$2.process WARN ZooKeeper watch triggered, but Solr cannot talk to ZK
   [junit4]   2> 434920 T2250 oascc.ZkStateReader$3.process WARN ZooKeeper watch triggered, but Solr cannot talk to ZK
   [junit4]   2> 434921 T2226 oasc.ZkTestServer.send4LetterWord connecting to 127.0.0.1:60127 60127
   [junit4]   2> 435565 T2226 oas.SolrTestCaseJ4.tearDown ###Ending testSliceStateUpdate
   [junit4]   1> client port:0.0.0.0/0.0.0.0:0
   [junit4]   2> NOTE: reproduce with: ant test  -Dtestcase=SliceStateUpdateTest -Dtests.method=testSliceStateUpdate -Dtests.seed=6C37A80B5C2F9E03 -Dtests.multiplier=3 -Dtests.slow=true -Dtests.locale=es_PR -Dtests.timezone=Asia/Seoul -Dtests.file.encoding=UTF-8
   [junit4] FAILURE 46.1s J0 | SliceStateUpdateTest.testSliceStateUpdate <<<
   [junit4]    > Throwable #1: org.junit.ComparisonFailure: expected:<[in]active> but was:<[]active>
   [junit4]    > 	at __randomizedtesting.SeedInfo.seed([6C37A80B5C2F9E03:BC55254702FA4487]:0)
   [junit4]    > 	at org.apache.solr.cloud.SliceStateUpdateTest.testSliceStateUpdate(SliceStateUpdateTest.java:183)
   [junit4]    > 	at java.lang.Thread.run(Thread.java:724)
   [junit4]   2> 435578 T2226 oas.SolrTestCaseJ4.deleteCore ###deleteCore
   [junit4]   2> NOTE: test params are: codec=Lucene45: {}, docValues:{}, sim=DefaultSimilarity, locale=es_PR, timezone=Asia/Seoul
   [junit4]   2> NOTE: Linux 3.2.0-52-generic amd64/Oracle Corporation 1.7.0_25 (64-bit)/cpus=8,threads=1,free=83106656,total=268500992
   [junit4]   2> NOTE: All tests run in this JVM: [SliceStateTest, TestSchemaNameResource, QueryParsingTest, HdfsCollectionsAPIDistributedZkTest, SyncSliceTest, ShowFileRequestHandlerTest, SpellPossibilityIteratorTest, TestImplicitCoreProperties, TestBM25SimilarityFactory, QueryEqualityTest, TestNoOpRegenerator, SuggesterFSTTest, DirectUpdateHandlerOptimizeTest, PrimitiveFieldTypeTest, HdfsUnloadDistributedZkTest, DateMathParserTest, TestSort, TestValueSourceCache, CachingDirectoryFactoryTest, IndexSchemaTest, FileBasedSpellCheckerTest, TestConfig, TestQueryUtils, TestReplicationHandler, TestSolrDeletionPolicy1, TestLMDirichletSimilarityFactory, TestCharFilters, SolrTestCaseJ4Test, TestFieldTypeResource, LoggingHandlerTest, EchoParamsTest, TestFaceting, OverseerTest, ShardRoutingTest, DocumentBuilderTest, ZkControllerTest, BadComponentTest, TestSolrIndexConfig, WordBreakSolrSpellCheckerTest, TermVectorComponentTest, TestReversedWildcardFilterFactory, CoreMergeIndexesAdminHandlerTest, TestRandomDVFaceting, TestCoreContainer, TestJoin, SpatialFilterTest, MoreLikeThisHandlerTest, SliceStateUpdateTest]
   [junit4] Completed on J0 in 46.11s, 1 test, 1 failure <<< FAILURES!

[...truncated 733 lines...]
BUILD FAILED
/mnt/ssd/jenkins/workspace/Lucene-Solr-4.x-Linux/build.xml:402: The following error occurred while executing this line:
/mnt/ssd/jenkins/workspace/Lucene-Solr-4.x-Linux/build.xml:382: The following error occurred while executing this line:
/mnt/ssd/jenkins/workspace/Lucene-Solr-4.x-Linux/build.xml:39: The following error occurred while executing this line:
/mnt/ssd/jenkins/workspace/Lucene-Solr-4.x-Linux/solr/build.xml:189: The following error occurred while executing this line:
/mnt/ssd/jenkins/workspace/Lucene-Solr-4.x-Linux/solr/common-build.xml:455: The following error occurred while executing this line:
/mnt/ssd/jenkins/workspace/Lucene-Solr-4.x-Linux/lucene/common-build.xml:1233: The following error occurred while executing this line:
/mnt/ssd/jenkins/workspace/Lucene-Solr-4.x-Linux/lucene/common-build.xml:876: There were test failures: 325 suites, 1446 tests, 1 failure, 35 ignored (7 assumptions)

Total time: 40 minutes 11 seconds
Build step 'Invoke Ant' marked build as failure
Description set: Java: 64bit/jdk1.7.0_25 -XX:+UseCompressedOops -XX:+UseParallelGC
Archiving artifacts
Recording test results
Email was triggered for: Failure
Sending email for trigger: Failure



Mime
View raw message