lucene-dev mailing list archives

Site index · List index
Message view « Date » · « Thread »
Top « Date » · « Thread »
From Apache Jenkins Server <jenk...@builds.apache.org>
Subject [JENKINS] Lucene-Solr-Tests-trunk-Java7 - Build # 4205 - Still Failing
Date Sat, 03 Aug 2013 03:30:59 GMT
Build: https://builds.apache.org/job/Lucene-Solr-Tests-trunk-Java7/4205/

1 tests failed.
FAILED:  org.apache.solr.cloud.CollectionsAPIDistributedZkTest.testDistribSearch

Error Message:
IOException occured when talking to server at: http://127.0.0.1:20368

Stack Trace:
org.apache.solr.client.solrj.SolrServerException: IOException occured when talking to server at: http://127.0.0.1:20368
	at __randomizedtesting.SeedInfo.seed([A26CCEE62D88142E:238A40FE5AD77412]:0)
	at org.apache.solr.client.solrj.impl.HttpSolrServer.request(HttpSolrServer.java:435)
	at org.apache.solr.client.solrj.impl.HttpSolrServer.request(HttpSolrServer.java:180)
	at org.apache.solr.cloud.AbstractFullDistribZkTestBase.createCollection(AbstractFullDistribZkTestBase.java:1535)
	at org.apache.solr.cloud.CollectionsAPIDistributedZkTest.testCustomCollectionsAPI(CollectionsAPIDistributedZkTest.java:677)
	at org.apache.solr.cloud.CollectionsAPIDistributedZkTest.doTest(CollectionsAPIDistributedZkTest.java:159)
	at org.apache.solr.BaseDistributedSearchTestCase.testDistribSearch(BaseDistributedSearchTestCase.java:835)
	at sun.reflect.NativeMethodAccessorImpl.invoke0(Native Method)
	at sun.reflect.NativeMethodAccessorImpl.invoke(NativeMethodAccessorImpl.java:57)
	at sun.reflect.DelegatingMethodAccessorImpl.invoke(DelegatingMethodAccessorImpl.java:43)
	at java.lang.reflect.Method.invoke(Method.java:606)
	at com.carrotsearch.randomizedtesting.RandomizedRunner.invoke(RandomizedRunner.java:1559)
	at com.carrotsearch.randomizedtesting.RandomizedRunner.access$600(RandomizedRunner.java:79)
	at com.carrotsearch.randomizedtesting.RandomizedRunner$6.evaluate(RandomizedRunner.java:737)
	at com.carrotsearch.randomizedtesting.RandomizedRunner$7.evaluate(RandomizedRunner.java:773)
	at com.carrotsearch.randomizedtesting.RandomizedRunner$8.evaluate(RandomizedRunner.java:787)
	at com.carrotsearch.randomizedtesting.rules.SystemPropertiesRestoreRule$1.evaluate(SystemPropertiesRestoreRule.java:53)
	at org.apache.lucene.util.TestRuleSetupTeardownChained$1.evaluate(TestRuleSetupTeardownChained.java:50)
	at org.apache.lucene.util.TestRuleFieldCacheSanity$1.evaluate(TestRuleFieldCacheSanity.java:51)
	at org.apache.lucene.util.AbstractBeforeAfterRule$1.evaluate(AbstractBeforeAfterRule.java:46)
	at com.carrotsearch.randomizedtesting.rules.SystemPropertiesInvariantRule$1.evaluate(SystemPropertiesInvariantRule.java:55)
	at org.apache.lucene.util.TestRuleThreadAndTestName$1.evaluate(TestRuleThreadAndTestName.java:49)
	at org.apache.lucene.util.TestRuleIgnoreAfterMaxFailures$1.evaluate(TestRuleIgnoreAfterMaxFailures.java:70)
	at org.apache.lucene.util.TestRuleMarkFailure$1.evaluate(TestRuleMarkFailure.java:48)
	at com.carrotsearch.randomizedtesting.rules.StatementAdapter.evaluate(StatementAdapter.java:36)
	at com.carrotsearch.randomizedtesting.ThreadLeakControl$StatementRunner.run(ThreadLeakControl.java:358)
	at com.carrotsearch.randomizedtesting.ThreadLeakControl.forkTimeoutingTask(ThreadLeakControl.java:782)
	at com.carrotsearch.randomizedtesting.ThreadLeakControl$3.evaluate(ThreadLeakControl.java:442)
	at com.carrotsearch.randomizedtesting.RandomizedRunner.runSingleTest(RandomizedRunner.java:746)
	at com.carrotsearch.randomizedtesting.RandomizedRunner$3.evaluate(RandomizedRunner.java:648)
	at com.carrotsearch.randomizedtesting.RandomizedRunner$4.evaluate(RandomizedRunner.java:682)
	at com.carrotsearch.randomizedtesting.RandomizedRunner$5.evaluate(RandomizedRunner.java:693)
	at com.carrotsearch.randomizedtesting.rules.StatementAdapter.evaluate(StatementAdapter.java:36)
	at com.carrotsearch.randomizedtesting.rules.SystemPropertiesRestoreRule$1.evaluate(SystemPropertiesRestoreRule.java:53)
	at org.apache.lucene.util.AbstractBeforeAfterRule$1.evaluate(AbstractBeforeAfterRule.java:46)
	at org.apache.lucene.util.TestRuleStoreClassName$1.evaluate(TestRuleStoreClassName.java:42)
	at com.carrotsearch.randomizedtesting.rules.SystemPropertiesInvariantRule$1.evaluate(SystemPropertiesInvariantRule.java:55)
	at com.carrotsearch.randomizedtesting.rules.NoShadowingOrOverridesOnMethodsRule$1.evaluate(NoShadowingOrOverridesOnMethodsRule.java:39)
	at com.carrotsearch.randomizedtesting.rules.NoShadowingOrOverridesOnMethodsRule$1.evaluate(NoShadowingOrOverridesOnMethodsRule.java:39)
	at com.carrotsearch.randomizedtesting.rules.StatementAdapter.evaluate(StatementAdapter.java:36)
	at org.apache.lucene.util.TestRuleAssertionsRequired$1.evaluate(TestRuleAssertionsRequired.java:43)
	at org.apache.lucene.util.TestRuleMarkFailure$1.evaluate(TestRuleMarkFailure.java:48)
	at org.apache.lucene.util.TestRuleIgnoreAfterMaxFailures$1.evaluate(TestRuleIgnoreAfterMaxFailures.java:70)
	at org.apache.lucene.util.TestRuleIgnoreTestSuites$1.evaluate(TestRuleIgnoreTestSuites.java:55)
	at com.carrotsearch.randomizedtesting.rules.StatementAdapter.evaluate(StatementAdapter.java:36)
	at com.carrotsearch.randomizedtesting.ThreadLeakControl$StatementRunner.run(ThreadLeakControl.java:358)
	at java.lang.Thread.run(Thread.java:724)
Caused by: org.apache.http.conn.ConnectTimeoutException: Connect to 127.0.0.1:20368 timed out
	at org.apache.http.conn.scheme.PlainSocketFactory.connectSocket(PlainSocketFactory.java:129)
	at org.apache.http.impl.conn.DefaultClientConnectionOperator.openConnection(DefaultClientConnectionOperator.java:180)
	at org.apache.http.impl.conn.ManagedClientConnectionImpl.open(ManagedClientConnectionImpl.java:294)
	at org.apache.http.impl.client.DefaultRequestDirector.tryConnect(DefaultRequestDirector.java:645)
	at org.apache.http.impl.client.DefaultRequestDirector.execute(DefaultRequestDirector.java:480)
	at org.apache.http.impl.client.AbstractHttpClient.execute(AbstractHttpClient.java:906)
	at org.apache.http.impl.client.AbstractHttpClient.execute(AbstractHttpClient.java:805)
	at org.apache.http.impl.client.AbstractHttpClient.execute(AbstractHttpClient.java:784)
	at org.apache.solr.client.solrj.impl.HttpSolrServer.request(HttpSolrServer.java:365)
	... 45 more




Build Log:
[...truncated 9759 lines...]
   [junit4] Suite: org.apache.solr.cloud.CollectionsAPIDistributedZkTest
   [junit4]   2> 978068 T2785 oas.BaseDistributedSearchTestCase.initHostContext Setting hostContext system property: /
   [junit4]   2> 978075 T2785 oas.SolrTestCaseJ4.setUp ###Starting testDistribSearch
   [junit4]   2> Creating dataDir: /usr/home/hudson/hudson-slave/workspace/Lucene-Solr-Tests-trunk-Java7/solr/build/solr-core/test/J1/./solrtest-CollectionsAPIDistributedZkTest-1375499119592
   [junit4]   2> 978076 T2785 oasc.ZkTestServer.run STARTING ZK TEST SERVER
   [junit4]   2> 978077 T2786 oasc.ZkTestServer$ZKServerMain.runFromConfig Starting server
   [junit4]   2> 978178 T2785 oasc.ZkTestServer.run start zk server on port:22369
   [junit4]   2> 978179 T2785 oascc.ConnectionManager.waitForConnected Waiting for client to connect to ZooKeeper
   [junit4]   2> 978185 T2792 oascc.ConnectionManager.process Watcher org.apache.solr.common.cloud.ConnectionManager@334452c2 name:ZooKeeperConnection Watcher:127.0.0.1:22369 got event WatchedEvent state:SyncConnected type:None path:null path:null type:None
   [junit4]   2> 978185 T2785 oascc.ConnectionManager.waitForConnected Client is connected to ZooKeeper
   [junit4]   2> 978186 T2785 oascc.SolrZkClient.makePath makePath: /solr
   [junit4]   2> 978260 T2785 oascc.ConnectionManager.waitForConnected Waiting for client to connect to ZooKeeper
   [junit4]   2> 978296 T2794 oascc.ConnectionManager.process Watcher org.apache.solr.common.cloud.ConnectionManager@6642c1b2 name:ZooKeeperConnection Watcher:127.0.0.1:22369/solr got event WatchedEvent state:SyncConnected type:None path:null path:null type:None
   [junit4]   2> 978297 T2785 oascc.ConnectionManager.waitForConnected Client is connected to ZooKeeper
   [junit4]   2> 978297 T2785 oascc.SolrZkClient.makePath makePath: /collections/collection1
   [junit4]   2> 978425 T2785 oascc.SolrZkClient.makePath makePath: /collections/collection1/shards
   [junit4]   2> 978429 T2785 oascc.SolrZkClient.makePath makePath: /collections/control_collection
   [junit4]   2> 978507 T2785 oascc.SolrZkClient.makePath makePath: /collections/control_collection/shards
   [junit4]   2> 978514 T2785 oasc.AbstractZkTestCase.putConfig put /usr/home/hudson/hudson-slave/workspace/Lucene-Solr-Tests-trunk-Java7/solr/build/solr-core/test-files/solr/collection1/conf/solrconfig-tlog.xml to /configs/conf1/solrconfig.xml
   [junit4]   2> 978515 T2785 oascc.SolrZkClient.makePath makePath: /configs/conf1/solrconfig.xml
   [junit4]   2> 978640 T2785 oasc.AbstractZkTestCase.putConfig put /usr/home/hudson/hudson-slave/workspace/Lucene-Solr-Tests-trunk-Java7/solr/build/solr-core/test-files/solr/collection1/conf/schema.xml to /configs/conf1/schema.xml
   [junit4]   2> 978642 T2785 oascc.SolrZkClient.makePath makePath: /configs/conf1/schema.xml
   [junit4]   2> 978747 T2785 oasc.AbstractZkTestCase.putConfig put /usr/home/hudson/hudson-slave/workspace/Lucene-Solr-Tests-trunk-Java7/solr/build/solr-core/test-files/solr/collection1/conf/stopwords.txt to /configs/conf1/stopwords.txt
   [junit4]   2> 978748 T2785 oascc.SolrZkClient.makePath makePath: /configs/conf1/stopwords.txt
   [junit4]   2> 978759 T2785 oasc.AbstractZkTestCase.putConfig put /usr/home/hudson/hudson-slave/workspace/Lucene-Solr-Tests-trunk-Java7/solr/build/solr-core/test-files/solr/collection1/conf/protwords.txt to /configs/conf1/protwords.txt
   [junit4]   2> 978760 T2785 oascc.SolrZkClient.makePath makePath: /configs/conf1/protwords.txt
   [junit4]   2> 978833 T2785 oasc.AbstractZkTestCase.putConfig put /usr/home/hudson/hudson-slave/workspace/Lucene-Solr-Tests-trunk-Java7/solr/build/solr-core/test-files/solr/collection1/conf/currency.xml to /configs/conf1/currency.xml
   [junit4]   2> 978834 T2785 oascc.SolrZkClient.makePath makePath: /configs/conf1/currency.xml
   [junit4]   2> 978843 T2785 oasc.AbstractZkTestCase.putConfig put /usr/home/hudson/hudson-slave/workspace/Lucene-Solr-Tests-trunk-Java7/solr/build/solr-core/test-files/solr/collection1/conf/open-exchange-rates.json to /configs/conf1/open-exchange-rates.json
   [junit4]   2> 978844 T2785 oascc.SolrZkClient.makePath makePath: /configs/conf1/open-exchange-rates.json
   [junit4]   2> 978877 T2785 oasc.AbstractZkTestCase.putConfig put /usr/home/hudson/hudson-slave/workspace/Lucene-Solr-Tests-trunk-Java7/solr/build/solr-core/test-files/solr/collection1/conf/mapping-ISOLatin1Accent.txt to /configs/conf1/mapping-ISOLatin1Accent.txt
   [junit4]   2> 978878 T2785 oascc.SolrZkClient.makePath makePath: /configs/conf1/mapping-ISOLatin1Accent.txt
   [junit4]   2> 978886 T2785 oasc.AbstractZkTestCase.putConfig put /usr/home/hudson/hudson-slave/workspace/Lucene-Solr-Tests-trunk-Java7/solr/build/solr-core/test-files/solr/collection1/conf/old_synonyms.txt to /configs/conf1/old_synonyms.txt
   [junit4]   2> 978886 T2785 oascc.SolrZkClient.makePath makePath: /configs/conf1/old_synonyms.txt
   [junit4]   2> 978918 T2785 oasc.AbstractZkTestCase.putConfig put /usr/home/hudson/hudson-slave/workspace/Lucene-Solr-Tests-trunk-Java7/solr/build/solr-core/test-files/solr/collection1/conf/synonyms.txt to /configs/conf1/synonyms.txt
   [junit4]   2> 978919 T2785 oascc.SolrZkClient.makePath makePath: /configs/conf1/synonyms.txt
   [junit4]   2> 979409 T2785 oejs.Server.doStart jetty-8.1.10.v20130312
   [junit4]   2> 979414 T2785 oejs.AbstractConnector.doStart Started SocketConnector@127.0.0.1:11285
   [junit4]   2> 979415 T2785 oass.SolrDispatchFilter.init SolrDispatchFilter.init()
   [junit4]   2> 979416 T2785 oasc.SolrResourceLoader.locateSolrHome JNDI not configured for solr (NoInitialContextEx)
   [junit4]   2> 979416 T2785 oasc.SolrResourceLoader.locateSolrHome using system property solr.solr.home: /usr/home/hudson/hudson-slave/workspace/Lucene-Solr-Tests-trunk-Java7/solr/build/solr-core/test/J1/./org.apache.solr.cloud.CollectionsAPIDistributedZkTest-controljetty-1375499120540
   [junit4]   2> 979417 T2785 oasc.SolrResourceLoader.<init> new SolrResourceLoader for directory: '/usr/home/hudson/hudson-slave/workspace/Lucene-Solr-Tests-trunk-Java7/solr/build/solr-core/test/J1/./org.apache.solr.cloud.CollectionsAPIDistributedZkTest-controljetty-1375499120540/'
   [junit4]   2> 979458 T2785 oasc.ConfigSolr.fromFile Loading container configuration from /usr/home/hudson/hudson-slave/workspace/Lucene-Solr-Tests-trunk-Java7/solr/build/solr-core/test/J1/./org.apache.solr.cloud.CollectionsAPIDistributedZkTest-controljetty-1375499120540/solr.xml
   [junit4]   2> 979550 T2785 oasc.ConfigSolrXml.<init> Config-defined core root directory: 
   [junit4]   2> 979551 T2785 oasc.CoreContainer.<init> New CoreContainer 1748912407
   [junit4]   2> 979552 T2785 oasc.CoreContainer.load Loading cores into CoreContainer [instanceDir=/usr/home/hudson/hudson-slave/workspace/Lucene-Solr-Tests-trunk-Java7/solr/build/solr-core/test/J1/./org.apache.solr.cloud.CollectionsAPIDistributedZkTest-controljetty-1375499120540/]
   [junit4]   2> 979554 T2785 oashc.HttpShardHandlerFactory.getParameter Setting socketTimeout to: 120000
   [junit4]   2> 979554 T2785 oashc.HttpShardHandlerFactory.getParameter Setting urlScheme to: http://
   [junit4]   2> 979555 T2785 oashc.HttpShardHandlerFactory.getParameter Setting connTimeout to: 15000
   [junit4]   2> 979555 T2785 oashc.HttpShardHandlerFactory.getParameter Setting maxConnectionsPerHost to: 20
   [junit4]   2> 979556 T2785 oashc.HttpShardHandlerFactory.getParameter Setting corePoolSize to: 0
   [junit4]   2> 979556 T2785 oashc.HttpShardHandlerFactory.getParameter Setting maximumPoolSize to: 2147483647
   [junit4]   2> 979557 T2785 oashc.HttpShardHandlerFactory.getParameter Setting maxThreadIdleTime to: 5
   [junit4]   2> 979557 T2785 oashc.HttpShardHandlerFactory.getParameter Setting sizeOfQueue to: -1
   [junit4]   2> 979558 T2785 oashc.HttpShardHandlerFactory.getParameter Setting fairnessPolicy to: false
   [junit4]   2> 979558 T2785 oascsi.HttpClientUtil.createClient Creating new http client, config:maxConnectionsPerHost=20&maxConnections=10000&socketTimeout=120000&connTimeout=15000&retry=false
   [junit4]   2> 979577 T2785 oasc.ZkContainer.initZooKeeper Zookeeper client=127.0.0.1:22369/solr
   [junit4]   2> 979577 T2785 oasc.ZkController.checkChrootPath zkHost includes chroot
   [junit4]   2> 979578 T2785 oascc.ConnectionManager.waitForConnected Waiting for client to connect to ZooKeeper
   [junit4]   2> 979581 T2805 oascc.ConnectionManager.process Watcher org.apache.solr.common.cloud.ConnectionManager@641cb521 name:ZooKeeperConnection Watcher:127.0.0.1:22369 got event WatchedEvent state:SyncConnected type:None path:null path:null type:None
   [junit4]   2> 979582 T2785 oascc.ConnectionManager.waitForConnected Client is connected to ZooKeeper
   [junit4]   2> 979726 T2785 oascsi.HttpClientUtil.createClient Creating new http client, config:maxConnections=500&maxConnectionsPerHost=16&socketTimeout=120000&connTimeout=15000
   [junit4]   2> 979772 T2785 oascc.ConnectionManager.waitForConnected Waiting for client to connect to ZooKeeper
   [junit4]   2> 979778 T2807 oascc.ConnectionManager.process Watcher org.apache.solr.common.cloud.ConnectionManager@69f7d859 name:ZooKeeperConnection Watcher:127.0.0.1:22369/solr got event WatchedEvent state:SyncConnected type:None path:null path:null type:None
   [junit4]   2> 979778 T2785 oascc.ConnectionManager.waitForConnected Client is connected to ZooKeeper
   [junit4]   2> 979781 T2785 oascc.SolrZkClient.makePath makePath: /overseer/queue
   [junit4]   2> 979808 T2785 oascc.SolrZkClient.makePath makePath: /overseer/collection-queue-work
   [junit4]   2> 979853 T2785 oascc.SolrZkClient.makePath makePath: /live_nodes
   [junit4]   2> 979859 T2785 oasc.ZkController.createEphemeralLiveNode Register node as live in ZooKeeper:/live_nodes/127.0.0.1:11285_
   [junit4]   2> 979861 T2785 oascc.SolrZkClient.makePath makePath: /live_nodes/127.0.0.1:11285_
   [junit4]   2> 979900 T2785 oascc.SolrZkClient.makePath makePath: /overseer_elect/election
   [junit4]   2> 979991 T2785 oascc.SolrZkClient.makePath makePath: /overseer_elect/leader
   [junit4]   2> 979999 T2785 oasc.Overseer.start Overseer (id=90144710302105603-127.0.0.1:11285_-n_0000000000) starting
   [junit4]   2> 980047 T2785 oascc.SolrZkClient.makePath makePath: /overseer/queue-work
   [junit4]   2> 980101 T2809 oasc.OverseerCollectionProcessor.run Process current queue of collection creations
   [junit4]   2> 980103 T2785 oascc.SolrZkClient.makePath makePath: /clusterstate.json
   [junit4]   2> 980118 T2785 oascc.SolrZkClient.makePath makePath: /aliases.json
   [junit4]   2> 980121 T2785 oascc.ZkStateReader.createClusterStateWatchersAndUpdate Updating cluster state from ZooKeeper... 
   [junit4]   2> 980124 T2808 oasc.Overseer$ClusterStateUpdater.run Starting to work on the main queue
   [junit4]   2> 980128 T2785 oasc.CorePropertiesLocator.discover Looking for core definitions underneath /usr/home/hudson/hudson-slave/workspace/Lucene-Solr-Tests-trunk-Java7/solr/build/solr-core/test/J1/./org.apache.solr.cloud.CollectionsAPIDistributedZkTest-controljetty-1375499120540
   [junit4]   2> 980346 T2785 oasc.CorePropertiesLocator.discoverUnder Found core conf in /usr/home/hudson/hudson-slave/workspace/Lucene-Solr-Tests-trunk-Java7/solr/build/solr-core/test/J1/./org.apache.solr.cloud.CollectionsAPIDistributedZkTest-controljetty-1375499120540/conf/
   [junit4]   2> 980349 T2785 oasc.CorePropertiesLocator.discover Found 1 core definitions
   [junit4]   2> 980349 T2785 oass.SolrDispatchFilter.init user.dir=/usr/home/hudson/hudson-slave/workspace/Lucene-Solr-Tests-trunk-Java7/solr/build/solr-core/test/J1
   [junit4]   2> 980350 T2785 oass.SolrDispatchFilter.init SolrDispatchFilter.init() done
   [junit4]   2> 980351 T2785 oascsi.HttpClientUtil.createClient Creating new http client, config:maxConnections=128&maxConnectionsPerHost=32&followRedirects=false
   [junit4]   2> 980368 T2785 oascsi.HttpClientUtil.createClient Creating new http client, config:
   [junit4]   2> 980370 T2785 oascc.ConnectionManager.waitForConnected Waiting for client to connect to ZooKeeper
   [junit4]   2> 980375 T2812 oascc.ConnectionManager.process Watcher org.apache.solr.common.cloud.ConnectionManager@5529d86e name:ZooKeeperConnection Watcher:127.0.0.1:22369/solr got event WatchedEvent state:SyncConnected type:None path:null path:null type:None
   [junit4]   2> 980375 T2785 oascc.ConnectionManager.waitForConnected Client is connected to ZooKeeper
   [junit4]   2> 980377 T2785 oascc.ZkStateReader.createClusterStateWatchersAndUpdate Updating cluster state from ZooKeeper... 
   [junit4]   2> 980379 T2785 oasc.ChaosMonkey.monkeyLog monkey: init - expire sessions:true cause connection loss:true
   [junit4]   2> 980811 T2785 oejs.Server.doStart jetty-8.1.10.v20130312
   [junit4]   2> 980815 T2785 oejs.AbstractConnector.doStart Started SocketConnector@127.0.0.1:20368
   [junit4]   2> 980816 T2785 oass.SolrDispatchFilter.init SolrDispatchFilter.init()
   [junit4]   2> 980817 T2785 oasc.SolrResourceLoader.locateSolrHome JNDI not configured for solr (NoInitialContextEx)
   [junit4]   2> 980817 T2785 oasc.SolrResourceLoader.locateSolrHome using system property solr.solr.home: /usr/home/hudson/hudson-slave/workspace/Lucene-Solr-Tests-trunk-Java7/solr/build/solr-core/test/J1/./org.apache.solr.cloud.CollectionsAPIDistributedZkTest-jetty1-1375499121896
   [junit4]   2> 980818 T2785 oasc.SolrResourceLoader.<init> new SolrResourceLoader for directory: '/usr/home/hudson/hudson-slave/workspace/Lucene-Solr-Tests-trunk-Java7/solr/build/solr-core/test/J1/./org.apache.solr.cloud.CollectionsAPIDistributedZkTest-jetty1-1375499121896/'
   [junit4]   2> 980902 T2785 oasc.ConfigSolr.fromFile Loading container configuration from /usr/home/hudson/hudson-slave/workspace/Lucene-Solr-Tests-trunk-Java7/solr/build/solr-core/test/J1/./org.apache.solr.cloud.CollectionsAPIDistributedZkTest-jetty1-1375499121896/solr.xml
   [junit4]   2> 981184 T2785 oasc.ConfigSolrXml.<init> Config-defined core root directory: 
   [junit4]   2> 981185 T2785 oasc.CoreContainer.<init> New CoreContainer 637513147
   [junit4]   2> 981186 T2785 oasc.CoreContainer.load Loading cores into CoreContainer [instanceDir=/usr/home/hudson/hudson-slave/workspace/Lucene-Solr-Tests-trunk-Java7/solr/build/solr-core/test/J1/./org.apache.solr.cloud.CollectionsAPIDistributedZkTest-jetty1-1375499121896/]
   [junit4]   2> 981188 T2785 oashc.HttpShardHandlerFactory.getParameter Setting socketTimeout to: 120000
   [junit4]   2> 981188 T2785 oashc.HttpShardHandlerFactory.getParameter Setting urlScheme to: http://
   [junit4]   2> 981189 T2785 oashc.HttpShardHandlerFactory.getParameter Setting connTimeout to: 15000
   [junit4]   2> 981189 T2785 oashc.HttpShardHandlerFactory.getParameter Setting maxConnectionsPerHost to: 20
   [junit4]   2> 981190 T2785 oashc.HttpShardHandlerFactory.getParameter Setting corePoolSize to: 0
   [junit4]   2> 981190 T2785 oashc.HttpShardHandlerFactory.getParameter Setting maximumPoolSize to: 2147483647
   [junit4]   2> 981191 T2785 oashc.HttpShardHandlerFactory.getParameter Setting maxThreadIdleTime to: 5
   [junit4]   2> 981191 T2785 oashc.HttpShardHandlerFactory.getParameter Setting sizeOfQueue to: -1
   [junit4]   2> 981192 T2785 oashc.HttpShardHandlerFactory.getParameter Setting fairnessPolicy to: false
   [junit4]   2> 981193 T2785 oascsi.HttpClientUtil.createClient Creating new http client, config:maxConnectionsPerHost=20&maxConnections=10000&socketTimeout=120000&connTimeout=15000&retry=false
   [junit4]   2> 981211 T2785 oasc.ZkContainer.initZooKeeper Zookeeper client=127.0.0.1:22369/solr
   [junit4]   2> 981212 T2785 oasc.ZkController.checkChrootPath zkHost includes chroot
   [junit4]   2> 981213 T2785 oascc.ConnectionManager.waitForConnected Waiting for client to connect to ZooKeeper
   [junit4]   2> 981216 T2823 oascc.ConnectionManager.process Watcher org.apache.solr.common.cloud.ConnectionManager@6bd730a9 name:ZooKeeperConnection Watcher:127.0.0.1:22369 got event WatchedEvent state:SyncConnected type:None path:null path:null type:None
   [junit4]   2> 981217 T2785 oascc.ConnectionManager.waitForConnected Client is connected to ZooKeeper
   [junit4]   2> 981253 T2785 oascsi.HttpClientUtil.createClient Creating new http client, config:maxConnections=500&maxConnectionsPerHost=16&socketTimeout=120000&connTimeout=15000
   [junit4]   2> 981275 T2785 oascc.ConnectionManager.waitForConnected Waiting for client to connect to ZooKeeper
   [junit4]   2> 981279 T2825 oascc.ConnectionManager.process Watcher org.apache.solr.common.cloud.ConnectionManager@19ba6480 name:ZooKeeperConnection Watcher:127.0.0.1:22369/solr got event WatchedEvent state:SyncConnected type:None path:null path:null type:None
   [junit4]   2> 981279 T2785 oascc.ConnectionManager.waitForConnected Client is connected to ZooKeeper
   [junit4]   2> 981306 T2785 oascc.ZkStateReader.createClusterStateWatchersAndUpdate Updating cluster state from ZooKeeper... 
   [junit4]   2> 982310 T2785 oasc.ZkController.createEphemeralLiveNode Register node as live in ZooKeeper:/live_nodes/127.0.0.1:20368_
   [junit4]   2> 982314 T2785 oascc.SolrZkClient.makePath makePath: /live_nodes/127.0.0.1:20368_
   [junit4]   2> 982321 T2812 oascc.ZkStateReader$3.process Updating live nodes... (2)
   [junit4]   2> 982321 T2807 oascc.ZkStateReader$3.process Updating live nodes... (2)
   [junit4]   2> 982321 T2825 oascc.ZkStateReader$3.process Updating live nodes... (2)
   [junit4]   2> 982358 T2785 oasc.CorePropertiesLocator.discover Looking for core definitions underneath /usr/home/hudson/hudson-slave/workspace/Lucene-Solr-Tests-trunk-Java7/solr/build/solr-core/test/J1/./org.apache.solr.cloud.CollectionsAPIDistributedZkTest-jetty1-1375499121896
   [junit4]   2> 982569 T2785 oasc.CorePropertiesLocator.discoverUnder Found core conf in /usr/home/hudson/hudson-slave/workspace/Lucene-Solr-Tests-trunk-Java7/solr/build/solr-core/test/J1/./org.apache.solr.cloud.CollectionsAPIDistributedZkTest-jetty1-1375499121896/conf/
   [junit4]   2> 982574 T2785 oasc.CorePropertiesLocator.discover Found 1 core definitions
   [junit4]   2> 982575 T2785 oass.SolrDispatchFilter.init user.dir=/usr/home/hudson/hudson-slave/workspace/Lucene-Solr-Tests-trunk-Java7/solr/build/solr-core/test/J1
   [junit4]   2> 982575 T2785 oass.SolrDispatchFilter.init SolrDispatchFilter.init() done
   [junit4]   2> 982576 T2785 oascsi.HttpClientUtil.createClient Creating new http client, config:maxConnections=128&maxConnectionsPerHost=32&followRedirects=false
   [junit4]   2> 983006 T2785 oejs.Server.doStart jetty-8.1.10.v20130312
   [junit4]   2> 983009 T2785 oejs.AbstractConnector.doStart Started SocketConnector@127.0.0.1:43003
   [junit4]   2> 983010 T2785 oass.SolrDispatchFilter.init SolrDispatchFilter.init()
   [junit4]   2> 983011 T2785 oasc.SolrResourceLoader.locateSolrHome JNDI not configured for solr (NoInitialContextEx)
   [junit4]   2> 983011 T2785 oasc.SolrResourceLoader.locateSolrHome using system property solr.solr.home: /usr/home/hudson/hudson-slave/workspace/Lucene-Solr-Tests-trunk-Java7/solr/build/solr-core/test/J1/./org.apache.solr.cloud.CollectionsAPIDistributedZkTest-jetty2-1375499124114
   [junit4]   2> 983012 T2785 oasc.SolrResourceLoader.<init> new SolrResourceLoader for directory: '/usr/home/hudson/hudson-slave/workspace/Lucene-Solr-Tests-trunk-Java7/solr/build/solr-core/test/J1/./org.apache.solr.cloud.CollectionsAPIDistributedZkTest-jetty2-1375499124114/'
   [junit4]   2> 983065 T2785 oasc.ConfigSolr.fromFile Loading container configuration from /usr/home/hudson/hudson-slave/workspace/Lucene-Solr-Tests-trunk-Java7/solr/build/solr-core/test/J1/./org.apache.solr.cloud.CollectionsAPIDistributedZkTest-jetty2-1375499124114/solr.xml
   [junit4]   2> 983164 T2785 oasc.ConfigSolrXml.<init> Config-defined core root directory: 
   [junit4]   2> 983165 T2785 oasc.CoreContainer.<init> New CoreContainer 475708360
   [junit4]   2> 983166 T2785 oasc.CoreContainer.load Loading cores into CoreContainer [instanceDir=/usr/home/hudson/hudson-slave/workspace/Lucene-Solr-Tests-trunk-Java7/solr/build/solr-core/test/J1/./org.apache.solr.cloud.CollectionsAPIDistributedZkTest-jetty2-1375499124114/]
   [junit4]   2> 983168 T2785 oashc.HttpShardHandlerFactory.getParameter Setting socketTimeout to: 120000
   [junit4]   2> 983168 T2785 oashc.HttpShardHandlerFactory.getParameter Setting urlScheme to: http://
   [junit4]   2> 983169 T2785 oashc.HttpShardHandlerFactory.getParameter Setting connTimeout to: 15000
   [junit4]   2> 983169 T2785 oashc.HttpShardHandlerFactory.getParameter Setting maxConnectionsPerHost to: 20
   [junit4]   2> 983170 T2785 oashc.HttpShardHandlerFactory.getParameter Setting corePoolSize to: 0
   [junit4]   2> 983170 T2785 oashc.HttpShardHandlerFactory.getParameter Setting maximumPoolSize to: 2147483647
   [junit4]   2> 983171 T2785 oashc.HttpShardHandlerFactory.getParameter Setting maxThreadIdleTime to: 5
   [junit4]   2> 983171 T2785 oashc.HttpShardHandlerFactory.getParameter Setting sizeOfQueue to: -1
   [junit4]   2> 983172 T2785 oashc.HttpShardHandlerFactory.getParameter Setting fairnessPolicy to: false
   [junit4]   2> 983172 T2785 oascsi.HttpClientUtil.createClient Creating new http client, config:maxConnectionsPerHost=20&maxConnections=10000&socketTimeout=120000&connTimeout=15000&retry=false
   [junit4]   2> 983191 T2785 oasc.ZkContainer.initZooKeeper Zookeeper client=127.0.0.1:22369/solr
   [junit4]   2> 983192 T2785 oasc.ZkController.checkChrootPath zkHost includes chroot
   [junit4]   2> 983193 T2785 oascc.ConnectionManager.waitForConnected Waiting for client to connect to ZooKeeper
   [junit4]   2> 983199 T2837 oascc.ConnectionManager.process Watcher org.apache.solr.common.cloud.ConnectionManager@50784960 name:ZooKeeperConnection Watcher:127.0.0.1:22369 got event WatchedEvent state:SyncConnected type:None path:null path:null type:None
   [junit4]   2> 983200 T2785 oascc.ConnectionManager.waitForConnected Client is connected to ZooKeeper
   [junit4]   2> 983204 T2785 oascsi.HttpClientUtil.createClient Creating new http client, config:maxConnections=500&maxConnectionsPerHost=16&socketTimeout=120000&connTimeout=15000
   [junit4]   2> 983215 T2785 oascc.ConnectionManager.waitForConnected Waiting for client to connect to ZooKeeper
   [junit4]   2> 983249 T2839 oascc.ConnectionManager.process Watcher org.apache.solr.common.cloud.ConnectionManager@5d6efd2a name:ZooKeeperConnection Watcher:127.0.0.1:22369/solr got event WatchedEvent state:SyncConnected type:None path:null path:null type:None
   [junit4]   2> 983250 T2785 oascc.ConnectionManager.waitForConnected Client is connected to ZooKeeper
   [junit4]   2> 983279 T2785 oascc.ZkStateReader.createClusterStateWatchersAndUpdate Updating cluster state from ZooKeeper... 
   [junit4]   2> 984283 T2785 oasc.ZkController.createEphemeralLiveNode Register node as live in ZooKeeper:/live_nodes/127.0.0.1:43003_
   [junit4]   2> 984291 T2785 oascc.SolrZkClient.makePath makePath: /live_nodes/127.0.0.1:43003_
   [junit4]   2> 984386 T2825 oascc.ZkStateReader$3.process Updating live nodes... (3)
   [junit4]   2> 984386 T2839 oascc.ZkStateReader$3.process Updating live nodes... (3)
   [junit4]   2> 984386 T2807 oascc.ZkStateReader$3.process Updating live nodes... (3)
   [junit4]   2> 984386 T2812 oascc.ZkStateReader$3.process Updating live nodes... (3)
   [junit4]   2> 984400 T2785 oasc.CorePropertiesLocator.discover Looking for core definitions underneath /usr/home/hudson/hudson-slave/workspace/Lucene-Solr-Tests-trunk-Java7/solr/build/solr-core/test/J1/./org.apache.solr.cloud.CollectionsAPIDistributedZkTest-jetty2-1375499124114
   [junit4]   2> 984407 T2785 oasc.CorePropertiesLocator.discoverUnder Found core conf in /usr/home/hudson/hudson-slave/workspace/Lucene-Solr-Tests-trunk-Java7/solr/build/solr-core/test/J1/./org.apache.solr.cloud.CollectionsAPIDistributedZkTest-jetty2-1375499124114/conf/
   [junit4]   2> 984592 T2785 oasc.CorePropertiesLocator.discover Found 1 core definitions
   [junit4]   2> 984594 T2785 oass.SolrDispatchFilter.init user.dir=/usr/home/hudson/hudson-slave/workspace/Lucene-Solr-Tests-trunk-Java7/solr/build/solr-core/test/J1
   [junit4]   2> 984594 T2785 oass.SolrDispatchFilter.init SolrDispatchFilter.init() done
   [junit4]   2> 984595 T2785 oascsi.HttpClientUtil.createClient Creating new http client, config:maxConnections=128&maxConnectionsPerHost=32&followRedirects=false
   [junit4]   2> 984993 T2785 oejs.Server.doStart jetty-8.1.10.v20130312
   [junit4]   2> 984997 T2785 oejs.AbstractConnector.doStart Started SocketConnector@127.0.0.1:37862
   [junit4]   2> 984997 T2785 oass.SolrDispatchFilter.init SolrDispatchFilter.init()
   [junit4]   2> 984998 T2785 oasc.SolrResourceLoader.locateSolrHome JNDI not configured for solr (NoInitialContextEx)
   [junit4]   2> 984999 T2785 oasc.SolrResourceLoader.locateSolrHome using system property solr.solr.home: /usr/home/hudson/hudson-slave/workspace/Lucene-Solr-Tests-trunk-Java7/solr/build/solr-core/test/J1/./org.apache.solr.cloud.CollectionsAPIDistributedZkTest-jetty3-1375499126127
   [junit4]   2> 984999 T2785 oasc.SolrResourceLoader.<init> new SolrResourceLoader for directory: '/usr/home/hudson/hudson-slave/workspace/Lucene-Solr-Tests-trunk-Java7/solr/build/solr-core/test/J1/./org.apache.solr.cloud.CollectionsAPIDistributedZkTest-jetty3-1375499126127/'
   [junit4]   2> 985044 T2785 oasc.ConfigSolr.fromFile Loading container configuration from /usr/home/hudson/hudson-slave/workspace/Lucene-Solr-Tests-trunk-Java7/solr/build/solr-core/test/J1/./org.apache.solr.cloud.CollectionsAPIDistributedZkTest-jetty3-1375499126127/solr.xml
   [junit4]   2> 985180 T2785 oasc.ConfigSolrXml.<init> Config-defined core root directory: 
   [junit4]   2> 985181 T2785 oasc.CoreContainer.<init> New CoreContainer 706555540
   [junit4]   2> 985182 T2785 oasc.CoreContainer.load Loading cores into CoreContainer [instanceDir=/usr/home/hudson/hudson-slave/workspace/Lucene-Solr-Tests-trunk-Java7/solr/build/solr-core/test/J1/./org.apache.solr.cloud.CollectionsAPIDistributedZkTest-jetty3-1375499126127/]
   [junit4]   2> 985184 T2785 oashc.HttpShardHandlerFactory.getParameter Setting socketTimeout to: 120000
   [junit4]   2> 985185 T2785 oashc.HttpShardHandlerFactory.getParameter Setting urlScheme to: http://
   [junit4]   2> 985185 T2785 oashc.HttpShardHandlerFactory.getParameter Setting connTimeout to: 15000
   [junit4]   2> 985186 T2785 oashc.HttpShardHandlerFactory.getParameter Setting maxConnectionsPerHost to: 20
   [junit4]   2> 985186 T2785 oashc.HttpShardHandlerFactory.getParameter Setting corePoolSize to: 0
   [junit4]   2> 985187 T2785 oashc.HttpShardHandlerFactory.getParameter Setting maximumPoolSize to: 2147483647
   [junit4]   2> 985187 T2785 oashc.HttpShardHandlerFactory.getParameter Setting maxThreadIdleTime to: 5
   [junit4]   2> 985188 T2785 oashc.HttpShardHandlerFactory.getParameter Setting sizeOfQueue to: -1
   [junit4]   2> 985188 T2785 oashc.HttpShardHandlerFactory.getParameter Setting fairnessPolicy to: false
   [junit4]   2> 985189 T2785 oascsi.HttpClientUtil.createClient Creating new http client, config:maxConnectionsPerHost=20&maxConnections=10000&socketTimeout=120000&connTimeout=15000&retry=false
   [junit4]   2> 985219 T2785 oasc.ZkContainer.initZooKeeper Zookeeper client=127.0.0.1:22369/solr
   [junit4]   2> 985219 T2785 oasc.ZkController.checkChrootPath zkHost includes chroot
   [junit4]   2> 985220 T2785 oascc.ConnectionManager.waitForConnected Waiting for client to connect to ZooKeeper
   [junit4]   2> 985224 T2851 oascc.ConnectionManager.process Watcher org.apache.solr.common.cloud.ConnectionManager@39a63cfa name:ZooKeeperConnection Watcher:127.0.0.1:22369 got event WatchedEvent state:SyncConnected type:None path:null path:null type:None
   [junit4]   2> 985224 T2785 oascc.ConnectionManager.waitForConnected Client is connected to ZooKeeper
   [junit4]   2> 985227 T2785 oascsi.HttpClientUtil.createClient Creating new http client, config:maxConnections=500&maxConnectionsPerHost=16&socketTimeout=120000&connTimeout=15000
   [junit4]   2> 985260 T2785 oascc.ConnectionManager.waitForConnected Waiting for client to connect to ZooKeeper
   [junit4]   2> 985266 T2853 oascc.ConnectionManager.process Watcher org.apache.solr.common.cloud.ConnectionManager@358682aa name:ZooKeeperConnection Watcher:127.0.0.1:22369/solr got event WatchedEvent state:SyncConnected type:None path:null path:null type:None
   [junit4]   2> 985266 T2785 oascc.ConnectionManager.waitForConnected Client is connected to ZooKeeper
   [junit4]   2> 985294 T2785 oascc.ZkStateReader.createClusterStateWatchersAndUpdate Updating cluster state from ZooKeeper... 
   [junit4]   2> 986298 T2785 oasc.ZkController.createEphemeralLiveNode Register node as live in ZooKeeper:/live_nodes/127.0.0.1:37862_
   [junit4]   2> 986302 T2785 oascc.SolrZkClient.makePath makePath: /live_nodes/127.0.0.1:37862_
   [junit4]   2> 986307 T2807 oascc.ZkStateReader$3.process Updating live nodes... (4)
   [junit4]   2> 986307 T2825 oascc.ZkStateReader$3.process Updating live nodes... (4)
   [junit4]   2> 986307 T2839 oascc.ZkStateReader$3.process Updating live nodes... (4)
   [junit4]   2> 986307 T2812 oascc.ZkStateReader$3.process Updating live nodes... (4)
   [junit4]   2> 986307 T2853 oascc.ZkStateReader$3.process Updating live nodes... (4)
   [junit4]   2> 986364 T2785 oasc.CorePropertiesLocator.discover Looking for core definitions underneath /usr/home/hudson/hudson-slave/workspace/Lucene-Solr-Tests-trunk-Java7/solr/build/solr-core/test/J1/./org.apache.solr.cloud.CollectionsAPIDistributedZkTest-jetty3-1375499126127
   [junit4]   2> 986366 T2785 oasc.CorePropertiesLocator.discoverUnder Found core conf in /usr/home/hudson/hudson-slave/workspace/Lucene-Solr-Tests-trunk-Java7/solr/build/solr-core/test/J1/./org.apache.solr.cloud.CollectionsAPIDistributedZkTest-jetty3-1375499126127/conf/
   [junit4]   2> 986572 T2785 oasc.CorePropertiesLocator.discover Found 1 core definitions
   [junit4]   2> 986573 T2785 oass.SolrDispatchFilter.init user.dir=/usr/home/hudson/hudson-slave/workspace/Lucene-Solr-Tests-trunk-Java7/solr/build/solr-core/test/J1
   [junit4]   2> 986574 T2785 oass.SolrDispatchFilter.init SolrDispatchFilter.init() done
   [junit4]   2> 986574 T2785 oascsi.HttpClientUtil.createClient Creating new http client, config:maxConnections=128&maxConnectionsPerHost=32&followRedirects=false
   [junit4]   2> 987030 T2785 oejs.Server.doStart jetty-8.1.10.v20130312
   [junit4]   2> 987034 T2785 oejs.AbstractConnector.doStart Started SocketConnector@127.0.0.1:23021
   [junit4]   2> 987035 T2785 oass.SolrDispatchFilter.init SolrDispatchFilter.init()
   [junit4]   2> 987035 T2785 oasc.SolrResourceLoader.locateSolrHome JNDI not configured for solr (NoInitialContextEx)
   [junit4]   2> 987036 T2785 oasc.SolrResourceLoader.locateSolrHome using system property solr.solr.home: /usr/home/hudson/hudson-slave/workspace/Lucene-Solr-Tests-trunk-Java7/solr/build/solr-core/test/J1/./org.apache.solr.cloud.CollectionsAPIDistributedZkTest-jetty4-1375499128109
   [junit4]   2> 987036 T2785 oasc.SolrResourceLoader.<init> new SolrResourceLoader for directory: '/usr/home/hudson/hudson-slave/workspace/Lucene-Solr-Tests-trunk-Java7/solr/build/solr-core/test/J1/./org.apache.solr.cloud.CollectionsAPIDistributedZkTest-jetty4-1375499128109/'
   [junit4]   2> 987118 T2785 oasc.ConfigSolr.fromFile Loading container configuration from /usr/home/hudson/hudson-slave/workspace/Lucene-Solr-Tests-trunk-Java7/solr/build/solr-core/test/J1/./org.apache.solr.cloud.CollectionsAPIDistributedZkTest-jetty4-1375499128109/solr.xml
   [junit4]   2> 987312 T2785 oasc.ConfigSolrXml.<init> Config-defined core root directory: 
   [junit4]   2> 987313 T2785 oasc.CoreContainer.<init> New CoreContainer 338437388
   [junit4]   2> 987314 T2785 oasc.CoreContainer.load Loading cores into CoreContainer [instanceDir=/usr/home/hudson/hudson-slave/workspace/Lucene-Solr-Tests-trunk-Java7/solr/build/solr-core/test/J1/./org.apache.solr.cloud.CollectionsAPIDistributedZkTest-jetty4-1375499128109/]
   [junit4]   2> 987316 T2785 oashc.HttpShardHandlerFactory.getParameter Setting socketTimeout to: 120000
   [junit4]   2> 987316 T2785 oashc.HttpShardHandlerFactory.getParameter Setting urlScheme to: http://
   [junit4]   2> 987317 T2785 oashc.HttpShardHandlerFactory.getParameter Setting connTimeout to: 15000
   [junit4]   2> 987317 T2785 oashc.HttpShardHandlerFactory.getParameter Setting maxConnectionsPerHost to: 20
   [junit4]   2> 987318 T2785 oashc.HttpShardHandlerFactory.getParameter Setting corePoolSize to: 0
   [junit4]   2> 987318 T2785 oashc.HttpShardHandlerFactory.getParameter Setting maximumPoolSize to: 2147483647
   [junit4]   2> 987319 T2785 oashc.HttpShardHandlerFactory.getParameter Setting maxThreadIdleTime to: 5
   [junit4]   2> 987319 T2785 oashc.HttpShardHandlerFactory.getParameter Setting sizeOfQueue to: -1
   [junit4]   2> 987320 T2785 oashc.HttpShardHandlerFactory.getParameter Setting fairnessPolicy to: false
   [junit4]   2> 987320 T2785 oascsi.HttpClientUtil.createClient Creating new http client, config:maxConnectionsPerHost=20&maxConnections=10000&socketTimeout=120000&connTimeout=15000&retry=false
   [junit4]   2> 987340 T2785 oasc.ZkContainer.initZooKeeper Zookeeper client=127.0.0.1:22369/solr
   [junit4]   2> 987341 T2785 oasc.ZkController.checkChrootPath zkHost includes chroot
   [junit4]   2> 987343 T2785 oascc.ConnectionManager.waitForConnected Waiting for client to connect to ZooKeeper
   [junit4]   2> 987349 T2865 oascc.ConnectionManager.process Watcher org.apache.solr.common.cloud.ConnectionManager@4d21854f name:ZooKeeperConnection Watcher:127.0.0.1:22369 got event WatchedEvent state:SyncConnected type:None path:null path:null type:None
   [junit4]   2> 987349 T2785 oascc.ConnectionManager.waitForConnected Client is connected to ZooKeeper
   [junit4]   2> 987357 T2785 oascsi.HttpClientUtil.createClient Creating new http client, config:maxConnections=500&maxConnectionsPerHost=16&socketTimeout=120000&connTimeout=15000
   [junit4]   2> 987370 T2785 oascc.ConnectionManager.waitForConnected Waiting for client to connect to ZooKeeper
   [junit4]   2> 987382 T2867 oascc.ConnectionManager.process Watcher org.apache.solr.common.cloud.ConnectionManager@fb3eccc name:ZooKeeperConnection Watcher:127.0.0.1:22369/solr got event WatchedEvent state:SyncConnected type:None path:null path:null type:None
   [junit4]   2> 987382 T2785 oascc.ConnectionManager.waitForConnected Client is connected to ZooKeeper
   [junit4]   2> 987548 T2785 oascc.ZkStateReader.createClusterStateWatchersAndUpdate Updating cluster state from ZooKeeper... 
   [junit4]   2> 988552 T2785 oasc.ZkController.createEphemeralLiveNode Register node as live in ZooKeeper:/live_nodes/127.0.0.1:23021_
   [junit4]   2> 988558 T2785 oascc.SolrZkClient.makePath makePath: /live_nodes/127.0.0.1:23021_
   [junit4]   2> 988598 T2807 oascc.ZkStateReader$3.process Updating live nodes... (5)
   [junit4]   2> 988598 T2825 oascc.ZkStateReader$3.process Updating live nodes... (5)
   [junit4]   2> 988599 T2867 oascc.ZkStateReader$3.process Updating live nodes... (5)
   [junit4]   2> 988598 T2839 oascc.ZkStateReader$3.process Updating live nodes... (5)
   [junit4]   2> 988598 T2853 oascc.ZkStateReader$3.process Updating live nodes... (5)
   [junit4]   2> 988598 T2812 oascc.ZkStateReader$3.process Updating live nodes... (5)
   [junit4]   2> 988657 T2785 oasc.CorePropertiesLocator.discover Looking for core definitions underneath /usr/home/hudson/hudson-slave/workspace/Lucene-Solr-Tests-trunk-Java7/solr/build/solr-core/test/J1/./org.apache.solr.cloud.CollectionsAPIDistributedZkTest-jetty4-1375499128109
   [junit4]   2> 988898 T2785 oasc.CorePropertiesLocator.discoverUnder Found core conf in /usr/home/hudson/hudson-slave/workspace/Lucene-Solr-Tests-trunk-Java7/solr/build/solr-core/test/J1/./org.apache.solr.cloud.CollectionsAPIDistributedZkTest-jetty4-1375499128109/conf/
   [junit4]   2> 988903 T2785 oasc.CorePropertiesLocator.discover Found 1 core definitions
   [junit4]   2> 988904 T2785 oass.SolrDispatchFilter.init user.dir=/usr/home/hudson/hudson-slave/workspace/Lucene-Solr-Tests-trunk-Java7/solr/build/solr-core/test/J1
   [junit4]   2> 988904 T2785 oass.SolrDispatchFilter.init SolrDispatchFilter.init() done
   [junit4]   2> 988905 T2785 oascsi.HttpClientUtil.createClient Creating new http client, config:maxConnections=128&maxConnectionsPerHost=32&followRedirects=false
   [junit4]   2> 988926 T2785 oascsi.HttpClientUtil.createClient Creating new http client, config:maxConnections=128&maxConnectionsPerHost=32&followRedirects=false
   [junit4]   2> 988941 T2815 oasha.CollectionsHandler.handleCreateAction Creating Collection : numShards=2&name=nodes_used_collection&replicationFactor=2&action=CREATE&wt=javabin&version=2
   [junit4]   2> 988945 T2807 oasc.DistributedQueue$LatchChildWatcher.process Watcher fired on path: /overseer/collection-queue-work state: SyncConnected type NodeChildrenChanged
   [junit4]   2> 988969 T2809 oasc.OverseerCollectionProcessor.run Overseer Collection Processor: Get the message id:/overseer/collection-queue-work/qn-0000000000 message:{
   [junit4]   2> 	  "operation":"createcollection",
   [junit4]   2> 	  "numShards":"2",
   [junit4]   2> 	  "name":"nodes_used_collection",
   [junit4]   2> 	  "replicationFactor":"2"}
   [junit4]   2> 988970 T2809 oasc.OverseerCollectionProcessor.processMessage WARN OverseerCollectionProcessor.processMessage : createcollection , {
   [junit4]   2> 	  "operation":"createcollection",
   [junit4]   2> 	  "numShards":"2",
   [junit4]   2> 	  "name":"nodes_used_collection",
   [junit4]   2> 	  "replicationFactor":"2"}
   [junit4]   2> 989139 T2808 oascc.ZkStateReader.updateClusterState Updating cloud state from ZooKeeper... 
   [junit4]   2> 989140 T2808 oasc.Overseer$ClusterStateUpdater.buildCollection building a new collection: nodes_used_collection
   [junit4]   2> 989140 T2808 oasc.Overseer$ClusterStateUpdater.createCollection Create collection nodes_used_collection with shards [shard1, shard2]
   [junit4]   2> 989340 T2839 oascc.ZkStateReader$2.process A cluster state change: WatchedEvent state:SyncConnected type:NodeDataChanged path:/clusterstate.json, has occurred - updating... (live nodes size: 5)
   [junit4]   2> 989340 T2825 oascc.ZkStateReader$2.process A cluster state change: WatchedEvent state:SyncConnected type:NodeDataChanged path:/clusterstate.json, has occurred - updating... (live nodes size: 5)
   [junit4]   2> 989340 T2853 oascc.ZkStateReader$2.process A cluster state change: WatchedEvent state:SyncConnected type:NodeDataChanged path:/clusterstate.json, has occurred - updating... (live nodes size: 5)
   [junit4]   2> 989340 T2812 oascc.ZkStateReader$2.process A cluster state change: WatchedEvent state:SyncConnected type:NodeDataChanged path:/clusterstate.json, has occurred - updating... (live nodes size: 5)
   [junit4]   2> 989340 T2867 oascc.ZkStateReader$2.process A cluster state change: WatchedEvent state:SyncConnected type:NodeDataChanged path:/clusterstate.json, has occurred - updating... (live nodes size: 5)
   [junit4]   2> 989340 T2807 oascc.ZkStateReader$2.process A cluster state change: WatchedEvent state:SyncConnected type:NodeDataChanged path:/clusterstate.json, has occurred - updating... (live nodes size: 5)
   [junit4]   2> 989447 T2809 oasc.OverseerCollectionProcessor.createCollection going to create cores replicas shardNames [shard1, shard2] , repFactor : 2
   [junit4]   2> 989447 T2809 oasc.OverseerCollectionProcessor.createCollection Creating shard nodes_used_collection_shard1_replica1 as part of slice shard1 of collection nodes_used_collection on 127.0.0.1:23021_
   [junit4]   2> 989448 T2809 oasc.OverseerCollectionProcessor.createCollection Creating shard nodes_used_collection_shard1_replica2 as part of slice shard1 of collection nodes_used_collection on 127.0.0.1:37862_
   [junit4]   2> 989449 T2809 oasc.OverseerCollectionProcessor.createCollection Creating shard nodes_used_collection_shard2_replica1 as part of slice shard2 of collection nodes_used_collection on 127.0.0.1:43003_
   [junit4]   2> 989450 T2809 oasc.OverseerCollectionProcessor.createCollection Creating shard nodes_used_collection_shard2_replica2 as part of slice shard2 of collection nodes_used_collection on 127.0.0.1:20368_
   [junit4]   2> 989453 T2857 oasc.ZkController.publish publishing core=nodes_used_collection_shard1_replica1 state=down
   [junit4]   2> 989453 T2843 oasc.ZkController.publish publishing core=nodes_used_collection_shard1_replica2 state=down
   [junit4]   2> 989454 T2816 oasc.ZkController.publish publishing core=nodes_used_collection_shard2_replica2 state=down
   [junit4]   2> 989454 T2829 oasc.ZkController.publish publishing core=nodes_used_collection_shard2_replica1 state=down
   [junit4]   2> 989460 T2857 oasc.ZkController.waitForCoreNodeName look for our core node name
   [junit4]   2> 989464 T2843 oasc.ZkController.waitForCoreNodeName look for our core node name
   [junit4]   2> 989464 T2829 oasc.ZkController.waitForCoreNodeName look for our core node name
   [junit4]   2> 989464 T2816 oasc.ZkController.waitForCoreNodeName look for our core node name
   [junit4]   2> 990944 T2808 oascc.ZkStateReader.updateClusterState Updating cloud state from ZooKeeper... 
   [junit4]   2> 990945 T2808 oasc.Overseer$ClusterStateUpdater.updateState WARN Could not find collection node for nodes_used_collection, skipping publish state
   [junit4]   2> 990945 T2808 oasc.Overseer$ClusterStateUpdater.updateState Update state numShards=2 message={
   [junit4]   2> 	  "operation":"state",
   [junit4]   2> 	  "core_node_name":"core_node1",
   [junit4]   2> 	  "numShards":"2",
   [junit4]   2> 	  "shard":"shard1",
   [junit4]   2> 	  "roles":null,
   [junit4]   2> 	  "state":"down",
   [junit4]   2> 	  "shard_state":"active",
   [junit4]   2> 	  "core":"nodes_used_collection_shard1_replica1",
   [junit4]   2> 	  "collection":"nodes_used_collection",
   [junit4]   2> 	  "shard_range":null,
   [junit4]   2> 	  "node_name":"127.0.0.1:23021_",
   [junit4]   2> 	  "base_url":"http://127.0.0.1:23021"}
   [junit4]   2> 991068 T2808 oasc.Overseer$ClusterStateUpdater.updateState WARN Could not find collection node for nodes_used_collection, skipping publish state
   [junit4]   2> 991069 T2808 oasc.Overseer$ClusterStateUpdater.updateState Update state numShards=2 message={
   [junit4]   2> 	  "operation":"state",
   [junit4]   2> 	  "core_node_name":"core_node2",
   [junit4]   2> 	  "numShards":"2",
   [junit4]   2> 	  "shard":"shard1",
   [junit4]   2> 	  "roles":null,
   [junit4]   2> 	  "state":"down",
   [junit4]   2> 	  "shard_state":"active",
   [junit4]   2> 	  "core":"nodes_used_collection_shard1_replica2",
   [junit4]   2> 	  "collection":"nodes_used_collection",
   [junit4]   2> 	  "shard_range":null,
   [junit4]   2> 	  "node_name":"127.0.0.1:37862_",
   [junit4]   2> 	  "base_url":"http://127.0.0.1:37862"}
   [junit4]   2> 991322 T2808 oasc.Overseer$ClusterStateUpdater.updateState WARN Could not find collection node for nodes_used_collection, skipping publish state
   [junit4]   2> 991323 T2808 oasc.Overseer$ClusterStateUpdater.updateState Update state numShards=2 message={
   [junit4]   2> 	  "operation":"state",
   [junit4]   2> 	  "core_node_name":"core_node3",
   [junit4]   2> 	  "numShards":"2",
   [junit4]   2> 	  "shard":"shard2",
   [junit4]   2> 	  "roles":null,
   [junit4]   2> 	  "state":"down",
   [junit4]   2> 	  "shard_state":"active",
   [junit4]   2> 	  "core":"nodes_used_collection_shard2_replica2",
   [junit4]   2> 	  "collection":"nodes_used_collection",
   [junit4]   2> 	  "shard_range":null,
   [junit4]   2> 	  "node_name":"127.0.0.1:20368_",
   [junit4]   2> 	  "base_url":"http://127.0.0.1:20368"}
   [junit4]   2> 991335 T2808 oasc.Overseer$ClusterStateUpdater.updateState WARN Could not find collection node for nodes_used_collection, skipping publish state
   [junit4]   2> 991336 T2808 oasc.Overseer$ClusterStateUpdater.updateState Update state numShards=2 message={
   [junit4]   2> 	  "operation":"state",
   [junit4]   2> 	  "core_node_name":"core_node4",
   [junit4]   2> 	  "numShards":"2",
   [junit4]   2> 	  "shard":"shard2",
   [junit4]   2> 	  "roles":null,
   [junit4]   2> 	  "state":"down",
   [junit4]   2> 	  "shard_state":"active",
   [junit4]   2> 	  "core":"nodes_used_collection_shard2_replica1",
   [junit4]   2> 	  "collection":"nodes_used_collection",
   [junit4]   2> 	  "shard_range":null,
   [junit4]   2> 	  "node_name":"127.0.0.1:43003_",
   [junit4]   2> 	  "base_url":"http://127.0.0.1:43003"}
   [junit4]   2> 991386 T2807 oascc.ZkStateReader$2.process A cluster state change: WatchedEvent state:SyncConnected type:NodeDataChanged path:/clusterstate.json, has occurred - updating... (live nodes size: 5)
   [junit4]   2> 991386 T2825 oascc.ZkStateReader$2.process A cluster state change: WatchedEvent state:SyncConnected type:NodeDataChanged path:/clusterstate.json, has occurred - updating... (live nodes size: 5)
   [junit4]   2> 991386 T2853 oascc.ZkStateReader$2.process A cluster state change: WatchedEvent state:SyncConnected type:NodeDataChanged path:/clusterstate.json, has occurred - updating... (live nodes size: 5)
   [junit4]   2> 991386 T2839 oascc.ZkStateReader$2.process A cluster state change: WatchedEvent state:SyncConnected type:NodeDataChanged path:/clusterstate.json, has occurred - updating... (live nodes size: 5)
   [junit4]   2> 991386 T2867 oascc.ZkStateReader$2.process A cluster state change: WatchedEvent state:SyncConnected type:NodeDataChanged path:/clusterstate.json, has occurred - updating... (live nodes size: 5)
   [junit4]   2> 991386 T2812 oascc.ZkStateReader$2.process A cluster state change: WatchedEvent state:SyncConnected type:NodeDataChanged path:/clusterstate.json, has occurred - updating... (live nodes size: 5)
   [junit4]   2> 991462 T2857 oasc.ZkController.waitForShardId waiting to find shard id in clusterstate for nodes_used_collection_shard1_replica1
   [junit4]   2> 991463 T2857 oasc.CorePropertiesLocator.writePropertiesFile ERROR Couldn't persist core properties to /usr/home/hudson/hudson-slave/workspace/Lucene-Solr-Tests-trunk-Java7/solr/build/solr-core/test/J1/./org.apache.solr.cloud.CollectionsAPIDistributedZkTest-jetty4-1375499128109/nodes_used_collection_shard1_replica1/core.properties: java.io.FileNotFoundException: /usr/home/hudson/hudson-slave/workspace/Lucene-Solr-Tests-trunk-Java7/solr/build/solr-core/test/J1/./org.apache.solr.cloud.CollectionsAPIDistributedZkTest-jetty4-1375499128109/nodes_used_collection_shard1_replica1/core.properties (No such file or directory)
   [junit4]   2> 991464 T2857 oasc.CoreContainer.create Creating SolrCore 'nodes_used_collection_shard1_replica1' using instanceDir: /usr/home/hudson/hudson-slave/workspace/Lucene-Solr-Tests-trunk-Java7/solr/build/solr-core/test/J1/./org.apache.solr.cloud.CollectionsAPIDistributedZkTest-jetty4-1375499128109/nodes_used_collection_shard1_replica1
   [junit4]   2> 991464 T2857 oasc.ZkController.createCollectionZkNode Check for collection zkNode:nodes_used_collection
   [junit4]   2> 991465 T2857 oasc.ZkController.createCollectionZkNode Creating collection in ZooKeeper:nodes_used_collection
   [junit4]   2> 991466 T2843 oasc.ZkController.waitForShardId waiting to find shard id in clusterstate for nodes_used_collection_shard1_replica2
   [junit4]   2> 991466 T2857 oasc.ZkController.getConfName Looking for collection configName
   [junit4]   2> 991467 T2816 oasc.ZkController.waitForShardId waiting to find shard id in clusterstate for nodes_used_collection_shard2_replica2
   [junit4]   2> 991467 T2829 oasc.ZkController.waitForShardId waiting to find shard id in clusterstate for nodes_used_collection_shard2_replica1
   [junit4]   2> 991467 T2843 oasc.CorePropertiesLocator.writePropertiesFile ERROR Couldn't persist core properties to /usr/home/hudson/hudson-slave/workspace/Lucene-Solr-Tests-trunk-Java7/solr/build/solr-core/test/J1/./org.apache.solr.cloud.CollectionsAPIDistributedZkTest-jetty3-1375499126127/nodes_used_collection_shard1_replica2/core.properties: java.io.FileNotFoundException: /usr/home/hudson/hudson-slave/workspace/Lucene-Solr-Tests-trunk-Java7/solr/build/solr-core/test/J1/./org.apache.solr.cloud.CollectionsAPIDistributedZkTest-jetty3-1375499126127/nodes_used_collection_shard1_replica2/core.properties (No such file or directory)
   [junit4]   2> 991468 T2816 oasc.CorePropertiesLocator.writePropertiesFile ERROR Couldn't persist core properties to /usr/home/hudson/hudson-slave/workspace/Lucene-Solr-Tests-trunk-Java7/solr/build/solr-core/test/J1/./org.apache.solr.cloud.CollectionsAPIDistributedZkTest-jetty1-1375499121896/nodes_used_collection_shard2_replica2/core.properties: java.io.FileNotFoundException: /usr/home/hudson/hudson-slave/workspace/Lucene-Solr-Tests-trunk-Java7/solr/build/solr-core/test/J1/./org.apache.solr.cloud.CollectionsAPIDistributedZkTest-jetty1-1375499121896/nodes_used_collection_shard2_replica2/core.properties (No such file or directory)
   [junit4]   2> 991468 T2843 oasc.CoreContainer.create Creating SolrCore 'nodes_used_collection_shard1_replica2' using instanceDir: /usr/home/hudson/hudson-slave/workspace/Lucene-Solr-Tests-trunk-Java7/solr/build/solr-core/test/J1/./org.apache.solr.cloud.CollectionsAPIDistributedZkTest-jetty3-1375499126127/nodes_used_collection_shard1_replica2
   [junit4]   2> 991468 T2857 oasc.ZkController.getConfName Only one config set found in zk - using it:conf1
   [junit4]   2> 991469 T2843 oasc.ZkController.createCollectionZkNode Check for collection zkNode:nodes_used_collection
   [junit4]   2> 991469 T2829 oasc.CorePropertiesLocator.writePropertiesFile ERROR Couldn't persist core properties to /usr/home/hudson/hudson-slave/workspace/Lucene-Solr-Tests-trunk-Java7/solr/build/solr-core/test/J1/./org.apache.solr.cloud.CollectionsAPIDistributedZkTest-jetty2-1375499124114/nodes_used_collection_shard2_replica1/core.properties: java.io.FileNotFoundException: /usr/home/hudson/hudson-slave/workspace/Lucene-Solr-Tests-trunk-Java7/solr/build/solr-core/test/J1/./org.apache.solr.cloud.CollectionsAPIDistributedZkTest-jetty2-1375499124114/nodes_used_collection_shard2_replica1/core.properties (No such file or directory)
   [junit4]   2> 991469 T2816 oasc.CoreContainer.create Creating SolrCore 'nodes_used_collection_shard2_replica2' using instanceDir: /usr/home/hudson/hudson-slave/workspace/Lucene-Solr-Tests-trunk-Java7/solr/build/solr-core/test/J1/./org.apache.solr.cloud.CollectionsAPIDistributedZkTest-jetty1-1375499121896/nodes_used_collection_shard2_replica2
   [junit4]   2> 991471 T2843 oasc.ZkController.createCollectionZkNode Creating collection in ZooKeeper:nodes_used_collection
   [junit4]   2> 991471 T2829 oasc.CoreContainer.create Creating SolrCore 'nodes_used_collection_shard2_replica1' using instanceDir: /usr/home/hudson/hudson-slave/workspace/Lucene-Solr-Tests-trunk-Java7/solr/build/solr-core/test/J1/./org.apache.solr.cloud.CollectionsAPIDistributedZkTest-jetty2-1375499124114/nodes_used_collection_shard2_replica1
   [junit4]   2> 991470 T2857 oascc.SolrZkClient.makePath makePath: /collections/nodes_used_collection
   [junit4]   2> 991472 T2829 oasc.ZkController.createCollectionZkNode Check for collection zkNode:nodes_used_collection
   [junit4]   2> 991472 T2843 oasc.ZkController.getConfName Looking for collection configName
   [junit4]   2> 991471 T2816 oasc.ZkController.createCollectionZkNode Check for collection zkNode:nodes_used_collection
   [junit4]   2> 991474 T2829 oasc.ZkController.createCollectionZkNode Creating collection in ZooKeeper:nodes_used_collection
   [junit4]   2> 991475 T2829 oasc.ZkController.getConfName Looking for collection configName
   [junit4]   2> 991479 T2816 oasc.ZkController.createCollectionZkNode Collection zkNode exists
   [junit4]   2> 991480 T2857 oasc.ZkController.readConfigName Load collection config from:/collections/nodes_used_collection
   [junit4]   2> 991480 T2829 oascc.SolrZkClient.makePath makePath: /collections/nodes_used_collection
   [junit4]   2> 991480 T2816 oasc.ZkController.readConfigName Load collection config from:/collections/nodes_used_collection
   [junit4]   2> 991480 T2843 oasc.ZkController.getConfName Only one config set found in zk - using it:conf1
   [junit4]   2> 991481 T2857 oasc.SolrResourceLoader.<init> new SolrResourceLoader for directory: '/usr/home/hudson/hudson-slave/workspace/Lucene-Solr-Tests-trunk-Java7/solr/build/solr-core/test/J1/./org.apache.solr.cloud.CollectionsAPIDistributedZkTest-jetty4-1375499128109/nodes_used_collection_shard1_replica1/'
   [junit4]   2> 991482 T2843 oascc.SolrZkClient.makePath makePath: /collections/nodes_used_collection
   [junit4]   2> 991498 T2816 oasc.SolrResourceLoader.<init> new SolrResourceLoader for directory: '/usr/home/hudson/hudson-slave/workspace/Lucene-Solr-Tests-trunk-Java7/solr/build/solr-core/test/J1/./org.apache.solr.cloud.CollectionsAPIDistributedZkTest-jetty1-1375499121896/nodes_used_collection_shard2_replica2/'
   [junit4]   2> 991498 T2829 oasc.ZkController.readConfigName Load collection config from:/collections/nodes_used_collection
   [junit4]   2> 991514 T2843 oasc.ZkController.readConfigName Load collection config from:/collections/nodes_used_collection
   [junit4]   2> 991515 T2829 oasc.SolrResourceLoader.<init> new SolrResourceLoader for directory: '/usr/home/hudson/hudson-slave/workspace/Lucene-Solr-Tests-trunk-Java7/solr/build/solr-core/test/J1/./org.apache.solr.cloud.CollectionsAPIDistributedZkTest-jetty2-1375499124114/nodes_used_collection_shard2_replica1/'
   [junit4]   2> 991516 T2843 oasc.SolrResourceLoader.<init> new SolrResourceLoader for directory: '/usr/home/hudson/hudson-slave/workspace/Lucene-Solr-Tests-trunk-Java7/solr/build/solr-core/test/J1/./org.apache.solr.cloud.CollectionsAPIDistributedZkTest-jetty3-1375499126127/nodes_used_collection_shard1_replica2/'
   [junit4]   2> 991664 T2857 oasc.SolrConfig.<init> Using Lucene MatchVersion: LUCENE_50
   [junit4]   2> 991664 T2843 oasc.SolrConfig.<init> Using Lucene MatchVersion: LUCENE_50
   [junit4]   2> 991664 T2816 oasc.SolrConfig.<init> Using Lucene MatchVersion: LUCENE_50
   [junit4]   2> 991666 T2829 oasc.SolrConfig.<init> Using Lucene MatchVersion: LUCENE_50
   [junit4]   2> 991770 T2829 oasc.SolrConfig.<init> Loaded SolrConfig: solrconfig.xml
   [junit4]   2> 991771 T2857 oasc.SolrConfig.<init> Loaded SolrConfig: solrconfig.xml
   [junit4]   2> 991774 T2816 oasc.SolrConfig.<init> Loaded SolrConfig: solrconfig.xml
   [junit4]   2> 991775 T2843 oasc.SolrConfig.<init> Loaded SolrConfig: solrconfig.xml
   [junit4]   2> 991873 T2857 oass.IndexSchema.readSchema Reading Solr Schema from schema.xml
   [junit4]   2> 991873 T2829 oass.IndexSchema.readSchema Reading Solr Schema from schema.xml
   [junit4]   2> 991876 T2816 oass.IndexSchema.readSchema Reading Solr Schema from schema.xml
   [junit4]   2> 991877 T2843 oass.IndexSchema.readSchema Reading Solr Schema from schema.xml
   [junit4]   2> 991897 T2857 oass.IndexSchema.readSchema [nodes_used_collection_shard1_replica1] Schema name=test
   [junit4]   2> 991897 T2829 oass.IndexSchema.readSchema [nodes_used_collection_shard2_replica1] Schema name=test
   [junit4]   2> 991901 T2816 oass.IndexSchema.readSchema [nodes_used_collection_shard2_replica2] Schema name=test
   [junit4]   2> 991901 T2843 oass.IndexSchema.readSchema [nodes_used_collection_shard1_replica2] Schema name=test
   [junit4]   2> 993402 T2816 oass.OpenExchangeRatesOrgProvider.init Initialized with rates=open-exchange-rates.json, refreshInterval=1440.
   [junit4]   2> 993413 T2843 oass.OpenExchangeRatesOrgProvider.init Initialized with rates=open-exchange-rates.json, refreshInterval=1440.
   [junit4]   2> 993418 T2829 oass.OpenExchangeRatesOrgProvider.init Initialized with rates=open-exchange-rates.json, refreshInterval=1440.
   [junit4]   2> 993418 T2816 oass.IndexSchema.readSchema default search field in schema is text
   [junit4]   2> 993420 T2857 oass.OpenExchangeRatesOrgProvider.init Initialized with rates=open-exchange-rates.json, refreshInterval=1440.
   [junit4]   2> 993424 T2843 oass.IndexSchema.readSchema default search field in schema is text
   [junit4]   2> 993424 T2816 oass.IndexSchema.readSchema unique key field: id
   [junit4]   2> 993435 T2829 oass.IndexSchema.readSchema default search field in schema is text
   [junit4]   2> 993438 T2843 oass.IndexSchema.readSchema unique key field: id
   [junit4]   2> 993439 T2857 oass.IndexSchema.readSchema default search field in schema is text
   [junit4]   2> 993449 T2816 oass.FileExchangeRateProvider.reload Reloading exchange rates from file currency.xml
   [junit4]   2> 993461 T2829 oass.IndexSchema.readSchema unique key field: id
   [junit4]   2> 993463 T2857 oass.IndexSchema.readSchema unique key field: id
   [junit4]   2> 993464 T2816 oass.FileExchangeRateProvider.reload Reloading exchange rates from file currency.xml
   [junit4]   2> 993471 T2816 oass.OpenExchangeRatesOrgProvider.reload Reloading exchange rates from open-exchange-rates.json
   [junit4]   2> 993473 T2816 oass.OpenExchangeRatesOrgProvider$OpenExchangeRates.<init> WARN Unknown key IMPORTANT NOTE
   [junit4]   2> 993474 T2816 oass.OpenExchangeRatesOrgProvider$OpenExchangeRates.<init> WARN Expected key, got STRING
   [junit4]   2> 993474 T2816 oass.OpenExchangeRatesOrgProvider.reload Reloading exchange rates from open-exchange-rates.json
   [junit4]   2> 993476 T2816 oass.OpenExchangeRatesOrgProvider$OpenExchangeRates.<init> WARN Unknown key IMPORTANT NOTE
   [junit4]   2> 993476 T2816 oass.OpenExchangeRatesOrgProvider$OpenExchangeRates.<init> WARN Expected key, got STRING
   [junit4]   2> 993477 T2843 oass.FileExchangeRateProvider.reload Reloading exchange rates from file currency.xml
   [junit4]   2> 993477 T2816 oasc.SolrCore.initDirectoryFactory org.apache.solr.core.MockDirectoryFactory
   [junit4]   2> 993506 T2816 oasc.SolrCore.<init> [nodes_used_collection_shard2_replica2] Opening new SolrCore at /usr/home/hudson/hudson-slave/workspace/Lucene-Solr-Tests-trunk-Java7/solr/build/solr-core/test/J1/./org.apache.solr.cloud.CollectionsAPIDistributedZkTest-jetty1-1375499121896/nodes_used_collection_shard2_replica2/, dataDir=/usr/home/hudson/hudson-slave/workspace/Lucene-Solr-Tests-trunk-Java7/solr/build/solr-core/test/J1/./org.apache.solr.cloud.CollectionsAPIDistributedZkTest-jetty1-1375499121896//nodes_used_collection_shard2_replica2/data/
   [junit4]   2> 993506 T2816 oasc.JmxMonitoredMap.<init> JMX monitoring is enabled. Adding Solr mbeans to JMX Server: com.sun.jmx.mbeanserver.JmxMBeanServer@50456ce9
   [junit4]   2> 993506 T2829 oass.FileExchangeRateProvider.reload Reloading exchange rates from file currency.xml
   [junit4]   2> 993508 T2816 oasc.CachingDirectoryFactory.get return new directory for /usr/home/hudson/hudson-slave/workspace/Lucene-Solr-Tests-trunk-Java7/solr/build/solr-core/test/J1/./org.apache.solr.cloud.CollectionsAPIDistributedZkTest-jetty1-1375499121896//nodes_used_collection_shard2_replica2/data
   [junit4]   2> 993509 T2816 oasc.SolrCore.getNewIndexDir New index directory detected: old=null new=/usr/home/hudson/hudson-slave/workspace/Lucene-Solr-Tests-trunk-Java7/solr/build/solr-core/test/J1/./org.apache.solr.cloud.CollectionsAPIDistributedZkTest-jetty1-1375499121896//nodes_used_collection_shard2_replica2/data/index/
   [junit4]   2> 993509 T2857 oass.FileExchangeRateProvider.reload Reloading exchange rates from file currency.xml
   [junit4]   2> 993509 T2816 oasc.SolrCore.initIndex WARN [nodes_used_collection_shard2_replica2] Solr index directory '/usr/home/hudson/hudson-slave/workspace/Lucene-Solr-Tests-trunk-Java7/solr/build/solr-core/test/J1/./org.apache.solr.cloud.CollectionsAPIDistributedZkTest-jetty1-1375499121896/nodes_used_collection_shard2_replica2/data/index' doesn't exist. Creating new index...
   [junit4]   2> 993510 T2816 oasc.CachingDirectoryFactory.get return new directory for /usr/home/hudson/hudson-slave/workspace/Lucene-Solr-Tests-trunk-Java7/solr/build/solr-core/test/J1/./org.apache.solr.cloud.CollectionsAPIDistributedZkTest-jetty1-1375499121896//nodes_used_collection_shard2_replica2/data/index
   [junit4]   2> 993512 T2843 oass.FileExchangeRateProvider.reload Reloading exchange rates from file currency.xml
   [junit4]   2> 993513 T2829 oass.FileExchangeRateProvider.reload Reloading exchange rates from file currency.xml
   [junit4]   2> 993515 T2857 oass.FileExchangeRateProvider.reload Reloading exchange rates from file currency.xml
   [junit4]   2> 993517 T2816 oasc.SolrDeletionPolicy.onCommit SolrDeletionPolicy.onCommit: commits: num=1
   [junit4]   2> 		commit{dir=MockDirWrapper(org.apache.lucene.store.RAMDirectory@2395be28 lockFactory=org.apache.lucene.store.NativeFSLockFactory@4f2c6ea9),segFN=segments_1,generation=1}
   [junit4]   2> 993517 T2816 oasc.SolrDeletionPolicy.updateCommits newest commit generation = 1
   [junit4]   2> 993525 T2816 oasup.UpdateRequestProcessorChain.init inserting DistributedUpdateProcessorFactory into updateRequestProcessorChain "dedupe"
   [junit4]   2> 993525 T2816 oasup.UpdateRequestProcessorChain.init inserting DistributedUpdateProcessorFactory into updateRequestProcessorChain "stored_sig"
   [junit4]   2> 993526 T2829 oass.OpenExchangeRatesOrgProvider.reload Reloading exchange rates from open-exchange-rates.json
   [junit4]   2> 993527 T2843 oass.OpenExchangeRatesOrgProvider.reload Reloading exchange rates from open-exchange-rates.json
   [junit4]   2> 993526 T2816 oasup.UpdateRequestProcessorChain.init inserting DistributedUpdateProcessorFactory into updateRequestProcessorChain "distrib-dup-test-chain-implicit"
   [junit4]   2> 993528 T2829 oass.OpenExchangeRatesOrgProvider$OpenExchangeRates.<init> WARN Unknown key IMPORTANT NOTE
   [junit4]   2> 993528 T2829 oass.OpenExchangeRatesOrgProvider$OpenExchangeRates.<init> WARN Expected key, got STRING
   [junit4]   2> 993529 T2816 oasc.RequestHandlers.initHandlersFromConfig created standard: solr.StandardRequestHandler
   [junit4]   2> 993528 T2843 oass.OpenExchangeRatesOrgProvider$OpenExchangeRates.<init> WARN Unknown key IMPORTANT NOTE
   [junit4]   2> 993530 T2816 oasc.RequestHandlers.initHandlersFromConfig created /get: solr.RealTimeGetHandler
   [junit4]   2> 993530 T2843 oass.OpenExchangeRatesOrgProvider$OpenExchangeRates.<init> WARN Expected key, got STRING
   [junit4]   2> 993529 T2829 oass.OpenExchangeRatesOrgProvider.reload Reloading exchange rates from open-exchange-rates.json
   [junit4]   2> 993531 T2843 oass.OpenExchangeRatesOrgProvider.reload Reloading exchange rates from open-exchange-rates.json
   [junit4]   2> 993530 T2816 oasc.RequestHandlers.initHandlersFromConfig adding lazy requestHandler: solr.ReplicationHandler
   [junit4]   2> 993532 T2829 oass.OpenExchangeRatesOrgProvider$OpenExchangeRates.<init> WARN Unknown key IMPORTANT NOTE
   [junit4]   2> 993532 T2816 oasc.RequestHandlers.initHandlersFromConfig created /replication: solr.ReplicationHandler
   [junit4]   2> 993533 T2843 oass.OpenExchangeRatesOrgProvider$OpenExchangeRates.<init> WARN Unknown key IMPORTANT NOTE
   [junit4]   2> 993532 T2829 oass.OpenExchangeRatesOrgProvider$OpenExchangeRates.<init> WARN Expected key, got STRING
   [junit4]   2> 993533 T2843 oass.OpenExchangeRatesOrgProvider$OpenExchangeRates.<init> WARN Expected key, got STRING
   [junit4]   2> 993533 T2816 oasc.RequestHandlers.initHandlersFromConfig created /update: solr.UpdateRequestHandler
   [junit4]   2> 993534 T2843 oasc.SolrCore.initDirectoryFactory org.apache.solr.core.MockDirectoryFactory
   [junit4]   2> 993534 T2829 oasc.SolrCore.initDirectoryFactory org.apache.solr.core.MockDirectoryFactory
   [junit4]   2> 993535 T2843 oasc.SolrCore.<init> [nodes_used_collection_shard1_replica2] Opening new SolrCore at /usr/home/hudson/hudson-slave/workspace/Lucene-Solr-Tests-trunk-Java7/solr/build/solr-core/test/J1/./org.apache.solr.cloud.CollectionsAPIDistributedZkTest-jetty3-1375499126127/nodes_used_collection_shard1_replica2/, dataDir=/usr/home/hudson/hudson-slave/workspace/Lucene-Solr-Tests-trunk-Java7/solr/build/solr-core/test/J1/./org.apache.solr.cloud.CollectionsAPIDistributedZkTest-jetty3-1375499126127//nodes_used_collection_shard1_replica2/data/
   [junit4]   2> 993535 T2816 oasc.RequestHandlers.initHandlersFromConfig created /admin/: org.apache.solr.handler.admin.AdminHandlers
   [junit4]   2> 993536 T2843 oasc.JmxMonitoredMap.<init> JMX monitoring is enabled. Adding Solr mbeans to JMX Server: com.sun.jmx.mbeanserver.JmxMBeanServer@50456ce9
   [junit4]   2> 993536 T2829 oasc.SolrCore.<init> [nodes_used_collection_shard2_replica1] Opening new SolrCore at /usr/home/hudson/hudson-slave/workspace/Lucene-Solr-Tests-trunk-Java7/solr/build/solr-core/test/J1/./org.apache.solr.cloud.CollectionsAPIDistributedZkTest-jetty2-1375499124114/nodes_used_collection_shard2_replica1/, dataDir=/usr/home/hudson/hudson-slave/workspace/Lucene-Solr-Tests-trunk-Java7/solr/build/solr-core/test/J1/./org.apache.solr.cloud.CollectionsAPIDistributedZkTest-jetty2-1375499124114//nodes_used_collection_shard2_replica1/data/
   [junit4]   2> 993538 T2829 oasc.JmxMonitoredMap.<init> JMX monitoring is enabled. Adding Solr mbeans to JMX Server: com.sun.jmx.mbeanserver.JmxMBeanServer@50456ce9
   [junit4]   2> 993538 T2843 oasc.CachingDirectoryFactory.get return new directory for /usr/home/hudson/hudson-slave/workspace/Lucene-Solr-Tests-trunk-Java7/solr/build/solr-core/test/J1/./org.apache.solr.cloud.CollectionsAPIDistributedZkTest-jetty3-1375499126127//nodes_used_collection_shard1_replica2/data
   [junit4]   2> 993539 T2843 oasc.SolrCore.getNewIndexDir New index directory detected: old=null new=/usr/home/hudson/hudson-slave/workspace/Lucene-Solr-Tests-trunk-Java7/solr/build/solr-core/test/J1/./org.apache.solr.cloud.CollectionsAPIDistributedZkTest-jetty3-1375499126127//nodes_used_collection_shard1_replica2/data/index/
   [junit4]   2> 993539 T2829 oasc.CachingDirectoryFactory.get return new directory for /usr/home/hudson/hudson-slave/workspace/Lucene-Solr-Tests-trunk-Java7/solr/build/solr-core/test/J1/./org.apache.solr.cloud.CollectionsAPIDistributedZkTest-jetty2-1375499124114//nodes_used_collection_shard2_replica1/data
   [junit4]   2> 993539 T2843 oasc.SolrCore.initIndex WARN [nodes_used_collection_shard1_replica2] Solr index directory '/usr/home/hudson/hudson-slave/workspace/Lucene-Solr-Tests-trunk-Java7/solr/build/solr-core/test/J1/./org.apache.solr.cloud.CollectionsAPIDistributedZkTest-jetty3-1375499126127/nodes_used_collection_shard1_replica2/data/index' doesn't exist. Creating new index...
   [junit4]   2> 993540 T2829 oasc.SolrCore.getNewIndexDir New index directory detected: old=null new=/usr/home/hudson/hudson-slave/workspace/Lucene-Solr-Tests-trunk-Java7/solr/build/solr-core/test/J1/./org.apache.solr.cloud.CollectionsAPIDistributedZkTest-jetty2-1375499124114//nodes_used_collection_shard2_replica1/data/index/
   [junit4]   2> 993540 T2843 oasc.CachingDirectoryFactory.get return new directory for /usr/home/hudson/hudson-slave/workspace/Lucene-Solr-Tests-trunk-Java7/solr/build/solr-core/test/J1/./org.apache.solr.cloud.CollectionsAPIDistributedZkTest-jetty3-1375499126127//nodes_used_collection_shard1_replica2/data/index
   [junit4]   2> 993540 T2829 oasc.SolrCore.initIndex WARN [nodes_used_collection_shard2_replica1] Solr index directory '/usr/home/hudson/hudson-slave/workspace/Lucene-Solr-Tests-trunk-Java7/solr/build/solr-core/test/J1/./org.apache.solr.cloud.CollectionsAPIDistributedZkTest-jetty2-1375499124114/nodes_used_collection_shard2_replica1/data/index' doesn't exist. Creating new index...
   [junit4]   2> 993542 T2829 oasc.CachingDirectoryFactory.get return new directory for /usr/home/hudson/hudson-slave/workspace/Lucene-Solr-Tests-trunk-Java7/solr/build/solr-core/test/J1/./org.apache.solr.cloud.CollectionsAPIDistributedZkTest-jetty2-1375499124114//nodes_used_collection_shard2_replica1/data/index
   [junit4]   2> 993547 T2843 oasc.SolrDeletionPolicy.onCommit SolrDeletionPolicy.onCommit: commits: num=1
   [junit4]   2> 		commit{dir=MockDirWrapper(org.apache.lucene.store.RAMDirectory@d08784b lockFactory=org.apache.lucene.store.NativeFSLockFactory@64766980),segFN=segments_1,generation=1}
   [junit4]   2> 993547 T2843 oasc.SolrDeletionPolicy.updateCommits newest commit generation = 1
   [junit4]   2> 993547 T2829 oasc.SolrDeletionPolicy.onCommit SolrDeletionPolicy.onCommit: commits: num=1
   [junit4]   2> 		commit{dir=MockDirWrapper(org.apache.lucene.store.RAMDirectory@259742eb lockFactory=org.apache.lucene.store.NativeFSLockFactory@10920068),segFN=segments_1,generation=1}
   [junit4]   2> 993548 T2829 oasc.SolrDeletionPolicy.updateCommits newest commit generation = 1
   [junit4]   2> 993553 T2843 oasup.UpdateRequestProcessorChain.init inserting DistributedUpdateProcessorFactory into updateRequestProcessorChain "dedupe"
   [junit4]   2> 993554 T2843 oasup.UpdateRequestProcessorChain.init inserting DistributedUpdateProcessorFactory into updateRequestProcessorChain "stored_sig"
   [junit4]   2> 993554 T2829 oasup.UpdateRequestProcessorChain.init inserting DistributedUpdateProcessorFactory into updateRequestProcessorChain "dedupe"
   [junit4]   2> 993555 T2829 oasup.UpdateRequestProcessorChain.init inserting DistributedUpdateProcessorFactory into updateRequestProcessorChain "stored_sig"
   [junit4]   2> 993555 T2843 oasup.UpdateRequestProcessorChain.init inserting DistributedUpdateProcessorFactory into updateRequestProcessorChain "distrib-dup-test-chain-implicit"
   [junit4]   2> 993556 T2829 oasup.UpdateRequestProcessorChain.init inserting DistributedUpdateProcessorFactory into updateRequestProcessorChain "distrib-dup-test-chain-implicit"
   [junit4]   2> 993556 T2843 oasc.RequestHandlers.initHandlersFromConfig created standard: solr.StandardRequestHandler
   [junit4]   2> 993557 T2829 oasc.RequestHandlers.initHandlersFromConfig created standard: solr.StandardRequestHandler
   [junit4]   2> 993557 T2843 oasc.RequestHandlers.initHandlersFromConfig created /get: solr.RealTimeGetHandler
   [junit4]   2> 993558 T2843 oasc.RequestHandlers.initHandlersFromConfig adding lazy requestHandler: solr.ReplicationHandler
   [junit4]   2> 993558 T2829 oasc.RequestHandlers.initHandlersFromConfig created /get: solr.RealTimeGetHandler
   [junit4]   2> 993559 T2829 oasc.RequestHandlers.initHandlersFromConfig adding lazy requestHandler: solr.ReplicationHandler
   [junit4]   2> 993558 T2843 oasc.RequestHandlers.initHandlersFromConfig created /replication: solr.ReplicationHandler
   [junit4]   2> 993559 T2829 oasc.RequestHandlers.initHandlersFromConfig created /replication: solr.ReplicationHandler
   [junit4]   2> 993560 T2843 oasc.RequestHandlers.initHandlersFromConfig created /update: solr.UpdateRequestHandler
   [junit4]   2> 993560 T2829 oasc.RequestHandlers.initHandlersFromConfig created /update: solr.UpdateRequestHandler
   [junit4]   2> 993560 T2843 oasc.RequestHandlers.initHandlersFromConfig created /admin/: org.apache.solr.handler.admin.AdminHandlers
   [junit4]   2> 993561 T2829 oasc.RequestHandlers.initHandlersFromConfig created /admin/: org.apache.solr.handler.admin.AdminHandlers
   [junit4]   2> 993571 T2857 oass.OpenExchangeRatesOrgProvider.reload Reloading exchange rates from open-exchange-rates.json
   [junit4]   2> 993573 T2857 oass.OpenExchangeRatesOrgProvider$OpenExchangeRates.<init> WARN Unknown key IMPORTANT NOTE
   [junit4]   2> 993574 T2857 oass.OpenExchangeRatesOrgProvider$OpenExchangeRates.<init> WARN Expected key, got STRING
   [junit4]   2> 993574 T2857 oass.OpenExchangeRatesOrgProvider.reload Reloading exchange rates from open-exchange-rates.json
   [junit4]   2> 993576 T2857 oass.OpenExchangeRatesOrgProvider$OpenExchangeRates.<init> WARN Unknown key IMPORTANT NOTE
   [junit4]   2> 993576 T2857 oass.OpenExchangeRatesOrgProvider$OpenExchangeRates.<init> WARN Expected key, got STRING
   [junit4]   2> 993577 T2857 oasc.SolrCore.initDirectoryFactory org.apache.solr.core.MockDirectoryFactory
   [junit4]   2> 993577 T2857 oasc.SolrCore.<init> [nodes_used_collection_shard1_replica1] Opening new SolrCore at /usr/home/hudson/hudson-slave/workspace/Lucene-Solr-Tests-trunk-Java7/solr/build/solr-core/test/J1/./org.apache.solr.cloud.CollectionsAPIDistributedZkTest-jetty4-1375499128109/nodes_used_collection_shard1_replica1/, dataDir=/usr/home/hudson/hudson-slave/workspace/Lucene-Solr-Tests-trunk-Java7/solr/build/solr-core/test/J1/./org.apache.solr.cloud.CollectionsAPIDistributedZkTest-jetty4-1375499128109//nodes_used_collection_shard1_replica1/data/
   [junit4]   2> 993578 T2857 oasc.JmxMonitoredMap.<init> JMX monitoring is enabled. Adding Solr mbeans to JMX Server: com.sun.jmx.mbeanserver.JmxMBeanServer@50456ce9
   [junit4]   2> 993579 T2857 oasc.CachingDirectoryFactory.get return new directory for /usr/home/hudson/hudson-slave/workspace/Lucene-Solr-Tests-trunk-Java7/solr/build/solr-core/test/J1/./org.apache.solr.cloud.CollectionsAPIDistributedZkTest-jetty4-1375499128109//nodes_used_collection_shard1_replica1/data
   [junit4]   2> 993580 T2857 oasc.SolrCore.getNewIndexDir New index directory detected: old=null new=/usr/home/hudson/hudson-slave/workspace/Lucene-Solr-Tests-trunk-Java7/solr/build/solr-core/test/J1/./org.apache.solr.cloud.CollectionsAPIDistributedZkTest-jetty4-1375499128109//nodes_used_collection_shard1_replica1/data/index/
   [junit4]   2> 993580 T2857 oasc.SolrCore.initIndex WARN [nodes_used_collection_shard1_replica1] Solr index directory '/usr/home/hudson/hudson-slave/workspace/Lucene-Solr-Tests-trunk-Java7/solr/build/solr-core/test/J1/./org.apache.solr.cloud.CollectionsAPIDistributedZkTest-jetty4-1375499128109/nodes_used_collection_shard1_replica1/data/index' doesn't exist. Creating new index...
   [junit4]   2> 993581 T2857 oasc.CachingDirectoryFactory.get return new directory for /usr/home/hudson/hudson-slave/workspace/Lucene-Solr-Tests-trunk-Java7/solr/build/solr-core/test/J1/./org.apache.solr.cloud.CollectionsAPIDistributedZkTest-jetty4-1375499128109//nodes_used_collection_shard1_replica1/data/index
   [junit4]   2> 993590 T2857 oasc.SolrDeletionPolicy.onCommit SolrDeletionPolicy.onCommit: commits: num=1
   [junit4]   2> 		commit{dir=MockDirWrapper(org.apache.lucene.store.RAMDirectory@54887340 lockFactory=org.apache.lucene.store.NativeFSLockFactory@77b854eb),segFN=segments_1,generation=1}
   [junit4]   2> 993590 T2857 oasc.SolrDeletionPolicy.updateCommits newest commit generation = 1
   [junit4]   2> 993592 T2829 oashl.XMLLoader.init xsltCacheLifetimeSeconds=60
   [junit4]   2> 993593 T2843 oashl.XMLLoader.init xsltCacheLifetimeSeconds=60
   [junit4]   2> 993593 T2816 oashl.XMLLoader.init xsltCacheLifetimeSeconds=60
   [junit4]   2> 993597 T2857 oasup.UpdateRequestProcessorChain.init inserting DistributedUpdateProcessorFactory into updateRequestProcessorChain "dedupe"
   [junit4]   2> 993598 T2857 oasup.UpdateRequestProcessorChain.init inserting DistributedUpdateProcessorFactory into updateRequestProcessorChain "stored_sig"
   [junit4]   2> 993599 T2857 oasup.UpdateRequestProcessorChain.init inserting DistributedUpdateProcessorFactory into updateRequestProcessorChain "distrib-dup-test-chain-implicit"
   [junit4]   2> 993600 T2857 oasc.RequestHandlers.initHandlersFromConfig created standard: solr.StandardRequestHandler
   [junit4]   2> 993600 T2857 oasc.RequestHandlers.initHandlersFromConfig created /get: solr.RealTimeGetHandler
   [junit4]   2> 993601 T2857 oasc.RequestHandlers.initHandlersFromConfig adding lazy requestHandler: solr.ReplicationHandler
   [junit4]   2> 993601 T2857 oasc.RequestHandlers.initHandlersFromConfig created /replication: solr.ReplicationHandler
   [junit4]   2> 993602 T2857 oasc.RequestHandlers.initHandlersFromConfig created /update: solr.UpdateRequestHandler
   [junit4]   2> 993603 T2857 oasc.RequestHandlers.initHandlersFromConfig created /admin/: org.apache.solr.handler.admin.AdminHandlers
   [junit4]   2> 993605 T2829 oass.SolrIndexSearcher.<init> Opening Searcher@ef7778c main
   [junit4]   2> 993605 T2816 oass.SolrIndexSearcher.<init> Opening Searcher@15fa63d2 main
   [junit4]   2> 993605 T2843 oass.SolrIndexSearcher.<init> Opening Searcher@db18cb5 main
   [junit4]   2> 993607 T2829 oasu.CommitTracker.<init> Hard AutoCommit: disabled
   [junit4]   2> 993607 T2829 oasu.CommitTracker.<init> Soft AutoCommit: disabled
   [junit4]   2> 993608 T2843 oasu.CommitTracker.<init> Hard AutoCommit: disabled
   [junit4]   2> 993607 T2816 oasu.CommitTracker.<init> Hard AutoCommit: disabled
   [junit4]   2> 993608 T2843 oasu.CommitTracker.<init> Soft AutoCommit: disabled
   [junit4]   2> 993609 T2816 oasu.CommitTracker.<init> Soft AutoCommit: disabled
   [junit4]   2> 993613 T2873 oasc.SolrCore.registerSearcher [nodes_used_collection_shard2_replica1] Registered new searcher Searcher@ef7778c main{StandardDirectoryReader(segments_1:1)}
   [junit4]   2> 993613 T2874 oasc.SolrCore.registerSearcher [nodes_used_collection_shard1_replica2] Registered new searcher Searcher@db18cb5 main{StandardDirectoryReader(segments_1:1)}
   [junit4]   2> 993614 T2875 oasc.SolrCore.registerSearcher [nodes_used_collection_shard2_replica2] Registered new searcher Searcher@15fa63d2 main{StandardDirectoryReader(segments_1:1)}
   [junit4]   2> 993617 T2843 oasc.CoreContainer.registerCore registering core: nodes_used_collection_shard1_replica2
   [junit4]   2> 993617 T2829 oasc.CoreContainer.registerCore registering core: nodes_used_collection_shard2_replica1
   [junit4]   2> 993617 T2816 oasc.CoreContainer.registerCore registering core: nodes_used_collection_shard2_replica2
   [junit4]   2> 993617 T2843 oasc.ZkController.register Register replica - core:nodes_used_collection_shard1_replica2 address:http://127.0.0.1:37862 collection:nodes_used_collection shard:shard1
   [junit4]   2> 993618 T2816 oasc.ZkController.register Register replica - core:nodes_used_collection_shard2_replica2 address:http://127.0.0.1:20368 collection:nodes_used_collection shard:shard2
   [junit4]   2> 993617 T2829 oasc.ZkController.register Register replica - core:nodes_used_collection_shard2_replica1 address:http://127.0.0.1:43003 collection:nodes_used_collection shard:shard2
   [junit4]   2> 993619 T2816 oascsi.HttpClientUtil.createClient Creating new http client, config:maxConnections=10000&maxConnectionsPerHost=20&connTimeout=15000&socketTimeout=30000&retry=false
   [junit4]   2> 993618 T2843 oascsi.HttpClientUtil.createClient Creating new http client, config:maxConnections=10000&maxConnectionsPerHost=20&connTimeout=15000&socketTimeout=30000&retry=false
   [junit4]   2> 993619 T2829 oascsi.HttpClientUtil.createClient Creating new http client, config:maxConnections=10000&maxConnectionsPerHost=20&connTimeout=15000&socketTimeout=30000&retry=false
   [junit4]   2> 993632 T2857 oashl.XMLLoader.init xsltCacheLifetimeSeconds=60
   [junit4]   2> 993637 T2857 oass.SolrIndexSearcher.<init> Opening Searcher@17f9b0b2 main
   [junit4]   2> 993639 T2857 oasu.CommitTracker.<init> Hard AutoCommit: disabled
   [junit4]   2> 993640 T2857 oasu.CommitTracker.<init> Soft AutoCommit: disabled
   [junit4]   2> 993644 T2876 oasc.SolrCore.registerSearcher [nodes_used_collection_shard1_replica1] Registered new searcher Searcher@17f9b0b2 main{StandardDirectoryReader(segments_1:1)}
   [junit4]   2> 993647 T2843 oascc.SolrZkClient.makePath makePath: /collections/nodes_used_collection/leader_elect/shard1/election
   [junit4]   2> 993647 T2829 oascc.SolrZkClient.makePath makePath: /collections/nodes_used_collection/leader_elect/shard2/election
   [junit4]   2> 993647 T2816 oascc.SolrZkClient.makePath makePath: /collections/nodes_used_collection/leader_elect/shard2/election
   [junit4]   2> 993647 T2857 oasc.CoreContainer.registerCore registering core: nodes_used_collection_shard1_replica1
   [junit4]   2> 993649 T2857 oasc.ZkController.register Register replica - core:nodes_used_collection_shard1_replica1 address:http://127.0.0.1:23021 collection:nodes_used_collection shard:shard1
   [junit4]   2> 993650 T2857 oascsi.HttpClientUtil.createClient Creating new http client, config:maxConnections=10000&maxConnectionsPerHost=20&connTimeout=15000&socketTimeout=30000&retry=false
   [junit4]   2> 993688 T2857 oascc.SolrZkClient.makePath makePath: /collections/nodes_used_collection/leader_elect/shard1/election
   [junit4]   2> 993804 T2843 oasc.ShardLeaderElectionContext.runLeaderProcess Running the leader process for shard shard1
   [junit4]   2> 993806 T2829 oasc.ShardLeaderElectionContext.runLeaderProcess Running the leader process for shard shard2
   [junit4]   2> 993861 T2843 oasc.ShardLeaderElectionContext.waitForReplicasToComeUp Enough replicas found to continue.
   [junit4]   2> 993861 T2829 oasc.ShardLeaderElectionContext.waitForReplicasToComeUp Enough replicas found to continue.
   [junit4]   2> 993861 T2843 oasc.ShardLeaderElectionContext.runLeaderProcess I may be the new leader - try and sync
   [junit4]   2> 993862 T2829 oasc.ShardLeaderElectionContext.runLeaderProcess I may be the new leader - try and sync
   [junit4]   2> 993862 T2843 oasc.SyncStrategy.sync Sync replicas to http://127.0.0.1:37862/nodes_used_collection_shard1_replica2/
   [junit4]   2> 993863 T2829 oasc.SyncStrategy.sync Sync replicas to http://127.0.0.1:43003/nodes_used_collection_shard2_replica1/
   [junit4]   2> 993863 T2843 oasu.PeerSync.sync PeerSync: core=nodes_used_collection_shard1_replica2 url=http://127.0.0.1:37862 START replicas=[http://127.0.0.1:23021/nodes_used_collection_shard1_replica1/] nUpdates=100
   [junit4]   2> 993864 T2829 oasu.PeerSync.sync PeerSync: core=nodes_used_collection_shard2_replica1 url=http://127.0.0.1:43003 START replicas=[http://127.0.0.1:20368/nodes_used_collection_shard2_replica2/] nUpdates=100
   [junit4]   2> 993864 T2843 oasu.PeerSync.sync PeerSync: core=nodes_used_collection_shard1_replica2 url=http://127.0.0.1:37862 DONE.  We have no versions.  sync failed.
   [junit4]   2> 993865 T2843 oasc.SyncStrategy.syncReplicas Leader's attempt to sync with shard failed, moving to the next candidate
   [junit4]   2> 993865 T2829 oasu.PeerSync.sync PeerSync: core=nodes_used_collection_shard2_replica1 url=http://127.0.0.1:43003 DONE.  We have no versions.  sync failed.
   [junit4]   2> 993866 T2829 oasc.SyncStrategy.syncReplicas Leader's attempt to sync with shard failed, moving to the next candidate
   [junit4]   2> 993866 T2843 oasc.ShardLeaderElectionContext.runLeaderProcess We failed sync, but we have no versions - we can't sync in that case - we were active before, so become leader anyway
   [junit4]   2> 993867 T2829 oasc.ShardLeaderElectionContext.runLeaderProcess We failed sync, but we have no versions - we can't sync in that case - we were active before, so become leader anyway
   [junit4]   2> 993867 T2843 oasc.ShardLeaderElectionContext.runLeaderProcess I am the new leader: http://127.0.0.1:37862/nodes_used_collection_shard1_replica2/ shard1
   [junit4]   2> 993868 T2829 oasc.ShardLeaderElectionContext.runLeaderProcess I am the new leader: http://127.0.0.1:43003/nodes_used_collection_shard2_replica1/ shard2
   [junit4]   2> 993868 T2843 oascc.SolrZkClient.makePath makePath: /collections/nodes_used_collection/leaders/shard1
   [junit4]   2> 993869 T2829 oascc.SolrZkClient.makePath makePath: /collections/nodes_used_collection/leaders/shard2
   [junit4]   2> ASYNC  NEW_CORE C1625 name=nodes_used_collection_shard2_replica2 org.apache.solr.core.SolrCore@4d0ac194 url=http://127.0.0.1:20368/nodes_used_collection_shard2_replica2 node=127.0.0.1:20368_ C1625_STATE=coll:nodes_used_collection core:nodes_used_collection_shard2_replica2 props:{state=down, core=nodes_used_collection_shard2_replica2, node_name=127.0.0.1:20368_, base_url=http://127.0.0.1:20368}
   [junit4]   2> 993876 T2817 C1625 P20368 oasc.SolrCore.execute [nodes_used_collection_shar

[...truncated too long message...]

-Solr-Tests-trunk-Java7/solr/build/solr-core/test/J1/./org.apache.solr.cloud.CollectionsAPIDistributedZkTest-jetty4-1375499128109//new_implicit_coll_1_a_replica2/data/index [CachedDir<<refCount=0;path=/usr/home/hudson/hudson-slave/workspace/Lucene-Solr-Tests-trunk-Java7/solr/build/solr-core/test/J1/./org.apache.solr.cloud.CollectionsAPIDistributedZkTest-jetty4-1375499128109//new_implicit_coll_1_a_replica2/data/index;done=false>>]
   [junit4]   2> 1151375 T2785 oasc.CachingDirectoryFactory.close Closing directory: /usr/home/hudson/hudson-slave/workspace/Lucene-Solr-Tests-trunk-Java7/solr/build/solr-core/test/J1/./org.apache.solr.cloud.CollectionsAPIDistributedZkTest-jetty4-1375499128109//new_implicit_coll_1_a_replica2/data/index
   [junit4]   2> 1151375 T2785 oasc.CachingDirectoryFactory.closeCacheValue looking to close /usr/home/hudson/hudson-slave/workspace/Lucene-Solr-Tests-trunk-Java7/solr/build/solr-core/test/J1/./org.apache.solr.cloud.CollectionsAPIDistributedZkTest-jetty4-1375499128109//new_implicit_coll_1_a_replica2/data [CachedDir<<refCount=0;path=/usr/home/hudson/hudson-slave/workspace/Lucene-Solr-Tests-trunk-Java7/solr/build/solr-core/test/J1/./org.apache.solr.cloud.CollectionsAPIDistributedZkTest-jetty4-1375499128109//new_implicit_coll_1_a_replica2/data;done=false>>]
   [junit4]   2> 1151376 T2785 oasc.CachingDirectoryFactory.close Closing directory: /usr/home/hudson/hudson-slave/workspace/Lucene-Solr-Tests-trunk-Java7/solr/build/solr-core/test/J1/./org.apache.solr.cloud.CollectionsAPIDistributedZkTest-jetty4-1375499128109//new_implicit_coll_1_a_replica2/data
   [junit4]   2> 1151431 T2785 oejsh.ContextHandler.doStop stopped o.e.j.s.ServletContextHandler{/,null}
   [junit4]   2> 1151497 T2785 oas.SolrTestCaseJ4.tearDown ###Ending testDistribSearch
   [junit4]   2> 1151502 T2785 oasc.ZkTestServer.send4LetterWord connecting to 127.0.0.1:22369 22369
   [junit4]   1> client port:0.0.0.0/0.0.0.0:0
   [junit4]   2> NOTE: reproduce with: ant test  -Dtestcase=CollectionsAPIDistributedZkTest -Dtests.method=testDistribSearch -Dtests.seed=A26CCEE62D88142E -Dtests.multiplier=3 -Dtests.slow=true -Dtests.locale=sk_SK -Dtests.timezone=America/Argentina/Salta -Dtests.file.encoding=US-ASCII
   [junit4] ERROR    174s J1 | CollectionsAPIDistributedZkTest.testDistribSearch <<<
   [junit4]    > Throwable #1: org.apache.solr.client.solrj.SolrServerException: IOException occured when talking to server at: http://127.0.0.1:20368
   [junit4]    > 	at __randomizedtesting.SeedInfo.seed([A26CCEE62D88142E:238A40FE5AD77412]:0)
   [junit4]    > 	at org.apache.solr.client.solrj.impl.HttpSolrServer.request(HttpSolrServer.java:435)
   [junit4]    > 	at org.apache.solr.client.solrj.impl.HttpSolrServer.request(HttpSolrServer.java:180)
   [junit4]    > 	at org.apache.solr.cloud.AbstractFullDistribZkTestBase.createCollection(AbstractFullDistribZkTestBase.java:1535)
   [junit4]    > 	at org.apache.solr.cloud.CollectionsAPIDistributedZkTest.testCustomCollectionsAPI(CollectionsAPIDistributedZkTest.java:677)
   [junit4]    > 	at org.apache.solr.cloud.CollectionsAPIDistributedZkTest.doTest(CollectionsAPIDistributedZkTest.java:159)
   [junit4]    > 	at org.apache.solr.BaseDistributedSearchTestCase.testDistribSearch(BaseDistributedSearchTestCase.java:835)
   [junit4]    > 	at java.lang.Thread.run(Thread.java:724)
   [junit4]    > Caused by: org.apache.http.conn.ConnectTimeoutException: Connect to 127.0.0.1:20368 timed out
   [junit4]    > 	at org.apache.http.conn.scheme.PlainSocketFactory.connectSocket(PlainSocketFactory.java:129)
   [junit4]    > 	at org.apache.http.impl.conn.DefaultClientConnectionOperator.openConnection(DefaultClientConnectionOperator.java:180)
   [junit4]    > 	at org.apache.http.impl.conn.ManagedClientConnectionImpl.open(ManagedClientConnectionImpl.java:294)
   [junit4]    > 	at org.apache.http.impl.client.DefaultRequestDirector.tryConnect(DefaultRequestDirector.java:645)
   [junit4]    > 	at org.apache.http.impl.client.DefaultRequestDirector.execute(DefaultRequestDirector.java:480)
   [junit4]    > 	at org.apache.http.impl.client.AbstractHttpClient.execute(AbstractHttpClient.java:906)
   [junit4]    > 	at org.apache.http.impl.client.AbstractHttpClient.execute(AbstractHttpClient.java:805)
   [junit4]    > 	at org.apache.http.impl.client.AbstractHttpClient.execute(AbstractHttpClient.java:784)
   [junit4]    > 	at org.apache.solr.client.solrj.impl.HttpSolrServer.request(HttpSolrServer.java:365)
   [junit4]    > 	... 45 more
   [junit4]   2> 1151896 T2785 oas.SolrTestCaseJ4.deleteCore ###deleteCore
   [junit4]   2> 173864 T2784 ccr.ThreadLeakControl.checkThreadLeaks WARNING Will linger awaiting termination of 2 leaked thread(s).
   [junit4]   2> 1152730 T2867 oasc.LeaderElector$1.process WARN  org.apache.zookeeper.KeeperException$SessionExpiredException: KeeperErrorCode = Session expired for /collections/new_implicit_coll_1/leader_elect/b/election
   [junit4]   2> 	at org.apache.zookeeper.KeeperException.create(KeeperException.java:127)
   [junit4]   2> 	at org.apache.zookeeper.KeeperException.create(KeeperException.java:51)
   [junit4]   2> 	at org.apache.zookeeper.ZooKeeper.getChildren(ZooKeeper.java:1468)
   [junit4]   2> 	at org.apache.solr.common.cloud.SolrZkClient$6.execute(SolrZkClient.java:235)
   [junit4]   2> 	at org.apache.solr.common.cloud.SolrZkClient$6.execute(SolrZkClient.java:232)
   [junit4]   2> 	at org.apache.solr.common.cloud.ZkCmdExecutor.retryOperation(ZkCmdExecutor.java:65)
   [junit4]   2> 	at org.apache.solr.common.cloud.SolrZkClient.getChildren(SolrZkClient.java:232)
   [junit4]   2> 	at org.apache.solr.cloud.LeaderElector.checkIfIamLeader(LeaderElector.java:84)
   [junit4]   2> 	at org.apache.solr.cloud.LeaderElector.access$000(LeaderElector.java:55)
   [junit4]   2> 	at org.apache.solr.cloud.LeaderElector$1.process(LeaderElector.java:129)
   [junit4]   2> 	at org.apache.zookeeper.ClientCnxn$EventThread.processEvent(ClientCnxn.java:519)
   [junit4]   2> 	at org.apache.zookeeper.ClientCnxn$EventThread.run(ClientCnxn.java:495)
   [junit4]   2> 
   [junit4]   2> 1152731 T2867 oascc.ZkStateReader$2.process A cluster state change: WatchedEvent state:SyncConnected type:NodeChildrenChanged path:/live_nodes, has occurred - updating... (live nodes size: 1)
   [junit4]   2> 1152732 T2867 oascc.ZkStateReader$2.process WARN ZooKeeper watch triggered, but Solr cannot talk to ZK
   [junit4]   2> 1152732 T2867 oascc.ZkStateReader$3.process WARN ZooKeeper watch triggered, but Solr cannot talk to ZK
   [junit4]   2> NOTE: test params are: codec=Lucene40, sim=RandomSimilarityProvider(queryNorm=false,coord=crazy): {}, locale=sk_SK, timezone=America/Argentina/Salta
   [junit4]   2> NOTE: FreeBSD 9.1-RELEASE-p3 amd64/Oracle Corporation 1.7.0_25 (64-bit)/cpus=16,threads=6,free=285540304,total=536870912
   [junit4]   2> NOTE: All tests run in this JVM: [TestRandomFaceting, StatsComponentTest, TestSuggestSpellingConverter, TestSchemaSimilarityResource, SolrCmdDistributorTest, TestRangeQuery, EchoParamsTest, TestCodecSupport, TestLuceneMatchVersion, OutputWriterTest, TestMergePolicyConfig, TestBM25SimilarityFactory, TestSchemaResource, SortByFunctionTest, TestManagedSchemaFieldResource, HighlighterTest, PathHierarchyTokenizerFactoryTest, TimeZoneUtilsTest, BadCopyFieldTest, DistanceFunctionTest, DeleteShardTest, DirectSolrSpellCheckerTest, HdfsUnloadDistributedZkTest, TestDFRSimilarityFactory, TestJmxMonitoredMap, TestFoldingMultitermQuery, TestLazyCores, TestUtils, TestUpdate, TestSolrJ, NumericFieldsTest, TestMultiCoreConfBootstrap, TestDistributedGrouping, TestSolr4Spatial, TestManagedSchema, ClusterStateTest, TestRTGBase, DebugComponentTest, DateMathParserTest, DocumentAnalysisRequestHandlerTest, TestCopyFieldCollectionResource, TestInfoStreamLogging, SpellPossibilityIteratorTest, XsltUpdateRequestHandlerTest, TestFastOutputStream, SignatureUpdateProcessorFactoryTest, TestDistributedSearch, HdfsSyncSliceTest, TestElisionMultitermQuery, TestStressReorder, BadIndexSchemaTest, TestLMJelinekMercerSimilarityFactory, TestRandomMergePolicy, TestStressLucene, SpellCheckComponentTest, OpenExchangeRatesOrgProviderTest, TestCollationField, TestRecoveryHdfs, SpellCheckCollatorTest, XmlUpdateRequestHandlerTest, CurrencyFieldXmlFileTest, TestRecovery, SampleTest, UpdateParamsTest, DOMUtilTest, QueryResultKeyTest, SimplePostToolTest, OpenCloseCoreStressTest, TestZkChroot, TestIndexingPerformance, TestComponentsName, HdfsLockFactoryTest, TestPostingsSolrHighlighter, ZkSolrClientTest, ChaosMonkeySafeLeaderTest, BasicDistributedZk2Test, UnloadDistributedZkTest, CollectionsAPIDistributedZkTest]
   [junit4] Completed on J1 in 174.91s, 1 test, 1 error <<< FAILURES!

[...truncated 533 lines...]
BUILD FAILED
/usr/home/hudson/hudson-slave/workspace/Lucene-Solr-Tests-trunk-Java7/build.xml:389: The following error occurred while executing this line:
/usr/home/hudson/hudson-slave/workspace/Lucene-Solr-Tests-trunk-Java7/build.xml:369: The following error occurred while executing this line:
/usr/home/hudson/hudson-slave/workspace/Lucene-Solr-Tests-trunk-Java7/build.xml:39: The following error occurred while executing this line:
/usr/home/hudson/hudson-slave/workspace/Lucene-Solr-Tests-trunk-Java7/solr/build.xml:181: The following error occurred while executing this line:
/usr/home/hudson/hudson-slave/workspace/Lucene-Solr-Tests-trunk-Java7/solr/common-build.xml:449: The following error occurred while executing this line:
/usr/home/hudson/hudson-slave/workspace/Lucene-Solr-Tests-trunk-Java7/lucene/common-build.xml:1230: The following error occurred while executing this line:
/usr/home/hudson/hudson-slave/workspace/Lucene-Solr-Tests-trunk-Java7/lucene/common-build.xml:873: There were test failures: 320 suites, 1347 tests, 1 error, 34 ignored (6 assumptions)

Total time: 64 minutes 2 seconds
Build step 'Invoke Ant' marked build as failure
Archiving artifacts
Recording test results
Email was triggered for: Failure
Sending email for trigger: Failure



Mime
View raw message