lucene-dev mailing list archives

Site index · List index
Message view « Date » · « Thread »
Top « Date » · « Thread »
From Policeman Jenkins Server <jenk...@thetaphi.de>
Subject [JENKINS] Lucene-Solr-trunk-Windows (64bit/jdk1.7.0_25) - Build # 3097 - Still Failing!
Date Thu, 01 Aug 2013 18:43:41 GMT
Build: http://jenkins.thetaphi.de/job/Lucene-Solr-trunk-Windows/3097/
Java: 64bit/jdk1.7.0_25 -XX:+UseCompressedOops -XX:+UseG1GC

1 tests failed.
FAILED:  org.apache.solr.cloud.CollectionsAPIDistributedZkTest.testDistribSearch

Error Message:
Server refused connection at: http://127.0.0.1:57142/_wz/y

Stack Trace:
org.apache.solr.client.solrj.SolrServerException: Server refused connection at: http://127.0.0.1:57142/_wz/y
	at __randomizedtesting.SeedInfo.seed([40549FD20C2804D4:C1B211CA7B7764E8]:0)
	at org.apache.solr.client.solrj.impl.HttpSolrServer.request(HttpSolrServer.java:428)
	at org.apache.solr.client.solrj.impl.HttpSolrServer.request(HttpSolrServer.java:180)
	at org.apache.solr.cloud.AbstractFullDistribZkTestBase.createCollection(AbstractFullDistribZkTestBase.java:1535)
	at org.apache.solr.cloud.CollectionsAPIDistributedZkTest.testCustomCollectionsAPI(CollectionsAPIDistributedZkTest.java:677)
	at org.apache.solr.cloud.CollectionsAPIDistributedZkTest.doTest(CollectionsAPIDistributedZkTest.java:159)
	at org.apache.solr.BaseDistributedSearchTestCase.testDistribSearch(BaseDistributedSearchTestCase.java:835)
	at sun.reflect.NativeMethodAccessorImpl.invoke0(Native Method)
	at sun.reflect.NativeMethodAccessorImpl.invoke(NativeMethodAccessorImpl.java:57)
	at sun.reflect.DelegatingMethodAccessorImpl.invoke(DelegatingMethodAccessorImpl.java:43)
	at java.lang.reflect.Method.invoke(Method.java:606)
	at com.carrotsearch.randomizedtesting.RandomizedRunner.invoke(RandomizedRunner.java:1559)
	at com.carrotsearch.randomizedtesting.RandomizedRunner.access$600(RandomizedRunner.java:79)
	at com.carrotsearch.randomizedtesting.RandomizedRunner$6.evaluate(RandomizedRunner.java:737)
	at com.carrotsearch.randomizedtesting.RandomizedRunner$7.evaluate(RandomizedRunner.java:773)
	at com.carrotsearch.randomizedtesting.RandomizedRunner$8.evaluate(RandomizedRunner.java:787)
	at com.carrotsearch.randomizedtesting.rules.SystemPropertiesRestoreRule$1.evaluate(SystemPropertiesRestoreRule.java:53)
	at org.apache.lucene.util.TestRuleSetupTeardownChained$1.evaluate(TestRuleSetupTeardownChained.java:50)
	at org.apache.lucene.util.TestRuleFieldCacheSanity$1.evaluate(TestRuleFieldCacheSanity.java:51)
	at org.apache.lucene.util.AbstractBeforeAfterRule$1.evaluate(AbstractBeforeAfterRule.java:46)
	at com.carrotsearch.randomizedtesting.rules.SystemPropertiesInvariantRule$1.evaluate(SystemPropertiesInvariantRule.java:55)
	at org.apache.lucene.util.TestRuleThreadAndTestName$1.evaluate(TestRuleThreadAndTestName.java:49)
	at org.apache.lucene.util.TestRuleIgnoreAfterMaxFailures$1.evaluate(TestRuleIgnoreAfterMaxFailures.java:70)
	at org.apache.lucene.util.TestRuleMarkFailure$1.evaluate(TestRuleMarkFailure.java:48)
	at com.carrotsearch.randomizedtesting.rules.StatementAdapter.evaluate(StatementAdapter.java:36)
	at com.carrotsearch.randomizedtesting.ThreadLeakControl$StatementRunner.run(ThreadLeakControl.java:358)
	at com.carrotsearch.randomizedtesting.ThreadLeakControl.forkTimeoutingTask(ThreadLeakControl.java:782)
	at com.carrotsearch.randomizedtesting.ThreadLeakControl$3.evaluate(ThreadLeakControl.java:442)
	at com.carrotsearch.randomizedtesting.RandomizedRunner.runSingleTest(RandomizedRunner.java:746)
	at com.carrotsearch.randomizedtesting.RandomizedRunner$3.evaluate(RandomizedRunner.java:648)
	at com.carrotsearch.randomizedtesting.RandomizedRunner$4.evaluate(RandomizedRunner.java:682)
	at com.carrotsearch.randomizedtesting.RandomizedRunner$5.evaluate(RandomizedRunner.java:693)
	at com.carrotsearch.randomizedtesting.rules.StatementAdapter.evaluate(StatementAdapter.java:36)
	at com.carrotsearch.randomizedtesting.rules.SystemPropertiesRestoreRule$1.evaluate(SystemPropertiesRestoreRule.java:53)
	at org.apache.lucene.util.AbstractBeforeAfterRule$1.evaluate(AbstractBeforeAfterRule.java:46)
	at org.apache.lucene.util.TestRuleStoreClassName$1.evaluate(TestRuleStoreClassName.java:42)
	at com.carrotsearch.randomizedtesting.rules.SystemPropertiesInvariantRule$1.evaluate(SystemPropertiesInvariantRule.java:55)
	at com.carrotsearch.randomizedtesting.rules.NoShadowingOrOverridesOnMethodsRule$1.evaluate(NoShadowingOrOverridesOnMethodsRule.java:39)
	at com.carrotsearch.randomizedtesting.rules.NoShadowingOrOverridesOnMethodsRule$1.evaluate(NoShadowingOrOverridesOnMethodsRule.java:39)
	at com.carrotsearch.randomizedtesting.rules.StatementAdapter.evaluate(StatementAdapter.java:36)
	at org.apache.lucene.util.TestRuleAssertionsRequired$1.evaluate(TestRuleAssertionsRequired.java:43)
	at org.apache.lucene.util.TestRuleMarkFailure$1.evaluate(TestRuleMarkFailure.java:48)
	at org.apache.lucene.util.TestRuleIgnoreAfterMaxFailures$1.evaluate(TestRuleIgnoreAfterMaxFailures.java:70)
	at org.apache.lucene.util.TestRuleIgnoreTestSuites$1.evaluate(TestRuleIgnoreTestSuites.java:55)
	at com.carrotsearch.randomizedtesting.rules.StatementAdapter.evaluate(StatementAdapter.java:36)
	at com.carrotsearch.randomizedtesting.ThreadLeakControl$StatementRunner.run(ThreadLeakControl.java:358)
	at java.lang.Thread.run(Thread.java:724)
Caused by: org.apache.http.conn.HttpHostConnectException: Connection to http://127.0.0.1:57142 refused
	at org.apache.http.impl.conn.DefaultClientConnectionOperator.openConnection(DefaultClientConnectionOperator.java:190)
	at org.apache.http.impl.conn.ManagedClientConnectionImpl.open(ManagedClientConnectionImpl.java:294)
	at org.apache.http.impl.client.DefaultRequestDirector.tryConnect(DefaultRequestDirector.java:645)
	at org.apache.http.impl.client.DefaultRequestDirector.execute(DefaultRequestDirector.java:480)
	at org.apache.http.impl.client.AbstractHttpClient.execute(AbstractHttpClient.java:906)
	at org.apache.http.impl.client.AbstractHttpClient.execute(AbstractHttpClient.java:805)
	at org.apache.http.impl.client.AbstractHttpClient.execute(AbstractHttpClient.java:784)
	at org.apache.solr.client.solrj.impl.HttpSolrServer.request(HttpSolrServer.java:365)
	... 45 more
Caused by: java.net.ConnectException: Connection refused: connect
	at java.net.DualStackPlainSocketImpl.waitForConnect(Native Method)
	at java.net.DualStackPlainSocketImpl.socketConnect(DualStackPlainSocketImpl.java:85)
	at java.net.AbstractPlainSocketImpl.doConnect(AbstractPlainSocketImpl.java:339)
	at java.net.AbstractPlainSocketImpl.connectToAddress(AbstractPlainSocketImpl.java:200)
	at java.net.AbstractPlainSocketImpl.connect(AbstractPlainSocketImpl.java:182)
	at java.net.PlainSocketImpl.connect(PlainSocketImpl.java:172)
	at java.net.SocksSocketImpl.connect(SocksSocketImpl.java:392)
	at java.net.Socket.connect(Socket.java:579)
	at org.apache.http.conn.scheme.PlainSocketFactory.connectSocket(PlainSocketFactory.java:127)
	at org.apache.http.impl.conn.DefaultClientConnectionOperator.openConnection(DefaultClientConnectionOperator.java:180)
	... 52 more




Build Log:
[...truncated 9531 lines...]
   [junit4] Suite: org.apache.solr.cloud.CollectionsAPIDistributedZkTest
   [junit4]   2> 933798 T3207 oas.BaseDistributedSearchTestCase.initHostContext Setting hostContext system property: /_wz/y
   [junit4]   2> 933806 T3207 oas.SolrTestCaseJ4.setUp ###Starting testDistribSearch
   [junit4]   2> Creating dataDir: C:\Users\JenkinsSlave\workspace\Lucene-Solr-trunk-Windows\solr\build\solr-core\test\J0\.\solrtest-CollectionsAPIDistributedZkTest-1375379980430
   [junit4]   2> 933809 T3207 oasc.ZkTestServer.run STARTING ZK TEST SERVER
   [junit4]   2> 933810 T3208 oasc.ZkTestServer$ZKServerMain.runFromConfig Starting server
   [junit4]   2> 933919 T3207 oasc.ZkTestServer.run start zk server on port:57123
   [junit4]   2> 933921 T3207 oascc.ConnectionManager.waitForConnected Waiting for client to connect to ZooKeeper
   [junit4]   2> 933938 T3214 oascc.ConnectionManager.process Watcher org.apache.solr.common.cloud.ConnectionManager@64482808 name:ZooKeeperConnection Watcher:127.0.0.1:57123 got event WatchedEvent state:SyncConnected type:None path:null path:null type:None
   [junit4]   2> 933938 T3207 oascc.ConnectionManager.waitForConnected Client is connected to ZooKeeper
   [junit4]   2> 933939 T3207 oascc.SolrZkClient.makePath makePath: /solr
   [junit4]   2> 933950 T3207 oascc.ConnectionManager.waitForConnected Waiting for client to connect to ZooKeeper
   [junit4]   2> 933955 T3216 oascc.ConnectionManager.process Watcher org.apache.solr.common.cloud.ConnectionManager@48c9b976 name:ZooKeeperConnection Watcher:127.0.0.1:57123/solr got event WatchedEvent state:SyncConnected type:None path:null path:null type:None
   [junit4]   2> 933955 T3207 oascc.ConnectionManager.waitForConnected Client is connected to ZooKeeper
   [junit4]   2> 933956 T3207 oascc.SolrZkClient.makePath makePath: /collections/collection1
   [junit4]   2> 933964 T3207 oascc.SolrZkClient.makePath makePath: /collections/collection1/shards
   [junit4]   2> 933970 T3207 oascc.SolrZkClient.makePath makePath: /collections/control_collection
   [junit4]   2> 933978 T3207 oascc.SolrZkClient.makePath makePath: /collections/control_collection/shards
   [junit4]   2> 933986 T3207 oasc.AbstractZkTestCase.putConfig put C:\Users\JenkinsSlave\workspace\Lucene-Solr-trunk-Windows\solr\build\solr-core\test-files\solr\collection1\conf\solrconfig-tlog.xml to /configs/conf1/solrconfig.xml
   [junit4]   2> 933988 T3207 oascc.SolrZkClient.makePath makePath: /configs/conf1/solrconfig.xml
   [junit4]   2> 934000 T3207 oasc.AbstractZkTestCase.putConfig put C:\Users\JenkinsSlave\workspace\Lucene-Solr-trunk-Windows\solr\build\solr-core\test-files\solr\collection1\conf\schema.xml to /configs/conf1/schema.xml
   [junit4]   2> 934001 T3207 oascc.SolrZkClient.makePath makePath: /configs/conf1/schema.xml
   [junit4]   2> 934010 T3207 oasc.AbstractZkTestCase.putConfig put C:\Users\JenkinsSlave\workspace\Lucene-Solr-trunk-Windows\solr\build\solr-core\test-files\solr\collection1\conf\stopwords.txt to /configs/conf1/stopwords.txt
   [junit4]   2> 934011 T3207 oascc.SolrZkClient.makePath makePath: /configs/conf1/stopwords.txt
   [junit4]   2> 934019 T3207 oasc.AbstractZkTestCase.putConfig put C:\Users\JenkinsSlave\workspace\Lucene-Solr-trunk-Windows\solr\build\solr-core\test-files\solr\collection1\conf\protwords.txt to /configs/conf1/protwords.txt
   [junit4]   2> 934021 T3207 oascc.SolrZkClient.makePath makePath: /configs/conf1/protwords.txt
   [junit4]   2> 934028 T3207 oasc.AbstractZkTestCase.putConfig put C:\Users\JenkinsSlave\workspace\Lucene-Solr-trunk-Windows\solr\build\solr-core\test-files\solr\collection1\conf\currency.xml to /configs/conf1/currency.xml
   [junit4]   2> 934029 T3207 oascc.SolrZkClient.makePath makePath: /configs/conf1/currency.xml
   [junit4]   2> 934036 T3207 oasc.AbstractZkTestCase.putConfig put C:\Users\JenkinsSlave\workspace\Lucene-Solr-trunk-Windows\solr\build\solr-core\test-files\solr\collection1\conf\open-exchange-rates.json to /configs/conf1/open-exchange-rates.json
   [junit4]   2> 934037 T3207 oascc.SolrZkClient.makePath makePath: /configs/conf1/open-exchange-rates.json
   [junit4]   2> 934043 T3207 oasc.AbstractZkTestCase.putConfig put C:\Users\JenkinsSlave\workspace\Lucene-Solr-trunk-Windows\solr\build\solr-core\test-files\solr\collection1\conf\mapping-ISOLatin1Accent.txt to /configs/conf1/mapping-ISOLatin1Accent.txt
   [junit4]   2> 934044 T3207 oascc.SolrZkClient.makePath makePath: /configs/conf1/mapping-ISOLatin1Accent.txt
   [junit4]   2> 934049 T3207 oasc.AbstractZkTestCase.putConfig put C:\Users\JenkinsSlave\workspace\Lucene-Solr-trunk-Windows\solr\build\solr-core\test-files\solr\collection1\conf\old_synonyms.txt to /configs/conf1/old_synonyms.txt
   [junit4]   2> 934050 T3207 oascc.SolrZkClient.makePath makePath: /configs/conf1/old_synonyms.txt
   [junit4]   2> 934056 T3207 oasc.AbstractZkTestCase.putConfig put C:\Users\JenkinsSlave\workspace\Lucene-Solr-trunk-Windows\solr\build\solr-core\test-files\solr\collection1\conf\synonyms.txt to /configs/conf1/synonyms.txt
   [junit4]   2> 934056 T3207 oascc.SolrZkClient.makePath makePath: /configs/conf1/synonyms.txt
   [junit4]   2> 934065 T3209 oazs.NIOServerCnxn.doIO WARN caught end of stream exception EndOfStreamException: Unable to read additional data from client sessionid 0x1403b0900980001, likely client has closed socket
   [junit4]   2> 	at org.apache.zookeeper.server.NIOServerCnxn.doIO(NIOServerCnxn.java:220)
   [junit4]   2> 	at org.apache.zookeeper.server.NIOServerCnxnFactory.run(NIOServerCnxnFactory.java:208)
   [junit4]   2> 	at java.lang.Thread.run(Thread.java:724)
   [junit4]   2> 
   [junit4]   2> 934640 T3207 oejs.Server.doStart jetty-8.1.10.v20130312
   [junit4]   2> 934648 T3207 oejs.AbstractConnector.doStart Started SelectChannelConnector@127.0.0.1:57130
   [junit4]   2> 934648 T3207 oass.SolrDispatchFilter.init SolrDispatchFilter.init()
   [junit4]   2> 934648 T3207 oasc.SolrResourceLoader.locateSolrHome JNDI not configured for solr (NoInitialContextEx)
   [junit4]   2> 934651 T3207 oasc.SolrResourceLoader.locateSolrHome using system property solr.solr.home: C:\Users\JenkinsSlave\workspace\Lucene-Solr-trunk-Windows\solr\build\solr-core\test\J0\.\org.apache.solr.cloud.CollectionsAPIDistributedZkTest-controljetty-1375379980687
   [junit4]   2> 934651 T3207 oasc.SolrResourceLoader.<init> new SolrResourceLoader for directory: 'C:\Users\JenkinsSlave\workspace\Lucene-Solr-trunk-Windows\solr\build\solr-core\test\J0\.\org.apache.solr.cloud.CollectionsAPIDistributedZkTest-controljetty-1375379980687\'
   [junit4]   2> 934692 T3207 oasc.ConfigSolr.fromFile Loading container configuration from C:\Users\JenkinsSlave\workspace\Lucene-Solr-trunk-Windows\solr\build\solr-core\test\J0\.\org.apache.solr.cloud.CollectionsAPIDistributedZkTest-controljetty-1375379980687\solr.xml
   [junit4]   2> 934778 T3207 oasc.ConfigSolrXml.<init> Config-defined core root directory: 
   [junit4]   2> 934779 T3207 oasc.CoreContainer.<init> New CoreContainer 735540341
   [junit4]   2> 934780 T3207 oasc.CoreContainer.load Loading cores into CoreContainer [instanceDir=C:\Users\JenkinsSlave\workspace\Lucene-Solr-trunk-Windows\solr\build\solr-core\test\J0\.\org.apache.solr.cloud.CollectionsAPIDistributedZkTest-controljetty-1375379980687\]
   [junit4]   2> 934781 T3207 oashc.HttpShardHandlerFactory.getParameter Setting socketTimeout to: 120000
   [junit4]   2> 934782 T3207 oashc.HttpShardHandlerFactory.getParameter Setting urlScheme to: http://
   [junit4]   2> 934782 T3207 oashc.HttpShardHandlerFactory.getParameter Setting connTimeout to: 15000
   [junit4]   2> 934782 T3207 oashc.HttpShardHandlerFactory.getParameter Setting maxConnectionsPerHost to: 20
   [junit4]   2> 934783 T3207 oashc.HttpShardHandlerFactory.getParameter Setting corePoolSize to: 0
   [junit4]   2> 934783 T3207 oashc.HttpShardHandlerFactory.getParameter Setting maximumPoolSize to: 2147483647
   [junit4]   2> 934783 T3207 oashc.HttpShardHandlerFactory.getParameter Setting maxThreadIdleTime to: 5
   [junit4]   2> 934784 T3207 oashc.HttpShardHandlerFactory.getParameter Setting sizeOfQueue to: -1
   [junit4]   2> 934784 T3207 oashc.HttpShardHandlerFactory.getParameter Setting fairnessPolicy to: false
   [junit4]   2> 934784 T3207 oascsi.HttpClientUtil.createClient Creating new http client, config:maxConnectionsPerHost=20&maxConnections=10000&socketTimeout=120000&connTimeout=15000&retry=false
   [junit4]   2> 934794 T3207 oasc.ZkContainer.initZooKeeper Zookeeper client=127.0.0.1:57123/solr
   [junit4]   2> 934794 T3207 oasc.ZkController.checkChrootPath zkHost includes chroot
   [junit4]   2> 934796 T3207 oascc.ConnectionManager.waitForConnected Waiting for client to connect to ZooKeeper
   [junit4]   2> 934813 T3227 oascc.ConnectionManager.process Watcher org.apache.solr.common.cloud.ConnectionManager@2ca3d3c1 name:ZooKeeperConnection Watcher:127.0.0.1:57123 got event WatchedEvent state:SyncConnected type:None path:null path:null type:None
   [junit4]   2> 934814 T3207 oascc.ConnectionManager.waitForConnected Client is connected to ZooKeeper
   [junit4]   2> 934817 T3207 oascsi.HttpClientUtil.createClient Creating new http client, config:maxConnections=500&maxConnectionsPerHost=16&socketTimeout=120000&connTimeout=15000
   [junit4]   2> 934818 T3209 oazs.NIOServerCnxn.doIO WARN caught end of stream exception EndOfStreamException: Unable to read additional data from client sessionid 0x1403b0900980002, likely client has closed socket
   [junit4]   2> 	at org.apache.zookeeper.server.NIOServerCnxn.doIO(NIOServerCnxn.java:220)
   [junit4]   2> 	at org.apache.zookeeper.server.NIOServerCnxnFactory.run(NIOServerCnxnFactory.java:208)
   [junit4]   2> 	at java.lang.Thread.run(Thread.java:724)
   [junit4]   2> 
   [junit4]   2> 934825 T3207 oascc.ConnectionManager.waitForConnected Waiting for client to connect to ZooKeeper
   [junit4]   2> 934828 T3229 oascc.ConnectionManager.process Watcher org.apache.solr.common.cloud.ConnectionManager@4162d73b name:ZooKeeperConnection Watcher:127.0.0.1:57123/solr got event WatchedEvent state:SyncConnected type:None path:null path:null type:None
   [junit4]   2> 934830 T3207 oascc.ConnectionManager.waitForConnected Client is connected to ZooKeeper
   [junit4]   2> 934834 T3207 oascc.SolrZkClient.makePath makePath: /overseer/queue
   [junit4]   2> 934843 T3207 oascc.SolrZkClient.makePath makePath: /overseer/collection-queue-work
   [junit4]   2> 934851 T3207 oascc.SolrZkClient.makePath makePath: /live_nodes
   [junit4]   2> 934856 T3207 oasc.ZkController.createEphemeralLiveNode Register node as live in ZooKeeper:/live_nodes/127.0.0.1:57130__wz%2Fy
   [junit4]   2> 934858 T3207 oascc.SolrZkClient.makePath makePath: /live_nodes/127.0.0.1:57130__wz%2Fy
   [junit4]   2> 934864 T3207 oascc.SolrZkClient.makePath makePath: /overseer_elect/election
   [junit4]   2> 934878 T3207 oascc.SolrZkClient.makePath makePath: /overseer_elect/leader
   [junit4]   2> 934885 T3207 oasc.Overseer.start Overseer (id=90136902398115843-127.0.0.1:57130__wz%2Fy-n_0000000000) starting
   [junit4]   2> 934896 T3207 oascc.SolrZkClient.makePath makePath: /overseer/queue-work
   [junit4]   2> 934905 T3231 oasc.OverseerCollectionProcessor.run Process current queue of collection creations
   [junit4]   2> 934906 T3207 oascc.SolrZkClient.makePath makePath: /clusterstate.json
   [junit4]   2> 934913 T3207 oascc.SolrZkClient.makePath makePath: /aliases.json
   [junit4]   2> 934918 T3207 oascc.ZkStateReader.createClusterStateWatchersAndUpdate Updating cluster state from ZooKeeper... 
   [junit4]   2> 934924 T3230 oasc.Overseer$ClusterStateUpdater.run Starting to work on the main queue
   [junit4]   2> 934930 T3207 oasc.CorePropertiesLocator.discover Looking for core definitions underneath C:\Users\JenkinsSlave\workspace\Lucene-Solr-trunk-Windows\solr\build\solr-core\test\J0\.\org.apache.solr.cloud.CollectionsAPIDistributedZkTest-controljetty-1375379980687
   [junit4]   2> 935212 T3207 oasc.CorePropertiesLocator.discoverUnder Found core conf in C:\Users\JenkinsSlave\workspace\Lucene-Solr-trunk-Windows\solr\build\solr-core\test\J0\.\org.apache.solr.cloud.CollectionsAPIDistributedZkTest-controljetty-1375379980687\conf\
   [junit4]   2> 935226 T3207 oasc.CorePropertiesLocator.discover Found 1 core definitions
   [junit4]   2> 935229 T3207 oass.SolrDispatchFilter.init user.dir=C:\Users\JenkinsSlave\workspace\Lucene-Solr-trunk-Windows\solr\build\solr-core\test\J0
   [junit4]   2> 935229 T3207 oass.SolrDispatchFilter.init SolrDispatchFilter.init() done
   [junit4]   2> 935230 T3207 oascsi.HttpClientUtil.createClient Creating new http client, config:maxConnections=128&maxConnectionsPerHost=32&followRedirects=false
   [junit4]   2> 935238 T3207 oascsi.HttpClientUtil.createClient Creating new http client, config:
   [junit4]   2> 935240 T3207 oascc.ConnectionManager.waitForConnected Waiting for client to connect to ZooKeeper
   [junit4]   2> 935247 T3234 oascc.ConnectionManager.process Watcher org.apache.solr.common.cloud.ConnectionManager@13d030a5 name:ZooKeeperConnection Watcher:127.0.0.1:57123/solr got event WatchedEvent state:SyncConnected type:None path:null path:null type:None
   [junit4]   2> 935249 T3207 oascc.ConnectionManager.waitForConnected Client is connected to ZooKeeper
   [junit4]   2> 935252 T3207 oascc.ZkStateReader.createClusterStateWatchersAndUpdate Updating cluster state from ZooKeeper... 
   [junit4]   2> 935255 T3207 oasc.ChaosMonkey.monkeyLog monkey: init - expire sessions:true cause connection loss:true
   [junit4]   2> 935748 T3207 oejs.Server.doStart jetty-8.1.10.v20130312
   [junit4]   2> 935753 T3207 oejs.AbstractConnector.doStart Started SelectChannelConnector@127.0.0.1:57142
   [junit4]   2> 935755 T3207 oass.SolrDispatchFilter.init SolrDispatchFilter.init()
   [junit4]   2> 935755 T3207 oasc.SolrResourceLoader.locateSolrHome JNDI not configured for solr (NoInitialContextEx)
   [junit4]   2> 935755 T3207 oasc.SolrResourceLoader.locateSolrHome using system property solr.solr.home: C:\Users\JenkinsSlave\workspace\Lucene-Solr-trunk-Windows\solr\build\solr-core\test\J0\.\org.apache.solr.cloud.CollectionsAPIDistributedZkTest-jetty1-1375379981877
   [junit4]   2> 935757 T3207 oasc.SolrResourceLoader.<init> new SolrResourceLoader for directory: 'C:\Users\JenkinsSlave\workspace\Lucene-Solr-trunk-Windows\solr\build\solr-core\test\J0\.\org.apache.solr.cloud.CollectionsAPIDistributedZkTest-jetty1-1375379981877\'
   [junit4]   2> 935791 T3207 oasc.ConfigSolr.fromFile Loading container configuration from C:\Users\JenkinsSlave\workspace\Lucene-Solr-trunk-Windows\solr\build\solr-core\test\J0\.\org.apache.solr.cloud.CollectionsAPIDistributedZkTest-jetty1-1375379981877\solr.xml
   [junit4]   2> 935875 T3207 oasc.ConfigSolrXml.<init> Config-defined core root directory: 
   [junit4]   2> 935876 T3207 oasc.CoreContainer.<init> New CoreContainer 864142828
   [junit4]   2> 935877 T3207 oasc.CoreContainer.load Loading cores into CoreContainer [instanceDir=C:\Users\JenkinsSlave\workspace\Lucene-Solr-trunk-Windows\solr\build\solr-core\test\J0\.\org.apache.solr.cloud.CollectionsAPIDistributedZkTest-jetty1-1375379981877\]
   [junit4]   2> 935880 T3207 oashc.HttpShardHandlerFactory.getParameter Setting socketTimeout to: 120000
   [junit4]   2> 935880 T3207 oashc.HttpShardHandlerFactory.getParameter Setting urlScheme to: http://
   [junit4]   2> 935880 T3207 oashc.HttpShardHandlerFactory.getParameter Setting connTimeout to: 15000
   [junit4]   2> 935880 T3207 oashc.HttpShardHandlerFactory.getParameter Setting maxConnectionsPerHost to: 20
   [junit4]   2> 935881 T3207 oashc.HttpShardHandlerFactory.getParameter Setting corePoolSize to: 0
   [junit4]   2> 935881 T3207 oashc.HttpShardHandlerFactory.getParameter Setting maximumPoolSize to: 2147483647
   [junit4]   2> 935882 T3207 oashc.HttpShardHandlerFactory.getParameter Setting maxThreadIdleTime to: 5
   [junit4]   2> 935882 T3207 oashc.HttpShardHandlerFactory.getParameter Setting sizeOfQueue to: -1
   [junit4]   2> 935883 T3207 oashc.HttpShardHandlerFactory.getParameter Setting fairnessPolicy to: false
   [junit4]   2> 935883 T3207 oascsi.HttpClientUtil.createClient Creating new http client, config:maxConnectionsPerHost=20&maxConnections=10000&socketTimeout=120000&connTimeout=15000&retry=false
   [junit4]   2> 935893 T3207 oasc.ZkContainer.initZooKeeper Zookeeper client=127.0.0.1:57123/solr
   [junit4]   2> 935894 T3207 oasc.ZkController.checkChrootPath zkHost includes chroot
   [junit4]   2> 935896 T3207 oascc.ConnectionManager.waitForConnected Waiting for client to connect to ZooKeeper
   [junit4]   2> 935910 T3245 oascc.ConnectionManager.process Watcher org.apache.solr.common.cloud.ConnectionManager@7c9a9293 name:ZooKeeperConnection Watcher:127.0.0.1:57123 got event WatchedEvent state:SyncConnected type:None path:null path:null type:None
   [junit4]   2> 935911 T3207 oascc.ConnectionManager.waitForConnected Client is connected to ZooKeeper
   [junit4]   2> 935914 T3207 oascsi.HttpClientUtil.createClient Creating new http client, config:maxConnections=500&maxConnectionsPerHost=16&socketTimeout=120000&connTimeout=15000
   [junit4]   2> 935921 T3207 oascc.ConnectionManager.waitForConnected Waiting for client to connect to ZooKeeper
   [junit4]   2> 935951 T3247 oascc.ConnectionManager.process Watcher org.apache.solr.common.cloud.ConnectionManager@7c81a23 name:ZooKeeperConnection Watcher:127.0.0.1:57123/solr got event WatchedEvent state:SyncConnected type:None path:null path:null type:None
   [junit4]   2> 935951 T3207 oascc.ConnectionManager.waitForConnected Client is connected to ZooKeeper
   [junit4]   2> 936021 T3207 oascc.ZkStateReader.createClusterStateWatchersAndUpdate Updating cluster state from ZooKeeper... 
   [junit4]   2> 937110 T3207 oasc.ZkController.createEphemeralLiveNode Register node as live in ZooKeeper:/live_nodes/127.0.0.1:57142__wz%2Fy
   [junit4]   2> 937131 T3207 oascc.SolrZkClient.makePath makePath: /live_nodes/127.0.0.1:57142__wz%2Fy
   [junit4]   2> 937151 T3229 oascc.ZkStateReader$3.process Updating live nodes... (2)
   [junit4]   2> 937152 T3247 oascc.ZkStateReader$3.process Updating live nodes... (2)
   [junit4]   2> 937152 T3234 oascc.ZkStateReader$3.process Updating live nodes... (2)
   [junit4]   2> 937164 T3207 oasc.CorePropertiesLocator.discover Looking for core definitions underneath C:\Users\JenkinsSlave\workspace\Lucene-Solr-trunk-Windows\solr\build\solr-core\test\J0\.\org.apache.solr.cloud.CollectionsAPIDistributedZkTest-jetty1-1375379981877
   [junit4]   2> 937462 T3207 oasc.CorePropertiesLocator.discoverUnder Found core conf in C:\Users\JenkinsSlave\workspace\Lucene-Solr-trunk-Windows\solr\build\solr-core\test\J0\.\org.apache.solr.cloud.CollectionsAPIDistributedZkTest-jetty1-1375379981877\conf\
   [junit4]   2> 937475 T3207 oasc.CorePropertiesLocator.discover Found 1 core definitions
   [junit4]   2> 937477 T3207 oass.SolrDispatchFilter.init user.dir=C:\Users\JenkinsSlave\workspace\Lucene-Solr-trunk-Windows\solr\build\solr-core\test\J0
   [junit4]   2> 937477 T3207 oass.SolrDispatchFilter.init SolrDispatchFilter.init() done
   [junit4]   2> 937477 T3207 oascsi.HttpClientUtil.createClient Creating new http client, config:maxConnections=128&maxConnectionsPerHost=32&followRedirects=false
   [junit4]   2> 937981 T3207 oejs.Server.doStart jetty-8.1.10.v20130312
   [junit4]   2> 937986 T3207 oejs.AbstractConnector.doStart Started SelectChannelConnector@127.0.0.1:57151
   [junit4]   2> 937988 T3207 oass.SolrDispatchFilter.init SolrDispatchFilter.init()
   [junit4]   2> 937989 T3207 oasc.SolrResourceLoader.locateSolrHome JNDI not configured for solr (NoInitialContextEx)
   [junit4]   2> 937989 T3207 oasc.SolrResourceLoader.locateSolrHome using system property solr.solr.home: C:\Users\JenkinsSlave\workspace\Lucene-Solr-trunk-Windows\solr\build\solr-core\test\J0\.\org.apache.solr.cloud.CollectionsAPIDistributedZkTest-jetty2-1375379984109
   [junit4]   2> 937990 T3207 oasc.SolrResourceLoader.<init> new SolrResourceLoader for directory: 'C:\Users\JenkinsSlave\workspace\Lucene-Solr-trunk-Windows\solr\build\solr-core\test\J0\.\org.apache.solr.cloud.CollectionsAPIDistributedZkTest-jetty2-1375379984109\'
   [junit4]   2> 938030 T3207 oasc.ConfigSolr.fromFile Loading container configuration from C:\Users\JenkinsSlave\workspace\Lucene-Solr-trunk-Windows\solr\build\solr-core\test\J0\.\org.apache.solr.cloud.CollectionsAPIDistributedZkTest-jetty2-1375379984109\solr.xml
   [junit4]   2> 938197 T3207 oasc.ConfigSolrXml.<init> Config-defined core root directory: 
   [junit4]   2> 938198 T3207 oasc.CoreContainer.<init> New CoreContainer 312340014
   [junit4]   2> 938198 T3207 oasc.CoreContainer.load Loading cores into CoreContainer [instanceDir=C:\Users\JenkinsSlave\workspace\Lucene-Solr-trunk-Windows\solr\build\solr-core\test\J0\.\org.apache.solr.cloud.CollectionsAPIDistributedZkTest-jetty2-1375379984109\]
   [junit4]   2> 938204 T3207 oashc.HttpShardHandlerFactory.getParameter Setting socketTimeout to: 120000
   [junit4]   2> 938205 T3207 oashc.HttpShardHandlerFactory.getParameter Setting urlScheme to: http://
   [junit4]   2> 938205 T3207 oashc.HttpShardHandlerFactory.getParameter Setting connTimeout to: 15000
   [junit4]   2> 938205 T3207 oashc.HttpShardHandlerFactory.getParameter Setting maxConnectionsPerHost to: 20
   [junit4]   2> 938206 T3207 oashc.HttpShardHandlerFactory.getParameter Setting corePoolSize to: 0
   [junit4]   2> 938206 T3207 oashc.HttpShardHandlerFactory.getParameter Setting maximumPoolSize to: 2147483647
   [junit4]   2> 938207 T3207 oashc.HttpShardHandlerFactory.getParameter Setting maxThreadIdleTime to: 5
   [junit4]   2> 938208 T3207 oashc.HttpShardHandlerFactory.getParameter Setting sizeOfQueue to: -1
   [junit4]   2> 938209 T3207 oashc.HttpShardHandlerFactory.getParameter Setting fairnessPolicy to: false
   [junit4]   2> 938209 T3207 oascsi.HttpClientUtil.createClient Creating new http client, config:maxConnectionsPerHost=20&maxConnections=10000&socketTimeout=120000&connTimeout=15000&retry=false
   [junit4]   2> 938225 T3207 oasc.ZkContainer.initZooKeeper Zookeeper client=127.0.0.1:57123/solr
   [junit4]   2> 938226 T3207 oasc.ZkController.checkChrootPath zkHost includes chroot
   [junit4]   2> 938230 T3207 oascc.ConnectionManager.waitForConnected Waiting for client to connect to ZooKeeper
   [junit4]   2> 938248 T3259 oascc.ConnectionManager.process Watcher org.apache.solr.common.cloud.ConnectionManager@74d8f68e name:ZooKeeperConnection Watcher:127.0.0.1:57123 got event WatchedEvent state:SyncConnected type:None path:null path:null type:None
   [junit4]   2> 938249 T3207 oascc.ConnectionManager.waitForConnected Client is connected to ZooKeeper
   [junit4]   2> 938254 T3207 oascsi.HttpClientUtil.createClient Creating new http client, config:maxConnections=500&maxConnectionsPerHost=16&socketTimeout=120000&connTimeout=15000
   [junit4]   2> 938263 T3207 oascc.ConnectionManager.waitForConnected Waiting for client to connect to ZooKeeper
   [junit4]   2> 938268 T3261 oascc.ConnectionManager.process Watcher org.apache.solr.common.cloud.ConnectionManager@4b632f71 name:ZooKeeperConnection Watcher:127.0.0.1:57123/solr got event WatchedEvent state:SyncConnected type:None path:null path:null type:None
   [junit4]   2> 938268 T3207 oascc.ConnectionManager.waitForConnected Client is connected to ZooKeeper
   [junit4]   2> 938280 T3207 oascc.ZkStateReader.createClusterStateWatchersAndUpdate Updating cluster state from ZooKeeper... 
   [junit4]   2> 939364 T3207 oasc.ZkController.createEphemeralLiveNode Register node as live in ZooKeeper:/live_nodes/127.0.0.1:57151__wz%2Fy
   [junit4]   2> 939367 T3207 oascc.SolrZkClient.makePath makePath: /live_nodes/127.0.0.1:57151__wz%2Fy
   [junit4]   2> 939372 T3229 oascc.ZkStateReader$3.process Updating live nodes... (3)
   [junit4]   2> 939373 T3247 oascc.ZkStateReader$3.process Updating live nodes... (3)
   [junit4]   2> 939373 T3261 oascc.ZkStateReader$3.process Updating live nodes... (3)
   [junit4]   2> 939375 T3234 oascc.ZkStateReader$3.process Updating live nodes... (3)
   [junit4]   2> 939385 T3207 oasc.CorePropertiesLocator.discover Looking for core definitions underneath C:\Users\JenkinsSlave\workspace\Lucene-Solr-trunk-Windows\solr\build\solr-core\test\J0\.\org.apache.solr.cloud.CollectionsAPIDistributedZkTest-jetty2-1375379984109
   [junit4]   2> 939664 T3207 oasc.CorePropertiesLocator.discoverUnder Found core conf in C:\Users\JenkinsSlave\workspace\Lucene-Solr-trunk-Windows\solr\build\solr-core\test\J0\.\org.apache.solr.cloud.CollectionsAPIDistributedZkTest-jetty2-1375379984109\conf\
   [junit4]   2> 939678 T3207 oasc.CorePropertiesLocator.discover Found 1 core definitions
   [junit4]   2> 939679 T3207 oass.SolrDispatchFilter.init user.dir=C:\Users\JenkinsSlave\workspace\Lucene-Solr-trunk-Windows\solr\build\solr-core\test\J0
   [junit4]   2> 939680 T3207 oass.SolrDispatchFilter.init SolrDispatchFilter.init() done
   [junit4]   2> 939680 T3207 oascsi.HttpClientUtil.createClient Creating new http client, config:maxConnections=128&maxConnectionsPerHost=32&followRedirects=false
   [junit4]   2> 940129 T3207 oejs.Server.doStart jetty-8.1.10.v20130312
   [junit4]   2> 940136 T3207 oejs.AbstractConnector.doStart Started SelectChannelConnector@127.0.0.1:57160
   [junit4]   2> 940137 T3207 oass.SolrDispatchFilter.init SolrDispatchFilter.init()
   [junit4]   2> 940138 T3207 oasc.SolrResourceLoader.locateSolrHome JNDI not configured for solr (NoInitialContextEx)
   [junit4]   2> 940138 T3207 oasc.SolrResourceLoader.locateSolrHome using system property solr.solr.home: C:\Users\JenkinsSlave\workspace\Lucene-Solr-trunk-Windows\solr\build\solr-core\test\J0\.\org.apache.solr.cloud.CollectionsAPIDistributedZkTest-jetty3-1375379986310
   [junit4]   2> 940139 T3207 oasc.SolrResourceLoader.<init> new SolrResourceLoader for directory: 'C:\Users\JenkinsSlave\workspace\Lucene-Solr-trunk-Windows\solr\build\solr-core\test\J0\.\org.apache.solr.cloud.CollectionsAPIDistributedZkTest-jetty3-1375379986310\'
   [junit4]   2> 940174 T3207 oasc.ConfigSolr.fromFile Loading container configuration from C:\Users\JenkinsSlave\workspace\Lucene-Solr-trunk-Windows\solr\build\solr-core\test\J0\.\org.apache.solr.cloud.CollectionsAPIDistributedZkTest-jetty3-1375379986310\solr.xml
   [junit4]   2> 940258 T3207 oasc.ConfigSolrXml.<init> Config-defined core root directory: 
   [junit4]   2> 940259 T3207 oasc.CoreContainer.<init> New CoreContainer 1003907691
   [junit4]   2> 940259 T3207 oasc.CoreContainer.load Loading cores into CoreContainer [instanceDir=C:\Users\JenkinsSlave\workspace\Lucene-Solr-trunk-Windows\solr\build\solr-core\test\J0\.\org.apache.solr.cloud.CollectionsAPIDistributedZkTest-jetty3-1375379986310\]
   [junit4]   2> 940261 T3207 oashc.HttpShardHandlerFactory.getParameter Setting socketTimeout to: 120000
   [junit4]   2> 940262 T3207 oashc.HttpShardHandlerFactory.getParameter Setting urlScheme to: http://
   [junit4]   2> 940262 T3207 oashc.HttpShardHandlerFactory.getParameter Setting connTimeout to: 15000
   [junit4]   2> 940263 T3207 oashc.HttpShardHandlerFactory.getParameter Setting maxConnectionsPerHost to: 20
   [junit4]   2> 940263 T3207 oashc.HttpShardHandlerFactory.getParameter Setting corePoolSize to: 0
   [junit4]   2> 940263 T3207 oashc.HttpShardHandlerFactory.getParameter Setting maximumPoolSize to: 2147483647
   [junit4]   2> 940264 T3207 oashc.HttpShardHandlerFactory.getParameter Setting maxThreadIdleTime to: 5
   [junit4]   2> 940264 T3207 oashc.HttpShardHandlerFactory.getParameter Setting sizeOfQueue to: -1
   [junit4]   2> 940264 T3207 oashc.HttpShardHandlerFactory.getParameter Setting fairnessPolicy to: false
   [junit4]   2> 940265 T3207 oascsi.HttpClientUtil.createClient Creating new http client, config:maxConnectionsPerHost=20&maxConnections=10000&socketTimeout=120000&connTimeout=15000&retry=false
   [junit4]   2> 940274 T3207 oasc.ZkContainer.initZooKeeper Zookeeper client=127.0.0.1:57123/solr
   [junit4]   2> 940275 T3207 oasc.ZkController.checkChrootPath zkHost includes chroot
   [junit4]   2> 940277 T3207 oascc.ConnectionManager.waitForConnected Waiting for client to connect to ZooKeeper
   [junit4]   2> 940298 T3273 oascc.ConnectionManager.process Watcher org.apache.solr.common.cloud.ConnectionManager@27f3c5dd name:ZooKeeperConnection Watcher:127.0.0.1:57123 got event WatchedEvent state:SyncConnected type:None path:null path:null type:None
   [junit4]   2> 940299 T3207 oascc.ConnectionManager.waitForConnected Client is connected to ZooKeeper
   [junit4]   2> 940303 T3207 oascsi.HttpClientUtil.createClient Creating new http client, config:maxConnections=500&maxConnectionsPerHost=16&socketTimeout=120000&connTimeout=15000
   [junit4]   2> 940312 T3207 oascc.ConnectionManager.waitForConnected Waiting for client to connect to ZooKeeper
   [junit4]   2> 940316 T3275 oascc.ConnectionManager.process Watcher org.apache.solr.common.cloud.ConnectionManager@1b5ab9f name:ZooKeeperConnection Watcher:127.0.0.1:57123/solr got event WatchedEvent state:SyncConnected type:None path:null path:null type:None
   [junit4]   2> 940317 T3207 oascc.ConnectionManager.waitForConnected Client is connected to ZooKeeper
   [junit4]   2> 940327 T3207 oascc.ZkStateReader.createClusterStateWatchersAndUpdate Updating cluster state from ZooKeeper... 
   [junit4]   2> 941412 T3207 oasc.ZkController.createEphemeralLiveNode Register node as live in ZooKeeper:/live_nodes/127.0.0.1:57160__wz%2Fy
   [junit4]   2> 941415 T3207 oascc.SolrZkClient.makePath makePath: /live_nodes/127.0.0.1:57160__wz%2Fy
   [junit4]   2> 941422 T3234 oascc.ZkStateReader$3.process Updating live nodes... (4)
   [junit4]   2> 941423 T3261 oascc.ZkStateReader$3.process Updating live nodes... (4)
   [junit4]   2> 941423 T3229 oascc.ZkStateReader$3.process Updating live nodes... (4)
   [junit4]   2> 941424 T3275 oascc.ZkStateReader$3.process Updating live nodes... (4)
   [junit4]   2> 941424 T3247 oascc.ZkStateReader$3.process Updating live nodes... (4)
   [junit4]   2> 941433 T3207 oasc.CorePropertiesLocator.discover Looking for core definitions underneath C:\Users\JenkinsSlave\workspace\Lucene-Solr-trunk-Windows\solr\build\solr-core\test\J0\.\org.apache.solr.cloud.CollectionsAPIDistributedZkTest-jetty3-1375379986310
   [junit4]   2> 941683 T3207 oasc.CorePropertiesLocator.discoverUnder Found core conf in C:\Users\JenkinsSlave\workspace\Lucene-Solr-trunk-Windows\solr\build\solr-core\test\J0\.\org.apache.solr.cloud.CollectionsAPIDistributedZkTest-jetty3-1375379986310\conf\
   [junit4]   2> 941697 T3207 oasc.CorePropertiesLocator.discover Found 1 core definitions
   [junit4]   2> 941699 T3207 oass.SolrDispatchFilter.init user.dir=C:\Users\JenkinsSlave\workspace\Lucene-Solr-trunk-Windows\solr\build\solr-core\test\J0
   [junit4]   2> 941699 T3207 oass.SolrDispatchFilter.init SolrDispatchFilter.init() done
   [junit4]   2> 941699 T3207 oascsi.HttpClientUtil.createClient Creating new http client, config:maxConnections=128&maxConnectionsPerHost=32&followRedirects=false
   [junit4]   2> 942177 T3207 oejs.Server.doStart jetty-8.1.10.v20130312
   [junit4]   2> 942182 T3207 oejs.AbstractConnector.doStart Started SelectChannelConnector@127.0.0.1:57169
   [junit4]   2> 942184 T3207 oass.SolrDispatchFilter.init SolrDispatchFilter.init()
   [junit4]   2> 942185 T3207 oasc.SolrResourceLoader.locateSolrHome JNDI not configured for solr (NoInitialContextEx)
   [junit4]   2> 942185 T3207 oasc.SolrResourceLoader.locateSolrHome using system property solr.solr.home: C:\Users\JenkinsSlave\workspace\Lucene-Solr-trunk-Windows\solr\build\solr-core\test\J0\.\org.apache.solr.cloud.CollectionsAPIDistributedZkTest-jetty4-1375379988331
   [junit4]   2> 942186 T3207 oasc.SolrResourceLoader.<init> new SolrResourceLoader for directory: 'C:\Users\JenkinsSlave\workspace\Lucene-Solr-trunk-Windows\solr\build\solr-core\test\J0\.\org.apache.solr.cloud.CollectionsAPIDistributedZkTest-jetty4-1375379988331\'
   [junit4]   2> 942235 T3207 oasc.ConfigSolr.fromFile Loading container configuration from C:\Users\JenkinsSlave\workspace\Lucene-Solr-trunk-Windows\solr\build\solr-core\test\J0\.\org.apache.solr.cloud.CollectionsAPIDistributedZkTest-jetty4-1375379988331\solr.xml
   [junit4]   2> 942351 T3207 oasc.ConfigSolrXml.<init> Config-defined core root directory: 
   [junit4]   2> 942352 T3207 oasc.CoreContainer.<init> New CoreContainer 377546357
   [junit4]   2> 942352 T3207 oasc.CoreContainer.load Loading cores into CoreContainer [instanceDir=C:\Users\JenkinsSlave\workspace\Lucene-Solr-trunk-Windows\solr\build\solr-core\test\J0\.\org.apache.solr.cloud.CollectionsAPIDistributedZkTest-jetty4-1375379988331\]
   [junit4]   2> 942355 T3207 oashc.HttpShardHandlerFactory.getParameter Setting socketTimeout to: 120000
   [junit4]   2> 942356 T3207 oashc.HttpShardHandlerFactory.getParameter Setting urlScheme to: http://
   [junit4]   2> 942356 T3207 oashc.HttpShardHandlerFactory.getParameter Setting connTimeout to: 15000
   [junit4]   2> 942357 T3207 oashc.HttpShardHandlerFactory.getParameter Setting maxConnectionsPerHost to: 20
   [junit4]   2> 942357 T3207 oashc.HttpShardHandlerFactory.getParameter Setting corePoolSize to: 0
   [junit4]   2> 942358 T3207 oashc.HttpShardHandlerFactory.getParameter Setting maximumPoolSize to: 2147483647
   [junit4]   2> 942358 T3207 oashc.HttpShardHandlerFactory.getParameter Setting maxThreadIdleTime to: 5
   [junit4]   2> 942358 T3207 oashc.HttpShardHandlerFactory.getParameter Setting sizeOfQueue to: -1
   [junit4]   2> 942359 T3207 oashc.HttpShardHandlerFactory.getParameter Setting fairnessPolicy to: false
   [junit4]   2> 942359 T3207 oascsi.HttpClientUtil.createClient Creating new http client, config:maxConnectionsPerHost=20&maxConnections=10000&socketTimeout=120000&connTimeout=15000&retry=false
   [junit4]   2> 942371 T3207 oasc.ZkContainer.initZooKeeper Zookeeper client=127.0.0.1:57123/solr
   [junit4]   2> 942372 T3207 oasc.ZkController.checkChrootPath zkHost includes chroot
   [junit4]   2> 942374 T3207 oascc.ConnectionManager.waitForConnected Waiting for client to connect to ZooKeeper
   [junit4]   2> 942396 T3287 oascc.ConnectionManager.process Watcher org.apache.solr.common.cloud.ConnectionManager@5cbdecb1 name:ZooKeeperConnection Watcher:127.0.0.1:57123 got event WatchedEvent state:SyncConnected type:None path:null path:null type:None
   [junit4]   2> 942396 T3207 oascc.ConnectionManager.waitForConnected Client is connected to ZooKeeper
   [junit4]   2> 942402 T3207 oascsi.HttpClientUtil.createClient Creating new http client, config:maxConnections=500&maxConnectionsPerHost=16&socketTimeout=120000&connTimeout=15000
   [junit4]   2> 942410 T3207 oascc.ConnectionManager.waitForConnected Waiting for client to connect to ZooKeeper
   [junit4]   2> 942415 T3289 oascc.ConnectionManager.process Watcher org.apache.solr.common.cloud.ConnectionManager@25df9a3d name:ZooKeeperConnection Watcher:127.0.0.1:57123/solr got event WatchedEvent state:SyncConnected type:None path:null path:null type:None
   [junit4]   2> 942415 T3207 oascc.ConnectionManager.waitForConnected Client is connected to ZooKeeper
   [junit4]   2> 942425 T3207 oascc.ZkStateReader.createClusterStateWatchersAndUpdate Updating cluster state from ZooKeeper... 
   [junit4]   2> 943594 T3207 oasc.ZkController.createEphemeralLiveNode Register node as live in ZooKeeper:/live_nodes/127.0.0.1:57169__wz%2Fy
   [junit4]   2> 943607 T3207 oascc.SolrZkClient.makePath makePath: /live_nodes/127.0.0.1:57169__wz%2Fy
   [junit4]   2> 943619 T3275 oascc.ZkStateReader$3.process Updating live nodes... (5)
   [junit4]   2> 943620 T3289 oascc.ZkStateReader$3.process Updating live nodes... (5)
   [junit4]   2> 943620 T3229 oascc.ZkStateReader$3.process Updating live nodes... (5)
   [junit4]   2> 943622 T3247 oascc.ZkStateReader$3.process Updating live nodes... (5)
   [junit4]   2> 943622 T3261 oascc.ZkStateReader$3.process Updating live nodes... (5)
   [junit4]   2> 943622 T3234 oascc.ZkStateReader$3.process Updating live nodes... (5)
   [junit4]   2> 943638 T3207 oasc.CorePropertiesLocator.discover Looking for core definitions underneath C:\Users\JenkinsSlave\workspace\Lucene-Solr-trunk-Windows\solr\build\solr-core\test\J0\.\org.apache.solr.cloud.CollectionsAPIDistributedZkTest-jetty4-1375379988331
   [junit4]   2> 944022 T3207 oasc.CorePropertiesLocator.discoverUnder Found core conf in C:\Users\JenkinsSlave\workspace\Lucene-Solr-trunk-Windows\solr\build\solr-core\test\J0\.\org.apache.solr.cloud.CollectionsAPIDistributedZkTest-jetty4-1375379988331\conf\
   [junit4]   2> 944044 T3207 oasc.CorePropertiesLocator.discover Found 1 core definitions
   [junit4]   2> 944047 T3207 oass.SolrDispatchFilter.init user.dir=C:\Users\JenkinsSlave\workspace\Lucene-Solr-trunk-Windows\solr\build\solr-core\test\J0
   [junit4]   2> 944047 T3207 oass.SolrDispatchFilter.init SolrDispatchFilter.init() done
   [junit4]   2> 944048 T3207 oascsi.HttpClientUtil.createClient Creating new http client, config:maxConnections=128&maxConnectionsPerHost=32&followRedirects=false
   [junit4]   2> 944074 T3207 oascsi.HttpClientUtil.createClient Creating new http client, config:maxConnections=128&maxConnectionsPerHost=32&followRedirects=false
   [junit4]   2> 944104 T3239 oasha.CollectionsHandler.handleCreateAction Creating Collection : numShards=2&name=nodes_used_collection&replicationFactor=2&action=CREATE&wt=javabin&version=2
   [junit4]   2> 944109 T3229 oasc.DistributedQueue$LatchChildWatcher.process Watcher fired on path: /overseer/collection-queue-work state: SyncConnected type NodeChildrenChanged
   [junit4]   2> 944116 T3231 oasc.OverseerCollectionProcessor.run Overseer Collection Processor: Get the message id:/overseer/collection-queue-work/qn-0000000000 message:{
   [junit4]   2> 	  "operation":"createcollection",
   [junit4]   2> 	  "numShards":"2",
   [junit4]   2> 	  "name":"nodes_used_collection",
   [junit4]   2> 	  "replicationFactor":"2"}
   [junit4]   2> 944116 T3231 oasc.OverseerCollectionProcessor.processMessage WARN OverseerCollectionProcessor.processMessage : createcollection , {
   [junit4]   2> 	  "operation":"createcollection",
   [junit4]   2> 	  "numShards":"2",
   [junit4]   2> 	  "name":"nodes_used_collection",
   [junit4]   2> 	  "replicationFactor":"2"}
   [junit4]   2> 944857 T3230 oascc.ZkStateReader.updateClusterState Updating cloud state from ZooKeeper... 
   [junit4]   2> 944858 T3230 oasc.Overseer$ClusterStateUpdater.buildCollection building a new collection: nodes_used_collection
   [junit4]   2> 944858 T3230 oasc.Overseer$ClusterStateUpdater.createCollection Create collection nodes_used_collection with shards [shard1, shard2]
   [junit4]   2> 944958 T3275 oascc.ZkStateReader$2.process A cluster state change: WatchedEvent state:SyncConnected type:NodeDataChanged path:/clusterstate.json, has occurred - updating... (live nodes size: 5)
   [junit4]   2> 944959 T3289 oascc.ZkStateReader$2.process A cluster state change: WatchedEvent state:SyncConnected type:NodeDataChanged path:/clusterstate.json, has occurred - updating... (live nodes size: 5)
   [junit4]   2> 944959 T3229 oascc.ZkStateReader$2.process A cluster state change: WatchedEvent state:SyncConnected type:NodeDataChanged path:/clusterstate.json, has occurred - updating... (live nodes size: 5)
   [junit4]   2> 944959 T3234 oascc.ZkStateReader$2.process A cluster state change: WatchedEvent state:SyncConnected type:NodeDataChanged path:/clusterstate.json, has occurred - updating... (live nodes size: 5)
   [junit4]   2> 944959 T3247 oascc.ZkStateReader$2.process A cluster state change: WatchedEvent state:SyncConnected type:NodeDataChanged path:/clusterstate.json, has occurred - updating... (live nodes size: 5)
   [junit4]   2> 944959 T3261 oascc.ZkStateReader$2.process A cluster state change: WatchedEvent state:SyncConnected type:NodeDataChanged path:/clusterstate.json, has occurred - updating... (live nodes size: 5)
   [junit4]   2> 945083 T3231 oasc.OverseerCollectionProcessor.createCollection going to create cores replicas shardNames [shard1, shard2] , repFactor : 2
   [junit4]   2> 945083 T3231 oasc.OverseerCollectionProcessor.createCollection Creating shard nodes_used_collection_shard1_replica1 as part of slice shard1 of collection nodes_used_collection on 127.0.0.1:57130__wz%2Fy
   [junit4]   2> 945085 T3231 oasc.OverseerCollectionProcessor.createCollection Creating shard nodes_used_collection_shard1_replica2 as part of slice shard1 of collection nodes_used_collection on 127.0.0.1:57151__wz%2Fy
   [junit4]   2> 945085 T3231 oasc.OverseerCollectionProcessor.createCollection Creating shard nodes_used_collection_shard2_replica1 as part of slice shard2 of collection nodes_used_collection on 127.0.0.1:57169__wz%2Fy
   [junit4]   2> 945089 T3231 oasc.OverseerCollectionProcessor.createCollection Creating shard nodes_used_collection_shard2_replica2 as part of slice shard2 of collection nodes_used_collection on 127.0.0.1:57142__wz%2Fy
   [junit4]   2> 945097 T3255 oasc.ZkController.publish publishing core=nodes_used_collection_shard1_replica2 state=down
   [junit4]   2> 945098 T3225 oasc.ZkController.publish publishing core=nodes_used_collection_shard1_replica1 state=down
   [junit4]   2> 945099 T3280 oasc.ZkController.publish publishing core=nodes_used_collection_shard2_replica1 state=down
   [junit4]   2> 945106 T3242 oasc.ZkController.publish publishing core=nodes_used_collection_shard2_replica2 state=down
   [junit4]   2> 945111 T3255 oasc.ZkController.waitForCoreNodeName look for our core node name
   [junit4]   2> 945112 T3225 oasc.ZkController.waitForCoreNodeName look for our core node name
   [junit4]   2> 945113 T3280 oasc.ZkController.waitForCoreNodeName look for our core node name
   [junit4]   2> 945114 T3242 oasc.ZkController.waitForCoreNodeName look for our core node name
   [junit4]   2> 946775 T3230 oascc.ZkStateReader.updateClusterState Updating cloud state from ZooKeeper... 
   [junit4]   2> 946777 T3230 oasc.Overseer$ClusterStateUpdater.updateState WARN Could not find collection node for nodes_used_collection, skipping publish state
   [junit4]   2> 946777 T3230 oasc.Overseer$ClusterStateUpdater.updateState Update state numShards=2 message={
   [junit4]   2> 	  "operation":"state",
   [junit4]   2> 	  "core_node_name":"core_node1",
   [junit4]   2> 	  "numShards":"2",
   [junit4]   2> 	  "shard":"shard1",
   [junit4]   2> 	  "roles":null,
   [junit4]   2> 	  "state":"down",
   [junit4]   2> 	  "shard_state":"active",
   [junit4]   2> 	  "core":"nodes_used_collection_shard1_replica2",
   [junit4]   2> 	  "collection":"nodes_used_collection",
   [junit4]   2> 	  "shard_range":null,
   [junit4]   2> 	  "node_name":"127.0.0.1:57151__wz%2Fy",
   [junit4]   2> 	  "base_url":"http://127.0.0.1:57151/_wz/y"}
   [junit4]   2> 946798 T3230 oasc.Overseer$ClusterStateUpdater.updateState WARN Could not find collection node for nodes_used_collection, skipping publish state
   [junit4]   2> 946798 T3230 oasc.Overseer$ClusterStateUpdater.updateState Update state numShards=2 message={
   [junit4]   2> 	  "operation":"state",
   [junit4]   2> 	  "core_node_name":"core_node2",
   [junit4]   2> 	  "numShards":"2",
   [junit4]   2> 	  "shard":"shard1",
   [junit4]   2> 	  "roles":null,
   [junit4]   2> 	  "state":"down",
   [junit4]   2> 	  "shard_state":"active",
   [junit4]   2> 	  "core":"nodes_used_collection_shard1_replica1",
   [junit4]   2> 	  "collection":"nodes_used_collection",
   [junit4]   2> 	  "shard_range":null,
   [junit4]   2> 	  "node_name":"127.0.0.1:57130__wz%2Fy",
   [junit4]   2> 	  "base_url":"http://127.0.0.1:57130/_wz/y"}
   [junit4]   2> 946811 T3230 oasc.Overseer$ClusterStateUpdater.updateState WARN Could not find collection node for nodes_used_collection, skipping publish state
   [junit4]   2> 946811 T3230 oasc.Overseer$ClusterStateUpdater.updateState Update state numShards=2 message={
   [junit4]   2> 	  "operation":"state",
   [junit4]   2> 	  "core_node_name":"core_node3",
   [junit4]   2> 	  "numShards":"2",
   [junit4]   2> 	  "shard":"shard2",
   [junit4]   2> 	  "roles":null,
   [junit4]   2> 	  "state":"down",
   [junit4]   2> 	  "shard_state":"active",
   [junit4]   2> 	  "core":"nodes_used_collection_shard2_replica1",
   [junit4]   2> 	  "collection":"nodes_used_collection",
   [junit4]   2> 	  "shard_range":null,
   [junit4]   2> 	  "node_name":"127.0.0.1:57169__wz%2Fy",
   [junit4]   2> 	  "base_url":"http://127.0.0.1:57169/_wz/y"}
   [junit4]   2> 946835 T3230 oasc.Overseer$ClusterStateUpdater.updateState WARN Could not find collection node for nodes_used_collection, skipping publish state
   [junit4]   2> 946835 T3230 oasc.Overseer$ClusterStateUpdater.updateState Update state numShards=2 message={
   [junit4]   2> 	  "operation":"state",
   [junit4]   2> 	  "core_node_name":"core_node4",
   [junit4]   2> 	  "numShards":"2",
   [junit4]   2> 	  "shard":"shard2",
   [junit4]   2> 	  "roles":null,
   [junit4]   2> 	  "state":"down",
   [junit4]   2> 	  "shard_state":"active",
   [junit4]   2> 	  "core":"nodes_used_collection_shard2_replica2",
   [junit4]   2> 	  "collection":"nodes_used_collection",
   [junit4]   2> 	  "shard_range":null,
   [junit4]   2> 	  "node_name":"127.0.0.1:57142__wz%2Fy",
   [junit4]   2> 	  "base_url":"http://127.0.0.1:57142/_wz/y"}
   [junit4]   2> 946870 T3275 oascc.ZkStateReader$2.process A cluster state change: WatchedEvent state:SyncConnected type:NodeDataChanged path:/clusterstate.json, has occurred - updating... (live nodes size: 5)
   [junit4]   2> 946871 T3229 oascc.ZkStateReader$2.process A cluster state change: WatchedEvent state:SyncConnected type:NodeDataChanged path:/clusterstate.json, has occurred - updating... (live nodes size: 5)
   [junit4]   2> 946871 T3261 oascc.ZkStateReader$2.process A cluster state change: WatchedEvent state:SyncConnected type:NodeDataChanged path:/clusterstate.json, has occurred - updating... (live nodes size: 5)
   [junit4]   2> 946871 T3247 oascc.ZkStateReader$2.process A cluster state change: WatchedEvent state:SyncConnected type:NodeDataChanged path:/clusterstate.json, has occurred - updating... (live nodes size: 5)
   [junit4]   2> 946872 T3289 oascc.ZkStateReader$2.process A cluster state change: WatchedEvent state:SyncConnected type:NodeDataChanged path:/clusterstate.json, has occurred - updating... (live nodes size: 5)
   [junit4]   2> 946871 T3234 oascc.ZkStateReader$2.process A cluster state change: WatchedEvent state:SyncConnected type:NodeDataChanged path:/clusterstate.json, has occurred - updating... (live nodes size: 5)
   [junit4]   2> 947484 T3255 oasc.ZkController.waitForShardId waiting to find shard id in clusterstate for nodes_used_collection_shard1_replica2
   [junit4]   2> 947484 T3225 oasc.ZkController.waitForShardId waiting to find shard id in clusterstate for nodes_used_collection_shard1_replica1
   [junit4]   2> 947486 T3280 oasc.ZkController.waitForShardId waiting to find shard id in clusterstate for nodes_used_collection_shard2_replica1
   [junit4]   2> 947488 T3242 oasc.ZkController.waitForShardId waiting to find shard id in clusterstate for nodes_used_collection_shard2_replica2
   [junit4]   2> 947490 T3280 oasc.CorePropertiesLocator.writePropertiesFile ERROR Couldn't persist core properties to C:\Users\JenkinsSlave\workspace\Lucene-Solr-trunk-Windows\solr\build\solr-core\test\J0\.\org.apache.solr.cloud.CollectionsAPIDistributedZkTest-jetty4-1375379988331\nodes_used_collection_shard2_replica1\core.properties: java.io.FileNotFoundException: C:\Users\JenkinsSlave\workspace\Lucene-Solr-trunk-Windows\solr\build\solr-core\test\J0\.\org.apache.solr.cloud.CollectionsAPIDistributedZkTest-jetty4-1375379988331\nodes_used_collection_shard2_replica1\core.properties (The system cannot find the path specified)
   [junit4]   2> 947491 T3280 oasc.CoreContainer.create Creating SolrCore 'nodes_used_collection_shard2_replica1' using instanceDir: C:\Users\JenkinsSlave\workspace\Lucene-Solr-trunk-Windows\solr\build\solr-core\test\J0\.\org.apache.solr.cloud.CollectionsAPIDistributedZkTest-jetty4-1375379988331\nodes_used_collection_shard2_replica1
   [junit4]   2> 947492 T3280 oasc.ZkController.createCollectionZkNode Check for collection zkNode:nodes_used_collection
   [junit4]   2> 947490 T3225 oasc.CorePropertiesLocator.writePropertiesFile ERROR Couldn't persist core properties to C:\Users\JenkinsSlave\workspace\Lucene-Solr-trunk-Windows\solr\build\solr-core\test\J0\.\org.apache.solr.cloud.CollectionsAPIDistributedZkTest-controljetty-1375379980687\nodes_used_collection_shard1_replica1\core.properties: java.io.FileNotFoundException: C:\Users\JenkinsSlave\workspace\Lucene-Solr-trunk-Windows\solr\build\solr-core\test\J0\.\org.apache.solr.cloud.CollectionsAPIDistributedZkTest-controljetty-1375379980687\nodes_used_collection_shard1_replica1\core.properties (The system cannot find the path specified)
   [junit4]   2> 947493 T3225 oasc.CoreContainer.create Creating SolrCore 'nodes_used_collection_shard1_replica1' using instanceDir: C:\Users\JenkinsSlave\workspace\Lucene-Solr-trunk-Windows\solr\build\solr-core\test\J0\.\org.apache.solr.cloud.CollectionsAPIDistributedZkTest-controljetty-1375379980687\nodes_used_collection_shard1_replica1
   [junit4]   2> 947494 T3225 oasc.ZkController.createCollectionZkNode Check for collection zkNode:nodes_used_collection
   [junit4]   2> 947490 T3255 oasc.CorePropertiesLocator.writePropertiesFile ERROR Couldn't persist core properties to C:\Users\JenkinsSlave\workspace\Lucene-Solr-trunk-Windows\solr\build\solr-core\test\J0\.\org.apache.solr.cloud.CollectionsAPIDistributedZkTest-jetty2-1375379984109\nodes_used_collection_shard1_replica2\core.properties: java.io.FileNotFoundException: C:\Users\JenkinsSlave\workspace\Lucene-Solr-trunk-Windows\solr\build\solr-core\test\J0\.\org.apache.solr.cloud.CollectionsAPIDistributedZkTest-jetty2-1375379984109\nodes_used_collection_shard1_replica2\core.properties (The system cannot find the path specified)
   [junit4]   2> 947495 T3255 oasc.CoreContainer.create Creating SolrCore 'nodes_used_collection_shard1_replica2' using instanceDir: C:\Users\JenkinsSlave\workspace\Lucene-Solr-trunk-Windows\solr\build\solr-core\test\J0\.\org.apache.solr.cloud.CollectionsAPIDistributedZkTest-jetty2-1375379984109\nodes_used_collection_shard1_replica2
   [junit4]   2> 947495 T3255 oasc.ZkController.createCollectionZkNode Check for collection zkNode:nodes_used_collection
   [junit4]   2> 947495 T3280 oasc.ZkController.createCollectionZkNode Creating collection in ZooKeeper:nodes_used_collection
   [junit4]   2> 947497 T3242 oasc.CorePropertiesLocator.writePropertiesFile ERROR Couldn't persist core properties to C:\Users\JenkinsSlave\workspace\Lucene-Solr-trunk-Windows\solr\build\solr-core\test\J0\.\org.apache.solr.cloud.CollectionsAPIDistributedZkTest-jetty1-1375379981877\nodes_used_collection_shard2_replica2\core.properties: java.io.FileNotFoundException: C:\Users\JenkinsSlave\workspace\Lucene-Solr-trunk-Windows\solr\build\solr-core\test\J0\.\org.apache.solr.cloud.CollectionsAPIDistributedZkTest-jetty1-1375379981877\nodes_used_collection_shard2_replica2\core.properties (The system cannot find the path specified)
   [junit4]   2> 947497 T3242 oasc.CoreContainer.create Creating SolrCore 'nodes_used_collection_shard2_replica2' using instanceDir: C:\Users\JenkinsSlave\workspace\Lucene-Solr-trunk-Windows\solr\build\solr-core\test\J0\.\org.apache.solr.cloud.CollectionsAPIDistributedZkTest-jetty1-1375379981877\nodes_used_collection_shard2_replica2
   [junit4]   2> 947497 T3242 oasc.ZkController.createCollectionZkNode Check for collection zkNode:nodes_used_collection
   [junit4]   2> 947498 T3280 oasc.ZkController.getConfName Looking for collection configName
   [junit4]   2> 947497 T3225 oasc.ZkController.createCollectionZkNode Creating collection in ZooKeeper:nodes_used_collection
   [junit4]   2> 947499 T3242 oasc.ZkController.createCollectionZkNode Creating collection in ZooKeeper:nodes_used_collection
   [junit4]   2> 947499 T3255 oasc.ZkController.createCollectionZkNode Creating collection in ZooKeeper:nodes_used_collection
   [junit4]   2> 947500 T3255 oasc.ZkController.getConfName Looking for collection configName
   [junit4]   2> 947499 T3225 oasc.ZkController.getConfName Looking for collection configName
   [junit4]   2> 947502 T3280 oasc.ZkController.getConfName Only one config set found in zk - using it:conf1
   [junit4]   2> 947502 T3280 oascc.SolrZkClient.makePath makePath: /collections/nodes_used_collection
   [junit4]   2> 947500 T3242 oasc.ZkController.getConfName Looking for collection configName
   [junit4]   2> 947505 T3255 oasc.ZkController.getConfName Only one config set found in zk - using it:conf1
   [junit4]   2> 947506 T3255 oascc.SolrZkClient.makePath makePath: /collections/nodes_used_collection
   [junit4]   2> 947507 T3225 oasc.ZkController.getConfName Only one config set found in zk - using it:conf1
   [junit4]   2> 947507 T3225 oascc.SolrZkClient.makePath makePath: /collections/nodes_used_collection
   [junit4]   2> 947509 T3242 oasc.ZkController.getConfName Only one config set found in zk - using it:conf1
   [junit4]   2> 947510 T3242 oascc.SolrZkClient.makePath makePath: /collections/nodes_used_collection
   [junit4]   2> 947528 T3280 oasc.ZkController.readConfigName Load collection config from:/collections/nodes_used_collection
   [junit4]   2> 947530 T3255 oasc.ZkController.readConfigName Load collection config from:/collections/nodes_used_collection
   [junit4]   2> 947532 T3225 oasc.ZkController.readConfigName Load collection config from:/collections/nodes_used_collection
   [junit4]   2> 947534 T3242 oasc.ZkController.readConfigName Load collection config from:/collections/nodes_used_collection
   [junit4]   2> 947535 T3280 oasc.SolrResourceLoader.<init> new SolrResourceLoader for directory: 'C:\Users\JenkinsSlave\workspace\Lucene-Solr-trunk-Windows\solr\build\solr-core\test\J0\.\org.apache.solr.cloud.CollectionsAPIDistributedZkTest-jetty4-1375379988331\nodes_used_collection_shard2_replica1\'
   [junit4]   2> 947535 T3255 oasc.SolrResourceLoader.<init> new SolrResourceLoader for directory: 'C:\Users\JenkinsSlave\workspace\Lucene-Solr-trunk-Windows\solr\build\solr-core\test\J0\.\org.apache.solr.cloud.CollectionsAPIDistributedZkTest-jetty2-1375379984109\nodes_used_collection_shard1_replica2\'
   [junit4]   2> 947536 T3225 oasc.SolrResourceLoader.<init> new SolrResourceLoader for directory: 'C:\Users\JenkinsSlave\workspace\Lucene-Solr-trunk-Windows\solr\build\solr-core\test\J0\.\org.apache.solr.cloud.CollectionsAPIDistributedZkTest-controljetty-1375379980687\nodes_used_collection_shard1_replica1\'
   [junit4]   2> 947541 T3242 oasc.SolrResourceLoader.<init> new SolrResourceLoader for directory: 'C:\Users\JenkinsSlave\workspace\Lucene-Solr-trunk-Windows\solr\build\solr-core\test\J0\.\org.apache.solr.cloud.CollectionsAPIDistributedZkTest-jetty1-1375379981877\nodes_used_collection_shard2_replica2\'
   [junit4]   2> 947711 T3255 oasc.SolrConfig.<init> Using Lucene MatchVersion: LUCENE_50
   [junit4]   2> 947715 T3280 oasc.SolrConfig.<init> Using Lucene MatchVersion: LUCENE_50
   [junit4]   2> 947775 T3242 oasc.SolrConfig.<init> Using Lucene MatchVersion: LUCENE_50
   [junit4]   2> 947781 T3225 oasc.SolrConfig.<init> Using Lucene MatchVersion: LUCENE_50
   [junit4]   2> 947966 T3280 oasc.SolrConfig.<init> Loaded SolrConfig: solrconfig.xml
   [junit4]   2> 947986 T3225 oasc.SolrConfig.<init> Loaded SolrConfig: solrconfig.xml
   [junit4]   2> 948041 T3255 oasc.SolrConfig.<init> Loaded SolrConfig: solrconfig.xml
   [junit4]   2> 948049 T3280 oass.IndexSchema.readSchema Reading Solr Schema from schema.xml
   [junit4]   2> 948072 T3280 oass.IndexSchema.readSchema [nodes_used_collection_shard2_replica1] Schema name=test
   [junit4]   2> 948110 T3242 oasc.SolrConfig.<init> Loaded SolrConfig: solrconfig.xml
   [junit4]   2> 948114 T3225 oass.IndexSchema.readSchema Reading Solr Schema from schema.xml
   [junit4]   2> 948135 T3225 oass.IndexSchema.readSchema [nodes_used_collection_shard1_replica1] Schema name=test
   [junit4]   2> 948242 T3255 oass.IndexSchema.readSchema Reading Solr Schema from schema.xml
   [junit4]   2> 948305 T3242 oass.IndexSchema.readSchema Reading Solr Schema from schema.xml
   [junit4]   2> 948314 T3255 oass.IndexSchema.readSchema [nodes_used_collection_shard1_replica2] Schema name=test
   [junit4]   2> 948325 T3242 oass.IndexSchema.readSchema [nodes_used_collection_shard2_replica2] Schema name=test
   [junit4]   2> 950409 T3280 oass.OpenExchangeRatesOrgProvider.init Initialized with rates=open-exchange-rates.json, refreshInterval=1440.
   [junit4]   2> 950440 T3280 oass.IndexSchema.readSchema default search field in schema is text
   [junit4]   2> 950452 T3280 oass.IndexSchema.readSchema unique key field: id
   [junit4]   2> 950525 T3225 oass.OpenExchangeRatesOrgProvider.init Initialized with rates=open-exchange-rates.json, refreshInterval=1440.
   [junit4]   2> 950542 T3225 oass.IndexSchema.readSchema default search field in schema is text
   [junit4]   2> 950549 T3225 oass.IndexSchema.readSchema unique key field: id
   [junit4]   2> 950630 T3242 oass.OpenExchangeRatesOrgProvider.init Initialized with rates=open-exchange-rates.json, refreshInterval=1440.
   [junit4]   2> 950645 T3242 oass.IndexSchema.readSchema default search field in schema is text
   [junit4]   2> 950654 T3242 oass.IndexSchema.readSchema unique key field: id
   [junit4]   2> 950710 T3242 oass.FileExchangeRateProvider.reload Reloading exchange rates from file currency.xml
   [junit4]   2> 950728 T3242 oass.FileExchangeRateProvider.reload Reloading exchange rates from file currency.xml
   [junit4]   2> 950742 T3242 oass.OpenExchangeRatesOrgProvider.reload Reloading exchange rates from open-exchange-rates.json
   [junit4]   2> 950749 T3242 oass.OpenExchangeRatesOrgProvider$OpenExchangeRates.<init> WARN Unknown key IMPORTANT NOTE
   [junit4]   2> 950750 T3242 oass.OpenExchangeRatesOrgProvider$OpenExchangeRates.<init> WARN Expected key, got STRING
   [junit4]   2> 950750 T3242 oass.OpenExchangeRatesOrgProvider.reload Reloading exchange rates from open-exchange-rates.json
   [junit4]   2> 950749 T3280 oass.FileExchangeRateProvider.reload Reloading exchange rates from file currency.xml
   [junit4]   2> 950757 T3225 oass.FileExchangeRateProvider.reload Reloading exchange rates from file currency.xml
   [junit4]   2> 950759 T3242 oass.OpenExchangeRatesOrgProvider$OpenExchangeRates.<init> WARN Unknown key IMPORTANT NOTE
   [junit4]   2> 950760 T3242 oass.OpenExchangeRatesOrgProvider$OpenExchangeRates.<init> WARN Expected key, got STRING
   [junit4]   2> 950760 T3242 oasc.SolrCore.initDirectoryFactory org.apache.solr.core.MockDirectoryFactory
   [junit4]   2> 950761 T3242 oasc.SolrCore.<init> [nodes_used_collection_shard2_replica2] Opening new SolrCore at C:\Users\JenkinsSlave\workspace\Lucene-Solr-trunk-Windows\solr\build\solr-core\test\J0\.\org.apache.solr.cloud.CollectionsAPIDistributedZkTest-jetty1-1375379981877\nodes_used_collection_shard2_replica2\, dataDir=C:\Users\JenkinsSlave\workspace\Lucene-Solr-trunk-Windows\solr\build\solr-core\test\J0\.\org.apache.solr.cloud.CollectionsAPIDistributedZkTest-jetty1-1375379981877\\nodes_used_collection_shard2_replica2\data\
   [junit4]   2> 950761 T3242 oasc.JmxMonitoredMap.<init> JMX monitoring is enabled. Adding Solr mbeans to JMX Server: com.sun.jmx.mbeanserver.JmxMBeanServer@753ab52c
   [junit4]   2> 950762 T3242 oasc.CachingDirectoryFactory.get return new directory for C:\Users\JenkinsSlave\workspace\Lucene-Solr-trunk-Windows\solr\build\solr-core\test\J0\.\org.apache.solr.cloud.CollectionsAPIDistributedZkTest-jetty1-1375379981877\\nodes_used_collection_shard2_replica2\data\
   [junit4]   2> 950762 T3242 oasc.SolrCore.getNewIndexDir New index directory detected: old=null new=C:\Users\JenkinsSlave\workspace\Lucene-Solr-trunk-Windows\solr\build\solr-core\test\J0\.\org.apache.solr.cloud.CollectionsAPIDistributedZkTest-jetty1-1375379981877\\nodes_used_collection_shard2_replica2\data\index/
   [junit4]   2> 950762 T3242 oasc.SolrCore.initIndex WARN [nodes_used_collection_shard2_replica2] Solr index directory 'C:\Users\JenkinsSlave\workspace\Lucene-Solr-trunk-Windows\solr\build\solr-core\test\J0\.\org.apache.solr.cloud.CollectionsAPIDistributedZkTest-jetty1-1375379981877\nodes_used_collection_shard2_replica2\data\index' doesn't exist. Creating new index...
   [junit4]   2> 950764 T3242 oasc.CachingDirectoryFactory.get return new directory for C:\Users\JenkinsSlave\workspace\Lucene-Solr-trunk-Windows\solr\build\solr-core\test\J0\.\org.apache.solr.cloud.CollectionsAPIDistributedZkTest-jetty1-1375379981877\\nodes_used_collection_shard2_replica2\data\index
   [junit4]   2> 950772 T3255 oass.OpenExchangeRatesOrgProvider.init Initialized with rates=open-exchange-rates.json, refreshInterval=1440.
   [junit4]   2> 950775 T3280 oass.FileExchangeRateProvider.reload Reloading exchange rates from file currency.xml
   [junit4]   2> 950780 T3242 oasc.SolrDeletionPolicy.onCommit SolrDeletionPolicy.onCommit: commits: num=1
   [junit4]   2> 		commit{dir=MockDirWrapper(org.apache.lucene.store.RAMDirectory@4a00927b lockFactory=org.apache.lucene.store.NativeFSLockFactory@2abe6cdf),segFN=segments_1,generation=1}
   [junit4]   2> 950781 T3242 oasc.SolrDeletionPolicy.updateCommits newest commit generation = 1
   [junit4]   2> 950793 T3242 oasup.UpdateRequestProcessorChain.init inserting DistributedUpdateProcessorFactory into updateRequestProcessorChain "dedupe"
   [junit4]   2> 950794 T3242 oasup.UpdateRequestProcessorChain.init inserting DistributedUpdateProcessorFactory into updateRequestProcessorChain "stored_sig"
   [junit4]   2> 950796 T3242 oasup.UpdateRequestProcessorChain.init inserting DistributedUpdateProcessorFactory into updateRequestProcessorChain "distrib-dup-test-chain-implicit"
   [junit4]   2> 950797 T3242 oasc.RequestHandlers.initHandlersFromConfig created standard: solr.StandardRequestHandler
   [junit4]   2> 950869 T3242 oasc.RequestHandlers.initHandlersFromConfig created /get: solr.RealTimeGetHandler
   [junit4]   2> 950869 T3242 oasc.RequestHandlers.initHandlersFromConfig adding lazy requestHandler: solr.ReplicationHandler
   [junit4]   2> 950870 T3242 oasc.RequestHandlers.initHandlersFromConfig created /replication: solr.ReplicationHandler
   [junit4]   2> 950871 T3242 oasc.RequestHandlers.initHandlersFromConfig created /update: solr.UpdateRequestHandler
   [junit4]   2> 950871 T3242 oasc.RequestHandlers.initHandlersFromConfig created /admin/: org.apache.solr.handler.admin.AdminHandlers
   [junit4]   2> 950892 T3280 oass.OpenExchangeRatesOrgProvider.reload Reloading exchange rates from open-exchange-rates.json
   [junit4]   2> 950896 T3225 oass.FileExchangeRateProvider.reload Reloading exchange rates from file currency.xml
   [junit4]   2> 950893 T3255 oass.IndexSchema.readSchema default search field in schema is text
   [junit4]   2> 950904 T3242 oashl.XMLLoader.init xsltCacheLifetimeSeconds=60
   [junit4]   2> 950905 T3255 oass.IndexSchema.readSchema unique key field: id
   [junit4]   2> 950912 T3242 oass.SolrIndexSearcher.<init> Opening Searcher@3214bab7 main
   [junit4]   2> 950913 T3280 oass.OpenExchangeRatesOrgProvider$OpenExchangeRates.<init> WARN Unknown key IMPORTANT NOTE
   [junit4]   2> 950913 T3280 oass.OpenExchangeRatesOrgProvider$OpenExchangeRates.<init> WARN Expected key, got STRING
   [junit4]   2> 950913 T3280 oass.OpenExchangeRatesOrgProvider.reload Reloading exchange rates from open-exchange-rates.json
   [junit4]   2> 950918 T3242 oasu.CommitTracker.<init> Hard AutoCommit: disabled
   [junit4]   2> 950919 T3280 oass.OpenExchangeRatesOrgProvider$OpenExchangeRates.<init> WARN Unknown key IMPORTANT NOTE
   [junit4]   2> 950919 T3280 oass.OpenExchangeRatesOrgProvider$OpenExchangeRates.<init> WARN Expected key, got STRING
   [junit4]   2> 950919 T3280 oasc.SolrCore.initDirectoryFactory org.apache.solr.core.MockDirectoryFactory
   [junit4]   2> 950920 T3280 oasc.SolrCore.<init> [nodes_used_collection_shard2_replica1] Opening new SolrCore at C:\Users\JenkinsSlave\workspace\Lucene-Solr-trunk-Windows\solr\build\solr-core\test\J0\.\org.apache.solr.cloud.CollectionsAPIDistributedZkTest-jetty4-1375379988331\nodes_used_collection_shard2_replica1\, dataDir=C:\Users\JenkinsSlave\workspace\Lucene-Solr-trunk-Windows\solr\build\solr-core\test\J0\.\org.apache.solr.cloud.CollectionsAPIDistributedZkTest-jetty4-1375379988331\\nodes_used_collection_shard2_replica1\data\
   [junit4]   2> 950920 T3280 oasc.JmxMonitoredMap.<init> JMX monitoring is enabled. Adding Solr mbeans to JMX Server: com.sun.jmx.mbeanserver.JmxMBeanServer@753ab52c
   [junit4]   2> 950922 T3242 oasu.CommitTracker.<init> Soft AutoCommit: disabled
   [junit4]   2> 950923 T3280 oasc.CachingDirectoryFactory.get return new directory for C:\Users\JenkinsSlave\workspace\Lucene-Solr-trunk-Windows\solr\build\solr-core\test\J0\.\org.apache.solr.cloud.CollectionsAPIDistributedZkTest-jetty4-1375379988331\\nodes_used_collection_shard2_replica1\data\
   [junit4]   2> 950925 T3280 oasc.SolrCore.getNewIndexDir New index directory detected: old=null new=C:\Users\JenkinsSlave\workspace\Lucene-Solr-trunk-Windows\solr\build\solr-core\test\J0\.\org.apache.solr.cloud.CollectionsAPIDistributedZkTest-jetty4-1375379988331\\nodes_used_collection_shard2_replica1\data\index/
   [junit4]   2> 950925 T3280 oasc.SolrCore.initIndex WARN [nodes_used_collection_shard2_replica1] Solr index directory 'C:\Users\JenkinsSlave\workspace\Lucene-Solr-trunk-Windows\solr\build\solr-core\test\J0\.\org.apache.solr.cloud.CollectionsAPIDistributedZkTest-jetty4-1375379988331\nodes_used_collection_shard2_replica1\data\index' doesn't exist. Creating new index...
   [junit4]   2> 950925 T3225 oass.OpenExchangeRatesOrgProvider.reload Reloading exchange rates from open-exchange-rates.json
   [junit4]   2> 950927 T3280 oasc.CachingDirectoryFactory.get return new directory for C:\Users\JenkinsSlave\workspace\Lucene-Solr-trunk-Windows\solr\build\solr-core\test\J0\.\org.apache.solr.cloud.CollectionsAPIDistributedZkTest-jetty4-1375379988331\\nodes_used_collection_shard2_replica1\data\index
   [junit4]   2> 950931 T3225 oass.OpenExchangeRatesOrgProvider$OpenExchangeRates.<init> WARN Unknown key IMPORTANT NOTE
   [junit4]   2> 950931 T3225 oass.OpenExchangeRatesOrgProvider$OpenExchangeRates.<init> WARN Expected key, got STRING
   [junit4]   2> 950933 T3225 oass.OpenExchangeRatesOrgProvider.reload Reloading exchange rates from open-exchange-rates.json
   [junit4]   2> 950935 T3280 oasc.SolrDeletionPolicy.onCommit SolrDeletionPolicy.onCommit: commits: num=1
   [junit4]   2> 		commit{dir=MockDirWrapper(org.apache.lucene.store.RAMDirectory@14f69fe9 lockFactory=org.apache.lucene.store.NativeFSLockFactory@37e42557),segFN=segments_1,generation=1}
   [junit4]   2> 950936 T3280 oasc.SolrDeletionPolicy.updateCommits newest commit generation = 1
   [junit4]   2> 950960 T3225 oass.OpenExchangeRatesOrgProvider$OpenExchangeRates.<init> WARN Unknown key IMPORTANT NOTE
   [junit4]   2> 950962 T3225 oass.OpenExchangeRatesOrgProvider$OpenExchangeRates.<init> WARN Expected key, got STRING
   [junit4]   2> 950962 T3225 oasc.SolrCore.initDirectoryFactory org.apache.solr.core.MockDirectoryFactory
   [junit4]   2> 950963 T3225 oasc.SolrCore.<init> [nodes_used_collection_shard1_replica1] Opening new SolrCore at C:\Users\JenkinsSlave\workspace\Lucene-Solr-trunk-Windows\solr\build\solr-core\test\J0\.\org.apache.solr.cloud.CollectionsAPIDistributedZkTest-controljetty-1375379980687\nodes_used_collection_shard1_replica1\, dataDir=C:\Users\JenkinsSlave\workspace\Lucene-Solr-trunk-Windows\solr\build\solr-core\test\J0\.\org.apache.solr.cloud.CollectionsAPIDistributedZkTest-controljetty-1375379980687\\nodes_used_collection_shard1_replica1\data\
   [junit4]   2> 950963 T3225 oasc.JmxMonitoredMap.<init> JMX monitoring is enabled. Adding Solr mbeans to JMX Server: com.sun.jmx.mbeanserver.JmxMBeanServer@753ab52c
   [junit4]   2> 950966 T3225 oasc.CachingDirectoryFactory.get return new directory for C:\Users\JenkinsSlave\workspace\Lucene-Solr-trunk-Windows\solr\build\solr-core\test\J0\.\org.apache.solr.cloud.CollectionsAPIDistributedZkTest-controljetty-1375379980687\\nodes_used_collection_shard1_replica1\data\
   [junit4]   2> 950967 T3225 oasc.SolrCore.getNewIndexDir New index directory detected: old=null new=C:\Users\JenkinsSlave\workspace\Lucene-Solr-trunk-Windows\solr\build\solr-core\test\J0\.\org.apache.solr.cloud.CollectionsAPIDistributedZkTest-controljetty-1375379980687\\nodes_used_collection_shard1_replica1\data\index/
   [junit4]   2> 950967 T3225 oasc.SolrCore.initIndex WARN [nodes_used_collection_shard1_replica1] Solr index directory 'C:\Users\JenkinsSlave\workspace\Lucene-Solr-trunk-Windows\solr\build\solr-core\test\J0\.\org.apache.solr.cloud.CollectionsAPIDistributedZkTest-controljetty-1375379980687\nodes_used_collection_shard1_replica1\data\index' doesn't exist. Creating new index...
   [junit4]   2> 950969 T3280 oasup.UpdateRequestProcessorChain.init inserting DistributedUpdateProcessorFactory into updateRequestProcessorChain "dedupe"
   [junit4]   2> 950974 T3280 oasup.UpdateRequestProcessorChain.init inserting DistributedUpdateProcessorFactory into updateRequestProcessorChain "stored_sig"
   [junit4]   2> 950975 T3280 oasup.UpdateRequestProcessorChain.init inserting DistributedUpdateProcessorFactory into updateRequestProcessorChain "distrib-dup-test-chain-implicit"
   [junit4]   2> 950978 T3280 oasc.RequestHandlers.initHandlersFromConfig created standard: solr.StandardRequestHandler
   [junit4]   2> 950978 T3280 oasc.RequestHandlers.initHandlersFromConfig created /get: solr.RealTimeGetHandler
   [junit4]   2> 950978 T3280 oasc.RequestHandlers.initHandlersFromConfig adding lazy requestHandler: solr.ReplicationHandler
   [junit4]   2> 950979 T3280 oasc.RequestHandlers.initHandlersFromConfig created /replication: solr.ReplicationHandler
   [junit4]   2> 950979 T3242 oasc.CoreContainer.registerCore registering core: nodes_used_collection_shard2_replica2
   [junit4]   2> 950980 T3242 oasc.ZkController.register Register replica - core:nodes_used_collection_shard2_replica2 address:http://127.0.0.1:57142/_wz/y collection:nodes_used_collection shard:shard2
   [junit4]   2> 950980 T3242 oascsi.HttpClientUtil.createClient Creating new http client, config:maxConnections=10000&maxConnectionsPerHost=20&connTimeout=15000&socketTimeout=30000&retry=false
   [junit4]   2> 950970 T3225 oasc.CachingDirectoryFactory.get return new directory for C:\Users\JenkinsSlave\workspace\Lucene-Solr-trunk-Windows\solr\build\solr-core\test\J0\.\org.apache.solr.cloud.CollectionsAPIDistributedZkTest-controljetty-1375379980687\\nodes_used_collection_shard1_replica1\data\index
   [junit4]   2> 950980 T3295 oasc.SolrCore.registerSearcher [nodes_used_collection_shard2_replica2] Registered new searcher Searcher@3214bab7 main{StandardDirectoryReader(segments_1:1)}
   [junit4]   2> 950989 T3225 oasc.SolrDeletionPolicy.onCommit SolrDeletionPolicy.onCommit: commits: num=1
   [junit4]   2> 		commit{dir=MockDirWrapper(org.apache.lucene.store.RAMDirectory@178b07cb lockFactory=org.apache.lucene.store.NativeFSLockFactory@21fd0d7b),segFN=segments_1,generation=1}
   [junit4]   2> 950989 T3225 oasc.SolrDeletionPolicy.updateCommits newest commit generation = 1
   [junit4]   2> 950998 T3225 oasup.UpdateRequestProcessorChain.init inserting DistributedUpdateProcessorFactory into updateRequestProcessorChain "dedupe"
   [junit4]   2> 950979 T3280 oasc.RequestHandlers.initHandlersFromConfig created /update: solr.UpdateRequestHandler
   [junit4]   2> 951000 T3280 oasc.RequestHandlers.initHandlersFromConfig created /admin/: org.apache.solr.handler.admin.AdminHandlers
   [junit4]   2> 950999 T3225 oasup.UpdateRequestProcessorChain.init inserting DistributedUpdateProcessorFactory into updateRequestProcessorChain "stored_sig"
   [junit4]   2> 951002 T3225 oasup.UpdateRequestProcessorChain.init inserting DistributedUpdateProcessorFactory into updateRequestProcessorChain "distrib-dup-test-chain-implicit"
   [junit4]   2> 951003 T3225 oasc.RequestHandlers.initHandlersFromConfig created standard: solr.StandardRequestHandler
   [junit4]   2> 951006 T3225 oasc.RequestHandlers.initHandlersFromConfig created /get: solr.RealTimeGetHandler
   [junit4]   2> 951006 T3225 oasc.RequestHandlers.initHandlersFromConfig adding lazy requestHandler: solr.ReplicationHandler
   [junit4]   2> 951007 T3225 oasc.RequestHandlers.initHandlersFromConfig created /replication: solr.ReplicationHandler
   [junit4]   2> 951008 T3225 oasc.RequestHandlers.initHandlersFromConfig created /update: solr.UpdateRequestHandler
   [junit4]   2> 951009 T3225 oasc.RequestHandlers.initHandlersFromConfig created /admin/: org.apache.solr.handler.admin.AdminHandlers
   [junit4]   2> 950999 T3242 oascc.SolrZkClient.makePath makePath: /collections/nodes_used_collection/leader_elect/shard2/election
   [junit4]   2> 951023 T3225 oashl.XMLLoader.init xsltCacheLifetimeSeconds=60
   [junit4]   2> 951023 T3280 oashl.XMLLoader.init xsltCacheLifetimeSeconds=60
   [junit4]   2> 951039 T3225 oass.SolrIndexSearcher.<init> Opening Searcher@6456ce65 main
   [junit4]   2> 951040 T3280 oass.SolrIndexSearcher.<init> Opening Searcher@47e99da0 main
   [junit4]   2> 951045 T3225 oasu.CommitTracker.<init> Hard AutoCommit: disabled
   [junit4]   2> 951045 T3225 oasu.CommitTracker.<init> Soft AutoCommit: disabled
   [junit4]   2> 951045 T3280 oasu.CommitTracker.<init> Hard AutoCommit: disabled
   [junit4]   2> 951047 T3280 oasu.CommitTracker.<init> Soft AutoCommit: disabled
   [junit4]   2> 951057 T3280 oasc.CoreContainer.registerCore registering core: nodes_used_collection_shard2_replica1
   [junit4]   2> 951058 T3280 oasc.ZkController.register Register replica - core:nodes_used_collection_shard2_replica1 address:http://127.0.0.1:57169/_wz/y collection:nodes_used_collection shard:shard2
   [junit4]   2> 951058 T3280 oascsi.HttpClientUtil.createClient Creating new http client, config:maxConnections=10000&maxConnectionsPerHost=20&connTimeout=15000&socketTimeout=30000&retry=false
   [junit4]   2> 951058 T3225 oasc.CoreContainer.registerCore registering core: nodes_used_collection_shard1_replica1
   [junit4]   2> 951060 T3225 oasc.ZkController.register Register replica - core:nodes_used_collection_shard1_replica1 address:http://127.0.0.1:57130/_wz/y collection:nodes_used_collection shard:shard1
   [junit4]   2> 951060 T3225 oascsi.HttpClientUtil.createClient Creating new http client, config:maxConnections=10000&maxConnectionsPerHost=20&connTimeout=15000&socketTimeout=30000&retry=false
   [junit4]   2> 951058 T3297 oasc.SolrCore.registerSearcher [nodes_used_collection_shard2_replica1] Registered new searcher Searcher@47e99da0 main{StandardDirectoryReader(segments_1:1)}
   [junit4]   2> 951076 T3296 oasc.SolrCore.registerSearcher [nodes_used_collection_shard1_replica1] Registered new searcher Searcher@6456ce65 main{StandardDirectoryReader(segments_1:1)}
   [junit4]   2> 951077 T3255 oass.FileExchangeRateProvider.reload Reloading exchange rates from file currency.xml
   [junit4]   2> 951076 T3225 oascc.SolrZkClient.makePath makePath: /collections/nodes_used_collection/leader_elect/shard1/election
   [junit4]   2> 951077 T3280 oascc.SolrZkClient.makePath makePath: /collections/nodes_used_collection/leader_elect/shard2/election
   [junit4]   2> 951102 T3242 oasc.ShardLeaderElectionContext.runLeaderProcess Running the leader process for shard shard2
   [junit4]   2> 951113 T3255 oass.FileExchangeRateProvider.reload Reloading exchange rates from file currency.xml
   [junit4]   2> 951119 T3242 oasc.ShardLeaderElectionContext.waitForReplicasToComeUp Enough replicas found to continue.
   [junit4]   2> 951119 T3242 oasc.ShardLeaderElectionContext.runLeaderProcess I may be the new leader - try and sync
   [junit4]   2> 951120 T3242 oasc.SyncStrategy.sync Sync replicas to http://127.0.0.1:57142/_wz/y/nodes_used_collection_shard2_replica2/
   [junit4]   2> 951121 T3242 oasu.PeerSync.sync PeerSync: core=nodes_used_collection_shard2_replica2 url=http://127.0.0.1:57142/_wz/y START replicas=[http://127.0.0.1:57169/_wz/y/nodes_used_collection_shard2_replica1/] nUpdates=100
   [junit4]   2> 951125 T3242 oasu.PeerSync.sync PeerSync: core=nodes_used_collection_shard2_replica2 url=http://127.0.0.1:57142/_wz/y DONE.  We have no versions.  sync failed.
   [junit4]   2> 951126 T3242 oasc.SyncStrategy.syncReplicas Leader's attempt to sync with shard failed, moving to the next candidate
   [junit4]   2> 951126 T3242 oasc.ShardLeaderElectionContext.runLeaderProcess We failed sync, but we have no versions - we can't sync in that case - we were active before, so become leader anyway
   [junit4]   2> 951127 T3242 oasc.ShardLeaderElectionContext.runLeaderProcess I am the new leader: http://127.0.0.1:57142/_wz/y/nodes_used_collection_shard2_replica2/ shard2
   [junit4]   2> 951127 T3242 oascc.SolrZkClient.makePath makePath: /collections/nodes_used_collection/leaders/shard2
   [junit4]   2> 951128 T3225 oasc.ShardLeaderElectionContext.runLeaderProcess Running the leader process for shard shard1
   [junit4]   2> 951127 T3255 oass.OpenExchangeRatesOrgProvider.reload Reloading exchange rates from open-exchange-rates.json
   [junit4]   2> 951139 T3255 oass.OpenExchangeRatesOrgProvider$OpenExchangeRates.<init> WARN Unknown key IMPORTANT NOTE
   [junit4]   2> 951140 T3255 oass.OpenExchangeRatesOrgProvider$OpenExchangeRates.<init> WARN Expected key, got STRING
   [junit4]   2> 951140 T3255 oass.OpenExchangeRatesOrgProvider.reload Reloading exchange rates from open-exchange-rates.json
   [junit4]   2> 951148 T3225 oasc.ShardLeaderElectionContext.waitForReplicasToComeUp Waiting until we see more replicas up for shard shard1: total=2 found=1 timeoutin=179999
   [junit4]   2> ASYNC  NEW_CORE C1070 name=nodes_used_collection_shard2_replica1 org.apache.solr.core.SolrCore@6eee5e10 url=http://127.0.0.1:57169/_wz/y/nodes_used_collection_shard2_replica1 node=127.0.0.1:57169__wz%2Fy C1070_STATE=coll:nodes_used_collection core:nodes_used_collection_shard2_replica1 props:{state=down, core=nodes_used_collection_shard2_replica1, node_name=127.0.0.1:57169__wz%2Fy, base_url=http://127.0.0.1:57169/_wz/y}
   [junit4]   2> 951150 T3283 C1070 P57169 oasc.SolrCore.execute [nodes_used_collection_shard2_replica1] webapp=/_wz/y path=/get params={getVersions=100&distrib=false&wt=javabin&qt=/get&version=2} status=0 QTime=1 
   [junit4]   2> 951150 T3255 oass.OpenExchangeRatesOrgProvider$OpenExchangeRates.<init> WARN Unknown key IMPORTANT NOTE
   [junit4]   2> 951153 T3255 oass.OpenExchangeRatesOrgProvider$OpenExchangeRates.<init> WARN Expected key, got STRING
   [junit4]   2> 951154 T3255 oasc.SolrCore.initDirectoryFactory org.apache.solr.core.MockDirectoryFactory
   [junit4]   2> 951155 T3255 oasc.SolrCore.<init> [nodes_used_collection_shard1_replica2] Opening new SolrCore at C:\Users\JenkinsSlave\workspace\Lucene-Solr-trunk-Windows\solr\build\solr-core\test\J0\.\org.apache.solr.cloud.CollectionsAPIDistributedZkTest-jetty2-1375379984109\nodes_used_collection_shard1_replica2\, dataDir=C:\Users\JenkinsSlave\workspace\Lucene-Solr-trunk-Windows\solr\build\solr-core\test\J0\.\org.apache.solr.cloud.CollectionsAPIDistributedZkTest-jetty2-1375379984109\\nodes_used_collection_shard1_replica2\data\
   [junit4]   2> 951155 T3255 oasc.JmxMonitoredMap.<init> JMX monitoring is enabled. Adding Solr mbeans to JMX Server: com.sun.jmx.mbeanserver.JmxMBeanServer@753ab52c
   [junit4]   2> 951158 T3255 oasc.CachingDirectoryFactory.get return new directory for C:\Users\JenkinsSlave\workspace\Lucene-Solr-trunk-Windows\solr\build\solr-core\test\J0\.\org.apache.solr.cloud.CollectionsAPIDistributedZkTest-jetty2-1375379984109\\nodes_used_collection_shard1_replica2\data\
   [junit4]   2> 951158 T3255 oasc.SolrCore.getNewIndexDir New index directory detected: old=null new=C:\Users\JenkinsSlave\workspace\Lucene-Solr-trunk-Windows\solr\build\solr-core\test\J0\.\org.apache.solr.cloud.CollectionsAPIDistributedZkTest-jetty2-1375379984109\\nodes_used_collection_shard1_replica2\data\index/
   [junit4]   2> 951161 T3255 oasc.SolrCore.initIndex WARN [nodes_used_collection_shard1_replica2] Solr index directory 'C:\Users\JenkinsSlave\workspace\Lucene-Solr-trunk-Windows\solr\build\solr-core\test\J0\.\org.apache.solr.cloud.CollectionsAPIDistributedZkTest-jetty2-1375379984109\nodes_used_collection_shard1_replica2\data\index' doesn't exist. Creating new index...
   [junit4]   2> 951162 T3255 oasc.CachingDirectoryFactory.get return new directory for C:\Users\JenkinsSlave\workspace\Lucene-Solr-trunk-Windows\solr\build\solr-core\test\J0\.\org.apache.solr.cloud.CollectionsAPIDistributedZkTest-jetty2-1375379984109\\nodes_used_collection_shard1_replica2\data\index
   [junit4]   2> 951171 T3255 oasc.SolrDeletionPolicy.onCommit SolrDeletionPolicy.onCommit: commits: num=1
   [junit4]   2> 		commit{dir=MockDirWrapper(org.apache.lucene.store.RAMDirectory@34b3d48f lockFactory=org.apache.lucene.store.NativeFSLockFactory@394ac0e7),segFN=segments_1,generation=1}
   [junit4]   2> 951172 T3255 oasc.SolrDeletionPolicy.updateCommits newest commit generation = 1
   [junit4]   2> 951177 T3255 oasup.UpdateRequestProcessorChain.init inserting DistributedUpdateProcessorFactory into updateRequestProcessorChain "dedupe"
   [junit4]   2> 951178 T3255 oasup.UpdateRequestProcessorChain.init inserting DistributedUpdateProcessorFactory into updateRequestProcessorChain "stored_sig"
   [junit4]   2> 951179 T3255 oasup.UpdateRequestProcessorChain.init inserting DistributedUpdateProcessorFactory into updateRequestProcessorChain "distrib-dup-test-chain-implicit"
   [junit4]   2> 951180 T3255 oasc.RequestHandlers.initHandlersFromConfig created standard: solr.StandardRequestHandler
   [junit4]   2> 951180 T3255 oasc.RequestHandlers.initHandlersFromConfig created /get: solr.RealTimeGetHandler
   [junit4]   2> 951180 T3255 oasc.RequestHandlers.initHandlersFromConfig adding lazy requestHandler: solr.ReplicationHandler
   [junit4]   2> 951182 T3255 oasc.RequestHandlers.initHandlersFromConfig created /replication: solr.ReplicationHandler
   [junit4]   2> 951183 T3255 oasc.RequestHandlers.initHandlersFromConfig created /update: solr.UpdateRequestHandler
   [junit4]   2> 951184 T3255 oasc.RequestHandlers.initHandlersFromConfig created /admin/: org.apache.solr.handler.admin.AdminHandlers
   [junit4]   2> 951197 T3255

[...truncated too long message...]

g.apache.solr.common.cloud.SolrZkClient.getChildren(SolrZkClient.java:232)
   [junit4]   2> 	at org.apache.solr.cloud.LeaderElector.checkIfIamLeader(LeaderElector.java:84)
   [junit4]   2> 	at org.apache.solr.cloud.LeaderElector.access$000(LeaderElector.java:55)
   [junit4]   2> 	at org.apache.solr.cloud.LeaderElector$1.process(LeaderElector.java:129)
   [junit4]   2> 	at org.apache.zookeeper.ClientCnxn$EventThread.processEvent(ClientCnxn.java:519)
   [junit4]   2> 	at org.apache.zookeeper.ClientCnxn$EventThread.run(ClientCnxn.java:495)
   [junit4]   2> 
   [junit4]   2> 1210912 T3289 oasc.LeaderElector$1.process WARN  org.apache.zookeeper.KeeperException$SessionExpiredException: KeeperErrorCode = Session expired for /collections/new_implicit_coll_0/leader_elect/c/election
   [junit4]   2> 	at org.apache.zookeeper.KeeperException.create(KeeperException.java:127)
   [junit4]   2> 	at org.apache.zookeeper.KeeperException.create(KeeperException.java:51)
   [junit4]   2> 	at org.apache.zookeeper.ZooKeeper.getChildren(ZooKeeper.java:1468)
   [junit4]   2> 	at org.apache.solr.common.cloud.SolrZkClient$6.execute(SolrZkClient.java:235)
   [junit4]   2> 	at org.apache.solr.common.cloud.SolrZkClient$6.execute(SolrZkClient.java:232)
   [junit4]   2> 	at org.apache.solr.common.cloud.ZkCmdExecutor.retryOperation(ZkCmdExecutor.java:65)
   [junit4]   2> 	at org.apache.solr.common.cloud.SolrZkClient.getChildren(SolrZkClient.java:232)
   [junit4]   2> 	at org.apache.solr.cloud.LeaderElector.checkIfIamLeader(LeaderElector.java:84)
   [junit4]   2> 	at org.apache.solr.cloud.LeaderElector.access$000(LeaderElector.java:55)
   [junit4]   2> 	at org.apache.solr.cloud.LeaderElector$1.process(LeaderElector.java:129)
   [junit4]   2> 	at org.apache.zookeeper.ClientCnxn$EventThread.processEvent(ClientCnxn.java:519)
   [junit4]   2> 	at org.apache.zookeeper.ClientCnxn$EventThread.run(ClientCnxn.java:495)
   [junit4]   2> 
   [junit4]   1> client port:0.0.0.0/0.0.0.0:0
   [junit4]   2> NOTE: reproduce with: ant test  -Dtestcase=CollectionsAPIDistributedZkTest -Dtests.method=testDistribSearch -Dtests.seed=40549FD20C2804D4 -Dtests.slow=true -Dtests.locale=es_UY -Dtests.timezone=Europe/Sofia -Dtests.file.encoding=Cp1252
   [junit4] ERROR    277s | CollectionsAPIDistributedZkTest.testDistribSearch <<<
   [junit4]    > Throwable #1: org.apache.solr.client.solrj.SolrServerException: Server refused connection at: http://127.0.0.1:57142/_wz/y
   [junit4]    > 	at __randomizedtesting.SeedInfo.seed([40549FD20C2804D4:C1B211CA7B7764E8]:0)
   [junit4]    > 	at org.apache.solr.client.solrj.impl.HttpSolrServer.request(HttpSolrServer.java:428)
   [junit4]    > 	at org.apache.solr.client.solrj.impl.HttpSolrServer.request(HttpSolrServer.java:180)
   [junit4]    > 	at org.apache.solr.cloud.AbstractFullDistribZkTestBase.createCollection(AbstractFullDistribZkTestBase.java:1535)
   [junit4]    > 	at org.apache.solr.cloud.CollectionsAPIDistributedZkTest.testCustomCollectionsAPI(CollectionsAPIDistributedZkTest.java:677)
   [junit4]    > 	at org.apache.solr.cloud.CollectionsAPIDistributedZkTest.doTest(CollectionsAPIDistributedZkTest.java:159)
   [junit4]    > 	at org.apache.solr.BaseDistributedSearchTestCase.testDistribSearch(BaseDistributedSearchTestCase.java:835)
   [junit4]    > 	at java.lang.Thread.run(Thread.java:724)
   [junit4]    > Caused by: org.apache.http.conn.HttpHostConnectException: Connection to http://127.0.0.1:57142 refused
   [junit4]    > 	at org.apache.http.impl.conn.DefaultClientConnectionOperator.openConnection(DefaultClientConnectionOperator.java:190)
   [junit4]    > 	at org.apache.http.impl.conn.ManagedClientConnectionImpl.open(ManagedClientConnectionImpl.java:294)
   [junit4]    > 	at org.apache.http.impl.client.DefaultRequestDirector.tryConnect(DefaultRequestDirector.java:645)
   [junit4]    > 	at org.apache.http.impl.client.DefaultRequestDirector.execute(DefaultRequestDirector.java:480)
   [junit4]    > 	at org.apache.http.impl.client.AbstractHttpClient.execute(AbstractHttpClient.java:906)
   [junit4]    > 	at org.apache.http.impl.client.AbstractHttpClient.execute(AbstractHttpClient.java:805)
   [junit4]    > 	at org.apache.http.impl.client.AbstractHttpClient.execute(AbstractHttpClient.java:784)
   [junit4]    > 	at org.apache.solr.client.solrj.impl.HttpSolrServer.request(HttpSolrServer.java:365)
   [junit4]    > 	... 45 more
   [junit4]    > Caused by: java.net.ConnectException: Connection refused: connect
   [junit4]    > 	at java.net.DualStackPlainSocketImpl.waitForConnect(Native Method)
   [junit4]    > 	at java.net.DualStackPlainSocketImpl.socketConnect(DualStackPlainSocketImpl.java:85)
   [junit4]    > 	at java.net.AbstractPlainSocketImpl.doConnect(AbstractPlainSocketImpl.java:339)
   [junit4]    > 	at java.net.AbstractPlainSocketImpl.connectToAddress(AbstractPlainSocketImpl.java:200)
   [junit4]    > 	at java.net.AbstractPlainSocketImpl.connect(AbstractPlainSocketImpl.java:182)
   [junit4]    > 	at java.net.PlainSocketImpl.connect(PlainSocketImpl.java:172)
   [junit4]    > 	at java.net.SocksSocketImpl.connect(SocksSocketImpl.java:392)
   [junit4]    > 	at java.net.Socket.connect(Socket.java:579)
   [junit4]    > 	at org.apache.http.conn.scheme.PlainSocketFactory.connectSocket(PlainSocketFactory.java:127)
   [junit4]    > 	at org.apache.http.impl.conn.DefaultClientConnectionOperator.openConnection(DefaultClientConnectionOperator.java:180)
   [junit4]    > 	... 52 more
   [junit4]   2> 1210938 T3207 oas.SolrTestCaseJ4.deleteCore ###deleteCore
   [junit4]   2> NOTE: test params are: codec=Lucene42: {timestamp=MockFixedIntBlock(blockSize=1752), range_facet_l=MockFixedIntBlock(blockSize=1752), id=PostingsFormat(name=TestBloomFilteredLucene41Postings), range_facet_sl=PostingsFormat(name=TestBloomFilteredLucene41Postings), a_t=MockFixedIntBlock(blockSize=1752), text=Pulsing41(freqCutoff=16 minBlockSize=51 maxBlockSize=181), range_facet_si=MockFixedIntBlock(blockSize=1752), _version_=PostingsFormat(name=Lucene41VarGapFixedInterval), other_tl1=PostingsFormat(name=Lucene41VarGapFixedInterval), multiDefault=MockFixedIntBlock(blockSize=1752), a_si=PostingsFormat(name=Lucene41VarGapFixedInterval), intDefault=PostingsFormat(name=Lucene41VarGapFixedInterval)}, docValues:{timestamp=DocValuesFormat(name=CheapBastard)}, sim=RandomSimilarityProvider(queryNorm=false,coord=yes): {}, locale=es_UY, timezone=Europe/Sofia
   [junit4]   2> NOTE: Windows 7 6.1 amd64/Oracle Corporation 1.7.0_25 (64-bit)/cpus=2,threads=3,free=380555080,total=527433728
   [junit4]   2> NOTE: All tests run in this JVM: [URLClassifyProcessorTest, TestStressLucene, SolrTestCaseJ4Test, FileBasedSpellCheckerTest, PeerSyncTest, MBeansHandlerTest, TestPostingsSolrHighlighter, TestRangeQuery, RAMDirectoryFactoryTest, TestMergePolicyConfig, ChaosMonkeyNothingIsSafeTest, HdfsChaosMonkeySafeLeaderTest, DirectUpdateHandlerOptimizeTest, TestPseudoReturnFields, TermsComponentTest, DistributedQueryElevationComponentTest, TestSolrXmlPersistence, TestReplicationHandler, AnalysisAfterCoreReloadTest, CurrencyFieldOpenExchangeTest, SolrCoreTest, TestManagedSchemaFieldResource, TestCharFilters, XmlUpdateRequestHandlerTest, TestCSVLoader, TestPropInjectDefaults, TestUtils, TestPropInject, CSVRequestHandlerTest, CircularListTest, PreAnalyzedUpdateProcessorTest, TestSolrXMLSerializer, TestSchemaNameResource, TestStressReorder, OpenCloseCoreStressTest, CoreAdminHandlerTest, TestFunctionQuery, BadIndexSchemaTest, TestJmxIntegration, IndexReaderFactoryTest, SolrIndexSplitterTest, TestSchemaResource, TestBinaryField, FileUtilsTest, SpellCheckComponentTest, ZkSolrClientTest, SolrIndexConfigTest, TestTrie, DistanceFunctionTest, SortByFunctionTest, TermVectorComponentDistributedTest, ShardRoutingCustomTest, FieldAnalysisRequestHandlerTest, TestClassNameShortening, ReturnFieldsTest, NumericFieldsTest, ShowFileRequestHandlerTest, OpenExchangeRatesOrgProviderTest, BadComponentTest, TestSchemaVersionResource, SliceStateTest, TestIBSimilarityFactory, TestPhraseSuggestions, RequestHandlersTest, TestSuggestSpellingConverter, ResourceLoaderTest, TestSolr4Spatial, TestDefaultSearchFieldResource, UnloadDistributedZkTest, MoreLikeThisHandlerTest, BasicDistributedZk2Test, DisMaxRequestHandlerTest, TestComponentsName, CoreContainerCoreInitFailuresTest, TestDistributedGrouping, InfoHandlerTest, SolrPluginUtilsTest, PathHierarchyTokenizerFactoryTest, SignatureUpdateProcessorFactoryTest, TestSolrDeletionPolicy2, SimpleFacetsTest, ChaosMonkeySafeLeaderTest, TestPartialUpdateDeduplication, CollectionsAPIDistributedZkTest]
   [junit4] Completed in 277.20s, 1 test, 1 error <<< FAILURES!

[...truncated 710 lines...]
BUILD FAILED
C:\Users\JenkinsSlave\workspace\Lucene-Solr-trunk-Windows\build.xml:389: The following error occurred while executing this line:
C:\Users\JenkinsSlave\workspace\Lucene-Solr-trunk-Windows\build.xml:369: The following error occurred while executing this line:
C:\Users\JenkinsSlave\workspace\Lucene-Solr-trunk-Windows\build.xml:39: The following error occurred while executing this line:
C:\Users\JenkinsSlave\workspace\Lucene-Solr-trunk-Windows\solr\build.xml:181: The following error occurred while executing this line:
C:\Users\JenkinsSlave\workspace\Lucene-Solr-trunk-Windows\solr\common-build.xml:449: The following error occurred while executing this line:
C:\Users\JenkinsSlave\workspace\Lucene-Solr-trunk-Windows\lucene\common-build.xml:1230: The following error occurred while executing this line:
C:\Users\JenkinsSlave\workspace\Lucene-Solr-trunk-Windows\lucene\common-build.xml:873: There were test failures: 320 suites, 1345 tests, 1 error, 39 ignored (11 assumptions)

Total time: 83 minutes 40 seconds
Build step 'Invoke Ant' marked build as failure
Description set: Java: 64bit/jdk1.7.0_25 -XX:+UseCompressedOops -XX:+UseG1GC
Archiving artifacts
Recording test results
Email was triggered for: Failure
Sending email for trigger: Failure



Mime
View raw message