lucene-dev mailing list archives

Site index · List index
Message view « Date » · « Thread »
Top « Date » · « Thread »
From Policeman Jenkins Server <jenk...@thetaphi.de>
Subject [JENKINS] Lucene-Solr-4.x-Linux (64bit/jdk1.7.0_25) - Build # 6788 - Still Failing!
Date Sat, 03 Aug 2013 21:27:15 GMT
Build: http://jenkins.thetaphi.de/job/Lucene-Solr-4.x-Linux/6788/
Java: 64bit/jdk1.7.0_25 -XX:+UseCompressedOops -XX:+UseG1GC

1 tests failed.
FAILED:  org.apache.solr.cloud.CollectionsAPIDistributedZkTest.testDistribSearch

Error Message:
Server refused connection at: http://127.0.0.1:48384

Stack Trace:
org.apache.solr.client.solrj.SolrServerException: Server refused connection at: http://127.0.0.1:48384
	at __randomizedtesting.SeedInfo.seed([F6ED320C02833110:770BBC1475DC512C]:0)
	at org.apache.solr.client.solrj.impl.HttpSolrServer.request(HttpSolrServer.java:428)
	at org.apache.solr.client.solrj.impl.HttpSolrServer.request(HttpSolrServer.java:180)
	at org.apache.solr.cloud.AbstractFullDistribZkTestBase.createCollection(AbstractFullDistribZkTestBase.java:1535)
	at org.apache.solr.cloud.CollectionsAPIDistributedZkTest.testCustomCollectionsAPI(CollectionsAPIDistributedZkTest.java:677)
	at org.apache.solr.cloud.CollectionsAPIDistributedZkTest.doTest(CollectionsAPIDistributedZkTest.java:159)
	at org.apache.solr.BaseDistributedSearchTestCase.testDistribSearch(BaseDistributedSearchTestCase.java:835)
	at sun.reflect.NativeMethodAccessorImpl.invoke0(Native Method)
	at sun.reflect.NativeMethodAccessorImpl.invoke(NativeMethodAccessorImpl.java:57)
	at sun.reflect.DelegatingMethodAccessorImpl.invoke(DelegatingMethodAccessorImpl.java:43)
	at java.lang.reflect.Method.invoke(Method.java:606)
	at com.carrotsearch.randomizedtesting.RandomizedRunner.invoke(RandomizedRunner.java:1559)
	at com.carrotsearch.randomizedtesting.RandomizedRunner.access$600(RandomizedRunner.java:79)
	at com.carrotsearch.randomizedtesting.RandomizedRunner$6.evaluate(RandomizedRunner.java:737)
	at com.carrotsearch.randomizedtesting.RandomizedRunner$7.evaluate(RandomizedRunner.java:773)
	at com.carrotsearch.randomizedtesting.RandomizedRunner$8.evaluate(RandomizedRunner.java:787)
	at com.carrotsearch.randomizedtesting.rules.SystemPropertiesRestoreRule$1.evaluate(SystemPropertiesRestoreRule.java:53)
	at org.apache.lucene.util.TestRuleSetupTeardownChained$1.evaluate(TestRuleSetupTeardownChained.java:50)
	at org.apache.lucene.util.TestRuleFieldCacheSanity$1.evaluate(TestRuleFieldCacheSanity.java:51)
	at org.apache.lucene.util.AbstractBeforeAfterRule$1.evaluate(AbstractBeforeAfterRule.java:46)
	at com.carrotsearch.randomizedtesting.rules.SystemPropertiesInvariantRule$1.evaluate(SystemPropertiesInvariantRule.java:55)
	at org.apache.lucene.util.TestRuleThreadAndTestName$1.evaluate(TestRuleThreadAndTestName.java:49)
	at org.apache.lucene.util.TestRuleIgnoreAfterMaxFailures$1.evaluate(TestRuleIgnoreAfterMaxFailures.java:70)
	at org.apache.lucene.util.TestRuleMarkFailure$1.evaluate(TestRuleMarkFailure.java:48)
	at com.carrotsearch.randomizedtesting.rules.StatementAdapter.evaluate(StatementAdapter.java:36)
	at com.carrotsearch.randomizedtesting.ThreadLeakControl$StatementRunner.run(ThreadLeakControl.java:358)
	at com.carrotsearch.randomizedtesting.ThreadLeakControl.forkTimeoutingTask(ThreadLeakControl.java:782)
	at com.carrotsearch.randomizedtesting.ThreadLeakControl$3.evaluate(ThreadLeakControl.java:442)
	at com.carrotsearch.randomizedtesting.RandomizedRunner.runSingleTest(RandomizedRunner.java:746)
	at com.carrotsearch.randomizedtesting.RandomizedRunner$3.evaluate(RandomizedRunner.java:648)
	at com.carrotsearch.randomizedtesting.RandomizedRunner$4.evaluate(RandomizedRunner.java:682)
	at com.carrotsearch.randomizedtesting.RandomizedRunner$5.evaluate(RandomizedRunner.java:693)
	at com.carrotsearch.randomizedtesting.rules.StatementAdapter.evaluate(StatementAdapter.java:36)
	at com.carrotsearch.randomizedtesting.rules.SystemPropertiesRestoreRule$1.evaluate(SystemPropertiesRestoreRule.java:53)
	at org.apache.lucene.util.AbstractBeforeAfterRule$1.evaluate(AbstractBeforeAfterRule.java:46)
	at org.apache.lucene.util.TestRuleStoreClassName$1.evaluate(TestRuleStoreClassName.java:42)
	at com.carrotsearch.randomizedtesting.rules.SystemPropertiesInvariantRule$1.evaluate(SystemPropertiesInvariantRule.java:55)
	at com.carrotsearch.randomizedtesting.rules.NoShadowingOrOverridesOnMethodsRule$1.evaluate(NoShadowingOrOverridesOnMethodsRule.java:39)
	at com.carrotsearch.randomizedtesting.rules.NoShadowingOrOverridesOnMethodsRule$1.evaluate(NoShadowingOrOverridesOnMethodsRule.java:39)
	at com.carrotsearch.randomizedtesting.rules.StatementAdapter.evaluate(StatementAdapter.java:36)
	at org.apache.lucene.util.TestRuleAssertionsRequired$1.evaluate(TestRuleAssertionsRequired.java:43)
	at org.apache.lucene.util.TestRuleMarkFailure$1.evaluate(TestRuleMarkFailure.java:48)
	at org.apache.lucene.util.TestRuleIgnoreAfterMaxFailures$1.evaluate(TestRuleIgnoreAfterMaxFailures.java:70)
	at org.apache.lucene.util.TestRuleIgnoreTestSuites$1.evaluate(TestRuleIgnoreTestSuites.java:55)
	at com.carrotsearch.randomizedtesting.rules.StatementAdapter.evaluate(StatementAdapter.java:36)
	at com.carrotsearch.randomizedtesting.ThreadLeakControl$StatementRunner.run(ThreadLeakControl.java:358)
	at java.lang.Thread.run(Thread.java:724)
Caused by: org.apache.http.conn.HttpHostConnectException: Connection to http://127.0.0.1:48384 refused
	at org.apache.http.impl.conn.DefaultClientConnectionOperator.openConnection(DefaultClientConnectionOperator.java:190)
	at org.apache.http.impl.conn.ManagedClientConnectionImpl.open(ManagedClientConnectionImpl.java:294)
	at org.apache.http.impl.client.DefaultRequestDirector.tryConnect(DefaultRequestDirector.java:645)
	at org.apache.http.impl.client.DefaultRequestDirector.execute(DefaultRequestDirector.java:480)
	at org.apache.http.impl.client.AbstractHttpClient.execute(AbstractHttpClient.java:906)
	at org.apache.http.impl.client.AbstractHttpClient.execute(AbstractHttpClient.java:805)
	at org.apache.http.impl.client.AbstractHttpClient.execute(AbstractHttpClient.java:784)
	at org.apache.solr.client.solrj.impl.HttpSolrServer.request(HttpSolrServer.java:365)
	... 45 more
Caused by: java.net.ConnectException: Connection refused
	at java.net.PlainSocketImpl.socketConnect(Native Method)
	at java.net.AbstractPlainSocketImpl.doConnect(AbstractPlainSocketImpl.java:339)
	at java.net.AbstractPlainSocketImpl.connectToAddress(AbstractPlainSocketImpl.java:200)
	at java.net.AbstractPlainSocketImpl.connect(AbstractPlainSocketImpl.java:182)
	at java.net.SocksSocketImpl.connect(SocksSocketImpl.java:392)
	at java.net.Socket.connect(Socket.java:579)
	at org.apache.http.conn.scheme.PlainSocketFactory.connectSocket(PlainSocketFactory.java:127)
	at org.apache.http.impl.conn.DefaultClientConnectionOperator.openConnection(DefaultClientConnectionOperator.java:180)
	... 52 more




Build Log:
[...truncated 10079 lines...]
   [junit4] Suite: org.apache.solr.cloud.CollectionsAPIDistributedZkTest
   [junit4]   2> 764219 T2474 oas.BaseDistributedSearchTestCase.initHostContext Setting hostContext system property: /
   [junit4]   2> 764223 T2474 oas.SolrTestCaseJ4.setUp ###Starting testDistribSearch
   [junit4]   2> Creating dataDir: /mnt/ssd/jenkins/workspace/Lucene-Solr-4.x-Linux/solr/build/solr-core/test/J1/./solrtest-CollectionsAPIDistributedZkTest-1375564552975
   [junit4]   2> 764223 T2474 oasc.ZkTestServer.run STARTING ZK TEST SERVER
   [junit4]   2> 764224 T2475 oasc.ZkTestServer$ZKServerMain.runFromConfig Starting server
   [junit4]   2> 764324 T2474 oasc.ZkTestServer.run start zk server on port:50288
   [junit4]   2> 764325 T2474 oascc.ConnectionManager.waitForConnected Waiting for client to connect to ZooKeeper
   [junit4]   2> 764612 T2481 oascc.ConnectionManager.process Watcher org.apache.solr.common.cloud.ConnectionManager@1bbea1ce name:ZooKeeperConnection Watcher:127.0.0.1:50288 got event WatchedEvent state:SyncConnected type:None path:null path:null type:None
   [junit4]   2> 764612 T2474 oascc.ConnectionManager.waitForConnected Client is connected to ZooKeeper
   [junit4]   2> 764613 T2474 oascc.SolrZkClient.makePath makePath: /solr
   [junit4]   2> 764618 T2474 oascc.ConnectionManager.waitForConnected Waiting for client to connect to ZooKeeper
   [junit4]   2> 764619 T2483 oascc.ConnectionManager.process Watcher org.apache.solr.common.cloud.ConnectionManager@314a661e name:ZooKeeperConnection Watcher:127.0.0.1:50288/solr got event WatchedEvent state:SyncConnected type:None path:null path:null type:None
   [junit4]   2> 764619 T2474 oascc.ConnectionManager.waitForConnected Client is connected to ZooKeeper
   [junit4]   2> 764619 T2474 oascc.SolrZkClient.makePath makePath: /collections/collection1
   [junit4]   2> 764624 T2474 oascc.SolrZkClient.makePath makePath: /collections/collection1/shards
   [junit4]   2> 764626 T2474 oascc.SolrZkClient.makePath makePath: /collections/control_collection
   [junit4]   2> 764628 T2474 oascc.SolrZkClient.makePath makePath: /collections/control_collection/shards
   [junit4]   2> 764630 T2474 oasc.AbstractZkTestCase.putConfig put /mnt/ssd/jenkins/workspace/Lucene-Solr-4.x-Linux/solr/build/solr-core/test-files/solr/collection1/conf/solrconfig-tlog.xml to /configs/conf1/solrconfig.xml
   [junit4]   2> 764630 T2474 oascc.SolrZkClient.makePath makePath: /configs/conf1/solrconfig.xml
   [junit4]   2> 764633 T2474 oasc.AbstractZkTestCase.putConfig put /mnt/ssd/jenkins/workspace/Lucene-Solr-4.x-Linux/solr/build/solr-core/test-files/solr/collection1/conf/schema.xml to /configs/conf1/schema.xml
   [junit4]   2> 764633 T2474 oascc.SolrZkClient.makePath makePath: /configs/conf1/schema.xml
   [junit4]   2> 764636 T2474 oasc.AbstractZkTestCase.putConfig put /mnt/ssd/jenkins/workspace/Lucene-Solr-4.x-Linux/solr/build/solr-core/test-files/solr/collection1/conf/stopwords.txt to /configs/conf1/stopwords.txt
   [junit4]   2> 764636 T2474 oascc.SolrZkClient.makePath makePath: /configs/conf1/stopwords.txt
   [junit4]   2> 764638 T2474 oasc.AbstractZkTestCase.putConfig put /mnt/ssd/jenkins/workspace/Lucene-Solr-4.x-Linux/solr/build/solr-core/test-files/solr/collection1/conf/protwords.txt to /configs/conf1/protwords.txt
   [junit4]   2> 764638 T2474 oascc.SolrZkClient.makePath makePath: /configs/conf1/protwords.txt
   [junit4]   2> 764641 T2474 oasc.AbstractZkTestCase.putConfig put /mnt/ssd/jenkins/workspace/Lucene-Solr-4.x-Linux/solr/build/solr-core/test-files/solr/collection1/conf/currency.xml to /configs/conf1/currency.xml
   [junit4]   2> 764641 T2474 oascc.SolrZkClient.makePath makePath: /configs/conf1/currency.xml
   [junit4]   2> 764643 T2474 oasc.AbstractZkTestCase.putConfig put /mnt/ssd/jenkins/workspace/Lucene-Solr-4.x-Linux/solr/build/solr-core/test-files/solr/collection1/conf/open-exchange-rates.json to /configs/conf1/open-exchange-rates.json
   [junit4]   2> 764643 T2474 oascc.SolrZkClient.makePath makePath: /configs/conf1/open-exchange-rates.json
   [junit4]   2> 764645 T2474 oasc.AbstractZkTestCase.putConfig put /mnt/ssd/jenkins/workspace/Lucene-Solr-4.x-Linux/solr/build/solr-core/test-files/solr/collection1/conf/mapping-ISOLatin1Accent.txt to /configs/conf1/mapping-ISOLatin1Accent.txt
   [junit4]   2> 764645 T2474 oascc.SolrZkClient.makePath makePath: /configs/conf1/mapping-ISOLatin1Accent.txt
   [junit4]   2> 764647 T2474 oasc.AbstractZkTestCase.putConfig put /mnt/ssd/jenkins/workspace/Lucene-Solr-4.x-Linux/solr/build/solr-core/test-files/solr/collection1/conf/old_synonyms.txt to /configs/conf1/old_synonyms.txt
   [junit4]   2> 764648 T2474 oascc.SolrZkClient.makePath makePath: /configs/conf1/old_synonyms.txt
   [junit4]   2> 764650 T2474 oasc.AbstractZkTestCase.putConfig put /mnt/ssd/jenkins/workspace/Lucene-Solr-4.x-Linux/solr/build/solr-core/test-files/solr/collection1/conf/synonyms.txt to /configs/conf1/synonyms.txt
   [junit4]   2> 764650 T2474 oascc.SolrZkClient.makePath makePath: /configs/conf1/synonyms.txt
   [junit4]   2> 764718 T2474 oejs.Server.doStart jetty-8.1.10.v20130312
   [junit4]   2> 764721 T2474 oejs.AbstractConnector.doStart Started SelectChannelConnector@127.0.0.1:37339
   [junit4]   2> 764722 T2474 oass.SolrDispatchFilter.init SolrDispatchFilter.init()
   [junit4]   2> 764722 T2474 oasc.SolrResourceLoader.locateSolrHome JNDI not configured for solr (NoInitialContextEx)
   [junit4]   2> 764722 T2474 oasc.SolrResourceLoader.locateSolrHome using system property solr.solr.home: /mnt/ssd/jenkins/workspace/Lucene-Solr-4.x-Linux/solr/build/solr-core/test/J1/./org.apache.solr.cloud.CollectionsAPIDistributedZkTest-controljetty-1375564553405
   [junit4]   2> 764723 T2474 oasc.SolrResourceLoader.<init> new SolrResourceLoader for directory: '/mnt/ssd/jenkins/workspace/Lucene-Solr-4.x-Linux/solr/build/solr-core/test/J1/./org.apache.solr.cloud.CollectionsAPIDistributedZkTest-controljetty-1375564553405/'
   [junit4]   2> 764733 T2474 oasc.ConfigSolr.fromFile Loading container configuration from /mnt/ssd/jenkins/workspace/Lucene-Solr-4.x-Linux/solr/build/solr-core/test/J1/./org.apache.solr.cloud.CollectionsAPIDistributedZkTest-controljetty-1375564553405/solr.xml
   [junit4]   2> 764785 T2474 oasc.ConfigSolrXml.<init> Config-defined core root directory: 
   [junit4]   2> 764785 T2474 oasc.CoreContainer.<init> New CoreContainer 858926837
   [junit4]   2> 764785 T2474 oasc.CoreContainer.load Loading cores into CoreContainer [instanceDir=/mnt/ssd/jenkins/workspace/Lucene-Solr-4.x-Linux/solr/build/solr-core/test/J1/./org.apache.solr.cloud.CollectionsAPIDistributedZkTest-controljetty-1375564553405/]
   [junit4]   2> 764786 T2474 oashc.HttpShardHandlerFactory.getParameter Setting socketTimeout to: 120000
   [junit4]   2> 764787 T2474 oashc.HttpShardHandlerFactory.getParameter Setting urlScheme to: http://
   [junit4]   2> 764787 T2474 oashc.HttpShardHandlerFactory.getParameter Setting connTimeout to: 15000
   [junit4]   2> 764787 T2474 oashc.HttpShardHandlerFactory.getParameter Setting maxConnectionsPerHost to: 20
   [junit4]   2> 764788 T2474 oashc.HttpShardHandlerFactory.getParameter Setting corePoolSize to: 0
   [junit4]   2> 764788 T2474 oashc.HttpShardHandlerFactory.getParameter Setting maximumPoolSize to: 2147483647
   [junit4]   2> 764788 T2474 oashc.HttpShardHandlerFactory.getParameter Setting maxThreadIdleTime to: 5
   [junit4]   2> 764788 T2474 oashc.HttpShardHandlerFactory.getParameter Setting sizeOfQueue to: -1
   [junit4]   2> 764789 T2474 oashc.HttpShardHandlerFactory.getParameter Setting fairnessPolicy to: false
   [junit4]   2> 764789 T2474 oascsi.HttpClientUtil.createClient Creating new http client, config:maxConnectionsPerHost=20&maxConnections=10000&socketTimeout=120000&connTimeout=15000&retry=false
   [junit4]   2> 764792 T2474 oasc.ZkContainer.initZooKeeper Zookeeper client=127.0.0.1:50288/solr
   [junit4]   2> 764792 T2474 oasc.ZkController.checkChrootPath zkHost includes chroot
   [junit4]   2> 764793 T2474 oascc.ConnectionManager.waitForConnected Waiting for client to connect to ZooKeeper
   [junit4]   2> 764794 T2494 oascc.ConnectionManager.process Watcher org.apache.solr.common.cloud.ConnectionManager@34e883c6 name:ZooKeeperConnection Watcher:127.0.0.1:50288 got event WatchedEvent state:SyncConnected type:None path:null path:null type:None
   [junit4]   2> 764795 T2474 oascc.ConnectionManager.waitForConnected Client is connected to ZooKeeper
   [junit4]   2> 764796 T2474 oascsi.HttpClientUtil.createClient Creating new http client, config:maxConnections=500&maxConnectionsPerHost=16&socketTimeout=120000&connTimeout=15000
   [junit4]   2> 764799 T2474 oascc.ConnectionManager.waitForConnected Waiting for client to connect to ZooKeeper
   [junit4]   2> 764800 T2496 oascc.ConnectionManager.process Watcher org.apache.solr.common.cloud.ConnectionManager@4f510202 name:ZooKeeperConnection Watcher:127.0.0.1:50288/solr got event WatchedEvent state:SyncConnected type:None path:null path:null type:None
   [junit4]   2> 764801 T2474 oascc.ConnectionManager.waitForConnected Client is connected to ZooKeeper
   [junit4]   2> 764802 T2474 oascc.SolrZkClient.makePath makePath: /overseer/queue
   [junit4]   2> 764805 T2474 oascc.SolrZkClient.makePath makePath: /overseer/collection-queue-work
   [junit4]   2> 764807 T2474 oascc.SolrZkClient.makePath makePath: /live_nodes
   [junit4]   2> 764808 T2474 oasc.ZkController.createEphemeralLiveNode Register node as live in ZooKeeper:/live_nodes/127.0.0.1:37339_
   [junit4]   2> 764809 T2474 oascc.SolrZkClient.makePath makePath: /live_nodes/127.0.0.1:37339_
   [junit4]   2> 764812 T2474 oascc.SolrZkClient.makePath makePath: /overseer_elect/election
   [junit4]   2> 764815 T2474 oascc.SolrZkClient.makePath makePath: /overseer_elect/leader
   [junit4]   2> 764817 T2474 oasc.Overseer.start Overseer (id=90148998543966211-127.0.0.1:37339_-n_0000000000) starting
   [junit4]   2> 764819 T2474 oascc.SolrZkClient.makePath makePath: /overseer/queue-work
   [junit4]   2> 764822 T2498 oasc.OverseerCollectionProcessor.run Process current queue of collection creations
   [junit4]   2> 764822 T2474 oascc.SolrZkClient.makePath makePath: /clusterstate.json
   [junit4]   2> 764824 T2474 oascc.SolrZkClient.makePath makePath: /aliases.json
   [junit4]   2> 764825 T2474 oascc.ZkStateReader.createClusterStateWatchersAndUpdate Updating cluster state from ZooKeeper... 
   [junit4]   2> 764827 T2497 oasc.Overseer$ClusterStateUpdater.run Starting to work on the main queue
   [junit4]   2> 764829 T2474 oasc.CorePropertiesLocator.discover Looking for core definitions underneath /mnt/ssd/jenkins/workspace/Lucene-Solr-4.x-Linux/solr/build/solr-core/test/J1/./org.apache.solr.cloud.CollectionsAPIDistributedZkTest-controljetty-1375564553405
   [junit4]   2> 764852 T2474 oasc.CorePropertiesLocator.discoverUnder Found core conf in /mnt/ssd/jenkins/workspace/Lucene-Solr-4.x-Linux/solr/build/solr-core/test/J1/./org.apache.solr.cloud.CollectionsAPIDistributedZkTest-controljetty-1375564553405/conf/
   [junit4]   2> 764853 T2474 oasc.CorePropertiesLocator.discover Found 1 core definitions
   [junit4]   2> 764853 T2474 oass.SolrDispatchFilter.init user.dir=/mnt/ssd/jenkins/workspace/Lucene-Solr-4.x-Linux/solr/build/solr-core/test/J1
   [junit4]   2> 764854 T2474 oass.SolrDispatchFilter.init SolrDispatchFilter.init() done
   [junit4]   2> 764854 T2474 oascsi.HttpClientUtil.createClient Creating new http client, config:maxConnections=128&maxConnectionsPerHost=32&followRedirects=false
   [junit4]   2> 764857 T2474 oascsi.HttpClientUtil.createClient Creating new http client, config:
   [junit4]   2> 764858 T2474 oascc.ConnectionManager.waitForConnected Waiting for client to connect to ZooKeeper
   [junit4]   2> 764859 T2501 oascc.ConnectionManager.process Watcher org.apache.solr.common.cloud.ConnectionManager@4ff88193 name:ZooKeeperConnection Watcher:127.0.0.1:50288/solr got event WatchedEvent state:SyncConnected type:None path:null path:null type:None
   [junit4]   2> 764859 T2474 oascc.ConnectionManager.waitForConnected Client is connected to ZooKeeper
   [junit4]   2> 764861 T2474 oascc.ZkStateReader.createClusterStateWatchersAndUpdate Updating cluster state from ZooKeeper... 
   [junit4]   2> 764862 T2474 oasc.ChaosMonkey.monkeyLog monkey: init - expire sessions:true cause connection loss:true
   [junit4]   2> 764932 T2474 oejs.Server.doStart jetty-8.1.10.v20130312
   [junit4]   2> 764934 T2474 oejs.AbstractConnector.doStart Started SelectChannelConnector@127.0.0.1:48384
   [junit4]   2> 764934 T2474 oass.SolrDispatchFilter.init SolrDispatchFilter.init()
   [junit4]   2> 764935 T2474 oasc.SolrResourceLoader.locateSolrHome JNDI not configured for solr (NoInitialContextEx)
   [junit4]   2> 764935 T2474 oasc.SolrResourceLoader.locateSolrHome using system property solr.solr.home: /mnt/ssd/jenkins/workspace/Lucene-Solr-4.x-Linux/solr/build/solr-core/test/J1/./org.apache.solr.cloud.CollectionsAPIDistributedZkTest-jetty1-1375564553615
   [junit4]   2> 764935 T2474 oasc.SolrResourceLoader.<init> new SolrResourceLoader for directory: '/mnt/ssd/jenkins/workspace/Lucene-Solr-4.x-Linux/solr/build/solr-core/test/J1/./org.apache.solr.cloud.CollectionsAPIDistributedZkTest-jetty1-1375564553615/'
   [junit4]   2> 764945 T2474 oasc.ConfigSolr.fromFile Loading container configuration from /mnt/ssd/jenkins/workspace/Lucene-Solr-4.x-Linux/solr/build/solr-core/test/J1/./org.apache.solr.cloud.CollectionsAPIDistributedZkTest-jetty1-1375564553615/solr.xml
   [junit4]   2> 764976 T2474 oasc.ConfigSolrXml.<init> Config-defined core root directory: 
   [junit4]   2> 764977 T2474 oasc.CoreContainer.<init> New CoreContainer 724664023
   [junit4]   2> 764977 T2474 oasc.CoreContainer.load Loading cores into CoreContainer [instanceDir=/mnt/ssd/jenkins/workspace/Lucene-Solr-4.x-Linux/solr/build/solr-core/test/J1/./org.apache.solr.cloud.CollectionsAPIDistributedZkTest-jetty1-1375564553615/]
   [junit4]   2> 764978 T2474 oashc.HttpShardHandlerFactory.getParameter Setting socketTimeout to: 120000
   [junit4]   2> 764979 T2474 oashc.HttpShardHandlerFactory.getParameter Setting urlScheme to: http://
   [junit4]   2> 764979 T2474 oashc.HttpShardHandlerFactory.getParameter Setting connTimeout to: 15000
   [junit4]   2> 764979 T2474 oashc.HttpShardHandlerFactory.getParameter Setting maxConnectionsPerHost to: 20
   [junit4]   2> 764979 T2474 oashc.HttpShardHandlerFactory.getParameter Setting corePoolSize to: 0
   [junit4]   2> 764980 T2474 oashc.HttpShardHandlerFactory.getParameter Setting maximumPoolSize to: 2147483647
   [junit4]   2> 764980 T2474 oashc.HttpShardHandlerFactory.getParameter Setting maxThreadIdleTime to: 5
   [junit4]   2> 764980 T2474 oashc.HttpShardHandlerFactory.getParameter Setting sizeOfQueue to: -1
   [junit4]   2> 764980 T2474 oashc.HttpShardHandlerFactory.getParameter Setting fairnessPolicy to: false
   [junit4]   2> 764981 T2474 oascsi.HttpClientUtil.createClient Creating new http client, config:maxConnectionsPerHost=20&maxConnections=10000&socketTimeout=120000&connTimeout=15000&retry=false
   [junit4]   2> 764984 T2474 oasc.ZkContainer.initZooKeeper Zookeeper client=127.0.0.1:50288/solr
   [junit4]   2> 764984 T2474 oasc.ZkController.checkChrootPath zkHost includes chroot
   [junit4]   2> 764985 T2474 oascc.ConnectionManager.waitForConnected Waiting for client to connect to ZooKeeper
   [junit4]   2> 764987 T2512 oascc.ConnectionManager.process Watcher org.apache.solr.common.cloud.ConnectionManager@4a811277 name:ZooKeeperConnection Watcher:127.0.0.1:50288 got event WatchedEvent state:SyncConnected type:None path:null path:null type:None
   [junit4]   2> 764987 T2474 oascc.ConnectionManager.waitForConnected Client is connected to ZooKeeper
   [junit4]   2> 764988 T2474 oascsi.HttpClientUtil.createClient Creating new http client, config:maxConnections=500&maxConnectionsPerHost=16&socketTimeout=120000&connTimeout=15000
   [junit4]   2> 764992 T2474 oascc.ConnectionManager.waitForConnected Waiting for client to connect to ZooKeeper
   [junit4]   2> 764993 T2514 oascc.ConnectionManager.process Watcher org.apache.solr.common.cloud.ConnectionManager@b0686f2 name:ZooKeeperConnection Watcher:127.0.0.1:50288/solr got event WatchedEvent state:SyncConnected type:None path:null path:null type:None
   [junit4]   2> 764993 T2474 oascc.ConnectionManager.waitForConnected Client is connected to ZooKeeper
   [junit4]   2> 764996 T2474 oascc.ZkStateReader.createClusterStateWatchersAndUpdate Updating cluster state from ZooKeeper... 
   [junit4]   2> 765999 T2474 oasc.ZkController.createEphemeralLiveNode Register node as live in ZooKeeper:/live_nodes/127.0.0.1:48384_
   [junit4]   2> 766001 T2474 oascc.SolrZkClient.makePath makePath: /live_nodes/127.0.0.1:48384_
   [junit4]   2> 766004 T2496 oascc.ZkStateReader$3.process Updating live nodes... (2)
   [junit4]   2> 766005 T2501 oascc.ZkStateReader$3.process Updating live nodes... (2)
   [junit4]   2> 766005 T2514 oascc.ZkStateReader$3.process Updating live nodes... (2)
   [junit4]   2> 766009 T2474 oasc.CorePropertiesLocator.discover Looking for core definitions underneath /mnt/ssd/jenkins/workspace/Lucene-Solr-4.x-Linux/solr/build/solr-core/test/J1/./org.apache.solr.cloud.CollectionsAPIDistributedZkTest-jetty1-1375564553615
   [junit4]   2> 766031 T2474 oasc.CorePropertiesLocator.discoverUnder Found core conf in /mnt/ssd/jenkins/workspace/Lucene-Solr-4.x-Linux/solr/build/solr-core/test/J1/./org.apache.solr.cloud.CollectionsAPIDistributedZkTest-jetty1-1375564553615/conf/
   [junit4]   2> 766031 T2474 oasc.CorePropertiesLocator.discover Found 1 core definitions
   [junit4]   2> 766032 T2474 oass.SolrDispatchFilter.init user.dir=/mnt/ssd/jenkins/workspace/Lucene-Solr-4.x-Linux/solr/build/solr-core/test/J1
   [junit4]   2> 766032 T2474 oass.SolrDispatchFilter.init SolrDispatchFilter.init() done
   [junit4]   2> 766032 T2474 oascsi.HttpClientUtil.createClient Creating new http client, config:maxConnections=128&maxConnectionsPerHost=32&followRedirects=false
   [junit4]   2> 766097 T2474 oejs.Server.doStart jetty-8.1.10.v20130312
   [junit4]   2> 766099 T2474 oejs.AbstractConnector.doStart Started SelectChannelConnector@127.0.0.1:51039
   [junit4]   2> 766100 T2474 oass.SolrDispatchFilter.init SolrDispatchFilter.init()
   [junit4]   2> 766100 T2474 oasc.SolrResourceLoader.locateSolrHome JNDI not configured for solr (NoInitialContextEx)
   [junit4]   2> 766100 T2474 oasc.SolrResourceLoader.locateSolrHome using system property solr.solr.home: /mnt/ssd/jenkins/workspace/Lucene-Solr-4.x-Linux/solr/build/solr-core/test/J1/./org.apache.solr.cloud.CollectionsAPIDistributedZkTest-jetty2-1375564554787
   [junit4]   2> 766101 T2474 oasc.SolrResourceLoader.<init> new SolrResourceLoader for directory: '/mnt/ssd/jenkins/workspace/Lucene-Solr-4.x-Linux/solr/build/solr-core/test/J1/./org.apache.solr.cloud.CollectionsAPIDistributedZkTest-jetty2-1375564554787/'
   [junit4]   2> 766110 T2474 oasc.ConfigSolr.fromFile Loading container configuration from /mnt/ssd/jenkins/workspace/Lucene-Solr-4.x-Linux/solr/build/solr-core/test/J1/./org.apache.solr.cloud.CollectionsAPIDistributedZkTest-jetty2-1375564554787/solr.xml
   [junit4]   2> 766141 T2474 oasc.ConfigSolrXml.<init> Config-defined core root directory: 
   [junit4]   2> 766141 T2474 oasc.CoreContainer.<init> New CoreContainer 835904445
   [junit4]   2> 766141 T2474 oasc.CoreContainer.load Loading cores into CoreContainer [instanceDir=/mnt/ssd/jenkins/workspace/Lucene-Solr-4.x-Linux/solr/build/solr-core/test/J1/./org.apache.solr.cloud.CollectionsAPIDistributedZkTest-jetty2-1375564554787/]
   [junit4]   2> 766142 T2474 oashc.HttpShardHandlerFactory.getParameter Setting socketTimeout to: 120000
   [junit4]   2> 766142 T2474 oashc.HttpShardHandlerFactory.getParameter Setting urlScheme to: http://
   [junit4]   2> 766143 T2474 oashc.HttpShardHandlerFactory.getParameter Setting connTimeout to: 15000
   [junit4]   2> 766143 T2474 oashc.HttpShardHandlerFactory.getParameter Setting maxConnectionsPerHost to: 20
   [junit4]   2> 766143 T2474 oashc.HttpShardHandlerFactory.getParameter Setting corePoolSize to: 0
   [junit4]   2> 766144 T2474 oashc.HttpShardHandlerFactory.getParameter Setting maximumPoolSize to: 2147483647
   [junit4]   2> 766144 T2474 oashc.HttpShardHandlerFactory.getParameter Setting maxThreadIdleTime to: 5
   [junit4]   2> 766144 T2474 oashc.HttpShardHandlerFactory.getParameter Setting sizeOfQueue to: -1
   [junit4]   2> 766144 T2474 oashc.HttpShardHandlerFactory.getParameter Setting fairnessPolicy to: false
   [junit4]   2> 766145 T2474 oascsi.HttpClientUtil.createClient Creating new http client, config:maxConnectionsPerHost=20&maxConnections=10000&socketTimeout=120000&connTimeout=15000&retry=false
   [junit4]   2> 766147 T2474 oasc.ZkContainer.initZooKeeper Zookeeper client=127.0.0.1:50288/solr
   [junit4]   2> 766148 T2474 oasc.ZkController.checkChrootPath zkHost includes chroot
   [junit4]   2> 766148 T2474 oascc.ConnectionManager.waitForConnected Waiting for client to connect to ZooKeeper
   [junit4]   2> 766150 T2526 oascc.ConnectionManager.process Watcher org.apache.solr.common.cloud.ConnectionManager@3e86b0cc name:ZooKeeperConnection Watcher:127.0.0.1:50288 got event WatchedEvent state:SyncConnected type:None path:null path:null type:None
   [junit4]   2> 766150 T2474 oascc.ConnectionManager.waitForConnected Client is connected to ZooKeeper
   [junit4]   2> 766152 T2474 oascsi.HttpClientUtil.createClient Creating new http client, config:maxConnections=500&maxConnectionsPerHost=16&socketTimeout=120000&connTimeout=15000
   [junit4]   2> 766154 T2474 oascc.ConnectionManager.waitForConnected Waiting for client to connect to ZooKeeper
   [junit4]   2> 766155 T2528 oascc.ConnectionManager.process Watcher org.apache.solr.common.cloud.ConnectionManager@102808e5 name:ZooKeeperConnection Watcher:127.0.0.1:50288/solr got event WatchedEvent state:SyncConnected type:None path:null path:null type:None
   [junit4]   2> 766156 T2474 oascc.ConnectionManager.waitForConnected Client is connected to ZooKeeper
   [junit4]   2> 766159 T2474 oascc.ZkStateReader.createClusterStateWatchersAndUpdate Updating cluster state from ZooKeeper... 
   [junit4]   2> 767162 T2474 oasc.ZkController.createEphemeralLiveNode Register node as live in ZooKeeper:/live_nodes/127.0.0.1:51039_
   [junit4]   2> 767163 T2474 oascc.SolrZkClient.makePath makePath: /live_nodes/127.0.0.1:51039_
   [junit4]   2> 767165 T2501 oascc.ZkStateReader$3.process Updating live nodes... (3)
   [junit4]   2> 767166 T2496 oascc.ZkStateReader$3.process Updating live nodes... (3)
   [junit4]   2> 767166 T2514 oascc.ZkStateReader$3.process Updating live nodes... (3)
   [junit4]   2> 767165 T2528 oascc.ZkStateReader$3.process Updating live nodes... (3)
   [junit4]   2> 767170 T2474 oasc.CorePropertiesLocator.discover Looking for core definitions underneath /mnt/ssd/jenkins/workspace/Lucene-Solr-4.x-Linux/solr/build/solr-core/test/J1/./org.apache.solr.cloud.CollectionsAPIDistributedZkTest-jetty2-1375564554787
   [junit4]   2> 767192 T2474 oasc.CorePropertiesLocator.discoverUnder Found core conf in /mnt/ssd/jenkins/workspace/Lucene-Solr-4.x-Linux/solr/build/solr-core/test/J1/./org.apache.solr.cloud.CollectionsAPIDistributedZkTest-jetty2-1375564554787/conf/
   [junit4]   2> 767192 T2474 oasc.CorePropertiesLocator.discover Found 1 core definitions
   [junit4]   2> 767193 T2474 oass.SolrDispatchFilter.init user.dir=/mnt/ssd/jenkins/workspace/Lucene-Solr-4.x-Linux/solr/build/solr-core/test/J1
   [junit4]   2> 767193 T2474 oass.SolrDispatchFilter.init SolrDispatchFilter.init() done
   [junit4]   2> 767193 T2474 oascsi.HttpClientUtil.createClient Creating new http client, config:maxConnections=128&maxConnectionsPerHost=32&followRedirects=false
   [junit4]   2> 767257 T2474 oejs.Server.doStart jetty-8.1.10.v20130312
   [junit4]   2> 767259 T2474 oejs.AbstractConnector.doStart Started SelectChannelConnector@127.0.0.1:47548
   [junit4]   2> 767260 T2474 oass.SolrDispatchFilter.init SolrDispatchFilter.init()
   [junit4]   2> 767260 T2474 oasc.SolrResourceLoader.locateSolrHome JNDI not configured for solr (NoInitialContextEx)
   [junit4]   2> 767260 T2474 oasc.SolrResourceLoader.locateSolrHome using system property solr.solr.home: /mnt/ssd/jenkins/workspace/Lucene-Solr-4.x-Linux/solr/build/solr-core/test/J1/./org.apache.solr.cloud.CollectionsAPIDistributedZkTest-jetty3-1375564555948
   [junit4]   2> 767261 T2474 oasc.SolrResourceLoader.<init> new SolrResourceLoader for directory: '/mnt/ssd/jenkins/workspace/Lucene-Solr-4.x-Linux/solr/build/solr-core/test/J1/./org.apache.solr.cloud.CollectionsAPIDistributedZkTest-jetty3-1375564555948/'
   [junit4]   2> 767270 T2474 oasc.ConfigSolr.fromFile Loading container configuration from /mnt/ssd/jenkins/workspace/Lucene-Solr-4.x-Linux/solr/build/solr-core/test/J1/./org.apache.solr.cloud.CollectionsAPIDistributedZkTest-jetty3-1375564555948/solr.xml
   [junit4]   2> 767300 T2474 oasc.ConfigSolrXml.<init> Config-defined core root directory: 
   [junit4]   2> 767301 T2474 oasc.CoreContainer.<init> New CoreContainer 1441807318
   [junit4]   2> 767301 T2474 oasc.CoreContainer.load Loading cores into CoreContainer [instanceDir=/mnt/ssd/jenkins/workspace/Lucene-Solr-4.x-Linux/solr/build/solr-core/test/J1/./org.apache.solr.cloud.CollectionsAPIDistributedZkTest-jetty3-1375564555948/]
   [junit4]   2> 767302 T2474 oashc.HttpShardHandlerFactory.getParameter Setting socketTimeout to: 120000
   [junit4]   2> 767302 T2474 oashc.HttpShardHandlerFactory.getParameter Setting urlScheme to: http://
   [junit4]   2> 767302 T2474 oashc.HttpShardHandlerFactory.getParameter Setting connTimeout to: 15000
   [junit4]   2> 767303 T2474 oashc.HttpShardHandlerFactory.getParameter Setting maxConnectionsPerHost to: 20
   [junit4]   2> 767303 T2474 oashc.HttpShardHandlerFactory.getParameter Setting corePoolSize to: 0
   [junit4]   2> 767303 T2474 oashc.HttpShardHandlerFactory.getParameter Setting maximumPoolSize to: 2147483647
   [junit4]   2> 767303 T2474 oashc.HttpShardHandlerFactory.getParameter Setting maxThreadIdleTime to: 5
   [junit4]   2> 767304 T2474 oashc.HttpShardHandlerFactory.getParameter Setting sizeOfQueue to: -1
   [junit4]   2> 767304 T2474 oashc.HttpShardHandlerFactory.getParameter Setting fairnessPolicy to: false
   [junit4]   2> 767304 T2474 oascsi.HttpClientUtil.createClient Creating new http client, config:maxConnectionsPerHost=20&maxConnections=10000&socketTimeout=120000&connTimeout=15000&retry=false
   [junit4]   2> 767307 T2474 oasc.ZkContainer.initZooKeeper Zookeeper client=127.0.0.1:50288/solr
   [junit4]   2> 767307 T2474 oasc.ZkController.checkChrootPath zkHost includes chroot
   [junit4]   2> 767308 T2474 oascc.ConnectionManager.waitForConnected Waiting for client to connect to ZooKeeper
   [junit4]   2> 767309 T2540 oascc.ConnectionManager.process Watcher org.apache.solr.common.cloud.ConnectionManager@7bffec9 name:ZooKeeperConnection Watcher:127.0.0.1:50288 got event WatchedEvent state:SyncConnected type:None path:null path:null type:None
   [junit4]   2> 767310 T2474 oascc.ConnectionManager.waitForConnected Client is connected to ZooKeeper
   [junit4]   2> 767312 T2474 oascsi.HttpClientUtil.createClient Creating new http client, config:maxConnections=500&maxConnectionsPerHost=16&socketTimeout=120000&connTimeout=15000
   [junit4]   2> 767314 T2474 oascc.ConnectionManager.waitForConnected Waiting for client to connect to ZooKeeper
   [junit4]   2> 767316 T2542 oascc.ConnectionManager.process Watcher org.apache.solr.common.cloud.ConnectionManager@c5f1989 name:ZooKeeperConnection Watcher:127.0.0.1:50288/solr got event WatchedEvent state:SyncConnected type:None path:null path:null type:None
   [junit4]   2> 767316 T2474 oascc.ConnectionManager.waitForConnected Client is connected to ZooKeeper
   [junit4]   2> 767320 T2474 oascc.ZkStateReader.createClusterStateWatchersAndUpdate Updating cluster state from ZooKeeper... 
   [junit4]   2> 768323 T2474 oasc.ZkController.createEphemeralLiveNode Register node as live in ZooKeeper:/live_nodes/127.0.0.1:47548_
   [junit4]   2> 768324 T2474 oascc.SolrZkClient.makePath makePath: /live_nodes/127.0.0.1:47548_
   [junit4]   2> 768327 T2501 oascc.ZkStateReader$3.process Updating live nodes... (4)
   [junit4]   2> 768327 T2496 oascc.ZkStateReader$3.process Updating live nodes... (4)
   [junit4]   2> 768327 T2514 oascc.ZkStateReader$3.process Updating live nodes... (4)
   [junit4]   2> 768327 T2528 oascc.ZkStateReader$3.process Updating live nodes... (4)
   [junit4]   2> 768328 T2542 oascc.ZkStateReader$3.process Updating live nodes... (4)
   [junit4]   2> 768331 T2474 oasc.CorePropertiesLocator.discover Looking for core definitions underneath /mnt/ssd/jenkins/workspace/Lucene-Solr-4.x-Linux/solr/build/solr-core/test/J1/./org.apache.solr.cloud.CollectionsAPIDistributedZkTest-jetty3-1375564555948
   [junit4]   2> 768353 T2474 oasc.CorePropertiesLocator.discoverUnder Found core conf in /mnt/ssd/jenkins/workspace/Lucene-Solr-4.x-Linux/solr/build/solr-core/test/J1/./org.apache.solr.cloud.CollectionsAPIDistributedZkTest-jetty3-1375564555948/conf/
   [junit4]   2> 768354 T2474 oasc.CorePropertiesLocator.discover Found 1 core definitions
   [junit4]   2> 768355 T2474 oass.SolrDispatchFilter.init user.dir=/mnt/ssd/jenkins/workspace/Lucene-Solr-4.x-Linux/solr/build/solr-core/test/J1
   [junit4]   2> 768355 T2474 oass.SolrDispatchFilter.init SolrDispatchFilter.init() done
   [junit4]   2> 768355 T2474 oascsi.HttpClientUtil.createClient Creating new http client, config:maxConnections=128&maxConnectionsPerHost=32&followRedirects=false
   [junit4]   2> 768418 T2474 oejs.Server.doStart jetty-8.1.10.v20130312
   [junit4]   2> 768420 T2474 oejs.AbstractConnector.doStart Started SelectChannelConnector@127.0.0.1:49280
   [junit4]   2> 768421 T2474 oass.SolrDispatchFilter.init SolrDispatchFilter.init()
   [junit4]   2> 768421 T2474 oasc.SolrResourceLoader.locateSolrHome JNDI not configured for solr (NoInitialContextEx)
   [junit4]   2> 768422 T2474 oasc.SolrResourceLoader.locateSolrHome using system property solr.solr.home: /mnt/ssd/jenkins/workspace/Lucene-Solr-4.x-Linux/solr/build/solr-core/test/J1/./org.apache.solr.cloud.CollectionsAPIDistributedZkTest-jetty4-1375564557110
   [junit4]   2> 768422 T2474 oasc.SolrResourceLoader.<init> new SolrResourceLoader for directory: '/mnt/ssd/jenkins/workspace/Lucene-Solr-4.x-Linux/solr/build/solr-core/test/J1/./org.apache.solr.cloud.CollectionsAPIDistributedZkTest-jetty4-1375564557110/'
   [junit4]   2> 768431 T2474 oasc.ConfigSolr.fromFile Loading container configuration from /mnt/ssd/jenkins/workspace/Lucene-Solr-4.x-Linux/solr/build/solr-core/test/J1/./org.apache.solr.cloud.CollectionsAPIDistributedZkTest-jetty4-1375564557110/solr.xml
   [junit4]   2> 768481 T2474 oasc.ConfigSolrXml.<init> Config-defined core root directory: 
   [junit4]   2> 768481 T2474 oasc.CoreContainer.<init> New CoreContainer 1862482245
   [junit4]   2> 768482 T2474 oasc.CoreContainer.load Loading cores into CoreContainer [instanceDir=/mnt/ssd/jenkins/workspace/Lucene-Solr-4.x-Linux/solr/build/solr-core/test/J1/./org.apache.solr.cloud.CollectionsAPIDistributedZkTest-jetty4-1375564557110/]
   [junit4]   2> 768483 T2474 oashc.HttpShardHandlerFactory.getParameter Setting socketTimeout to: 120000
   [junit4]   2> 768483 T2474 oashc.HttpShardHandlerFactory.getParameter Setting urlScheme to: http://
   [junit4]   2> 768483 T2474 oashc.HttpShardHandlerFactory.getParameter Setting connTimeout to: 15000
   [junit4]   2> 768483 T2474 oashc.HttpShardHandlerFactory.getParameter Setting maxConnectionsPerHost to: 20
   [junit4]   2> 768484 T2474 oashc.HttpShardHandlerFactory.getParameter Setting corePoolSize to: 0
   [junit4]   2> 768484 T2474 oashc.HttpShardHandlerFactory.getParameter Setting maximumPoolSize to: 2147483647
   [junit4]   2> 768484 T2474 oashc.HttpShardHandlerFactory.getParameter Setting maxThreadIdleTime to: 5
   [junit4]   2> 768484 T2474 oashc.HttpShardHandlerFactory.getParameter Setting sizeOfQueue to: -1
   [junit4]   2> 768485 T2474 oashc.HttpShardHandlerFactory.getParameter Setting fairnessPolicy to: false
   [junit4]   2> 768485 T2474 oascsi.HttpClientUtil.createClient Creating new http client, config:maxConnectionsPerHost=20&maxConnections=10000&socketTimeout=120000&connTimeout=15000&retry=false
   [junit4]   2> 768488 T2474 oasc.ZkContainer.initZooKeeper Zookeeper client=127.0.0.1:50288/solr
   [junit4]   2> 768488 T2474 oasc.ZkController.checkChrootPath zkHost includes chroot
   [junit4]   2> 768489 T2474 oascc.ConnectionManager.waitForConnected Waiting for client to connect to ZooKeeper
   [junit4]   2> 768491 T2554 oascc.ConnectionManager.process Watcher org.apache.solr.common.cloud.ConnectionManager@686a9ef5 name:ZooKeeperConnection Watcher:127.0.0.1:50288 got event WatchedEvent state:SyncConnected type:None path:null path:null type:None
   [junit4]   2> 768491 T2474 oascc.ConnectionManager.waitForConnected Client is connected to ZooKeeper
   [junit4]   2> 768493 T2474 oascsi.HttpClientUtil.createClient Creating new http client, config:maxConnections=500&maxConnectionsPerHost=16&socketTimeout=120000&connTimeout=15000
   [junit4]   2> 768496 T2474 oascc.ConnectionManager.waitForConnected Waiting for client to connect to ZooKeeper
   [junit4]   2> 768497 T2556 oascc.ConnectionManager.process Watcher org.apache.solr.common.cloud.ConnectionManager@21416038 name:ZooKeeperConnection Watcher:127.0.0.1:50288/solr got event WatchedEvent state:SyncConnected type:None path:null path:null type:None
   [junit4]   2> 768497 T2474 oascc.ConnectionManager.waitForConnected Client is connected to ZooKeeper
   [junit4]   2> 768502 T2474 oascc.ZkStateReader.createClusterStateWatchersAndUpdate Updating cluster state from ZooKeeper... 
   [junit4]   2> 769505 T2474 oasc.ZkController.createEphemeralLiveNode Register node as live in ZooKeeper:/live_nodes/127.0.0.1:49280_
   [junit4]   2> 769506 T2474 oascc.SolrZkClient.makePath makePath: /live_nodes/127.0.0.1:49280_
   [junit4]   2> 769509 T2528 oascc.ZkStateReader$3.process Updating live nodes... (5)
   [junit4]   2> 769510 T2514 oascc.ZkStateReader$3.process Updating live nodes... (5)
   [junit4]   2> 769510 T2542 oascc.ZkStateReader$3.process Updating live nodes... (5)
   [junit4]   2> 769510 T2496 oascc.ZkStateReader$3.process Updating live nodes... (5)
   [junit4]   2> 769509 T2501 oascc.ZkStateReader$3.process Updating live nodes... (5)
   [junit4]   2> 769510 T2556 oascc.ZkStateReader$3.process Updating live nodes... (5)
   [junit4]   2> 769515 T2474 oasc.CorePropertiesLocator.discover Looking for core definitions underneath /mnt/ssd/jenkins/workspace/Lucene-Solr-4.x-Linux/solr/build/solr-core/test/J1/./org.apache.solr.cloud.CollectionsAPIDistributedZkTest-jetty4-1375564557110
   [junit4]   2> 769537 T2474 oasc.CorePropertiesLocator.discoverUnder Found core conf in /mnt/ssd/jenkins/workspace/Lucene-Solr-4.x-Linux/solr/build/solr-core/test/J1/./org.apache.solr.cloud.CollectionsAPIDistributedZkTest-jetty4-1375564557110/conf/
   [junit4]   2> 769537 T2474 oasc.CorePropertiesLocator.discover Found 1 core definitions
   [junit4]   2> 769538 T2474 oass.SolrDispatchFilter.init user.dir=/mnt/ssd/jenkins/workspace/Lucene-Solr-4.x-Linux/solr/build/solr-core/test/J1
   [junit4]   2> 769538 T2474 oass.SolrDispatchFilter.init SolrDispatchFilter.init() done
   [junit4]   2> 769538 T2474 oascsi.HttpClientUtil.createClient Creating new http client, config:maxConnections=128&maxConnectionsPerHost=32&followRedirects=false
   [junit4]   2> 769542 T2474 oascsi.HttpClientUtil.createClient Creating new http client, config:maxConnections=128&maxConnectionsPerHost=32&followRedirects=false
   [junit4]   2> 769547 T2507 oasha.CollectionsHandler.handleCreateAction Creating Collection : numShards=2&name=nodes_used_collection&replicationFactor=2&action=CREATE&wt=javabin&version=2
   [junit4]   2> 769549 T2496 oasc.DistributedQueue$LatchChildWatcher.process Watcher fired on path: /overseer/collection-queue-work state: SyncConnected type NodeChildrenChanged
   [junit4]   2> 769550 T2498 oasc.OverseerCollectionProcessor.run Overseer Collection Processor: Get the message id:/overseer/collection-queue-work/qn-0000000000 message:{
   [junit4]   2> 	  "operation":"createcollection",
   [junit4]   2> 	  "numShards":"2",
   [junit4]   2> 	  "name":"nodes_used_collection",
   [junit4]   2> 	  "replicationFactor":"2"}
   [junit4]   2> 769550 T2498 oasc.OverseerCollectionProcessor.processMessage WARN OverseerCollectionProcessor.processMessage : createcollection , {
   [junit4]   2> 	  "operation":"createcollection",
   [junit4]   2> 	  "numShards":"2",
   [junit4]   2> 	  "name":"nodes_used_collection",
   [junit4]   2> 	  "replicationFactor":"2"}
   [junit4]   2> 770836 T2497 oascc.ZkStateReader.updateClusterState Updating cloud state from ZooKeeper... 
   [junit4]   2> 770837 T2497 oasc.Overseer$ClusterStateUpdater.buildCollection building a new collection: nodes_used_collection
   [junit4]   2> 770837 T2497 oasc.Overseer$ClusterStateUpdater.createCollection Create collection nodes_used_collection with shards [shard1, shard2]
   [junit4]   2> 770840 T2501 oascc.ZkStateReader$2.process A cluster state change: WatchedEvent state:SyncConnected type:NodeDataChanged path:/clusterstate.json, has occurred - updating... (live nodes size: 5)
   [junit4]   2> 770841 T2496 oascc.ZkStateReader$2.process A cluster state change: WatchedEvent state:SyncConnected type:NodeDataChanged path:/clusterstate.json, has occurred - updating... (live nodes size: 5)
   [junit4]   2> 770841 T2556 oascc.ZkStateReader$2.process A cluster state change: WatchedEvent state:SyncConnected type:NodeDataChanged path:/clusterstate.json, has occurred - updating... (live nodes size: 5)
   [junit4]   2> 770840 T2542 oascc.ZkStateReader$2.process A cluster state change: WatchedEvent state:SyncConnected type:NodeDataChanged path:/clusterstate.json, has occurred - updating... (live nodes size: 5)
   [junit4]   2> 770840 T2528 oascc.ZkStateReader$2.process A cluster state change: WatchedEvent state:SyncConnected type:NodeDataChanged path:/clusterstate.json, has occurred - updating... (live nodes size: 5)
   [junit4]   2> 770840 T2514 oascc.ZkStateReader$2.process A cluster state change: WatchedEvent state:SyncConnected type:NodeDataChanged path:/clusterstate.json, has occurred - updating... (live nodes size: 5)
   [junit4]   2> 770857 T2498 oasc.OverseerCollectionProcessor.createCollection going to create cores replicas shardNames [shard1, shard2] , repFactor : 2
   [junit4]   2> 770857 T2498 oasc.OverseerCollectionProcessor.createCollection Creating shard nodes_used_collection_shard1_replica1 as part of slice shard1 of collection nodes_used_collection on 127.0.0.1:47548_
   [junit4]   2> 770858 T2498 oasc.OverseerCollectionProcessor.createCollection Creating shard nodes_used_collection_shard1_replica2 as part of slice shard1 of collection nodes_used_collection on 127.0.0.1:48384_
   [junit4]   2> 770858 T2498 oasc.OverseerCollectionProcessor.createCollection Creating shard nodes_used_collection_shard2_replica1 as part of slice shard2 of collection nodes_used_collection on 127.0.0.1:37339_
   [junit4]   2> 770859 T2498 oasc.OverseerCollectionProcessor.createCollection Creating shard nodes_used_collection_shard2_replica2 as part of slice shard2 of collection nodes_used_collection on 127.0.0.1:51039_
   [junit4]   2> 770860 T2509 oasc.ZkController.publish publishing core=nodes_used_collection_shard1_replica2 state=down
   [junit4]   2> 770860 T2537 oasc.ZkController.publish publishing core=nodes_used_collection_shard1_replica1 state=down
   [junit4]   2> 770860 T2489 oasc.ZkController.publish publishing core=nodes_used_collection_shard2_replica1 state=down
   [junit4]   2> 770861 T2524 oasc.ZkController.publish publishing core=nodes_used_collection_shard2_replica2 state=down
   [junit4]   2> 770862 T2509 oasc.ZkController.waitForCoreNodeName look for our core node name
   [junit4]   2> 770862 T2489 oasc.ZkController.waitForCoreNodeName look for our core node name
   [junit4]   2> 770862 T2537 oasc.ZkController.waitForCoreNodeName look for our core node name
   [junit4]   2> 770863 T2524 oasc.ZkController.waitForCoreNodeName look for our core node name
   [junit4]   2> 772345 T2497 oascc.ZkStateReader.updateClusterState Updating cloud state from ZooKeeper... 
   [junit4]   2> 772346 T2497 oasc.Overseer$ClusterStateUpdater.updateState WARN Could not find collection node for nodes_used_collection, skipping publish state
   [junit4]   2> 772346 T2497 oasc.Overseer$ClusterStateUpdater.updateState Update state numShards=2 message={
   [junit4]   2> 	  "operation":"state",
   [junit4]   2> 	  "core_node_name":"core_node1",
   [junit4]   2> 	  "numShards":"2",
   [junit4]   2> 	  "shard":"shard1",
   [junit4]   2> 	  "roles":null,
   [junit4]   2> 	  "state":"down",
   [junit4]   2> 	  "shard_state":"active",
   [junit4]   2> 	  "core":"nodes_used_collection_shard1_replica2",
   [junit4]   2> 	  "collection":"nodes_used_collection",
   [junit4]   2> 	  "shard_range":null,
   [junit4]   2> 	  "node_name":"127.0.0.1:48384_",
   [junit4]   2> 	  "base_url":"http://127.0.0.1:48384"}
   [junit4]   2> 772350 T2497 oasc.Overseer$ClusterStateUpdater.updateState WARN Could not find collection node for nodes_used_collection, skipping publish state
   [junit4]   2> 772350 T2497 oasc.Overseer$ClusterStateUpdater.updateState Update state numShards=2 message={
   [junit4]   2> 	  "operation":"state",
   [junit4]   2> 	  "core_node_name":"core_node2",
   [junit4]   2> 	  "numShards":"2",
   [junit4]   2> 	  "shard":"shard1",
   [junit4]   2> 	  "roles":null,
   [junit4]   2> 	  "state":"down",
   [junit4]   2> 	  "shard_state":"active",
   [junit4]   2> 	  "core":"nodes_used_collection_shard1_replica1",
   [junit4]   2> 	  "collection":"nodes_used_collection",
   [junit4]   2> 	  "shard_range":null,
   [junit4]   2> 	  "node_name":"127.0.0.1:47548_",
   [junit4]   2> 	  "base_url":"http://127.0.0.1:47548"}
   [junit4]   2> 772353 T2497 oasc.Overseer$ClusterStateUpdater.updateState WARN Could not find collection node for nodes_used_collection, skipping publish state
   [junit4]   2> 772353 T2497 oasc.Overseer$ClusterStateUpdater.updateState Update state numShards=2 message={
   [junit4]   2> 	  "operation":"state",
   [junit4]   2> 	  "core_node_name":"core_node3",
   [junit4]   2> 	  "numShards":"2",
   [junit4]   2> 	  "shard":"shard2",
   [junit4]   2> 	  "roles":null,
   [junit4]   2> 	  "state":"down",
   [junit4]   2> 	  "shard_state":"active",
   [junit4]   2> 	  "core":"nodes_used_collection_shard2_replica1",
   [junit4]   2> 	  "collection":"nodes_used_collection",
   [junit4]   2> 	  "shard_range":null,
   [junit4]   2> 	  "node_name":"127.0.0.1:37339_",
   [junit4]   2> 	  "base_url":"http://127.0.0.1:37339"}
   [junit4]   2> 772357 T2497 oasc.Overseer$ClusterStateUpdater.updateState WARN Could not find collection node for nodes_used_collection, skipping publish state
   [junit4]   2> 772357 T2497 oasc.Overseer$ClusterStateUpdater.updateState Update state numShards=2 message={
   [junit4]   2> 	  "operation":"state",
   [junit4]   2> 	  "core_node_name":"core_node4",
   [junit4]   2> 	  "numShards":"2",
   [junit4]   2> 	  "shard":"shard2",
   [junit4]   2> 	  "roles":null,
   [junit4]   2> 	  "state":"down",
   [junit4]   2> 	  "shard_state":"active",
   [junit4]   2> 	  "core":"nodes_used_collection_shard2_replica2",
   [junit4]   2> 	  "collection":"nodes_used_collection",
   [junit4]   2> 	  "shard_range":null,
   [junit4]   2> 	  "node_name":"127.0.0.1:51039_",
   [junit4]   2> 	  "base_url":"http://127.0.0.1:51039"}
   [junit4]   2> 772360 T2528 oascc.ZkStateReader$2.process A cluster state change: WatchedEvent state:SyncConnected type:NodeDataChanged path:/clusterstate.json, has occurred - updating... (live nodes size: 5)
   [junit4]   2> 772360 T2501 oascc.ZkStateReader$2.process A cluster state change: WatchedEvent state:SyncConnected type:NodeDataChanged path:/clusterstate.json, has occurred - updating... (live nodes size: 5)
   [junit4]   2> 772360 T2542 oascc.ZkStateReader$2.process A cluster state change: WatchedEvent state:SyncConnected type:NodeDataChanged path:/clusterstate.json, has occurred - updating... (live nodes size: 5)
   [junit4]   2> 772360 T2514 oascc.ZkStateReader$2.process A cluster state change: WatchedEvent state:SyncConnected type:NodeDataChanged path:/clusterstate.json, has occurred - updating... (live nodes size: 5)
   [junit4]   2> 772360 T2556 oascc.ZkStateReader$2.process A cluster state change: WatchedEvent state:SyncConnected type:NodeDataChanged path:/clusterstate.json, has occurred - updating... (live nodes size: 5)
   [junit4]   2> 772360 T2496 oascc.ZkStateReader$2.process A cluster state change: WatchedEvent state:SyncConnected type:NodeDataChanged path:/clusterstate.json, has occurred - updating... (live nodes size: 5)
   [junit4]   2> 772862 T2509 oasc.ZkController.waitForShardId waiting to find shard id in clusterstate for nodes_used_collection_shard1_replica2
   [junit4]   2> 772863 T2489 oasc.ZkController.waitForShardId waiting to find shard id in clusterstate for nodes_used_collection_shard2_replica1
   [junit4]   2> 772863 T2537 oasc.ZkController.waitForShardId waiting to find shard id in clusterstate for nodes_used_collection_shard1_replica1
   [junit4]   2> 772864 T2489 oasc.CorePropertiesLocator.writePropertiesFile ERROR Couldn't persist core properties to /mnt/ssd/jenkins/workspace/Lucene-Solr-4.x-Linux/solr/build/solr-core/test/J1/./org.apache.solr.cloud.CollectionsAPIDistributedZkTest-controljetty-1375564553405/nodes_used_collection_shard2_replica1/core.properties: java.io.FileNotFoundException: /mnt/ssd/jenkins/workspace/Lucene-Solr-4.x-Linux/solr/build/solr-core/test/J1/./org.apache.solr.cloud.CollectionsAPIDistributedZkTest-controljetty-1375564553405/nodes_used_collection_shard2_replica1/core.properties (No such file or directory)
   [junit4]   2> 772864 T2489 oasc.CoreContainer.create Creating SolrCore 'nodes_used_collection_shard2_replica1' using instanceDir: /mnt/ssd/jenkins/workspace/Lucene-Solr-4.x-Linux/solr/build/solr-core/test/J1/./org.apache.solr.cloud.CollectionsAPIDistributedZkTest-controljetty-1375564553405/nodes_used_collection_shard2_replica1
   [junit4]   2> 772865 T2489 oasc.ZkController.createCollectionZkNode Check for collection zkNode:nodes_used_collection
   [junit4]   2> 772864 T2524 oasc.ZkController.waitForShardId waiting to find shard id in clusterstate for nodes_used_collection_shard2_replica2
   [junit4]   2> 772863 T2509 oasc.CorePropertiesLocator.writePropertiesFile ERROR Couldn't persist core properties to /mnt/ssd/jenkins/workspace/Lucene-Solr-4.x-Linux/solr/build/solr-core/test/J1/./org.apache.solr.cloud.CollectionsAPIDistributedZkTest-jetty1-1375564553615/nodes_used_collection_shard1_replica2/core.properties: java.io.FileNotFoundException: /mnt/ssd/jenkins/workspace/Lucene-Solr-4.x-Linux/solr/build/solr-core/test/J1/./org.apache.solr.cloud.CollectionsAPIDistributedZkTest-jetty1-1375564553615/nodes_used_collection_shard1_replica2/core.properties (No such file or directory)
   [junit4]   2> 772865 T2524 oasc.CorePropertiesLocator.writePropertiesFile ERROR Couldn't persist core properties to /mnt/ssd/jenkins/workspace/Lucene-Solr-4.x-Linux/solr/build/solr-core/test/J1/./org.apache.solr.cloud.CollectionsAPIDistributedZkTest-jetty2-1375564554787/nodes_used_collection_shard2_replica2/core.properties: java.io.FileNotFoundException: /mnt/ssd/jenkins/workspace/Lucene-Solr-4.x-Linux/solr/build/solr-core/test/J1/./org.apache.solr.cloud.CollectionsAPIDistributedZkTest-jetty2-1375564554787/nodes_used_collection_shard2_replica2/core.properties (No such file or directory)
   [junit4]   2> 772866 T2524 oasc.CoreContainer.create Creating SolrCore 'nodes_used_collection_shard2_replica2' using instanceDir: /mnt/ssd/jenkins/workspace/Lucene-Solr-4.x-Linux/solr/build/solr-core/test/J1/./org.apache.solr.cloud.CollectionsAPIDistributedZkTest-jetty2-1375564554787/nodes_used_collection_shard2_replica2
   [junit4]   2> 772866 T2524 oasc.ZkController.createCollectionZkNode Check for collection zkNode:nodes_used_collection
   [junit4]   2> 772865 T2489 oasc.ZkController.createCollectionZkNode Creating collection in ZooKeeper:nodes_used_collection
   [junit4]   2> 772864 T2537 oasc.CorePropertiesLocator.writePropertiesFile ERROR Couldn't persist core properties to /mnt/ssd/jenkins/workspace/Lucene-Solr-4.x-Linux/solr/build/solr-core/test/J1/./org.apache.solr.cloud.CollectionsAPIDistributedZkTest-jetty3-1375564555948/nodes_used_collection_shard1_replica1/core.properties: java.io.FileNotFoundException: /mnt/ssd/jenkins/workspace/Lucene-Solr-4.x-Linux/solr/build/solr-core/test/J1/./org.apache.solr.cloud.CollectionsAPIDistributedZkTest-jetty3-1375564555948/nodes_used_collection_shard1_replica1/core.properties (No such file or directory)
   [junit4]   2> 772867 T2537 oasc.CoreContainer.create Creating SolrCore 'nodes_used_collection_shard1_replica1' using instanceDir: /mnt/ssd/jenkins/workspace/Lucene-Solr-4.x-Linux/solr/build/solr-core/test/J1/./org.apache.solr.cloud.CollectionsAPIDistributedZkTest-jetty3-1375564555948/nodes_used_collection_shard1_replica1
   [junit4]   2> 772867 T2537 oasc.ZkController.createCollectionZkNode Check for collection zkNode:nodes_used_collection
   [junit4]   2> 772867 T2524 oasc.ZkController.createCollectionZkNode Creating collection in ZooKeeper:nodes_used_collection
   [junit4]   2> 772867 T2489 oasc.ZkController.getConfName Looking for collection configName
   [junit4]   2> 772865 T2509 oasc.CoreContainer.create Creating SolrCore 'nodes_used_collection_shard1_replica2' using instanceDir: /mnt/ssd/jenkins/workspace/Lucene-Solr-4.x-Linux/solr/build/solr-core/test/J1/./org.apache.solr.cloud.CollectionsAPIDistributedZkTest-jetty1-1375564553615/nodes_used_collection_shard1_replica2
   [junit4]   2> 772868 T2509 oasc.ZkController.createCollectionZkNode Check for collection zkNode:nodes_used_collection
   [junit4]   2> 772868 T2537 oasc.ZkController.createCollectionZkNode Creating collection in ZooKeeper:nodes_used_collection
   [junit4]   2> 772868 T2524 oasc.ZkController.getConfName Looking for collection configName
   [junit4]   2> 772869 T2489 oasc.ZkController.getConfName Only one config set found in zk - using it:conf1
   [junit4]   2> 772869 T2537 oasc.ZkController.getConfName Looking for collection configName
   [junit4]   2> 772869 T2489 oascc.SolrZkClient.makePath makePath: /collections/nodes_used_collection
   [junit4]   2> 772869 T2509 oasc.ZkController.createCollectionZkNode Creating collection in ZooKeeper:nodes_used_collection
   [junit4]   2> 772870 T2524 oasc.ZkController.getConfName Only one config set found in zk - using it:conf1
   [junit4]   2> 772870 T2537 oasc.ZkController.getConfName Only one config set found in zk - using it:conf1
   [junit4]   2> 772870 T2509 oasc.ZkController.getConfName Looking for collection configName
   [junit4]   2> 772871 T2537 oascc.SolrZkClient.makePath makePath: /collections/nodes_used_collection
   [junit4]   2> 772870 T2524 oascc.SolrZkClient.makePath makePath: /collections/nodes_used_collection
   [junit4]   2> 772872 T2489 oasc.ZkController.readConfigName Load collection config from:/collections/nodes_used_collection
   [junit4]   2> 772873 T2509 oascc.SolrZkClient.makePath makePath: /collections/nodes_used_collection
   [junit4]   2> 772873 T2524 oasc.ZkController.readConfigName Load collection config from:/collections/nodes_used_collection
   [junit4]   2> 772874 T2537 oasc.ZkController.readConfigName Load collection config from:/collections/nodes_used_collection
   [junit4]   2> 772874 T2489 oasc.SolrResourceLoader.<init> new SolrResourceLoader for directory: '/mnt/ssd/jenkins/workspace/Lucene-Solr-4.x-Linux/solr/build/solr-core/test/J1/./org.apache.solr.cloud.CollectionsAPIDistributedZkTest-controljetty-1375564553405/nodes_used_collection_shard2_replica1/'
   [junit4]   2> 772875 T2524 oasc.SolrResourceLoader.<init> new SolrResourceLoader for directory: '/mnt/ssd/jenkins/workspace/Lucene-Solr-4.x-Linux/solr/build/solr-core/test/J1/./org.apache.solr.cloud.CollectionsAPIDistributedZkTest-jetty2-1375564554787/nodes_used_collection_shard2_replica2/'
   [junit4]   2> 772875 T2509 oasc.ZkController.readConfigName Load collection config from:/collections/nodes_used_collection
   [junit4]   2> 772875 T2537 oasc.SolrResourceLoader.<init> new SolrResourceLoader for directory: '/mnt/ssd/jenkins/workspace/Lucene-Solr-4.x-Linux/solr/build/solr-core/test/J1/./org.apache.solr.cloud.CollectionsAPIDistributedZkTest-jetty3-1375564555948/nodes_used_collection_shard1_replica1/'
   [junit4]   2> 772876 T2509 oasc.SolrResourceLoader.<init> new SolrResourceLoader for directory: '/mnt/ssd/jenkins/workspace/Lucene-Solr-4.x-Linux/solr/build/solr-core/test/J1/./org.apache.solr.cloud.CollectionsAPIDistributedZkTest-jetty1-1375564553615/nodes_used_collection_shard1_replica2/'
   [junit4]   2> 772919 T2524 oasc.SolrConfig.<init> Using Lucene MatchVersion: LUCENE_45
   [junit4]   2> 772919 T2489 oasc.SolrConfig.<init> Using Lucene MatchVersion: LUCENE_45
   [junit4]   2> 772923 T2509 oasc.SolrConfig.<init> Using Lucene MatchVersion: LUCENE_45
   [junit4]   2> 772926 T2537 oasc.SolrConfig.<init> Using Lucene MatchVersion: LUCENE_45
   [junit4]   2> 772988 T2509 oasc.SolrConfig.<init> Loaded SolrConfig: solrconfig.xml
   [junit4]   2> 772989 T2509 oass.IndexSchema.readSchema Reading Solr Schema from schema.xml
   [junit4]   2> 772993 T2489 oasc.SolrConfig.<init> Loaded SolrConfig: solrconfig.xml
   [junit4]   2> 772994 T2524 oasc.SolrConfig.<init> Loaded SolrConfig: solrconfig.xml
   [junit4]   2> 772996 T2489 oass.IndexSchema.readSchema Reading Solr Schema from schema.xml
   [junit4]   2> 772996 T2524 oass.IndexSchema.readSchema Reading Solr Schema from schema.xml
   [junit4]   2> 772997 T2509 oass.IndexSchema.readSchema [nodes_used_collection_shard1_replica2] Schema name=test
   [junit4]   2> 772998 T2537 oasc.SolrConfig.<init> Loaded SolrConfig: solrconfig.xml
   [junit4]   2> 772999 T2537 oass.IndexSchema.readSchema Reading Solr Schema from schema.xml
   [junit4]   2> 773006 T2524 oass.IndexSchema.readSchema [nodes_used_collection_shard2_replica2] Schema name=test
   [junit4]   2> 773006 T2489 oass.IndexSchema.readSchema [nodes_used_collection_shard2_replica1] Schema name=test
   [junit4]   2> 773009 T2537 oass.IndexSchema.readSchema [nodes_used_collection_shard1_replica1] Schema name=test
   [junit4]   2> 773484 T2509 oass.ByteField.init WARN ByteField is deprecated and will be removed in 5.0. You should use TrieIntField instead.
   [junit4]   2> 773485 T2509 oass.ShortField.init WARN ShortField is deprecated and will be removed in 5.0. You should use TrieIntField instead.
   [junit4]   2> 773486 T2509 oass.OpenExchangeRatesOrgProvider.init Initialized with rates=open-exchange-rates.json, refreshInterval=1440.
   [junit4]   2> 773494 T2509 oass.IndexSchema.readSchema default search field in schema is text
   [junit4]   2> 773498 T2509 oass.IndexSchema.readSchema unique key field: id
   [junit4]   2> 773515 T2509 oass.FileExchangeRateProvider.reload Reloading exchange rates from file currency.xml
   [junit4]   2> 773520 T2509 oass.FileExchangeRateProvider.reload Reloading exchange rates from file currency.xml
   [junit4]   2> 773525 T2509 oass.OpenExchangeRatesOrgProvider.reload Reloading exchange rates from open-exchange-rates.json
   [junit4]   2> 773527 T2509 oass.OpenExchangeRatesOrgProvider$OpenExchangeRates.<init> WARN Unknown key IMPORTANT NOTE
   [junit4]   2> 773527 T2509 oass.OpenExchangeRatesOrgProvider$OpenExchangeRates.<init> WARN Expected key, got STRING
   [junit4]   2> 773527 T2509 oass.OpenExchangeRatesOrgProvider.reload Reloading exchange rates from open-exchange-rates.json
   [junit4]   2> 773529 T2509 oass.OpenExchangeRatesOrgProvider$OpenExchangeRates.<init> WARN Unknown key IMPORTANT NOTE
   [junit4]   2> 773529 T2509 oass.OpenExchangeRatesOrgProvider$OpenExchangeRates.<init> WARN Expected key, got STRING
   [junit4]   2> 773530 T2509 oasc.SolrCore.initDirectoryFactory org.apache.solr.core.MockDirectoryFactory
   [junit4]   2> 773530 T2509 oasc.SolrCore.<init> [nodes_used_collection_shard1_replica2] Opening new SolrCore at /mnt/ssd/jenkins/workspace/Lucene-Solr-4.x-Linux/solr/build/solr-core/test/J1/./org.apache.solr.cloud.CollectionsAPIDistributedZkTest-jetty1-1375564553615/nodes_used_collection_shard1_replica2/, dataDir=/mnt/ssd/jenkins/workspace/Lucene-Solr-4.x-Linux/solr/build/solr-core/test/J1/./org.apache.solr.cloud.CollectionsAPIDistributedZkTest-jetty1-1375564553615//nodes_used_collection_shard1_replica2/data/
   [junit4]   2> 773531 T2509 oasc.JmxMonitoredMap.<init> JMX monitoring is enabled. Adding Solr mbeans to JMX Server: com.sun.jmx.mbeanserver.JmxMBeanServer@53e49e15
   [junit4]   2> 773532 T2509 oasc.CachingDirectoryFactory.get return new directory for /mnt/ssd/jenkins/workspace/Lucene-Solr-4.x-Linux/solr/build/solr-core/test/J1/./org.apache.solr.cloud.CollectionsAPIDistributedZkTest-jetty1-1375564553615//nodes_used_collection_shard1_replica2/data
   [junit4]   2> 773532 T2509 oasc.SolrCore.getNewIndexDir New index directory detected: old=null new=/mnt/ssd/jenkins/workspace/Lucene-Solr-4.x-Linux/solr/build/solr-core/test/J1/./org.apache.solr.cloud.CollectionsAPIDistributedZkTest-jetty1-1375564553615//nodes_used_collection_shard1_replica2/data/index/
   [junit4]   2> 773532 T2509 oasc.SolrCore.initIndex WARN [nodes_used_collection_shard1_replica2] Solr index directory '/mnt/ssd/jenkins/workspace/Lucene-Solr-4.x-Linux/solr/build/solr-core/test/J1/./org.apache.solr.cloud.CollectionsAPIDistributedZkTest-jetty1-1375564553615/nodes_used_collection_shard1_replica2/data/index' doesn't exist. Creating new index...
   [junit4]   2> 773533 T2509 oasc.CachingDirectoryFactory.get return new directory for /mnt/ssd/jenkins/workspace/Lucene-Solr-4.x-Linux/solr/build/solr-core/test/J1/./org.apache.solr.cloud.CollectionsAPIDistributedZkTest-jetty1-1375564553615//nodes_used_collection_shard1_replica2/data/index
   [junit4]   2> 773535 T2509 oasc.SolrDeletionPolicy.onCommit SolrDeletionPolicy.onCommit: commits: num=1
   [junit4]   2> 		commit{dir=MockDirWrapper(org.apache.lucene.store.RAMDirectory@82179d6 lockFactory=org.apache.lucene.store.NativeFSLockFactory@405ad49d),segFN=segments_1,generation=1}
   [junit4]   2> 773536 T2509 oasc.SolrDeletionPolicy.updateCommits newest commit generation = 1
   [junit4]   2> 773566 T2509 oasup.UpdateRequestProcessorChain.init inserting DistributedUpdateProcessorFactory into updateRequestProcessorChain "dedupe"
   [junit4]   2> 773566 T2509 oasup.UpdateRequestProcessorChain.init inserting DistributedUpdateProcessorFactory into updateRequestProcessorChain "stored_sig"
   [junit4]   2> 773567 T2509 oasup.UpdateRequestProcessorChain.init inserting DistributedUpdateProcessorFactory into updateRequestProcessorChain "distrib-dup-test-chain-implicit"
   [junit4]   2> 773568 T2509 oasc.RequestHandlers.initHandlersFromConfig created standard: solr.StandardRequestHandler
   [junit4]   2> 773569 T2509 oasc.RequestHandlers.initHandlersFromConfig created /get: solr.RealTimeGetHandler
   [junit4]   2> 773569 T2509 oasc.RequestHandlers.initHandlersFromConfig adding lazy requestHandler: solr.ReplicationHandler
   [junit4]   2> 773569 T2509 oasc.RequestHandlers.initHandlersFromConfig created /replication: solr.ReplicationHandler
   [junit4]   2> 773570 T2509 oasc.RequestHandlers.initHandlersFromConfig created /update: solr.UpdateRequestHandler
   [junit4]   2> 773571 T2509 oasc.RequestHandlers.initHandlersFromConfig created /admin/: org.apache.solr.handler.admin.AdminHandlers
   [junit4]   2> 773573 T2537 oass.ByteField.init WARN ByteField is deprecated and will be removed in 5.0. You should use TrieIntField instead.
   [junit4]   2> 773573 T2537 oass.ShortField.init WARN ShortField is deprecated and will be removed in 5.0. You should use TrieIntField instead.
   [junit4]   2> 773574 T2537 oass.OpenExchangeRatesOrgProvider.init Initialized with rates=open-exchange-rates.json, refreshInterval=1440.
   [junit4]   2> 773574 T2509 oashl.XMLLoader.init xsltCacheLifetimeSeconds=60
   [junit4]   2> 773577 T2509 oass.SolrIndexSearcher.<init> Opening Searcher@6629a7ee main
   [junit4]   2> 773578 T2509 oasu.CommitTracker.<init> Hard AutoCommit: disabled
   [junit4]   2> 773578 T2509 oasu.CommitTracker.<init> Soft AutoCommit: disabled
   [junit4]   2> 773579 T2537 oass.IndexSchema.readSchema default search field in schema is text
   [junit4]   2> 773582 T2537 oass.IndexSchema.readSchema unique key field: id
   [junit4]   2> 773585 T2562 oasc.SolrCore.registerSearcher [nodes_used_collection_shard1_replica2] Registered new searcher Searcher@6629a7ee main{StandardDirectoryReader(segments_1:1)}
   [junit4]   2> 773595 T2509 oasc.CoreContainer.registerCore registering core: nodes_used_collection_shard1_replica2
   [junit4]   2> 773596 T2509 oasc.ZkController.register Register replica - core:nodes_used_collection_shard1_replica2 address:http://127.0.0.1:48384 collection:nodes_used_collection shard:shard1
   [junit4]   2> 773596 T2489 oass.ByteField.init WARN ByteField is deprecated and will be removed in 5.0. You should use TrieIntField instead.
   [junit4]   2> 773597 T2489 oass.ShortField.init WARN ShortField is deprecated and will be removed in 5.0. You should use TrieIntField instead.
   [junit4]   2> 773597 T2489 oass.OpenExchangeRatesOrgProvider.init Initialized with rates=open-exchange-rates.json, refreshInterval=1440.
   [junit4]   2> 773596 T2509 oascsi.HttpClientUtil.createClient Creating new http client, config:maxConnections=10000&maxConnectionsPerHost=20&connTimeout=15000&socketTimeout=30000&retry=false
   [junit4]   2> 773604 T2537 oass.FileExchangeRateProvider.reload Reloading exchange rates from file currency.xml
   [junit4]   2> 773605 T2489 oass.IndexSchema.readSchema default search field in schema is text
   [junit4]   2> 773608 T2509 oascc.SolrZkClient.makePath makePath: /collections/nodes_used_collection/leader_elect/shard1/election
   [junit4]   2> 773609 T2489 oass.IndexSchema.readSchema unique key field: id
   [junit4]   2> 773611 T2537 oass.FileExchangeRateProvider.reload Reloading exchange rates from file currency.xml
   [junit4]   2> 773615 T2537 oass.OpenExchangeRatesOrgProvider.reload Reloading exchange rates from open-exchange-rates.json
   [junit4]   2> 773616 T2509 oasc.ShardLeaderElectionContext.runLeaderProcess Running the leader process for shard shard1
   [junit4]   2> 773617 T2537 oass.OpenExchangeRatesOrgProvider$OpenExchangeRates.<init> WARN Unknown key IMPORTANT NOTE
   [junit4]   2> 773617 T2537 oass.OpenExchangeRatesOrgProvider$OpenExchangeRates.<init> WARN Expected key, got STRING
   [junit4]   2> 773618 T2537 oass.OpenExchangeRatesOrgProvider.reload Reloading exchange rates from open-exchange-rates.json
   [junit4]   2> 773619 T2537 oass.OpenExchangeRatesOrgProvider$OpenExchangeRates.<init> WARN Unknown key IMPORTANT NOTE
   [junit4]   2> 773620 T2537 oass.OpenExchangeRatesOrgProvider$OpenExchangeRates.<init> WARN Expected key, got STRING
   [junit4]   2> 773620 T2509 oasc.ShardLeaderElectionContext.waitForReplicasToComeUp Waiting until we see more replicas up for shard shard1: total=2 found=1 timeoutin=179999
   [junit4]   2> 773620 T2537 oasc.SolrCore.initDirectoryFactory org.apache.solr.core.MockDirectoryFactory
   [junit4]   2> 773621 T2537 oasc.SolrCore.<init> [nodes_used_collection_shard1_replica1] Opening new SolrCore at /mnt/ssd/jenkins/workspace/Lucene-Solr-4.x-Linux/solr/build/solr-core/test/J1/./org.apache.solr.cloud.CollectionsAPIDistributedZkTest-jetty3-1375564555948/nodes_used_collection_shard1_replica1/, dataDir=/mnt/ssd/jenkins/workspace/Lucene-Solr-4.x-Linux/solr/build/solr-core/test/J1/./org.apache.solr.cloud.CollectionsAPIDistributedZkTest-jetty3-1375564555948//nodes_used_collection_shard1_replica1/data/
   [junit4]   2> 773621 T2537 oasc.JmxMonitoredMap.<init> JMX monitoring is enabled. Adding Solr mbeans to JMX Server: com.sun.jmx.mbeanserver.JmxMBeanServer@53e49e15
   [junit4]   2> 773623 T2537 oasc.CachingDirectoryFactory.get return new directory for /mnt/ssd/jenkins/workspace/Lucene-Solr-4.x-Linux/solr/build/solr-core/test/J1/./org.apache.solr.cloud.CollectionsAPIDistributedZkTest-jetty3-1375564555948//nodes_used_collection_shard1_replica1/data
   [junit4]   2> 773623 T2537 oasc.SolrCore.getNewIndexDir New index directory detected: old=null new=/mnt/ssd/jenkins/workspace/Lucene-Solr-4.x-Linux/solr/build/solr-core/test/J1/./org.apache.solr.cloud.CollectionsAPIDistributedZkTest-jetty3-1375564555948//nodes_used_collection_shard1_replica1/data/index/
   [junit4]   2> 773623 T2537 oasc.SolrCore.initIndex WARN [nodes_used_collection_shard1_replica1] Solr index directory '/mnt/ssd/jenkins/workspace/Lucene-Solr-4.x-Linux/solr/build/solr-core/test/J1/./org.apache.solr.cloud.CollectionsAPIDistributedZkTest-jetty3-1375564555948/nodes_used_collection_shard1_replica1/data/index' doesn't exist. Creating new index...
   [junit4]   2> 773624 T2537 oasc.CachingDirectoryFactory.get return new directory for /mnt/ssd/jenkins/workspace/Lucene-Solr-4.x-Linux/solr/build/solr-core/test/J1/./org.apache.solr.cloud.CollectionsAPIDistributedZkTest-jetty3-1375564555948//nodes_used_collection_shard1_replica1/data/index
   [junit4]   2> 773624 T2489 oass.FileExchangeRateProvider.reload Reloading exchange rates from file currency.xml
   [junit4]   2> 773627 T2537 oasc.SolrDeletionPolicy.onCommit SolrDeletionPolicy.onCommit: commits: num=1
   [junit4]   2> 		commit{dir=MockDirWrapper(org.apache.lucene.store.RAMDirectory@2b78eabf lockFactory=org.apache.lucene.store.NativeFSLockFactory@2699618a),segFN=segments_1,generation=1}
   [junit4]   2> 773628 T2537 oasc.SolrDeletionPolicy.updateCommits newest commit generation = 1
   [junit4]   2> 773628 T2489 oass.FileExchangeRateProvider.reload Reloading exchange rates from file currency.xml
   [junit4]   2> 773632 T2537 oasup.UpdateRequestProcessorChain.init inserting DistributedUpdateProcessorFactory into updateRequestProcessorChain "dedupe"
   [junit4]   2> 773632 T2537 oasup.UpdateRequestProcessorChain.init inserting DistributedUpdateProcessorFactory into updateRequestProcessorChain "stored_sig"
   [junit4]   2> 773633 T2537 oasup.UpdateRequestProcessorChain.init inserting DistributedUpdateProcessorFactory into updateRequestProcessorChain "distrib-dup-test-chain-implicit"
   [junit4]   2> 773633 T2489 oass.OpenExchangeRatesOrgProvider.reload Reloading exchange rates from open-exchange-rates.json
   [junit4]   2> 773633 T2537 oasc.RequestHandlers.initHandlersFromConfig created standard: solr.StandardRequestHandler
   [junit4]   2> 773634 T2537 oasc.RequestHandlers.initHandlersFromConfig created /get: solr.RealTimeGetHandler
   [junit4]   2> 773634 T2537 oasc.RequestHandlers.initHandlersFromConfig adding lazy requestHandler: solr.ReplicationHandler
   [junit4]   2> 773634 T2489 oass.OpenExchangeRatesOrgProvider$OpenExchangeRates.<init> WARN Unknown key IMPORTANT NOTE
   [junit4]   2> 773635 T2489 oass.OpenExchangeRatesOrgProvider$OpenExchangeRates.<init> WARN Expected key, got STRING
   [junit4]   2> 773635 T2489 oass.OpenExchangeRatesOrgProvider.reload Reloading exchange rates from open-exchange-rates.json
   [junit4]   2> 773635 T2537 oasc.RequestHandlers.initHandlersFromConfig created /replication: solr.ReplicationHandler
   [junit4]   2> 773636 T2537 oasc.RequestHandlers.initHandlersFromConfig created /update: solr.UpdateRequestHandler
   [junit4]   2> 773636 T2489 oass.OpenExchangeRatesOrgProvider$OpenExchangeRates.<init> WARN Unknown key IMPORTANT NOTE
   [junit4]   2> 773636 T2489 oass.OpenExchangeRatesOrgProvider$OpenExchangeRates.<init> WARN Expected key, got STRING
   [junit4]   2> 773636 T2537 oasc.RequestHandlers.initHandlersFromConfig created /admin/: org.apache.solr.handler.admin.AdminHandlers
   [junit4]   2> 773637 T2489 oasc.SolrCore.initDirectoryFactory org.apache.solr.core.MockDirectoryFactory
   [junit4]   2> 773637 T2489 oasc.SolrCore.<init> [nodes_used_collection_shard2_replica1] Opening new SolrCore at /mnt/ssd/jenkins/workspace/Lucene-Solr-4.x-Linux/solr/build/solr-core/test/J1/./org.apache.solr.cloud.CollectionsAPIDistributedZkTest-controljetty-1375564553405/nodes_used_collection_shard2_replica1/, dataDir=/mnt/ssd/jenkins/workspace/Lucene-Solr-4.x-Linux/solr/build/solr-core/test/J1/./org.apache.solr.cloud.CollectionsAPIDistributedZkTest-controljetty-1375564553405//nodes_used_collection_shard2_replica1/data/
   [junit4]   2> 773637 T2489 oasc.JmxMonitoredMap.<init> JMX monitoring is enabled. Adding Solr mbeans to JMX Server: com.sun.jmx.mbeanserver.JmxMBeanServer@53e49e15
   [junit4]   2> 773638 T2489 oasc.CachingDirectoryFactory.get return new directory for /mnt/ssd/jenkins/workspace/Lucene-Solr-4.x-Linux/solr/build/solr-core/test/J1/./org.apache.solr.cloud.CollectionsAPIDistributedZkTest-controljetty-1375564553405//nodes_used_collection_shard2_replica1/data
   [junit4]   2> 773638 T2489 oasc.SolrCore.getNewIndexDir New index directory detected: old=null new=/mnt/ssd/jenkins/workspace/Lucene-Solr-4.x-Linux/solr/build/solr-core/test/J1/./org.apache.solr.cloud.CollectionsAPIDistributedZkTest-controljetty-1375564553405//nodes_used_collection_shard2_replica1/data/index/
   [junit4]   2> 773639 T2489 oasc.SolrCore.initIndex WARN [nodes_used_collection_shard2_replica1] Solr index directory '/mnt/ssd/jenkins/workspace/Lucene-Solr-4.x-Linux/solr/build/solr-core/test/J1/./org.apache.solr.cloud.CollectionsAPIDistributedZkTest-controljetty-1375564553405/nodes_used_collection_shard2_replica1/data/index' doesn't exist. Creating new index...
   [junit4]   2> 773639 T2537 oashl.XMLLoader.init xsltCacheLifetimeSeconds=60
   [junit4]   2> 773639 T2489 oasc.CachingDirectoryFactory.get return new directory for /mnt/ssd/jenkins/workspace/Lucene-Solr-4.x-Linux/solr/build/solr-core/test/J1/./org.apache.solr.cloud.CollectionsAPIDistributedZkTest-controljetty-1375564553405//nodes_used_collection_shard2_replica1/data/index
   [junit4]   2> 773641 T2489 oasc.SolrDeletionPolicy.onCommit SolrDeletionPolicy.onCommit: commits: num=1
   [junit4]   2> 		commit{dir=MockDirWrapper(org.apache.lucene.store.RAMDirectory@61795c1 lockFactory=org.apache.lucene.store.NativeFSLockFactory@742d0adb),segFN=segments_1,generation=1}
   [junit4]   2> 773641 T2537 oass.SolrIndexSearcher.<init> Opening Searcher@5b940804 main
   [junit4]   2> 773642 T2489 oasc.SolrDeletionPolicy.updateCommits newest commit generation = 1
   [junit4]   2> 773642 T2537 oasu.CommitTracker.<init> Hard AutoCommit: disabled
   [junit4]   2> 773643 T2537 oasu.CommitTracker.<init> Soft AutoCommit: disabled
   [junit4]   2> 773646 T2563 oasc.SolrCore.registerSearcher [nodes_used_collection_shard1_replica1] Registered new searcher Searcher@5b940804 main{StandardDirectoryReader(segments_1:1)}
   [junit4]   2> 773646 T2489 oasup.UpdateRequestProcessorChain.init inserting DistributedUpdateProcessorFactory into updateRequestProcessorChain "dedupe"
   [junit4]   2> 773647 T2489 oasup.UpdateRequestProcessorChain.init inserting DistributedUpdateProcessorFactory into updateRequestProcessorChain "stored_sig"
   [junit4]   2> 773647 T2537 oasc.CoreContainer.registerCore registering core: nodes_used_collection_shard1_replica1
   [junit4]   2> 773647 T2537 oasc.ZkController.register Register replica - core:nodes_used_collection_shard1_replica1 address:http://127.0.0.1:47548 collection:nodes_used_collection shard:shard1
   [junit4]   2> 773647 T2489 oasup.UpdateRequestProcessorChain.init inserting DistributedUpdateProcessorFactory into updateRequestProcessorChain "distrib-dup-test-chain-implicit"
   [junit4]   2> 773648 T2524 oass.ByteField.init WARN ByteField is deprecated and will be removed in 5.0. You should use TrieIntField instead.
   [junit4]   2> 773648 T2537 oascsi.HttpClientUtil.createClient Creating new http client, config:maxConnections=10000&maxConnectionsPerHost=20&connTimeout=15000&socketTimeout=30000&retry=false
   [junit4]   2> 773648 T2524 oass.ShortField.init WARN ShortField is deprecated and will be removed in 5.0. You should use TrieIntField instead.
   [junit4]   2> 773648 T2489 oasc.RequestHandlers.initHandlersFromConfig created standard: solr.StandardRequestHandler
   [junit4]   2> 773649 T2524 oass.OpenExchangeRatesOrgProvider.init Initialized with rates=open-exchange-rates.json, refreshInterval=1440.
   [junit4]   2> 773649 T2489 oasc.RequestHandlers.initHandlersFromConfig created /get: solr.RealTimeGetHandler
   [junit4]   2> 773650 T2489 oasc.RequestHandlers.initHandlersFromConfig adding lazy requestHandler: solr.ReplicationHandler
   [junit4]   2> 773650 T2489 oasc.RequestHandlers.initHandlersFromConfig created /replication: solr.ReplicationHandler
   [junit4]   2> 773650 T2489 oasc.RequestHandlers.initHandlersFromConfig created /update: solr.UpdateRequestHandler
   [junit4]   2> 773651 T2489 oasc.RequestHandlers.initHandlersFromConfig created /admin/: org.apache.solr.handler.admin.AdminHandlers
   [junit4]   2> 773654 T2489 oashl.XMLLoader.init xsltCacheLifetimeSeconds=60
   [junit4]   2> 773654 T2524 oass.IndexSchema.readSchema default search field in schema is text
   [junit4]   2> 773656 T2489 oass.SolrIndexSearcher.<init> Opening Searcher@1bd382c0 main
   [junit4]   2> 773656 T2489 oasu.CommitTracker.<init> Hard AutoCommit: disabled
   [junit4]   2> 773656 T2524 oass.IndexSchema.readSchema unique key field: id
   [junit4]   2> 773656 T2489 oasu.CommitTracker.<init> Soft AutoCommit: disabled
   [junit4]   2> 773659 T2564 oasc.SolrCore.registerSearcher [nodes_used_collection_shard2_replica1] Registered new searcher Searcher@1bd382c0 main{StandardDirectoryReader(segments_1:1)}
   [junit4]   2> 773660 T2489 oasc.CoreContainer.registerCore registering core: nodes_used_collection_shard2_replica1
   [junit4]   2> 773660 T2489 oasc.ZkController.register Register replica - core:nodes_used_collection_shard2_replica1 address:http://127.0.0.1:37339 collection:nodes_used_collection shard:shard2
   [junit4]   2> 773661 T2489 oascsi.HttpClientUtil.createClient Creating new http client, config:maxConnections=10000&maxConnectionsPerHost=20&connTimeout=15000&socketTimeout=30000&retry=false
   [junit4]   2> 773663 T2489 oascc.SolrZkClient.makePath makePath: /collections/nodes_used_collection/leader_elect/shard2/election
   [junit4]   2> 773669 T2524 oass.FileExchangeRateProvider.reload Reloading exchange rates from file currency.xml
   [junit4]   2> 773671 T2489 oasc.ShardLeaderElectionContext.runLeaderProcess Running the leader process for shard shard2
   [junit4]   2> 773674 T2489 oasc.ShardLeaderElectionContext.waitForReplicasToComeUp Waiting until we see more replicas up for shard shard2: total=2 found=1 timeoutin=179999
   [junit4]   2> 773675 T2524 oass.FileExchangeRateProvider.reload Reloading exchange rates from file currency.xml
   [junit4]   2> 773678 T2524 oass.OpenExchangeRatesOrgProvider.reload Reloading exchange rates from open-exchange-rates.json
   [junit4]   2> 773679 T2524 oass.OpenExchangeRatesOrgProvider$OpenExchangeRates.<init> WARN Unknown key IMPORTANT NOTE
   [junit4]   2> 773680 T2524 oass.OpenExchangeRatesOrgProvider$OpenExchangeRates.<init> WARN Expected key, got STRING
   [junit4]   2> 773680 T2524 oass.OpenExchangeRatesOrgProvider.reload Reloading exchange rates from open-exchange-rates.json
   [junit4]   2> 773681 T2524 oass.OpenExchangeRatesOrgProvider$OpenExchangeRates.<init> WARN Unknown key IMPORTANT NOTE
   [junit4]   2> 773681 T2524 oass.OpenExchangeRatesOrgProvider$OpenExchangeRates.<init> WARN Expected key, got STRING
   [junit4]   2> 773681 T2524 oasc.SolrCore.initDirectoryFactory org.apache.solr.core.MockDirectoryFactory
   [junit4]   2> 773682 T2524 oasc.SolrCore.<init> [nodes_used_collection_shard2_replica2] Opening new SolrCore at /mnt/ssd/jenkins/workspace/Lucene-Solr-4.x-Linux/solr/build/solr-core/test/J1/./org.apache.solr.cloud.CollectionsAPIDistributedZkTest-jetty2-1375564554787/nodes_used_collection_shard2_replica2/, dataDir=/mnt/ssd/jenkins/workspace/Lucene-Solr-4.x-Linux/solr/build/solr-core/test/J1/./org.apache.solr.cloud.CollectionsAPIDistributedZkTest-jetty2-1375564554787//nodes_used_collection_shard2_replica2/data/
   [junit4]   2> 773682 T2524 oasc.JmxMonitoredMap.<init> JMX monitoring is enabled. Adding Solr mbeans to JMX Server: com.sun.jmx.mbeanserver.JmxMBeanServer@53e49e15
   [junit4]   2> 773683 T2524 oasc.CachingDirectoryFactory.get return new directory for /mnt/ssd/jenkins/workspace/Lucene-Solr-4.x-Linux/solr/build/solr-core/test/J1/./org.apache.solr.cloud.CollectionsAPIDistributedZkTest-jetty2-1375564554787//nodes_used_collection_shard2_replica2/data
   [junit4]   2> 773683 T2524 oasc.SolrCore.getNewIndexDir New index directory detected: old=null new=/mnt/ssd/jenkins/workspace/Lucene-Solr-4.x-Linux/solr/build/solr-core/test/J1/./org.apache.solr.cloud.CollectionsAPIDistributedZkTest-jetty2-1375564554787//nodes_used_collection_shard2_replica2/data/index/
   [junit4]   2> 773683 T2524 oasc.SolrCore.initIndex WARN [nodes_used_collection_shard2_replica2] Solr index directory '/mnt/ssd/jenkins/workspace/Lucene-Solr-4.x-Linux/solr/build/solr-core/test/J1/./org.apache.solr.cloud.CollectionsAPIDistributedZkTest-jetty2-1375564554787/nodes_used_collection_shard2_replica2/data/index' doesn't exist. Creating new index...
   [junit4]   2> 773684 T2524 oasc.CachingDirectoryFactory.get return new directory for /mnt/ssd/jenkins/workspace/Lucene-Solr-4.x-Linux/solr/build/solr-core/test/J1/./org.apache.solr.cloud.CollectionsAPIDistributedZkTest-jetty2-1375564554787//nodes_used_collection_shard2_replica2/data/index
   [junit4]   2> 773685 T2524 oasc.SolrDeletionPolicy.onCommit SolrDeletionPolicy.onCommit: commits: num=1
   [junit4]   2> 		commit{dir=MockDirWrapper(org.apache.lucene.store.RAMDirectory@4275454e lockFactory=org.apache.lucene.store.NativeFSLockFactory@1cf17880),segFN=segments_1,generation=1}
   [junit4]   2> 773685 T2524 oasc.SolrDeletionPolicy.updateCommits newest commit generation = 1
   [junit4]   2> 773688 T2524 oasup.UpdateRequestProcessorChain.init inserting DistributedUpdateProcessorFactory into updateRequestProcessorChain "dedupe"
   [junit4]   2> 773689 T2524 oasup.UpdateRequestProcessorChain.init inserting DistributedUpdateProcessorFactory into updateRequestProcessorChain "stored_sig"
   [junit4]   2> 773689 T2524 oasup.UpdateRequestProcessorChain.init inserting DistributedUpdateProcessorFactory into updateRequestProcessorChain "distrib-dup-test-chain-implicit"
   [junit4]   2> 773690 T2524 oasc.RequestHandlers.initHandlersFromConfig created standard: solr.StandardRequestHandler
   [junit4]   2> 773690 T2524 oasc.RequestHandlers.initHandlersFromConfig created /get: solr.RealTimeGetHandler
   [junit4]   2> 773690 T2524 oasc.RequestHandlers.initHandlersFromConfig adding lazy requestHandler: solr.ReplicationHandler
   [junit4]   2> 773691 T2524 oasc.RequestHandlers.initHandlersFromConfig created /replication: solr.ReplicationHandler
   [junit4]   2> 773691 T2524 oasc.RequestHandlers.initHandlersFromConfig created /update: solr.UpdateRequestHandler
   [junit4]   2> 773691 T2524 oasc.RequestHandlers.initHandlersFromConfig created /admin/: org.apache.solr.handler.admin.AdminHandlers
   [junit4]   2> 773694 T2524 oashl.XMLLoader.init xsltCacheLifetimeSeconds=60
   [junit4]   2> 773696 T2524 oass.SolrIndexSearcher.<init> Opening Searcher@24f33018 main
   [junit4]   2> 773697 T2524 oasu.CommitTracker.<init> Hard AutoCommit: disabled
   [junit4]   2> 773697 T2524 oasu.CommitTracker.<init> Soft AutoCommit: disabled
   [junit4]   2> 773699 T2565 oasc.SolrCore.registerSearcher [nodes_used_collection_shard2_replica2] Registered new searcher Searcher@24f33018 main{StandardDirectoryReader(segments_1:1)}
   [junit4]   2> 773700 T2524 oasc.CoreContainer.registerCore registering core: nodes_used_collection_shard2_replica2
   [junit4]   2> 773700 T2524 oasc.ZkController.register Register replica - core:nodes_used_collection_shard2_replica2 address:http://127.0.0.1:51039 collection:nodes_used_collection shard:shard2
   [junit4]   2> 773701 T2524 oascsi.HttpClientUtil.createClient Creating new http client, config:maxConnections=10000&maxConnectionsPerHost=20&connTimeout=15000&socketTimeout=30000&retry=false
   [junit4]   2> 773871 T2497 oascc.ZkStateReader.updateClusterState Updating cloud state from ZooKeeper... 
   [junit4]   2> 773877 T2528 oascc.ZkStateReader$2.process A cluster state change: WatchedEvent state:SyncConnected type:NodeDataChanged path:/clusterstate.json, has occurred - updating... (live nodes size: 5)
   [junit4]   2> 773878 T2542 oascc.ZkStateReader$2.process A cluster state change: WatchedEvent state:SyncConnected type:NodeDataChanged path:/clusterstate.json, has occurred - updating... (live nodes size: 5)
   [junit4]   2> 773878 T2556 oascc.ZkStateReader$2.process A cluster state change: WatchedEvent state:SyncConnected type:NodeDataChanged path:/clusterstate.json, has occurred - updating... (live nodes size: 5)
   [junit4]   2> 773878 T2514 oascc.ZkStateReader$2.process A cluster state change: WatchedEvent state:SyncConnected type:NodeDataChanged path:/clusterstate.json, has occurred - updating... (live nodes size: 5)
   [junit4]   2> 773878 T2496 oascc.ZkStateReader$2.process A cluster state change: WatchedEvent state:SyncConnected type:NodeDataChanged path:/clusterstate.json, has occurred - updating... (live nodes size: 5)
   [junit4]   2> 773877 T2501 oascc.ZkStateReader$2.process A cluster state change: WatchedEvent state:SyncConnected type:NodeDataChanged path:/clusterstate.json, has occurred - updating... (live nodes size: 5)
   [junit4]   2> 774121 T2509 oasc.ShardLeaderElectionContext.waitForReplicasToComeUp Enough replicas found to continue.
   [junit4]   2> 774122 T2509 oasc.ShardLeaderElectionContext.runLeaderProcess I may be the new leader - try and sync
   [junit4]   2> 774122 T2509 oasc.SyncStrategy.sync Sync replicas to http://127.0.0.1:48384/nodes_used_collection_shard1_replica2/
   [junit4]   2> 774123 T2509 oasu.PeerSync.sync PeerSync: core=nodes_used_collection_shard1_replica2 url=http://127.0.0.1:48384 START replicas=[http://127.0.0.1:47548/nodes_used_collection_shard1_replica1/] nUpdates=100
   [junit4]   2> 774123 T2509 oasu.PeerSync.sync PeerSync: core=nodes_used_collection_shard1_replica2 url=http://127.0.0.1:48384 DONE.  We have no versions.  sync failed.
   [junit4]   2> 774124 T2509 oasc.SyncStrategy.syncReplicas Leader's attempt to sync with shard failed, moving to the next candidate
   [junit4]   2> 774124 T2509 oasc.ShardLeaderElectionContext.runLeaderProcess We failed sync, but we have no versions - we can't sync in that case - we were active before, so become leader anyway
   [junit4]   2> 774124 T2509 oasc.ShardLeaderElectionContext.runLeaderProcess I am the new leader: http://127.0.0.1:48384/nodes_used_collection_shard1_replica2/ shard1
   [junit4]   2> 774125 T2509 oascc.SolrZkClient.makePath makePath: /collections/nodes_used_collec

[...truncated too long message...]

jenkins/workspace/Lucene-Solr-4.x-Linux/solr/build/solr-core/test/J1/./org.apache.solr.cloud.CollectionsAPIDistributedZkTest-jetty4-1375564557110//new_implicit_coll_1_a_replica2/data [CachedDir<<refCount=0;path=/mnt/ssd/jenkins/workspace/Lucene-Solr-4.x-Linux/solr/build/solr-core/test/J1/./org.apache.solr.cloud.CollectionsAPIDistributedZkTest-jetty4-1375564557110//new_implicit_coll_1_a_replica2/data;done=false>>]
   [junit4]   2> 896598 T2474 oasc.CachingDirectoryFactory.close Closing directory: /mnt/ssd/jenkins/workspace/Lucene-Solr-4.x-Linux/solr/build/solr-core/test/J1/./org.apache.solr.cloud.CollectionsAPIDistributedZkTest-jetty4-1375564557110//new_implicit_coll_1_a_replica2/data
   [junit4]   2> 896600 T2946 oasc.Overseer$ClusterStateUpdater.amILeader According to ZK I (id=90148998543966220-127.0.0.1:49280_-n_0000000004) am no longer a leader.
   [junit4]   2> 896601 T2556 oascc.ZkStateReader$2.process A cluster state change: WatchedEvent state:SyncConnected type:NodeChildrenChanged path:/live_nodes, has occurred - updating... (live nodes size: 1)
   [junit4]   2> 896623 T2474 oejsh.ContextHandler.doStop stopped o.e.j.s.ServletContextHandler{/,null}
   [junit4]   2> 896675 T2474 oas.SolrTestCaseJ4.tearDown ###Ending testDistribSearch
   [junit4]   2> 896677 T2474 oasc.ZkTestServer.send4LetterWord connecting to 127.0.0.1:50288 50288
   [junit4]   1> client port:0.0.0.0/0.0.0.0:0
   [junit4]   2> NOTE: reproduce with: ant test  -Dtestcase=CollectionsAPIDistributedZkTest -Dtests.method=testDistribSearch -Dtests.seed=F6ED320C02833110 -Dtests.multiplier=3 -Dtests.slow=true -Dtests.locale=es_SV -Dtests.timezone=Asia/Singapore -Dtests.file.encoding=ISO-8859-1
   [junit4] ERROR    133s J1 | CollectionsAPIDistributedZkTest.testDistribSearch <<<
   [junit4]    > Throwable #1: org.apache.solr.client.solrj.SolrServerException: Server refused connection at: http://127.0.0.1:48384
   [junit4]    > 	at __randomizedtesting.SeedInfo.seed([F6ED320C02833110:770BBC1475DC512C]:0)
   [junit4]    > 	at org.apache.solr.client.solrj.impl.HttpSolrServer.request(HttpSolrServer.java:428)
   [junit4]    > 	at org.apache.solr.client.solrj.impl.HttpSolrServer.request(HttpSolrServer.java:180)
   [junit4]    > 	at org.apache.solr.cloud.AbstractFullDistribZkTestBase.createCollection(AbstractFullDistribZkTestBase.java:1535)
   [junit4]    > 	at org.apache.solr.cloud.CollectionsAPIDistributedZkTest.testCustomCollectionsAPI(CollectionsAPIDistributedZkTest.java:677)
   [junit4]    > 	at org.apache.solr.cloud.CollectionsAPIDistributedZkTest.doTest(CollectionsAPIDistributedZkTest.java:159)
   [junit4]    > 	at org.apache.solr.BaseDistributedSearchTestCase.testDistribSearch(BaseDistributedSearchTestCase.java:835)
   [junit4]    > 	at java.lang.Thread.run(Thread.java:724)
   [junit4]    > Caused by: org.apache.http.conn.HttpHostConnectException: Connection to http://127.0.0.1:48384 refused
   [junit4]    > 	at org.apache.http.impl.conn.DefaultClientConnectionOperator.openConnection(DefaultClientConnectionOperator.java:190)
   [junit4]    > 	at org.apache.http.impl.conn.ManagedClientConnectionImpl.open(ManagedClientConnectionImpl.java:294)
   [junit4]    > 	at org.apache.http.impl.client.DefaultRequestDirector.tryConnect(DefaultRequestDirector.java:645)
   [junit4]    > 	at org.apache.http.impl.client.DefaultRequestDirector.execute(DefaultRequestDirector.java:480)
   [junit4]    > 	at org.apache.http.impl.client.AbstractHttpClient.execute(AbstractHttpClient.java:906)
   [junit4]    > 	at org.apache.http.impl.client.AbstractHttpClient.execute(AbstractHttpClient.java:805)
   [junit4]    > 	at org.apache.http.impl.client.AbstractHttpClient.execute(AbstractHttpClient.java:784)
   [junit4]    > 	at org.apache.solr.client.solrj.impl.HttpSolrServer.request(HttpSolrServer.java:365)
   [junit4]    > 	... 45 more
   [junit4]    > Caused by: java.net.ConnectException: Connection refused
   [junit4]    > 	at java.net.PlainSocketImpl.socketConnect(Native Method)
   [junit4]    > 	at java.net.AbstractPlainSocketImpl.doConnect(AbstractPlainSocketImpl.java:339)
   [junit4]    > 	at java.net.AbstractPlainSocketImpl.connectToAddress(AbstractPlainSocketImpl.java:200)
   [junit4]    > 	at java.net.AbstractPlainSocketImpl.connect(AbstractPlainSocketImpl.java:182)
   [junit4]    > 	at java.net.SocksSocketImpl.connect(SocksSocketImpl.java:392)
   [junit4]    > 	at java.net.Socket.connect(Socket.java:579)
   [junit4]    > 	at org.apache.http.conn.scheme.PlainSocketFactory.connectSocket(PlainSocketFactory.java:127)
   [junit4]    > 	at org.apache.http.impl.conn.DefaultClientConnectionOperator.openConnection(DefaultClientConnectionOperator.java:180)
   [junit4]    > 	... 52 more
   [junit4]   2> 897333 T2474 oas.SolrTestCaseJ4.deleteCore ###deleteCore
   [junit4]   2> 133118 T2473 ccr.ThreadLeakControl.checkThreadLeaks WARNING Will linger awaiting termination of 1 leaked thread(s).
   [junit4]   2> 897901 T2556 oascc.ZkStateReader$2.process WARN ZooKeeper watch triggered, but Solr cannot talk to ZK
   [junit4]   2> 897901 T2556 oascc.ZkStateReader$3.process WARN ZooKeeper watch triggered, but Solr cannot talk to ZK
   [junit4]   2> 897901 T2556 oasc.LeaderElector$1.process WARN  org.apache.zookeeper.KeeperException$SessionExpiredException: KeeperErrorCode = Session expired for /collections/new_implicit_coll_1/leader_elect/b/election
   [junit4]   2> 	at org.apache.zookeeper.KeeperException.create(KeeperException.java:127)
   [junit4]   2> 	at org.apache.zookeeper.KeeperException.create(KeeperException.java:51)
   [junit4]   2> 	at org.apache.zookeeper.ZooKeeper.getChildren(ZooKeeper.java:1468)
   [junit4]   2> 	at org.apache.solr.common.cloud.SolrZkClient$6.execute(SolrZkClient.java:235)
   [junit4]   2> 	at org.apache.solr.common.cloud.SolrZkClient$6.execute(SolrZkClient.java:232)
   [junit4]   2> 	at org.apache.solr.common.cloud.ZkCmdExecutor.retryOperation(ZkCmdExecutor.java:65)
   [junit4]   2> 	at org.apache.solr.common.cloud.SolrZkClient.getChildren(SolrZkClient.java:232)
   [junit4]   2> 	at org.apache.solr.cloud.LeaderElector.checkIfIamLeader(LeaderElector.java:84)
   [junit4]   2> 	at org.apache.solr.cloud.LeaderElector.access$000(LeaderElector.java:55)
   [junit4]   2> 	at org.apache.solr.cloud.LeaderElector$1.process(LeaderElector.java:129)
   [junit4]   2> 	at org.apache.zookeeper.ClientCnxn$EventThread.processEvent(ClientCnxn.java:519)
   [junit4]   2> 	at org.apache.zookeeper.ClientCnxn$EventThread.run(ClientCnxn.java:495)
   [junit4]   2> 
   [junit4]   2> NOTE: test params are: codec=Lucene3x, sim=DefaultSimilarity, locale=es_SV, timezone=Asia/Singapore
   [junit4]   2> NOTE: Linux 3.2.0-51-generic amd64/Oracle Corporation 1.7.0_25 (64-bit)/cpus=8,threads=8,free=238126224,total=519045120
   [junit4]   2> NOTE: All tests run in this JVM: [TestIndexSearcher, PreAnalyzedUpdateProcessorTest, AssignTest, TestUpdate, StatsComponentTest, TestDistributedSearch, SortByFunctionTest, TestHashPartitioner, OutputWriterTest, HdfsCollectionsAPIDistributedZkTest, FullSolrCloudDistribCmdsTest, CopyFieldTest, SpellCheckCollatorTest, NoCacheHeaderTest, TestCopyFieldCollectionResource, TestBM25SimilarityFactory, DebugComponentTest, TestManagedSchemaFieldResource, SuggesterTSTTest, MultiTermTest, LeaderElectionIntegrationTest, XmlUpdateRequestHandlerTest, TestFiltering, ChaosMonkeySafeLeaderTest, DirectSolrSpellCheckerTest, TestDFRSimilarityFactory, CoreAdminCreateDiscoverTest, HdfsRecoveryZkTest, DefaultValueUpdateProcessorTest, CurrencyFieldXmlFileTest, TestDynamicFieldResource, UniqFieldsUpdateProcessorFactoryTest, TestReload, DateMathParserTest, DOMUtilTest, BadIndexSchemaTest, BasicZkTest, CoreContainerCoreInitFailuresTest, TestDistributedGrouping, OpenCloseCoreStressTest, TermVectorComponentDistributedTest, SuggesterWFSTTest, StandardRequestHandlerTest, IndexSchemaRuntimeFieldTest, TestSystemIdResolver, SignatureUpdateProcessorFactoryTest, TestRangeQuery, TestIndexingPerformance, DistanceFunctionTest, TestSerializedLuceneMatchVersion, TestCoreDiscovery, TestNumberUtils, TestUtils, TestRTGBase, TestCloudManagedSchema, HdfsBasicDistributedZk2Test, TestInfoStreamLogging, TestJmxMonitoredMap, CurrencyFieldOpenExchangeTest, TestAtomicUpdateErrorCases, SpellPossibilityIteratorTest, TestAnalyzedSuggestions, TestAddFieldRealTimeGet, TestQueryTypes, TestWordDelimiterFilterFactory, TestLuceneMatchVersion, TestPropInject, TestFoldingMultitermQuery, TestFieldCollectionResource, SolrIndexConfigTest, DocumentAnalysisRequestHandlerTest, NumericFieldsTest, ShardRoutingCustomTest, JSONWriterTest, ZkSolrClientTest, TestRandomFaceting, TestSolrXMLSerializer, BasicDistributedZk2Test, CollectionsAPIDistributedZkTest]
   [junit4] Completed on J1 in 133.91s, 1 test, 1 error <<< FAILURES!

[...truncated 493 lines...]
BUILD FAILED
/mnt/ssd/jenkins/workspace/Lucene-Solr-4.x-Linux/build.xml:395: The following error occurred while executing this line:
/mnt/ssd/jenkins/workspace/Lucene-Solr-4.x-Linux/build.xml:375: The following error occurred while executing this line:
/mnt/ssd/jenkins/workspace/Lucene-Solr-4.x-Linux/build.xml:39: The following error occurred while executing this line:
/mnt/ssd/jenkins/workspace/Lucene-Solr-4.x-Linux/solr/build.xml:181: The following error occurred while executing this line:
/mnt/ssd/jenkins/workspace/Lucene-Solr-4.x-Linux/solr/common-build.xml:449: The following error occurred while executing this line:
/mnt/ssd/jenkins/workspace/Lucene-Solr-4.x-Linux/lucene/common-build.xml:1233: The following error occurred while executing this line:
/mnt/ssd/jenkins/workspace/Lucene-Solr-4.x-Linux/lucene/common-build.xml:876: There were test failures: 321 suites, 1352 tests, 1 error, 34 ignored (6 assumptions)

Total time: 44 minutes 24 seconds
Build step 'Invoke Ant' marked build as failure
Description set: Java: 64bit/jdk1.7.0_25 -XX:+UseCompressedOops -XX:+UseG1GC
Archiving artifacts
Recording test results
Email was triggered for: Failure
Sending email for trigger: Failure



Mime
View raw message