lucene-dev mailing list archives

Site index · List index
Message view « Date » · « Thread »
Top « Date » · « Thread »
From Apache Jenkins Server <jenk...@builds.apache.org>
Subject [JENKINS] Lucene-Solr-Tests-trunk-Java7 - Build # 4199 - Still Failing
Date Thu, 01 Aug 2013 09:44:08 GMT
Build: https://builds.apache.org/job/Lucene-Solr-Tests-trunk-Java7/4199/

1 tests failed.
FAILED:  org.apache.solr.cloud.CollectionsAPIDistributedZkTest.testDistribSearch

Error Message:
IOException occured when talking to server at: http://127.0.0.1:22013/e

Stack Trace:
org.apache.solr.client.solrj.SolrServerException: IOException occured when talking to server at: http://127.0.0.1:22013/e
	at __randomizedtesting.SeedInfo.seed([1AD2B6BF02D63BAB:9B3438A775895B97]:0)
	at org.apache.solr.client.solrj.impl.HttpSolrServer.request(HttpSolrServer.java:435)
	at org.apache.solr.client.solrj.impl.HttpSolrServer.request(HttpSolrServer.java:180)
	at org.apache.solr.cloud.AbstractFullDistribZkTestBase.createCollection(AbstractFullDistribZkTestBase.java:1535)
	at org.apache.solr.cloud.CollectionsAPIDistributedZkTest.testCustomCollectionsAPI(CollectionsAPIDistributedZkTest.java:677)
	at org.apache.solr.cloud.CollectionsAPIDistributedZkTest.doTest(CollectionsAPIDistributedZkTest.java:159)
	at org.apache.solr.BaseDistributedSearchTestCase.testDistribSearch(BaseDistributedSearchTestCase.java:835)
	at sun.reflect.NativeMethodAccessorImpl.invoke0(Native Method)
	at sun.reflect.NativeMethodAccessorImpl.invoke(NativeMethodAccessorImpl.java:57)
	at sun.reflect.DelegatingMethodAccessorImpl.invoke(DelegatingMethodAccessorImpl.java:43)
	at java.lang.reflect.Method.invoke(Method.java:606)
	at com.carrotsearch.randomizedtesting.RandomizedRunner.invoke(RandomizedRunner.java:1559)
	at com.carrotsearch.randomizedtesting.RandomizedRunner.access$600(RandomizedRunner.java:79)
	at com.carrotsearch.randomizedtesting.RandomizedRunner$6.evaluate(RandomizedRunner.java:737)
	at com.carrotsearch.randomizedtesting.RandomizedRunner$7.evaluate(RandomizedRunner.java:773)
	at com.carrotsearch.randomizedtesting.RandomizedRunner$8.evaluate(RandomizedRunner.java:787)
	at com.carrotsearch.randomizedtesting.rules.SystemPropertiesRestoreRule$1.evaluate(SystemPropertiesRestoreRule.java:53)
	at org.apache.lucene.util.TestRuleSetupTeardownChained$1.evaluate(TestRuleSetupTeardownChained.java:50)
	at org.apache.lucene.util.TestRuleFieldCacheSanity$1.evaluate(TestRuleFieldCacheSanity.java:51)
	at org.apache.lucene.util.AbstractBeforeAfterRule$1.evaluate(AbstractBeforeAfterRule.java:46)
	at com.carrotsearch.randomizedtesting.rules.SystemPropertiesInvariantRule$1.evaluate(SystemPropertiesInvariantRule.java:55)
	at org.apache.lucene.util.TestRuleThreadAndTestName$1.evaluate(TestRuleThreadAndTestName.java:49)
	at org.apache.lucene.util.TestRuleIgnoreAfterMaxFailures$1.evaluate(TestRuleIgnoreAfterMaxFailures.java:70)
	at org.apache.lucene.util.TestRuleMarkFailure$1.evaluate(TestRuleMarkFailure.java:48)
	at com.carrotsearch.randomizedtesting.rules.StatementAdapter.evaluate(StatementAdapter.java:36)
	at com.carrotsearch.randomizedtesting.ThreadLeakControl$StatementRunner.run(ThreadLeakControl.java:358)
	at com.carrotsearch.randomizedtesting.ThreadLeakControl.forkTimeoutingTask(ThreadLeakControl.java:782)
	at com.carrotsearch.randomizedtesting.ThreadLeakControl$3.evaluate(ThreadLeakControl.java:442)
	at com.carrotsearch.randomizedtesting.RandomizedRunner.runSingleTest(RandomizedRunner.java:746)
	at com.carrotsearch.randomizedtesting.RandomizedRunner$3.evaluate(RandomizedRunner.java:648)
	at com.carrotsearch.randomizedtesting.RandomizedRunner$4.evaluate(RandomizedRunner.java:682)
	at com.carrotsearch.randomizedtesting.RandomizedRunner$5.evaluate(RandomizedRunner.java:693)
	at com.carrotsearch.randomizedtesting.rules.StatementAdapter.evaluate(StatementAdapter.java:36)
	at com.carrotsearch.randomizedtesting.rules.SystemPropertiesRestoreRule$1.evaluate(SystemPropertiesRestoreRule.java:53)
	at org.apache.lucene.util.AbstractBeforeAfterRule$1.evaluate(AbstractBeforeAfterRule.java:46)
	at org.apache.lucene.util.TestRuleStoreClassName$1.evaluate(TestRuleStoreClassName.java:42)
	at com.carrotsearch.randomizedtesting.rules.SystemPropertiesInvariantRule$1.evaluate(SystemPropertiesInvariantRule.java:55)
	at com.carrotsearch.randomizedtesting.rules.NoShadowingOrOverridesOnMethodsRule$1.evaluate(NoShadowingOrOverridesOnMethodsRule.java:39)
	at com.carrotsearch.randomizedtesting.rules.NoShadowingOrOverridesOnMethodsRule$1.evaluate(NoShadowingOrOverridesOnMethodsRule.java:39)
	at com.carrotsearch.randomizedtesting.rules.StatementAdapter.evaluate(StatementAdapter.java:36)
	at org.apache.lucene.util.TestRuleAssertionsRequired$1.evaluate(TestRuleAssertionsRequired.java:43)
	at org.apache.lucene.util.TestRuleMarkFailure$1.evaluate(TestRuleMarkFailure.java:48)
	at org.apache.lucene.util.TestRuleIgnoreAfterMaxFailures$1.evaluate(TestRuleIgnoreAfterMaxFailures.java:70)
	at org.apache.lucene.util.TestRuleIgnoreTestSuites$1.evaluate(TestRuleIgnoreTestSuites.java:55)
	at com.carrotsearch.randomizedtesting.rules.StatementAdapter.evaluate(StatementAdapter.java:36)
	at com.carrotsearch.randomizedtesting.ThreadLeakControl$StatementRunner.run(ThreadLeakControl.java:358)
	at java.lang.Thread.run(Thread.java:724)
Caused by: org.apache.http.conn.ConnectTimeoutException: Connect to 127.0.0.1:22013 timed out
	at org.apache.http.conn.scheme.PlainSocketFactory.connectSocket(PlainSocketFactory.java:129)
	at org.apache.http.impl.conn.DefaultClientConnectionOperator.openConnection(DefaultClientConnectionOperator.java:180)
	at org.apache.http.impl.conn.ManagedClientConnectionImpl.open(ManagedClientConnectionImpl.java:294)
	at org.apache.http.impl.client.DefaultRequestDirector.tryConnect(DefaultRequestDirector.java:645)
	at org.apache.http.impl.client.DefaultRequestDirector.execute(DefaultRequestDirector.java:480)
	at org.apache.http.impl.client.AbstractHttpClient.execute(AbstractHttpClient.java:906)
	at org.apache.http.impl.client.AbstractHttpClient.execute(AbstractHttpClient.java:805)
	at org.apache.http.impl.client.AbstractHttpClient.execute(AbstractHttpClient.java:784)
	at org.apache.solr.client.solrj.impl.HttpSolrServer.request(HttpSolrServer.java:365)
	... 45 more




Build Log:
[...truncated 9815 lines...]
   [junit4] Suite: org.apache.solr.cloud.CollectionsAPIDistributedZkTest
   [junit4]   2> 1624415 T2622 oas.BaseDistributedSearchTestCase.initHostContext Setting hostContext system property: /e/
   [junit4]   2> 1624425 T2622 oas.SolrTestCaseJ4.setUp ###Starting testDistribSearch
   [junit4]   2> Creating dataDir: /usr/home/hudson/hudson-slave/workspace/Lucene-Solr-Tests-trunk-Java7/solr/build/solr-core/test/J1/./solrtest-CollectionsAPIDistributedZkTest-1375349466395
   [junit4]   2> 1624428 T2622 oasc.ZkTestServer.run STARTING ZK TEST SERVER
   [junit4]   2> 1624428 T2623 oasc.ZkTestServer$ZKServerMain.runFromConfig Starting server
   [junit4]   2> 1624529 T2622 oasc.ZkTestServer.run start zk server on port:16076
   [junit4]   2> 1624530 T2622 oascc.ConnectionManager.waitForConnected Waiting for client to connect to ZooKeeper
   [junit4]   2> 1624535 T2629 oascc.ConnectionManager.process Watcher org.apache.solr.common.cloud.ConnectionManager@fb60aba name:ZooKeeperConnection Watcher:127.0.0.1:16076 got event WatchedEvent state:SyncConnected type:None path:null path:null type:None
   [junit4]   2> 1624535 T2622 oascc.ConnectionManager.waitForConnected Client is connected to ZooKeeper
   [junit4]   2> 1624536 T2622 oascc.SolrZkClient.makePath makePath: /solr
   [junit4]   2> 1624554 T2622 oascc.ConnectionManager.waitForConnected Waiting for client to connect to ZooKeeper
   [junit4]   2> 1624556 T2631 oascc.ConnectionManager.process Watcher org.apache.solr.common.cloud.ConnectionManager@450f6989 name:ZooKeeperConnection Watcher:127.0.0.1:16076/solr got event WatchedEvent state:SyncConnected type:None path:null path:null type:None
   [junit4]   2> 1624557 T2622 oascc.ConnectionManager.waitForConnected Client is connected to ZooKeeper
   [junit4]   2> 1624557 T2622 oascc.SolrZkClient.makePath makePath: /collections/collection1
   [junit4]   2> 1624566 T2622 oascc.SolrZkClient.makePath makePath: /collections/collection1/shards
   [junit4]   2> 1624570 T2622 oascc.SolrZkClient.makePath makePath: /collections/control_collection
   [junit4]   2> 1624577 T2622 oascc.SolrZkClient.makePath makePath: /collections/control_collection/shards
   [junit4]   2> 1624581 T2622 oasc.AbstractZkTestCase.putConfig put /usr/home/hudson/hudson-slave/workspace/Lucene-Solr-Tests-trunk-Java7/solr/build/solr-core/test-files/solr/collection1/conf/solrconfig-tlog.xml to /configs/conf1/solrconfig.xml
   [junit4]   2> 1624582 T2622 oascc.SolrZkClient.makePath makePath: /configs/conf1/solrconfig.xml
   [junit4]   2> 1624594 T2622 oasc.AbstractZkTestCase.putConfig put /usr/home/hudson/hudson-slave/workspace/Lucene-Solr-Tests-trunk-Java7/solr/build/solr-core/test-files/solr/collection1/conf/schema.xml to /configs/conf1/schema.xml
   [junit4]   2> 1624595 T2622 oascc.SolrZkClient.makePath makePath: /configs/conf1/schema.xml
   [junit4]   2> 1624700 T2622 oasc.AbstractZkTestCase.putConfig put /usr/home/hudson/hudson-slave/workspace/Lucene-Solr-Tests-trunk-Java7/solr/build/solr-core/test-files/solr/collection1/conf/stopwords.txt to /configs/conf1/stopwords.txt
   [junit4]   2> 1624701 T2622 oascc.SolrZkClient.makePath makePath: /configs/conf1/stopwords.txt
   [junit4]   2> 1624704 T2622 oasc.AbstractZkTestCase.putConfig put /usr/home/hudson/hudson-slave/workspace/Lucene-Solr-Tests-trunk-Java7/solr/build/solr-core/test-files/solr/collection1/conf/protwords.txt to /configs/conf1/protwords.txt
   [junit4]   2> 1624705 T2622 oascc.SolrZkClient.makePath makePath: /configs/conf1/protwords.txt
   [junit4]   2> 1624709 T2622 oasc.AbstractZkTestCase.putConfig put /usr/home/hudson/hudson-slave/workspace/Lucene-Solr-Tests-trunk-Java7/solr/build/solr-core/test-files/solr/collection1/conf/currency.xml to /configs/conf1/currency.xml
   [junit4]   2> 1624709 T2622 oascc.SolrZkClient.makePath makePath: /configs/conf1/currency.xml
   [junit4]   2> 1624713 T2622 oasc.AbstractZkTestCase.putConfig put /usr/home/hudson/hudson-slave/workspace/Lucene-Solr-Tests-trunk-Java7/solr/build/solr-core/test-files/solr/collection1/conf/open-exchange-rates.json to /configs/conf1/open-exchange-rates.json
   [junit4]   2> 1624714 T2622 oascc.SolrZkClient.makePath makePath: /configs/conf1/open-exchange-rates.json
   [junit4]   2> 1624717 T2622 oasc.AbstractZkTestCase.putConfig put /usr/home/hudson/hudson-slave/workspace/Lucene-Solr-Tests-trunk-Java7/solr/build/solr-core/test-files/solr/collection1/conf/mapping-ISOLatin1Accent.txt to /configs/conf1/mapping-ISOLatin1Accent.txt
   [junit4]   2> 1624718 T2622 oascc.SolrZkClient.makePath makePath: /configs/conf1/mapping-ISOLatin1Accent.txt
   [junit4]   2> 1624721 T2622 oasc.AbstractZkTestCase.putConfig put /usr/home/hudson/hudson-slave/workspace/Lucene-Solr-Tests-trunk-Java7/solr/build/solr-core/test-files/solr/collection1/conf/old_synonyms.txt to /configs/conf1/old_synonyms.txt
   [junit4]   2> 1624722 T2622 oascc.SolrZkClient.makePath makePath: /configs/conf1/old_synonyms.txt
   [junit4]   2> 1624725 T2622 oasc.AbstractZkTestCase.putConfig put /usr/home/hudson/hudson-slave/workspace/Lucene-Solr-Tests-trunk-Java7/solr/build/solr-core/test-files/solr/collection1/conf/synonyms.txt to /configs/conf1/synonyms.txt
   [junit4]   2> 1624726 T2622 oascc.SolrZkClient.makePath makePath: /configs/conf1/synonyms.txt
   [junit4]   2> 1625019 T2622 oejs.Server.doStart jetty-8.1.10.v20130312
   [junit4]   2> 1625025 T2622 oejs.AbstractConnector.doStart Started SocketConnector@127.0.0.1:22468
   [junit4]   2> 1625026 T2622 oass.SolrDispatchFilter.init SolrDispatchFilter.init()
   [junit4]   2> 1625026 T2622 oasc.SolrResourceLoader.locateSolrHome JNDI not configured for solr (NoInitialContextEx)
   [junit4]   2> 1625027 T2622 oasc.SolrResourceLoader.locateSolrHome using system property solr.solr.home: /usr/home/hudson/hudson-slave/workspace/Lucene-Solr-Tests-trunk-Java7/solr/build/solr-core/test/J1/./org.apache.solr.cloud.CollectionsAPIDistributedZkTest-controljetty-1375349466699
   [junit4]   2> 1625027 T2622 oasc.SolrResourceLoader.<init> new SolrResourceLoader for directory: '/usr/home/hudson/hudson-slave/workspace/Lucene-Solr-Tests-trunk-Java7/solr/build/solr-core/test/J1/./org.apache.solr.cloud.CollectionsAPIDistributedZkTest-controljetty-1375349466699/'
   [junit4]   2> 1625070 T2622 oasc.ConfigSolr.fromFile Loading container configuration from /usr/home/hudson/hudson-slave/workspace/Lucene-Solr-Tests-trunk-Java7/solr/build/solr-core/test/J1/./org.apache.solr.cloud.CollectionsAPIDistributedZkTest-controljetty-1375349466699/solr.xml
   [junit4]   2> 1625170 T2622 oasc.ConfigSolrXml.<init> Config-defined core root directory: 
   [junit4]   2> 1625171 T2622 oasc.CoreContainer.<init> New CoreContainer 909033330
   [junit4]   2> 1625171 T2622 oasc.CoreContainer.load Loading cores into CoreContainer [instanceDir=/usr/home/hudson/hudson-slave/workspace/Lucene-Solr-Tests-trunk-Java7/solr/build/solr-core/test/J1/./org.apache.solr.cloud.CollectionsAPIDistributedZkTest-controljetty-1375349466699/]
   [junit4]   2> 1625173 T2622 oashc.HttpShardHandlerFactory.getParameter Setting socketTimeout to: 120000
   [junit4]   2> 1625174 T2622 oashc.HttpShardHandlerFactory.getParameter Setting urlScheme to: http://
   [junit4]   2> 1625174 T2622 oashc.HttpShardHandlerFactory.getParameter Setting connTimeout to: 15000
   [junit4]   2> 1625175 T2622 oashc.HttpShardHandlerFactory.getParameter Setting maxConnectionsPerHost to: 20
   [junit4]   2> 1625175 T2622 oashc.HttpShardHandlerFactory.getParameter Setting corePoolSize to: 0
   [junit4]   2> 1625176 T2622 oashc.HttpShardHandlerFactory.getParameter Setting maximumPoolSize to: 2147483647
   [junit4]   2> 1625176 T2622 oashc.HttpShardHandlerFactory.getParameter Setting maxThreadIdleTime to: 5
   [junit4]   2> 1625177 T2622 oashc.HttpShardHandlerFactory.getParameter Setting sizeOfQueue to: -1
   [junit4]   2> 1625177 T2622 oashc.HttpShardHandlerFactory.getParameter Setting fairnessPolicy to: false
   [junit4]   2> 1625178 T2622 oascsi.HttpClientUtil.createClient Creating new http client, config:maxConnectionsPerHost=20&maxConnections=10000&socketTimeout=120000&connTimeout=15000&retry=false
   [junit4]   2> 1625195 T2622 oasc.ZkContainer.initZooKeeper Zookeeper client=127.0.0.1:16076/solr
   [junit4]   2> 1625195 T2622 oasc.ZkController.checkChrootPath zkHost includes chroot
   [junit4]   2> 1625197 T2622 oascc.ConnectionManager.waitForConnected Waiting for client to connect to ZooKeeper
   [junit4]   2> 1625253 T2642 oascc.ConnectionManager.process Watcher org.apache.solr.common.cloud.ConnectionManager@19afaf38 name:ZooKeeperConnection Watcher:127.0.0.1:16076 got event WatchedEvent state:SyncConnected type:None path:null path:null type:None
   [junit4]   2> 1625254 T2622 oascc.ConnectionManager.waitForConnected Client is connected to ZooKeeper
   [junit4]   2> 1625257 T2622 oascsi.HttpClientUtil.createClient Creating new http client, config:maxConnections=500&maxConnectionsPerHost=16&socketTimeout=120000&connTimeout=15000
   [junit4]   2> 1625269 T2622 oascc.ConnectionManager.waitForConnected Waiting for client to connect to ZooKeeper
   [junit4]   2> 1625289 T2644 oascc.ConnectionManager.process Watcher org.apache.solr.common.cloud.ConnectionManager@5315ed18 name:ZooKeeperConnection Watcher:127.0.0.1:16076/solr got event WatchedEvent state:SyncConnected type:None path:null path:null type:None
   [junit4]   2> 1625290 T2622 oascc.ConnectionManager.waitForConnected Client is connected to ZooKeeper
   [junit4]   2> 1625300 T2622 oascc.SolrZkClient.makePath makePath: /overseer/queue
   [junit4]   2> 1625418 T2622 oascc.SolrZkClient.makePath makePath: /overseer/collection-queue-work
   [junit4]   2> 1625513 T2622 oascc.SolrZkClient.makePath makePath: /live_nodes
   [junit4]   2> 1625547 T2622 oasc.ZkController.createEphemeralLiveNode Register node as live in ZooKeeper:/live_nodes/127.0.0.1:22468_e
   [junit4]   2> 1625582 T2622 oascc.SolrZkClient.makePath makePath: /live_nodes/127.0.0.1:22468_e
   [junit4]   2> 1625586 T2622 oascc.SolrZkClient.makePath makePath: /overseer_elect/election
   [junit4]   2> 1625699 T2622 oascc.SolrZkClient.makePath makePath: /overseer_elect/leader
   [junit4]   2> 1625702 T2622 oasc.Overseer.start Overseer (id=90134902630187011-127.0.0.1:22468_e-n_0000000000) starting
   [junit4]   2> 1625715 T2622 oascc.SolrZkClient.makePath makePath: /overseer/queue-work
   [junit4]   2> 1625727 T2646 oasc.OverseerCollectionProcessor.run Process current queue of collection creations
   [junit4]   2> 1625728 T2622 oascc.SolrZkClient.makePath makePath: /clusterstate.json
   [junit4]   2> 1625731 T2622 oascc.SolrZkClient.makePath makePath: /aliases.json
   [junit4]   2> 1625734 T2622 oascc.ZkStateReader.createClusterStateWatchersAndUpdate Updating cluster state from ZooKeeper... 
   [junit4]   2> 1625737 T2645 oasc.Overseer$ClusterStateUpdater.run Starting to work on the main queue
   [junit4]   2> 1625741 T2622 oasc.CorePropertiesLocator.discover Looking for core definitions underneath /usr/home/hudson/hudson-slave/workspace/Lucene-Solr-Tests-trunk-Java7/solr/build/solr-core/test/J1/./org.apache.solr.cloud.CollectionsAPIDistributedZkTest-controljetty-1375349466699
   [junit4]   2> 1625745 T2622 oasc.CorePropertiesLocator.discoverUnder Found core conf in /usr/home/hudson/hudson-slave/workspace/Lucene-Solr-Tests-trunk-Java7/solr/build/solr-core/test/J1/./org.apache.solr.cloud.CollectionsAPIDistributedZkTest-controljetty-1375349466699/conf/
   [junit4]   2> 1625931 T2622 oasc.CorePropertiesLocator.discover Found 1 core definitions
   [junit4]   2> 1625932 T2622 oass.SolrDispatchFilter.init user.dir=/usr/home/hudson/hudson-slave/workspace/Lucene-Solr-Tests-trunk-Java7/solr/build/solr-core/test/J1
   [junit4]   2> 1625932 T2622 oass.SolrDispatchFilter.init SolrDispatchFilter.init() done
   [junit4]   2> 1625933 T2622 oascsi.HttpClientUtil.createClient Creating new http client, config:maxConnections=128&maxConnectionsPerHost=32&followRedirects=false
   [junit4]   2> 1625949 T2622 oascsi.HttpClientUtil.createClient Creating new http client, config:
   [junit4]   2> 1625951 T2622 oascc.ConnectionManager.waitForConnected Waiting for client to connect to ZooKeeper
   [junit4]   2> 1625979 T2649 oascc.ConnectionManager.process Watcher org.apache.solr.common.cloud.ConnectionManager@688e1882 name:ZooKeeperConnection Watcher:127.0.0.1:16076/solr got event WatchedEvent state:SyncConnected type:None path:null path:null type:None
   [junit4]   2> 1625980 T2622 oascc.ConnectionManager.waitForConnected Client is connected to ZooKeeper
   [junit4]   2> 1625982 T2622 oascc.ZkStateReader.createClusterStateWatchersAndUpdate Updating cluster state from ZooKeeper... 
   [junit4]   2> 1625984 T2622 oasc.ChaosMonkey.monkeyLog monkey: init - expire sessions:true cause connection loss:true
   [junit4]   2> 1626273 T2622 oejs.Server.doStart jetty-8.1.10.v20130312
   [junit4]   2> 1626276 T2622 oejs.AbstractConnector.doStart Started SocketConnector@127.0.0.1:22013
   [junit4]   2> 1626277 T2622 oass.SolrDispatchFilter.init SolrDispatchFilter.init()
   [junit4]   2> 1626278 T2622 oasc.SolrResourceLoader.locateSolrHome JNDI not configured for solr (NoInitialContextEx)
   [junit4]   2> 1626278 T2622 oasc.SolrResourceLoader.locateSolrHome using system property solr.solr.home: /usr/home/hudson/hudson-slave/workspace/Lucene-Solr-Tests-trunk-Java7/solr/build/solr-core/test/J1/./org.apache.solr.cloud.CollectionsAPIDistributedZkTest-jetty1-1375349467953
   [junit4]   2> 1626279 T2622 oasc.SolrResourceLoader.<init> new SolrResourceLoader for directory: '/usr/home/hudson/hudson-slave/workspace/Lucene-Solr-Tests-trunk-Java7/solr/build/solr-core/test/J1/./org.apache.solr.cloud.CollectionsAPIDistributedZkTest-jetty1-1375349467953/'
   [junit4]   2> 1626320 T2622 oasc.ConfigSolr.fromFile Loading container configuration from /usr/home/hudson/hudson-slave/workspace/Lucene-Solr-Tests-trunk-Java7/solr/build/solr-core/test/J1/./org.apache.solr.cloud.CollectionsAPIDistributedZkTest-jetty1-1375349467953/solr.xml
   [junit4]   2> 1626418 T2622 oasc.ConfigSolrXml.<init> Config-defined core root directory: 
   [junit4]   2> 1626419 T2622 oasc.CoreContainer.<init> New CoreContainer 693920914
   [junit4]   2> 1626420 T2622 oasc.CoreContainer.load Loading cores into CoreContainer [instanceDir=/usr/home/hudson/hudson-slave/workspace/Lucene-Solr-Tests-trunk-Java7/solr/build/solr-core/test/J1/./org.apache.solr.cloud.CollectionsAPIDistributedZkTest-jetty1-1375349467953/]
   [junit4]   2> 1626422 T2622 oashc.HttpShardHandlerFactory.getParameter Setting socketTimeout to: 120000
   [junit4]   2> 1626422 T2622 oashc.HttpShardHandlerFactory.getParameter Setting urlScheme to: http://
   [junit4]   2> 1626423 T2622 oashc.HttpShardHandlerFactory.getParameter Setting connTimeout to: 15000
   [junit4]   2> 1626423 T2622 oashc.HttpShardHandlerFactory.getParameter Setting maxConnectionsPerHost to: 20
   [junit4]   2> 1626424 T2622 oashc.HttpShardHandlerFactory.getParameter Setting corePoolSize to: 0
   [junit4]   2> 1626424 T2622 oashc.HttpShardHandlerFactory.getParameter Setting maximumPoolSize to: 2147483647
   [junit4]   2> 1626425 T2622 oashc.HttpShardHandlerFactory.getParameter Setting maxThreadIdleTime to: 5
   [junit4]   2> 1626425 T2622 oashc.HttpShardHandlerFactory.getParameter Setting sizeOfQueue to: -1
   [junit4]   2> 1626426 T2622 oashc.HttpShardHandlerFactory.getParameter Setting fairnessPolicy to: false
   [junit4]   2> 1626426 T2622 oascsi.HttpClientUtil.createClient Creating new http client, config:maxConnectionsPerHost=20&maxConnections=10000&socketTimeout=120000&connTimeout=15000&retry=false
   [junit4]   2> 1626444 T2622 oasc.ZkContainer.initZooKeeper Zookeeper client=127.0.0.1:16076/solr
   [junit4]   2> 1626445 T2622 oasc.ZkController.checkChrootPath zkHost includes chroot
   [junit4]   2> 1626446 T2622 oascc.ConnectionManager.waitForConnected Waiting for client to connect to ZooKeeper
   [junit4]   2> 1626449 T2660 oascc.ConnectionManager.process Watcher org.apache.solr.common.cloud.ConnectionManager@6681fd21 name:ZooKeeperConnection Watcher:127.0.0.1:16076 got event WatchedEvent state:SyncConnected type:None path:null path:null type:None
   [junit4]   2> 1626450 T2622 oascc.ConnectionManager.waitForConnected Client is connected to ZooKeeper
   [junit4]   2> 1626469 T2622 oascsi.HttpClientUtil.createClient Creating new http client, config:maxConnections=500&maxConnectionsPerHost=16&socketTimeout=120000&connTimeout=15000
   [junit4]   2> 1626482 T2622 oascc.ConnectionManager.waitForConnected Waiting for client to connect to ZooKeeper
   [junit4]   2> 1626484 T2662 oascc.ConnectionManager.process Watcher org.apache.solr.common.cloud.ConnectionManager@270deef8 name:ZooKeeperConnection Watcher:127.0.0.1:16076/solr got event WatchedEvent state:SyncConnected type:None path:null path:null type:None
   [junit4]   2> 1626485 T2622 oascc.ConnectionManager.waitForConnected Client is connected to ZooKeeper
   [junit4]   2> 1626491 T2622 oascc.ZkStateReader.createClusterStateWatchersAndUpdate Updating cluster state from ZooKeeper... 
   [junit4]   2> 1627494 T2622 oasc.ZkController.createEphemeralLiveNode Register node as live in ZooKeeper:/live_nodes/127.0.0.1:22013_e
   [junit4]   2> 1627522 T2622 oascc.SolrZkClient.makePath makePath: /live_nodes/127.0.0.1:22013_e
   [junit4]   2> 1627527 T2644 oascc.ZkStateReader$3.process Updating live nodes... (2)
   [junit4]   2> 1627527 T2662 oascc.ZkStateReader$3.process Updating live nodes... (2)
   [junit4]   2> 1627527 T2649 oascc.ZkStateReader$3.process Updating live nodes... (2)
   [junit4]   2> 1627533 T2622 oasc.CorePropertiesLocator.discover Looking for core definitions underneath /usr/home/hudson/hudson-slave/workspace/Lucene-Solr-Tests-trunk-Java7/solr/build/solr-core/test/J1/./org.apache.solr.cloud.CollectionsAPIDistributedZkTest-jetty1-1375349467953
   [junit4]   2> 1627714 T2622 oasc.CorePropertiesLocator.discoverUnder Found core conf in /usr/home/hudson/hudson-slave/workspace/Lucene-Solr-Tests-trunk-Java7/solr/build/solr-core/test/J1/./org.apache.solr.cloud.CollectionsAPIDistributedZkTest-jetty1-1375349467953/conf/
   [junit4]   2> 1627718 T2622 oasc.CorePropertiesLocator.discover Found 1 core definitions
   [junit4]   2> 1627718 T2622 oass.SolrDispatchFilter.init user.dir=/usr/home/hudson/hudson-slave/workspace/Lucene-Solr-Tests-trunk-Java7/solr/build/solr-core/test/J1
   [junit4]   2> 1627719 T2622 oass.SolrDispatchFilter.init SolrDispatchFilter.init() done
   [junit4]   2> 1627719 T2622 oascsi.HttpClientUtil.createClient Creating new http client, config:maxConnections=128&maxConnectionsPerHost=32&followRedirects=false
   [junit4]   2> 1628017 T2622 oejs.Server.doStart jetty-8.1.10.v20130312
   [junit4]   2> 1628020 T2622 oejs.AbstractConnector.doStart Started SocketConnector@127.0.0.1:35817
   [junit4]   2> 1628021 T2622 oass.SolrDispatchFilter.init SolrDispatchFilter.init()
   [junit4]   2> 1628022 T2622 oasc.SolrResourceLoader.locateSolrHome JNDI not configured for solr (NoInitialContextEx)
   [junit4]   2> 1628022 T2622 oasc.SolrResourceLoader.locateSolrHome using system property solr.solr.home: /usr/home/hudson/hudson-slave/workspace/Lucene-Solr-Tests-trunk-Java7/solr/build/solr-core/test/J1/./org.apache.solr.cloud.CollectionsAPIDistributedZkTest-jetty2-1375349469705
   [junit4]   2> 1628023 T2622 oasc.SolrResourceLoader.<init> new SolrResourceLoader for directory: '/usr/home/hudson/hudson-slave/workspace/Lucene-Solr-Tests-trunk-Java7/solr/build/solr-core/test/J1/./org.apache.solr.cloud.CollectionsAPIDistributedZkTest-jetty2-1375349469705/'
   [junit4]   2> 1628064 T2622 oasc.ConfigSolr.fromFile Loading container configuration from /usr/home/hudson/hudson-slave/workspace/Lucene-Solr-Tests-trunk-Java7/solr/build/solr-core/test/J1/./org.apache.solr.cloud.CollectionsAPIDistributedZkTest-jetty2-1375349469705/solr.xml
   [junit4]   2> 1628132 T2622 oasc.ConfigSolrXml.<init> Config-defined core root directory: 
   [junit4]   2> 1628133 T2622 oasc.CoreContainer.<init> New CoreContainer 233386558
   [junit4]   2> 1628133 T2622 oasc.CoreContainer.load Loading cores into CoreContainer [instanceDir=/usr/home/hudson/hudson-slave/workspace/Lucene-Solr-Tests-trunk-Java7/solr/build/solr-core/test/J1/./org.apache.solr.cloud.CollectionsAPIDistributedZkTest-jetty2-1375349469705/]
   [junit4]   2> 1628135 T2622 oashc.HttpShardHandlerFactory.getParameter Setting socketTimeout to: 120000
   [junit4]   2> 1628135 T2622 oashc.HttpShardHandlerFactory.getParameter Setting urlScheme to: http://
   [junit4]   2> 1628136 T2622 oashc.HttpShardHandlerFactory.getParameter Setting connTimeout to: 15000
   [junit4]   2> 1628136 T2622 oashc.HttpShardHandlerFactory.getParameter Setting maxConnectionsPerHost to: 20
   [junit4]   2> 1628136 T2622 oashc.HttpShardHandlerFactory.getParameter Setting corePoolSize to: 0
   [junit4]   2> 1628136 T2622 oashc.HttpShardHandlerFactory.getParameter Setting maximumPoolSize to: 2147483647
   [junit4]   2> 1628137 T2622 oashc.HttpShardHandlerFactory.getParameter Setting maxThreadIdleTime to: 5
   [junit4]   2> 1628137 T2622 oashc.HttpShardHandlerFactory.getParameter Setting sizeOfQueue to: -1
   [junit4]   2> 1628137 T2622 oashc.HttpShardHandlerFactory.getParameter Setting fairnessPolicy to: false
   [junit4]   2> 1628138 T2622 oascsi.HttpClientUtil.createClient Creating new http client, config:maxConnectionsPerHost=20&maxConnections=10000&socketTimeout=120000&connTimeout=15000&retry=false
   [junit4]   2> 1628150 T2622 oasc.ZkContainer.initZooKeeper Zookeeper client=127.0.0.1:16076/solr
   [junit4]   2> 1628150 T2622 oasc.ZkController.checkChrootPath zkHost includes chroot
   [junit4]   2> 1628151 T2622 oascc.ConnectionManager.waitForConnected Waiting for client to connect to ZooKeeper
   [junit4]   2> 1628180 T2674 oascc.ConnectionManager.process Watcher org.apache.solr.common.cloud.ConnectionManager@2d421a6b name:ZooKeeperConnection Watcher:127.0.0.1:16076 got event WatchedEvent state:SyncConnected type:None path:null path:null type:None
   [junit4]   2> 1628180 T2622 oascc.ConnectionManager.waitForConnected Client is connected to ZooKeeper
   [junit4]   2> 1628184 T2622 oascsi.HttpClientUtil.createClient Creating new http client, config:maxConnections=500&maxConnectionsPerHost=16&socketTimeout=120000&connTimeout=15000
   [junit4]   2> 1628193 T2622 oascc.ConnectionManager.waitForConnected Waiting for client to connect to ZooKeeper
   [junit4]   2> 1628195 T2676 oascc.ConnectionManager.process Watcher org.apache.solr.common.cloud.ConnectionManager@53a969ce name:ZooKeeperConnection Watcher:127.0.0.1:16076/solr got event WatchedEvent state:SyncConnected type:None path:null path:null type:None
   [junit4]   2> 1628196 T2622 oascc.ConnectionManager.waitForConnected Client is connected to ZooKeeper
   [junit4]   2> 1628207 T2622 oascc.ZkStateReader.createClusterStateWatchersAndUpdate Updating cluster state from ZooKeeper... 
   [junit4]   2> 1629210 T2622 oasc.ZkController.createEphemeralLiveNode Register node as live in ZooKeeper:/live_nodes/127.0.0.1:35817_e
   [junit4]   2> 1629223 T2622 oascc.SolrZkClient.makePath makePath: /live_nodes/127.0.0.1:35817_e
   [junit4]   2> 1629227 T2649 oascc.ZkStateReader$3.process Updating live nodes... (3)
   [junit4]   2> 1629227 T2662 oascc.ZkStateReader$3.process Updating live nodes... (3)
   [junit4]   2> 1629228 T2676 oascc.ZkStateReader$3.process Updating live nodes... (3)
   [junit4]   2> 1629228 T2644 oascc.ZkStateReader$3.process Updating live nodes... (3)
   [junit4]   2> 1629234 T2622 oasc.CorePropertiesLocator.discover Looking for core definitions underneath /usr/home/hudson/hudson-slave/workspace/Lucene-Solr-Tests-trunk-Java7/solr/build/solr-core/test/J1/./org.apache.solr.cloud.CollectionsAPIDistributedZkTest-jetty2-1375349469705
   [junit4]   2> 1629239 T2622 oasc.CorePropertiesLocator.discoverUnder Found core conf in /usr/home/hudson/hudson-slave/workspace/Lucene-Solr-Tests-trunk-Java7/solr/build/solr-core/test/J1/./org.apache.solr.cloud.CollectionsAPIDistributedZkTest-jetty2-1375349469705/conf/
   [junit4]   2> 1629420 T2622 oasc.CorePropertiesLocator.discover Found 1 core definitions
   [junit4]   2> 1629422 T2622 oass.SolrDispatchFilter.init user.dir=/usr/home/hudson/hudson-slave/workspace/Lucene-Solr-Tests-trunk-Java7/solr/build/solr-core/test/J1
   [junit4]   2> 1629422 T2622 oass.SolrDispatchFilter.init SolrDispatchFilter.init() done
   [junit4]   2> 1629423 T2622 oascsi.HttpClientUtil.createClient Creating new http client, config:maxConnections=128&maxConnectionsPerHost=32&followRedirects=false
   [junit4]   2> 1629722 T2622 oejs.Server.doStart jetty-8.1.10.v20130312
   [junit4]   2> 1629725 T2622 oejs.AbstractConnector.doStart Started SocketConnector@127.0.0.1:53720
   [junit4]   2> 1629726 T2622 oass.SolrDispatchFilter.init SolrDispatchFilter.init()
   [junit4]   2> 1629726 T2622 oasc.SolrResourceLoader.locateSolrHome JNDI not configured for solr (NoInitialContextEx)
   [junit4]   2> 1629727 T2622 oasc.SolrResourceLoader.locateSolrHome using system property solr.solr.home: /usr/home/hudson/hudson-slave/workspace/Lucene-Solr-Tests-trunk-Java7/solr/build/solr-core/test/J1/./org.apache.solr.cloud.CollectionsAPIDistributedZkTest-jetty3-1375349471407
   [junit4]   2> 1629727 T2622 oasc.SolrResourceLoader.<init> new SolrResourceLoader for directory: '/usr/home/hudson/hudson-slave/workspace/Lucene-Solr-Tests-trunk-Java7/solr/build/solr-core/test/J1/./org.apache.solr.cloud.CollectionsAPIDistributedZkTest-jetty3-1375349471407/'
   [junit4]   2> 1629768 T2622 oasc.ConfigSolr.fromFile Loading container configuration from /usr/home/hudson/hudson-slave/workspace/Lucene-Solr-Tests-trunk-Java7/solr/build/solr-core/test/J1/./org.apache.solr.cloud.CollectionsAPIDistributedZkTest-jetty3-1375349471407/solr.xml
   [junit4]   2> 1629864 T2622 oasc.ConfigSolrXml.<init> Config-defined core root directory: 
   [junit4]   2> 1629865 T2622 oasc.CoreContainer.<init> New CoreContainer 993892648
   [junit4]   2> 1629865 T2622 oasc.CoreContainer.load Loading cores into CoreContainer [instanceDir=/usr/home/hudson/hudson-slave/workspace/Lucene-Solr-Tests-trunk-Java7/solr/build/solr-core/test/J1/./org.apache.solr.cloud.CollectionsAPIDistributedZkTest-jetty3-1375349471407/]
   [junit4]   2> 1629867 T2622 oashc.HttpShardHandlerFactory.getParameter Setting socketTimeout to: 120000
   [junit4]   2> 1629868 T2622 oashc.HttpShardHandlerFactory.getParameter Setting urlScheme to: http://
   [junit4]   2> 1629868 T2622 oashc.HttpShardHandlerFactory.getParameter Setting connTimeout to: 15000
   [junit4]   2> 1629869 T2622 oashc.HttpShardHandlerFactory.getParameter Setting maxConnectionsPerHost to: 20
   [junit4]   2> 1629869 T2622 oashc.HttpShardHandlerFactory.getParameter Setting corePoolSize to: 0
   [junit4]   2> 1629870 T2622 oashc.HttpShardHandlerFactory.getParameter Setting maximumPoolSize to: 2147483647
   [junit4]   2> 1629870 T2622 oashc.HttpShardHandlerFactory.getParameter Setting maxThreadIdleTime to: 5
   [junit4]   2> 1629871 T2622 oashc.HttpShardHandlerFactory.getParameter Setting sizeOfQueue to: -1
   [junit4]   2> 1629871 T2622 oashc.HttpShardHandlerFactory.getParameter Setting fairnessPolicy to: false
   [junit4]   2> 1629872 T2622 oascsi.HttpClientUtil.createClient Creating new http client, config:maxConnectionsPerHost=20&maxConnections=10000&socketTimeout=120000&connTimeout=15000&retry=false
   [junit4]   2> 1629889 T2622 oasc.ZkContainer.initZooKeeper Zookeeper client=127.0.0.1:16076/solr
   [junit4]   2> 1629890 T2622 oasc.ZkController.checkChrootPath zkHost includes chroot
   [junit4]   2> 1629891 T2622 oascc.ConnectionManager.waitForConnected Waiting for client to connect to ZooKeeper
   [junit4]   2> 1629894 T2688 oascc.ConnectionManager.process Watcher org.apache.solr.common.cloud.ConnectionManager@4278e7d6 name:ZooKeeperConnection Watcher:127.0.0.1:16076 got event WatchedEvent state:SyncConnected type:None path:null path:null type:None
   [junit4]   2> 1629894 T2622 oascc.ConnectionManager.waitForConnected Client is connected to ZooKeeper
   [junit4]   2> 1629898 T2622 oascsi.HttpClientUtil.createClient Creating new http client, config:maxConnections=500&maxConnectionsPerHost=16&socketTimeout=120000&connTimeout=15000
   [junit4]   2> 1629909 T2622 oascc.ConnectionManager.waitForConnected Waiting for client to connect to ZooKeeper
   [junit4]   2> 1629912 T2690 oascc.ConnectionManager.process Watcher org.apache.solr.common.cloud.ConnectionManager@66664a7f name:ZooKeeperConnection Watcher:127.0.0.1:16076/solr got event WatchedEvent state:SyncConnected type:None path:null path:null type:None
   [junit4]   2> 1629912 T2622 oascc.ConnectionManager.waitForConnected Client is connected to ZooKeeper
   [junit4]   2> 1629924 T2622 oascc.ZkStateReader.createClusterStateWatchersAndUpdate Updating cluster state from ZooKeeper... 
   [junit4]   2> 1630928 T2622 oasc.ZkController.createEphemeralLiveNode Register node as live in ZooKeeper:/live_nodes/127.0.0.1:53720_e
   [junit4]   2> 1630933 T2622 oascc.SolrZkClient.makePath makePath: /live_nodes/127.0.0.1:53720_e
   [junit4]   2> 1630937 T2676 oascc.ZkStateReader$3.process Updating live nodes... (4)
   [junit4]   2> 1630937 T2690 oascc.ZkStateReader$3.process Updating live nodes... (4)
   [junit4]   2> 1630937 T2662 oascc.ZkStateReader$3.process Updating live nodes... (4)
   [junit4]   2> 1630937 T2644 oascc.ZkStateReader$3.process Updating live nodes... (4)
   [junit4]   2> 1630937 T2649 oascc.ZkStateReader$3.process Updating live nodes... (4)
   [junit4]   2> 1630954 T2622 oasc.CorePropertiesLocator.discover Looking for core definitions underneath /usr/home/hudson/hudson-slave/workspace/Lucene-Solr-Tests-trunk-Java7/solr/build/solr-core/test/J1/./org.apache.solr.cloud.CollectionsAPIDistributedZkTest-jetty3-1375349471407
   [junit4]   2> 1630960 T2622 oasc.CorePropertiesLocator.discoverUnder Found core conf in /usr/home/hudson/hudson-slave/workspace/Lucene-Solr-Tests-trunk-Java7/solr/build/solr-core/test/J1/./org.apache.solr.cloud.CollectionsAPIDistributedZkTest-jetty3-1375349471407/conf/
   [junit4]   2> 1631140 T2622 oasc.CorePropertiesLocator.discover Found 1 core definitions
   [junit4]   2> 1631142 T2622 oass.SolrDispatchFilter.init user.dir=/usr/home/hudson/hudson-slave/workspace/Lucene-Solr-Tests-trunk-Java7/solr/build/solr-core/test/J1
   [junit4]   2> 1631142 T2622 oass.SolrDispatchFilter.init SolrDispatchFilter.init() done
   [junit4]   2> 1631143 T2622 oascsi.HttpClientUtil.createClient Creating new http client, config:maxConnections=128&maxConnectionsPerHost=32&followRedirects=false
   [junit4]   2> 1631448 T2622 oejs.Server.doStart jetty-8.1.10.v20130312
   [junit4]   2> 1631452 T2622 oejs.AbstractConnector.doStart Started SocketConnector@127.0.0.1:34679
   [junit4]   2> 1631453 T2622 oass.SolrDispatchFilter.init SolrDispatchFilter.init()
   [junit4]   2> 1631453 T2622 oasc.SolrResourceLoader.locateSolrHome JNDI not configured for solr (NoInitialContextEx)
   [junit4]   2> 1631454 T2622 oasc.SolrResourceLoader.locateSolrHome using system property solr.solr.home: /usr/home/hudson/hudson-slave/workspace/Lucene-Solr-Tests-trunk-Java7/solr/build/solr-core/test/J1/./org.apache.solr.cloud.CollectionsAPIDistributedZkTest-jetty4-1375349473127
   [junit4]   2> 1631454 T2622 oasc.SolrResourceLoader.<init> new SolrResourceLoader for directory: '/usr/home/hudson/hudson-slave/workspace/Lucene-Solr-Tests-trunk-Java7/solr/build/solr-core/test/J1/./org.apache.solr.cloud.CollectionsAPIDistributedZkTest-jetty4-1375349473127/'
   [junit4]   2> 1631496 T2622 oasc.ConfigSolr.fromFile Loading container configuration from /usr/home/hudson/hudson-slave/workspace/Lucene-Solr-Tests-trunk-Java7/solr/build/solr-core/test/J1/./org.apache.solr.cloud.CollectionsAPIDistributedZkTest-jetty4-1375349473127/solr.xml
   [junit4]   2> 1631620 T2622 oasc.ConfigSolrXml.<init> Config-defined core root directory: 
   [junit4]   2> 1631621 T2622 oasc.CoreContainer.<init> New CoreContainer 1469108073
   [junit4]   2> 1631621 T2622 oasc.CoreContainer.load Loading cores into CoreContainer [instanceDir=/usr/home/hudson/hudson-slave/workspace/Lucene-Solr-Tests-trunk-Java7/solr/build/solr-core/test/J1/./org.apache.solr.cloud.CollectionsAPIDistributedZkTest-jetty4-1375349473127/]
   [junit4]   2> 1631623 T2622 oashc.HttpShardHandlerFactory.getParameter Setting socketTimeout to: 120000
   [junit4]   2> 1631623 T2622 oashc.HttpShardHandlerFactory.getParameter Setting urlScheme to: http://
   [junit4]   2> 1631623 T2622 oashc.HttpShardHandlerFactory.getParameter Setting connTimeout to: 15000
   [junit4]   2> 1631624 T2622 oashc.HttpShardHandlerFactory.getParameter Setting maxConnectionsPerHost to: 20
   [junit4]   2> 1631624 T2622 oashc.HttpShardHandlerFactory.getParameter Setting corePoolSize to: 0
   [junit4]   2> 1631624 T2622 oashc.HttpShardHandlerFactory.getParameter Setting maximumPoolSize to: 2147483647
   [junit4]   2> 1631625 T2622 oashc.HttpShardHandlerFactory.getParameter Setting maxThreadIdleTime to: 5
   [junit4]   2> 1631625 T2622 oashc.HttpShardHandlerFactory.getParameter Setting sizeOfQueue to: -1
   [junit4]   2> 1631625 T2622 oashc.HttpShardHandlerFactory.getParameter Setting fairnessPolicy to: false
   [junit4]   2> 1631626 T2622 oascsi.HttpClientUtil.createClient Creating new http client, config:maxConnectionsPerHost=20&maxConnections=10000&socketTimeout=120000&connTimeout=15000&retry=false
   [junit4]   2> 1631636 T2622 oasc.ZkContainer.initZooKeeper Zookeeper client=127.0.0.1:16076/solr
   [junit4]   2> 1631637 T2622 oasc.ZkController.checkChrootPath zkHost includes chroot
   [junit4]   2> 1631638 T2622 oascc.ConnectionManager.waitForConnected Waiting for client to connect to ZooKeeper
   [junit4]   2> 1631666 T2702 oascc.ConnectionManager.process Watcher org.apache.solr.common.cloud.ConnectionManager@6b539ed7 name:ZooKeeperConnection Watcher:127.0.0.1:16076 got event WatchedEvent state:SyncConnected type:None path:null path:null type:None
   [junit4]   2> 1631667 T2622 oascc.ConnectionManager.waitForConnected Client is connected to ZooKeeper
   [junit4]   2> 1631670 T2622 oascsi.HttpClientUtil.createClient Creating new http client, config:maxConnections=500&maxConnectionsPerHost=16&socketTimeout=120000&connTimeout=15000
   [junit4]   2> 1631678 T2622 oascc.ConnectionManager.waitForConnected Waiting for client to connect to ZooKeeper
   [junit4]   2> 1631680 T2704 oascc.ConnectionManager.process Watcher org.apache.solr.common.cloud.ConnectionManager@2630456d name:ZooKeeperConnection Watcher:127.0.0.1:16076/solr got event WatchedEvent state:SyncConnected type:None path:null path:null type:None
   [junit4]   2> 1631680 T2622 oascc.ConnectionManager.waitForConnected Client is connected to ZooKeeper
   [junit4]   2> 1631692 T2622 oascc.ZkStateReader.createClusterStateWatchersAndUpdate Updating cluster state from ZooKeeper... 
   [junit4]   2> 1632695 T2622 oasc.ZkController.createEphemeralLiveNode Register node as live in ZooKeeper:/live_nodes/127.0.0.1:34679_e
   [junit4]   2> 1632701 T2622 oascc.SolrZkClient.makePath makePath: /live_nodes/127.0.0.1:34679_e
   [junit4]   2> 1632705 T2649 oascc.ZkStateReader$3.process Updating live nodes... (5)
   [junit4]   2> 1632705 T2676 oascc.ZkStateReader$3.process Updating live nodes... (5)
   [junit4]   2> 1632705 T2662 oascc.ZkStateReader$3.process Updating live nodes... (5)
   [junit4]   2> 1632705 T2704 oascc.ZkStateReader$3.process Updating live nodes... (5)
   [junit4]   2> 1632705 T2690 oascc.ZkStateReader$3.process Updating live nodes... (5)
   [junit4]   2> 1632705 T2644 oascc.ZkStateReader$3.process Updating live nodes... (5)
   [junit4]   2> 1632722 T2622 oasc.CorePropertiesLocator.discover Looking for core definitions underneath /usr/home/hudson/hudson-slave/workspace/Lucene-Solr-Tests-trunk-Java7/solr/build/solr-core/test/J1/./org.apache.solr.cloud.CollectionsAPIDistributedZkTest-jetty4-1375349473127
   [junit4]   2> 1632901 T2622 oasc.CorePropertiesLocator.discoverUnder Found core conf in /usr/home/hudson/hudson-slave/workspace/Lucene-Solr-Tests-trunk-Java7/solr/build/solr-core/test/J1/./org.apache.solr.cloud.CollectionsAPIDistributedZkTest-jetty4-1375349473127/conf/
   [junit4]   2> 1632906 T2622 oasc.CorePropertiesLocator.discover Found 1 core definitions
   [junit4]   2> 1632907 T2622 oass.SolrDispatchFilter.init user.dir=/usr/home/hudson/hudson-slave/workspace/Lucene-Solr-Tests-trunk-Java7/solr/build/solr-core/test/J1
   [junit4]   2> 1632907 T2622 oass.SolrDispatchFilter.init SolrDispatchFilter.init() done
   [junit4]   2> 1632908 T2622 oascsi.HttpClientUtil.createClient Creating new http client, config:maxConnections=128&maxConnectionsPerHost=32&followRedirects=false
   [junit4]   2> 1632924 T2622 oascsi.HttpClientUtil.createClient Creating new http client, config:maxConnections=128&maxConnectionsPerHost=32&followRedirects=false
   [junit4]   2> 1632936 T2652 oasha.CollectionsHandler.handleCreateAction Creating Collection : numShards=2&name=nodes_used_collection&replicationFactor=2&action=CREATE&wt=javabin&version=2
   [junit4]   2> 1632939 T2644 oasc.DistributedQueue$LatchChildWatcher.process Watcher fired on path: /overseer/collection-queue-work state: SyncConnected type NodeChildrenChanged
   [junit4]   2> 1632940 T2646 oasc.OverseerCollectionProcessor.run Overseer Collection Processor: Get the message id:/overseer/collection-queue-work/qn-0000000000 message:{
   [junit4]   2> 	  "operation":"createcollection",
   [junit4]   2> 	  "numShards":"2",
   [junit4]   2> 	  "name":"nodes_used_collection",
   [junit4]   2> 	  "replicationFactor":"2"}
   [junit4]   2> 1632941 T2646 oasc.OverseerCollectionProcessor.processMessage WARN OverseerCollectionProcessor.processMessage : createcollection , {
   [junit4]   2> 	  "operation":"createcollection",
   [junit4]   2> 	  "numShards":"2",
   [junit4]   2> 	  "name":"nodes_used_collection",
   [junit4]   2> 	  "replicationFactor":"2"}
   [junit4]   2> 1633249 T2645 oascc.ZkStateReader.updateClusterState Updating cloud state from ZooKeeper... 
   [junit4]   2> 1633250 T2645 oasc.Overseer$ClusterStateUpdater.buildCollection building a new collection: nodes_used_collection
   [junit4]   2> 1633250 T2645 oasc.Overseer$ClusterStateUpdater.createCollection Create collection nodes_used_collection with shards [shard1, shard2]
   [junit4]   2> 1633269 T2649 oascc.ZkStateReader$2.process A cluster state change: WatchedEvent state:SyncConnected type:NodeDataChanged path:/clusterstate.json, has occurred - updating... (live nodes size: 5)
   [junit4]   2> 1633269 T2704 oascc.ZkStateReader$2.process A cluster state change: WatchedEvent state:SyncConnected type:NodeDataChanged path:/clusterstate.json, has occurred - updating... (live nodes size: 5)
   [junit4]   2> 1633269 T2662 oascc.ZkStateReader$2.process A cluster state change: WatchedEvent state:SyncConnected type:NodeDataChanged path:/clusterstate.json, has occurred - updating... (live nodes size: 5)
   [junit4]   2> 1633269 T2676 oascc.ZkStateReader$2.process A cluster state change: WatchedEvent state:SyncConnected type:NodeDataChanged path:/clusterstate.json, has occurred - updating... (live nodes size: 5)
   [junit4]   2> 1633269 T2690 oascc.ZkStateReader$2.process A cluster state change: WatchedEvent state:SyncConnected type:NodeDataChanged path:/clusterstate.json, has occurred - updating... (live nodes size: 5)
   [junit4]   2> 1633269 T2644 oascc.ZkStateReader$2.process A cluster state change: WatchedEvent state:SyncConnected type:NodeDataChanged path:/clusterstate.json, has occurred - updating... (live nodes size: 5)
   [junit4]   2> 1633360 T2646 oasc.OverseerCollectionProcessor.createCollection going to create cores replicas shardNames [shard1, shard2] , repFactor : 2
   [junit4]   2> 1633360 T2646 oasc.OverseerCollectionProcessor.createCollection Creating shard nodes_used_collection_shard1_replica1 as part of slice shard1 of collection nodes_used_collection on 127.0.0.1:53720_e
   [junit4]   2> 1633361 T2646 oasc.OverseerCollectionProcessor.createCollection Creating shard nodes_used_collection_shard1_replica2 as part of slice shard1 of collection nodes_used_collection on 127.0.0.1:34679_e
   [junit4]   2> 1633362 T2646 oasc.OverseerCollectionProcessor.createCollection Creating shard nodes_used_collection_shard2_replica1 as part of slice shard2 of collection nodes_used_collection on 127.0.0.1:22013_e
   [junit4]   2> 1633363 T2646 oasc.OverseerCollectionProcessor.createCollection Creating shard nodes_used_collection_shard2_replica2 as part of slice shard2 of collection nodes_used_collection on 127.0.0.1:22468_e
   [junit4]   2> 1633366 T2694 oasc.ZkController.publish publishing core=nodes_used_collection_shard1_replica2 state=down
   [junit4]   2> 1633366 T2680 oasc.ZkController.publish publishing core=nodes_used_collection_shard1_replica1 state=down
   [junit4]   2> 1633367 T2634 oasc.ZkController.publish publishing core=nodes_used_collection_shard2_replica2 state=down
   [junit4]   2> 1633367 T2653 oasc.ZkController.publish publishing core=nodes_used_collection_shard2_replica1 state=down
   [junit4]   2> 1633368 T2694 oasc.ZkController.waitForCoreNodeName look for our core node name
   [junit4]   2> 1633369 T2680 oasc.ZkController.waitForCoreNodeName look for our core node name
   [junit4]   2> 1633369 T2634 oasc.ZkController.waitForCoreNodeName look for our core node name
   [junit4]   2> 1633380 T2653 oasc.ZkController.waitForCoreNodeName look for our core node name
   [junit4]   2> 1634775 T2645 oascc.ZkStateReader.updateClusterState Updating cloud state from ZooKeeper... 
   [junit4]   2> 1634776 T2645 oasc.Overseer$ClusterStateUpdater.updateState WARN Could not find collection node for nodes_used_collection, skipping publish state
   [junit4]   2> 1634776 T2645 oasc.Overseer$ClusterStateUpdater.updateState Update state numShards=2 message={
   [junit4]   2> 	  "operation":"state",
   [junit4]   2> 	  "core_node_name":"core_node1",
   [junit4]   2> 	  "numShards":"2",
   [junit4]   2> 	  "shard":"shard1",
   [junit4]   2> 	  "roles":null,
   [junit4]   2> 	  "state":"down",
   [junit4]   2> 	  "shard_state":"active",
   [junit4]   2> 	  "core":"nodes_used_collection_shard1_replica2",
   [junit4]   2> 	  "collection":"nodes_used_collection",
   [junit4]   2> 	  "shard_range":null,
   [junit4]   2> 	  "node_name":"127.0.0.1:34679_e",
   [junit4]   2> 	  "base_url":"http://127.0.0.1:34679/e"}
   [junit4]   2> 1634781 T2645 oasc.Overseer$ClusterStateUpdater.updateState WARN Could not find collection node for nodes_used_collection, skipping publish state
   [junit4]   2> 1634781 T2645 oasc.Overseer$ClusterStateUpdater.updateState Update state numShards=2 message={
   [junit4]   2> 	  "operation":"state",
   [junit4]   2> 	  "core_node_name":"core_node2",
   [junit4]   2> 	  "numShards":"2",
   [junit4]   2> 	  "shard":"shard1",
   [junit4]   2> 	  "roles":null,
   [junit4]   2> 	  "state":"down",
   [junit4]   2> 	  "shard_state":"active",
   [junit4]   2> 	  "core":"nodes_used_collection_shard1_replica1",
   [junit4]   2> 	  "collection":"nodes_used_collection",
   [junit4]   2> 	  "shard_range":null,
   [junit4]   2> 	  "node_name":"127.0.0.1:53720_e",
   [junit4]   2> 	  "base_url":"http://127.0.0.1:53720/e"}
   [junit4]   2> 1634795 T2645 oasc.Overseer$ClusterStateUpdater.updateState WARN Could not find collection node for nodes_used_collection, skipping publish state
   [junit4]   2> 1634795 T2645 oasc.Overseer$ClusterStateUpdater.updateState Update state numShards=2 message={
   [junit4]   2> 	  "operation":"state",
   [junit4]   2> 	  "core_node_name":"core_node3",
   [junit4]   2> 	  "numShards":"2",
   [junit4]   2> 	  "shard":"shard2",
   [junit4]   2> 	  "roles":null,
   [junit4]   2> 	  "state":"down",
   [junit4]   2> 	  "shard_state":"active",
   [junit4]   2> 	  "core":"nodes_used_collection_shard2_replica2",
   [junit4]   2> 	  "collection":"nodes_used_collection",
   [junit4]   2> 	  "shard_range":null,
   [junit4]   2> 	  "node_name":"127.0.0.1:22468_e",
   [junit4]   2> 	  "base_url":"http://127.0.0.1:22468/e"}
   [junit4]   2> 1634799 T2645 oasc.Overseer$ClusterStateUpdater.updateState WARN Could not find collection node for nodes_used_collection, skipping publish state
   [junit4]   2> 1634800 T2645 oasc.Overseer$ClusterStateUpdater.updateState Update state numShards=2 message={
   [junit4]   2> 	  "operation":"state",
   [junit4]   2> 	  "core_node_name":"core_node4",
   [junit4]   2> 	  "numShards":"2",
   [junit4]   2> 	  "shard":"shard2",
   [junit4]   2> 	  "roles":null,
   [junit4]   2> 	  "state":"down",
   [junit4]   2> 	  "shard_state":"active",
   [junit4]   2> 	  "core":"nodes_used_collection_shard2_replica1",
   [junit4]   2> 	  "collection":"nodes_used_collection",
   [junit4]   2> 	  "shard_range":null,
   [junit4]   2> 	  "node_name":"127.0.0.1:22013_e",
   [junit4]   2> 	  "base_url":"http://127.0.0.1:22013/e"}
   [junit4]   2> 1634810 T2644 oascc.ZkStateReader$2.process A cluster state change: WatchedEvent state:SyncConnected type:NodeDataChanged path:/clusterstate.json, has occurred - updating... (live nodes size: 5)
   [junit4]   2> 1634810 T2704 oascc.ZkStateReader$2.process A cluster state change: WatchedEvent state:SyncConnected type:NodeDataChanged path:/clusterstate.json, has occurred - updating... (live nodes size: 5)
   [junit4]   2> 1634810 T2662 oascc.ZkStateReader$2.process A cluster state change: WatchedEvent state:SyncConnected type:NodeDataChanged path:/clusterstate.json, has occurred - updating... (live nodes size: 5)
   [junit4]   2> 1634810 T2690 oascc.ZkStateReader$2.process A cluster state change: WatchedEvent state:SyncConnected type:NodeDataChanged path:/clusterstate.json, has occurred - updating... (live nodes size: 5)
   [junit4]   2> 1634810 T2676 oascc.ZkStateReader$2.process A cluster state change: WatchedEvent state:SyncConnected type:NodeDataChanged path:/clusterstate.json, has occurred - updating... (live nodes size: 5)
   [junit4]   2> 1634810 T2649 oascc.ZkStateReader$2.process A cluster state change: WatchedEvent state:SyncConnected type:NodeDataChanged path:/clusterstate.json, has occurred - updating... (live nodes size: 5)
   [junit4]   2> 1635370 T2694 oasc.ZkController.waitForShardId waiting to find shard id in clusterstate for nodes_used_collection_shard1_replica2
   [junit4]   2> 1635371 T2634 oasc.ZkController.waitForShardId waiting to find shard id in clusterstate for nodes_used_collection_shard2_replica2
   [junit4]   2> 1635371 T2680 oasc.ZkController.waitForShardId waiting to find shard id in clusterstate for nodes_used_collection_shard1_replica1
   [junit4]   2> 1635371 T2694 oasc.CorePropertiesLocator.writePropertiesFile ERROR Couldn't persist core properties to /usr/home/hudson/hudson-slave/workspace/Lucene-Solr-Tests-trunk-Java7/solr/build/solr-core/test/J1/./org.apache.solr.cloud.CollectionsAPIDistributedZkTest-jetty4-1375349473127/nodes_used_collection_shard1_replica2/core.properties: java.io.FileNotFoundException: /usr/home/hudson/hudson-slave/workspace/Lucene-Solr-Tests-trunk-Java7/solr/build/solr-core/test/J1/./org.apache.solr.cloud.CollectionsAPIDistributedZkTest-jetty4-1375349473127/nodes_used_collection_shard1_replica2/core.properties (No such file or directory)
   [junit4]   2> 1635372 T2634 oasc.CorePropertiesLocator.writePropertiesFile ERROR Couldn't persist core properties to /usr/home/hudson/hudson-slave/workspace/Lucene-Solr-Tests-trunk-Java7/solr/build/solr-core/test/J1/./org.apache.solr.cloud.CollectionsAPIDistributedZkTest-controljetty-1375349466699/nodes_used_collection_shard2_replica2/core.properties: java.io.FileNotFoundException: /usr/home/hudson/hudson-slave/workspace/Lucene-Solr-Tests-trunk-Java7/solr/build/solr-core/test/J1/./org.apache.solr.cloud.CollectionsAPIDistributedZkTest-controljetty-1375349466699/nodes_used_collection_shard2_replica2/core.properties (No such file or directory)
   [junit4]   2> 1635372 T2680 oasc.CorePropertiesLocator.writePropertiesFile ERROR Couldn't persist core properties to /usr/home/hudson/hudson-slave/workspace/Lucene-Solr-Tests-trunk-Java7/solr/build/solr-core/test/J1/./org.apache.solr.cloud.CollectionsAPIDistributedZkTest-jetty3-1375349471407/nodes_used_collection_shard1_replica1/core.properties: java.io.FileNotFoundException: /usr/home/hudson/hudson-slave/workspace/Lucene-Solr-Tests-trunk-Java7/solr/build/solr-core/test/J1/./org.apache.solr.cloud.CollectionsAPIDistributedZkTest-jetty3-1375349471407/nodes_used_collection_shard1_replica1/core.properties (No such file or directory)
   [junit4]   2> 1635372 T2694 oasc.CoreContainer.create Creating SolrCore 'nodes_used_collection_shard1_replica2' using instanceDir: /usr/home/hudson/hudson-slave/workspace/Lucene-Solr-Tests-trunk-Java7/solr/build/solr-core/test/J1/./org.apache.solr.cloud.CollectionsAPIDistributedZkTest-jetty4-1375349473127/nodes_used_collection_shard1_replica2
   [junit4]   2> 1635373 T2680 oasc.CoreContainer.create Creating SolrCore 'nodes_used_collection_shard1_replica1' using instanceDir: /usr/home/hudson/hudson-slave/workspace/Lucene-Solr-Tests-trunk-Java7/solr/build/solr-core/test/J1/./org.apache.solr.cloud.CollectionsAPIDistributedZkTest-jetty3-1375349471407/nodes_used_collection_shard1_replica1
   [junit4]   2> 1635373 T2634 oasc.CoreContainer.create Creating SolrCore 'nodes_used_collection_shard2_replica2' using instanceDir: /usr/home/hudson/hudson-slave/workspace/Lucene-Solr-Tests-trunk-Java7/solr/build/solr-core/test/J1/./org.apache.solr.cloud.CollectionsAPIDistributedZkTest-controljetty-1375349466699/nodes_used_collection_shard2_replica2
   [junit4]   2> 1635374 T2634 oasc.ZkController.createCollectionZkNode Check for collection zkNode:nodes_used_collection
   [junit4]   2> 1635374 T2680 oasc.ZkController.createCollectionZkNode Check for collection zkNode:nodes_used_collection
   [junit4]   2> 1635373 T2694 oasc.ZkController.createCollectionZkNode Check for collection zkNode:nodes_used_collection
   [junit4]   2> 1635375 T2634 oasc.ZkController.createCollectionZkNode Creating collection in ZooKeeper:nodes_used_collection
   [junit4]   2> 1635375 T2680 oasc.ZkController.createCollectionZkNode Creating collection in ZooKeeper:nodes_used_collection
   [junit4]   2> 1635376 T2694 oasc.ZkController.createCollectionZkNode Creating collection in ZooKeeper:nodes_used_collection
   [junit4]   2> 1635376 T2634 oasc.ZkController.getConfName Looking for collection configName
   [junit4]   2> 1635376 T2694 oasc.ZkController.getConfName Looking for collection configName
   [junit4]   2> 1635376 T2680 oasc.ZkController.getConfName Looking for collection configName
   [junit4]   2> 1635378 T2634 oasc.ZkController.getConfName Only one config set found in zk - using it:conf1
   [junit4]   2> 1635378 T2694 oasc.ZkController.getConfName Only one config set found in zk - using it:conf1
   [junit4]   2> 1635378 T2680 oasc.ZkController.getConfName Only one config set found in zk - using it:conf1
   [junit4]   2> 1635379 T2694 oascc.SolrZkClient.makePath makePath: /collections/nodes_used_collection
   [junit4]   2> 1635378 T2634 oascc.SolrZkClient.makePath makePath: /collections/nodes_used_collection
   [junit4]   2> 1635379 T2680 oascc.SolrZkClient.makePath makePath: /collections/nodes_used_collection
   [junit4]   2> 1635382 T2634 oasc.ZkController.readConfigName Load collection config from:/collections/nodes_used_collection
   [junit4]   2> 1635382 T2694 oasc.ZkController.readConfigName Load collection config from:/collections/nodes_used_collection
   [junit4]   2> 1635383 T2653 oasc.ZkController.waitForShardId waiting to find shard id in clusterstate for nodes_used_collection_shard2_replica1
   [junit4]   2> 1635384 T2653 oasc.CorePropertiesLocator.writePropertiesFile ERROR Couldn't persist core properties to /usr/home/hudson/hudson-slave/workspace/Lucene-Solr-Tests-trunk-Java7/solr/build/solr-core/test/J1/./org.apache.solr.cloud.CollectionsAPIDistributedZkTest-jetty1-1375349467953/nodes_used_collection_shard2_replica1/core.properties: java.io.FileNotFoundException: /usr/home/hudson/hudson-slave/workspace/Lucene-Solr-Tests-trunk-Java7/solr/build/solr-core/test/J1/./org.apache.solr.cloud.CollectionsAPIDistributedZkTest-jetty1-1375349467953/nodes_used_collection_shard2_replica1/core.properties (No such file or directory)
   [junit4]   2> 1635385 T2653 oasc.CoreContainer.create Creating SolrCore 'nodes_used_collection_shard2_replica1' using instanceDir: /usr/home/hudson/hudson-slave/workspace/Lucene-Solr-Tests-trunk-Java7/solr/build/solr-core/test/J1/./org.apache.solr.cloud.CollectionsAPIDistributedZkTest-jetty1-1375349467953/nodes_used_collection_shard2_replica1
   [junit4]   2> 1635385 T2653 oasc.ZkController.createCollectionZkNode Check for collection zkNode:nodes_used_collection
   [junit4]   2> 1635413 T2680 oasc.ZkController.readConfigName Load collection config from:/collections/nodes_used_collection
   [junit4]   2> 1635413 T2634 oasc.SolrResourceLoader.<init> new SolrResourceLoader for directory: '/usr/home/hudson/hudson-slave/workspace/Lucene-Solr-Tests-trunk-Java7/solr/build/solr-core/test/J1/./org.apache.solr.cloud.CollectionsAPIDistributedZkTest-controljetty-1375349466699/nodes_used_collection_shard2_replica2/'
   [junit4]   2> 1635414 T2694 oasc.SolrResourceLoader.<init> new SolrResourceLoader for directory: '/usr/home/hudson/hudson-slave/workspace/Lucene-Solr-Tests-trunk-Java7/solr/build/solr-core/test/J1/./org.apache.solr.cloud.CollectionsAPIDistributedZkTest-jetty4-1375349473127/nodes_used_collection_shard1_replica2/'
   [junit4]   2> 1635413 T2653 oasc.ZkController.createCollectionZkNode Collection zkNode exists
   [junit4]   2> 1635414 T2680 oasc.SolrResourceLoader.<init> new SolrResourceLoader for directory: '/usr/home/hudson/hudson-slave/workspace/Lucene-Solr-Tests-trunk-Java7/solr/build/solr-core/test/J1/./org.apache.solr.cloud.CollectionsAPIDistributedZkTest-jetty3-1375349471407/nodes_used_collection_shard1_replica1/'
   [junit4]   2> 1635415 T2653 oasc.ZkController.readConfigName Load collection config from:/collections/nodes_used_collection
   [junit4]   2> 1635417 T2653 oasc.SolrResourceLoader.<init> new SolrResourceLoader for directory: '/usr/home/hudson/hudson-slave/workspace/Lucene-Solr-Tests-trunk-Java7/solr/build/solr-core/test/J1/./org.apache.solr.cloud.CollectionsAPIDistributedZkTest-jetty1-1375349467953/nodes_used_collection_shard2_replica1/'
   [junit4]   2> 1635566 T2634 oasc.SolrConfig.<init> Using Lucene MatchVersion: LUCENE_50
   [junit4]   2> 1635566 T2680 oasc.SolrConfig.<init> Using Lucene MatchVersion: LUCENE_50
   [junit4]   2> 1635566 T2653 oasc.SolrConfig.<init> Using Lucene MatchVersion: LUCENE_50
   [junit4]   2> 1635569 T2694 oasc.SolrConfig.<init> Using Lucene MatchVersion: LUCENE_50
   [junit4]   2> 1635648 T2680 oasc.SolrConfig.<init> Loaded SolrConfig: solrconfig.xml
   [junit4]   2> 1635648 T2634 oasc.SolrConfig.<init> Loaded SolrConfig: solrconfig.xml
   [junit4]   2> 1635648 T2653 oasc.SolrConfig.<init> Loaded SolrConfig: solrconfig.xml
   [junit4]   2> 1635653 T2694 oasc.SolrConfig.<init> Loaded SolrConfig: solrconfig.xml
   [junit4]   2> 1635751 T2653 oass.IndexSchema.readSchema Reading Solr Schema from schema.xml
   [junit4]   2> 1635751 T2680 oass.IndexSchema.readSchema Reading Solr Schema from schema.xml
   [junit4]   2> 1635751 T2634 oass.IndexSchema.readSchema Reading Solr Schema from schema.xml
   [junit4]   2> 1635755 T2694 oass.IndexSchema.readSchema Reading Solr Schema from schema.xml
   [junit4]   2> 1635765 T2653 oass.IndexSchema.readSchema [nodes_used_collection_shard2_replica1] Schema name=test
   [junit4]   2> 1635765 T2634 oass.IndexSchema.readSchema [nodes_used_collection_shard2_replica2] Schema name=test
   [junit4]   2> 1635765 T2680 oass.IndexSchema.readSchema [nodes_used_collection_shard1_replica1] Schema name=test
   [junit4]   2> 1635769 T2694 oass.IndexSchema.readSchema [nodes_used_collection_shard1_replica2] Schema name=test
   [junit4]   2> 1636627 T2653 oass.OpenExchangeRatesOrgProvider.init Initialized with rates=open-exchange-rates.json, refreshInterval=1440.
   [junit4]   2> 1636634 T2680 oass.OpenExchangeRatesOrgProvider.init Initialized with rates=open-exchange-rates.json, refreshInterval=1440.
   [junit4]   2> 1636636 T2634 oass.OpenExchangeRatesOrgProvider.init Initialized with rates=open-exchange-rates.json, refreshInterval=1440.
   [junit4]   2> 1636641 T2653 oass.IndexSchema.readSchema default search field in schema is text
   [junit4]   2> 1636645 T2680 oass.IndexSchema.readSchema default search field in schema is text
   [junit4]   2> 1636645 T2634 oass.IndexSchema.readSchema default search field in schema is text
   [junit4]   2> 1636645 T2653 oass.IndexSchema.readSchema unique key field: id
   [junit4]   2> 1636650 T2680 oass.IndexSchema.readSchema unique key field: id
   [junit4]   2> 1636650 T2634 oass.IndexSchema.readSchema unique key field: id
   [junit4]   2> 1636664 T2653 oass.FileExchangeRateProvider.reload Reloading exchange rates from file currency.xml
   [junit4]   2> 1636665 T2694 oass.OpenExchangeRatesOrgProvider.init Initialized with rates=open-exchange-rates.json, refreshInterval=1440.
   [junit4]   2> 1636668 T2680 oass.FileExchangeRateProvider.reload Reloading exchange rates from file currency.xml
   [junit4]   2> 1636669 T2634 oass.FileExchangeRateProvider.reload Reloading exchange rates from file currency.xml
   [junit4]   2> 1636670 T2653 oass.FileExchangeRateProvider.reload Reloading exchange rates from file currency.xml
   [junit4]   2> 1636675 T2694 oass.IndexSchema.readSchema default search field in schema is text
   [junit4]   2> 1636676 T2653 oass.OpenExchangeRatesOrgProvider.reload Reloading exchange rates from open-exchange-rates.json
   [junit4]   2> 1636675 T2634 oass.FileExchangeRateProvider.reload Reloading exchange rates from file currency.xml
   [junit4]   2> 1636677 T2680 oass.FileExchangeRateProvider.reload Reloading exchange rates from file currency.xml
   [junit4]   2> 1636677 T2653 oass.OpenExchangeRatesOrgProvider$OpenExchangeRates.<init> WARN Unknown key IMPORTANT NOTE
   [junit4]   2> 1636678 T2653 oass.OpenExchangeRatesOrgProvider$OpenExchangeRates.<init> WARN Expected key, got STRING
   [junit4]   2> 1636679 T2653 oass.OpenExchangeRatesOrgProvider.reload Reloading exchange rates from open-exchange-rates.json
   [junit4]   2> 1636680 T2653 oass.OpenExchangeRatesOrgProvider$OpenExchangeRates.<init> WARN Unknown key IMPORTANT NOTE
   [junit4]   2> 1636680 T2653 oass.OpenExchangeRatesOrgProvider$OpenExchangeRates.<init> WARN Expected key, got STRING
   [junit4]   2> 1636680 T2694 oass.IndexSchema.readSchema unique key field: id
   [junit4]   2> 1636681 T2653 oasc.SolrCore.initDirectoryFactory org.apache.solr.core.MockDirectoryFactory
   [junit4]   2> 1636682 T2653 oasc.SolrCore.<init> [nodes_used_collection_shard2_replica1] Opening new SolrCore at /usr/home/hudson/hudson-slave/workspace/Lucene-Solr-Tests-trunk-Java7/solr/build/solr-core/test/J1/./org.apache.solr.cloud.CollectionsAPIDistributedZkTest-jetty1-1375349467953/nodes_used_collection_shard2_replica1/, dataDir=/usr/home/hudson/hudson-slave/workspace/Lucene-Solr-Tests-trunk-Java7/solr/build/solr-core/test/J1/./org.apache.solr.cloud.CollectionsAPIDistributedZkTest-jetty1-1375349467953//nodes_used_collection_shard2_replica1/data/
   [junit4]   2> 1636682 T2634 oass.OpenExchangeRatesOrgProvider.reload Reloading exchange rates from open-exchange-rates.json
   [junit4]   2> 1636682 T2653 oasc.JmxMonitoredMap.<init> JMX monitoring is enabled. Adding Solr mbeans to JMX Server: com.sun.jmx.mbeanserver.JmxMBeanServer@57711189
   [junit4]   2> 1636683 T2680 oass.OpenExchangeRatesOrgProvider.reload Reloading exchange rates from open-exchange-rates.json
   [junit4]   2> 1636684 T2653 oasc.CachingDirectoryFactory.get return new directory for /usr/home/hudson/hudson-slave/workspace/Lucene-Solr-Tests-trunk-Java7/solr/build/solr-core/test/J1/./org.apache.solr.cloud.CollectionsAPIDistributedZkTest-jetty1-1375349467953//nodes_used_collection_shard2_replica1/data
   [junit4]   2> 1636684 T2634 oass.OpenExchangeRatesOrgProvider$OpenExchangeRates.<init> WARN Unknown key IMPORTANT NOTE
   [junit4]   2> 1636684 T2653 oasc.SolrCore.getNewIndexDir New index directory detected: old=null new=/usr/home/hudson/hudson-slave/workspace/Lucene-Solr-Tests-trunk-Java7/solr/build/solr-core/test/J1/./org.apache.solr.cloud.CollectionsAPIDistributedZkTest-jetty1-1375349467953//nodes_used_collection_shard2_replica1/data/index/
   [junit4]   2> 1636685 T2680 oass.OpenExchangeRatesOrgProvider$OpenExchangeRates.<init> WARN Unknown key IMPORTANT NOTE
   [junit4]   2> 1636685 T2634 oass.OpenExchangeRatesOrgProvider$OpenExchangeRates.<init> WARN Expected key, got STRING
   [junit4]   2> 1636686 T2680 oass.OpenExchangeRatesOrgProvider$OpenExchangeRates.<init> WARN Expected key, got STRING
   [junit4]   2> 1636685 T2653 oasc.SolrCore.initIndex WARN [nodes_used_collection_shard2_replica1] Solr index directory '/usr/home/hudson/hudson-slave/workspace/Lucene-Solr-Tests-trunk-Java7/solr/build/solr-core/test/J1/./org.apache.solr.cloud.CollectionsAPIDistributedZkTest-jetty1-1375349467953/nodes_used_collection_shard2_replica1/data/index' doesn't exist. Creating new index...
   [junit4]   2> 1636687 T2680 oass.OpenExchangeRatesOrgProvider.reload Reloading exchange rates from open-exchange-rates.json
   [junit4]   2> 1636686 T2634 oass.OpenExchangeRatesOrgProvider.reload Reloading exchange rates from open-exchange-rates.json
   [junit4]   2> 1636687 T2653 oasc.CachingDirectoryFactory.get return new directory for /usr/home/hudson/hudson-slave/workspace/Lucene-Solr-Tests-trunk-Java7/solr/build/solr-core/test/J1/./org.apache.solr.cloud.CollectionsAPIDistributedZkTest-jetty1-1375349467953//nodes_used_collection_shard2_replica1/data/index
   [junit4]   2> 1636688 T2680 oass.OpenExchangeRatesOrgProvider$OpenExchangeRates.<init> WARN Unknown key IMPORTANT NOTE
   [junit4]   2> 1636689 T2634 oass.OpenExchangeRatesOrgProvider$OpenExchangeRates.<init> WARN Unknown key IMPORTANT NOTE
   [junit4]   2> 1636689 T2634 oass.OpenExchangeRatesOrgProvider$OpenExchangeRates.<init> WARN Expected key, got STRING
   [junit4]   2> 1636689 T2680 oass.OpenExchangeRatesOrgProvider$OpenExchangeRates.<init> WARN Expected key, got STRING
   [junit4]   2> 1636690 T2634 oasc.SolrCore.initDirectoryFactory org.apache.solr.core.MockDirectoryFactory
   [junit4]   2> 1636690 T2680 oasc.SolrCore.initDirectoryFactory org.apache.solr.core.MockDirectoryFactory
   [junit4]   2> 1636691 T2634 oasc.SolrCore.<init> [nodes_used_collection_shard2_replica2] Opening new SolrCore at /usr/home/hudson/hudson-slave/workspace/Lucene-Solr-Tests-trunk-Java7/solr/build/solr-core/test/J1/./org.apache.solr.cloud.CollectionsAPIDistributedZkTest-controljetty-1375349466699/nodes_used_collection_shard2_replica2/, dataDir=/usr/home/hudson/hudson-slave/workspace/Lucene-Solr-Tests-trunk-Java7/solr/build/solr-core/test/J1/./org.apache.solr.cloud.CollectionsAPIDistributedZkTest-controljetty-1375349466699//nodes_used_collection_shard2_replica2/data/
   [junit4]   2> 1636691 T2680 oasc.SolrCore.<init> [nodes_used_collection_shard1_replica1] Opening new SolrCore at /usr/home/hudson/hudson-slave/workspace/Lucene-Solr-Tests-trunk-Java7/solr/build/solr-core/test/J1/./org.apache.solr.cloud.CollectionsAPIDistributedZkTest-jetty3-1375349471407/nodes_used_collection_shard1_replica1/, dataDir=/usr/home/hudson/hudson-slave/workspace/Lucene-Solr-Tests-trunk-Java7/solr/build/solr-core/test/J1/./org.apache.solr.cloud.CollectionsAPIDistributedZkTest-jetty3-1375349471407//nodes_used_collection_shard1_replica1/data/
   [junit4]   2> 1636692 T2634 oasc.JmxMonitoredMap.<init> JMX monitoring is enabled. Adding Solr mbeans to JMX Server: com.sun.jmx.mbeanserver.JmxMBeanServer@57711189
   [junit4]   2> 1636692 T2680 oasc.JmxMonitoredMap.<init> JMX monitoring is enabled. Adding Solr mbeans to JMX Server: com.sun.jmx.mbeanserver.JmxMBeanServer@57711189
   [junit4]   2> 1636693 T2653 oasc.SolrDeletionPolicy.onCommit SolrDeletionPolicy.onCommit: commits: num=1
   [junit4]   2> 		commit{dir=MockDirWrapper(org.apache.lucene.store.RAMDirectory@73c42451 lockFactory=org.apache.lucene.store.NativeFSLockFactory@17096ea6),segFN=segments_1,generation=1}
   [junit4]   2> 1636693 T2634 oasc.CachingDirectoryFactory.get return new directory for /usr/home/hudson/hudson-slave/workspace/Lucene-Solr-Tests-trunk-Java7/solr/build/solr-core/test/J1/./org.apache.solr.cloud.CollectionsAPIDistributedZkTest-controljetty-1375349466699//nodes_used_collection_shard2_replica2/data
   [junit4]   2> 1636694 T2680 oasc.CachingDirectoryFactory.get return new directory for /usr/home/hudson/hudson-slave/workspace/Lucene-Solr-Tests-trunk-Java7/solr/build/solr-core/test/J1/./org.apache.solr.cloud.CollectionsAPIDistributedZkTest-jetty3-1375349471407//nodes_used_collection_shard1_replica1/data
   [junit4]   2> 1636694 T2653 oasc.SolrDeletionPolicy.updateCommits newest commit generation = 1
   [junit4]   2> 1636695 T2680 oasc.SolrCore.getNewIndexDir New index directory detected: old=null new=/usr/home/hudson/hudson-slave/workspace/Lucene-Solr-Tests-trunk-Java7/solr/build/solr-core/test/J1/./org.apache.solr.cloud.CollectionsAPIDistributedZkTest-jetty3-1375349471407//nodes_used_collection_shard1_replica1/data/index/
   [junit4]   2> 1636694 T2634 oasc.SolrCore.getNewIndexDir New index directory detected: old=null new=/usr/home/hudson/hudson-slave/workspace/Lucene-Solr-Tests-trunk-Java7/solr/build/solr-core/test/J1/./org.apache.solr.cloud.CollectionsAPIDistributedZkTest-controljetty-1375349466699//nodes_used_collection_shard2_replica2/data/index/
   [junit4]   2> 1636696 T2680 oasc.SolrCore.initIndex WARN [nodes_used_collection_shard1_replica1] Solr index directory '/usr/home/hudson/hudson-slave/workspace/Lucene-Solr-Tests-trunk-Java7/solr/build/solr-core/test/J1/./org.apache.solr.cloud.CollectionsAPIDistributedZkTest-jetty3-1375349471407/nodes_used_collection_shard1_replica1/data/index' doesn't exist. Creating new index...
   [junit4]   2> 1636696 T2634 oasc.SolrCore.initIndex WARN [nodes_used_collection_shard2_replica2] Solr index directory '/usr/home/hudson/hudson-slave/workspace/Lucene-Solr-Tests-trunk-Java7/solr/build/solr-core/test/J1/./org.apache.solr.cloud.CollectionsAPIDistributedZkTest-controljetty-1375349466699/nodes_used_collection_shard2_replica2/data/index' doesn't exist. Creating new index...
   [junit4]   2> 1636697 T2680 oasc.CachingDirectoryFactory.get return new directory for /usr/home/hudson/hudson-slave/workspace/Lucene-Solr-Tests-trunk-Java7/solr/build/solr-core/test/J1/./org.apache.solr.cloud.CollectionsAPIDistributedZkTest-jetty3-1375349471407//nodes_used_collection_shard1_replica1/data/index
   [junit4]   2> 1636697 T2634 oasc.CachingDirectoryFactory.get return new directory for /usr/home/hudson/hudson-slave/workspace/Lucene-Solr-Tests-trunk-Java7/solr/build/solr-core/test/J1/./org.apache.solr.cloud.CollectionsAPIDistributedZkTest-controljetty-1375349466699//nodes_used_collection_shard2_replica2/data/index
   [junit4]   2> 1636698 T2694 oass.FileExchangeRateProvider.reload Reloading exchange rates from file currency.xml
   [junit4]   2> 1636701 T2653 oasup.UpdateRequestProcessorChain.init inserting DistributedUpdateProcessorFactory into updateRequestProcessorChain "dedupe"
   [junit4]   2> 1636701 T2653 oasup.UpdateRequestProcessorChain.init inserting DistributedUpdateProcessorFactory into updateRequestProcessorChain "stored_sig"
   [junit4]   2> 1636702 T2653 oasup.UpdateRequestProcessorChain.init inserting DistributedUpdateProcessorFactory into updateRequestProcessorChain "distrib-dup-test-chain-implicit"
   [junit4]   2> 1636703 T2653 oasc.RequestHandlers.initHandlersFromConfig created standard: solr.StandardRequestHandler
   [junit4]   2> 1636704 T2680 oasc.SolrDeletionPolicy.onCommit SolrDeletionPolicy.onCommit: commits: num=1
   [junit4]   2> 		commit{dir=MockDirWrapper(org.apache.lucene.store.RAMDirectory@3853903 lockFactory=org.apache.lucene.store.NativeFSLockFactory@62094f85),segFN=segments_1,generation=1}
   [junit4]   2> 1636704 T2653 oasc.RequestHandlers.initHandlersFromConfig created /get: solr.RealTimeGetHandler
   [junit4]   2> 1636704 T2634 oasc.SolrDeletionPolicy.onCommit SolrDeletionPolicy.onCommit: commits: num=1
   [junit4]   2> 		commit{dir=MockDirWrapper(org.apache.lucene.store.RAMDirectory@3cdb3cdb lockFactory=org.apache.lucene.store.NativeFSLockFactory@31427ae6),segFN=segments_1,generation=1}
   [junit4]   2> 1636704 T2680 oasc.SolrDeletionPolicy.updateCommits newest commit generation = 1
   [junit4]   2> 1636705 T2634 oasc.SolrDeletionPolicy.updateCommits newest commit generation = 1
   [junit4]   2> 1636704 T2653 oasc.RequestHandlers.initHandlersFromConfig adding lazy requestHandler: solr.ReplicationHandler
   [junit4]   2> 1636707 T2653 oasc.RequestHandlers.initHandlersFromConfig created /replication: solr.ReplicationHandler
   [junit4]   2> 1636707 T2653 oasc.RequestHandlers.initHandlersFromConfig created /update: solr.UpdateRequestHandler
   [junit4]   2> 1636708 T2653 oasc.RequestHandlers.initHandlersFromConfig created /admin/: org.apache.solr.handler.admin.AdminHandlers
   [junit4]   2> 1636712 T2680 oasup.UpdateRequestProcessorChain.init inserting DistributedUpdateProcessorFactory into updateRequestProcessorChain "dedupe"
   [junit4]   2> 1636712 T2680 oasup.UpdateRequestProcessorChain.init inserting DistributedUpdateProcessorFactory into updateRequestProcessorChain "stored_sig"
   [junit4]   2> 1636712 T2634 oasup.UpdateRequestProcessorChain.init inserting DistributedUpdateProcessorFactory into updateRequestProcessorChain "dedupe"
   [junit4]   2> 1636713 T2634 oasup.UpdateRequestProcessorChain.init inserting DistributedUpdateProcessorFactory into updateRequestProcessorChain "stored_sig"
   [junit4]   2> 1636713 T2680 oasup.UpdateRequestProcessorChain.init inserting DistributedUpdateProcessorFactory into updateRequestProcessorChain "distrib-dup-test-chain-implicit"
   [junit4]   2> 1636714 T2634 oasup.UpdateRequestProcessorChain.init inserting DistributedUpdateProcessorFactory into updateRequestProcessorChain "distrib-dup-test-chain-implicit"
   [junit4]   2> 1636714 T2680 oasc.RequestHandlers.initHandlersFromConfig created standard: solr.StandardRequestHandler
   [junit4]   2> 1636715 T2634 oasc.RequestHandlers.initHandlersFromConfig created standard: solr.StandardRequestHandler
   [junit4]   2> 1636715 T2680 oasc.RequestHandlers.initHandlersFromConfig created /get: solr.RealTimeGetHandler
   [junit4]   2> 1636716 T2680 oasc.RequestHandlers.initHandlersFromConfig adding lazy requestHandler: solr.ReplicationHandler
   [junit4]   2> 1636716 T2634 oasc.RequestHandlers.initHandlersFromConfig created /get: solr.RealTimeGetHandler
   [junit4]   2> 1636716 T2634 oasc.RequestHandlers.initHandlersFromConfig adding lazy requestHandler: solr.ReplicationHandler
   [junit4]   2> 1636716 T2680 oasc.RequestHandlers.initHandlersFromConfig created /replication: solr.ReplicationHandler
   [junit4]   2> 1636717 T2634 oasc.RequestHandlers.initHandlersFromConfig created /replication: solr.ReplicationHandler
   [junit4]   2> 1636718 T2680 oasc.RequestHandlers.initHandlersFromConfig created /update: solr.UpdateRequestHandler
   [junit4]   2> 1636718 T2634 oasc.RequestHandlers.initHandlersFromConfig created /update: solr.UpdateRequestHandler
   [junit4]   2> 1636718 T2680 oasc.RequestHandlers.initHandlersFromConfig created /admin/: org.apache.solr.handler.admin.AdminHandlers
   [junit4]   2> 1636718 T2634 oasc.RequestHandlers.initHandlersFromConfig created /admin/: org.apache.solr.handler.admin.AdminHandlers
   [junit4]   2> 1636738 T2653 oashl.XMLLoader.init xsltCacheLifetimeSeconds=60
   [junit4]   2> 1636738 T2634 oashl.XMLLoader.init xsltCacheLifetimeSeconds=60
   [junit4]   2> 1636739 T2680 oashl.XMLLoader.init xsltCacheLifetimeSeconds=60
   [junit4]   2> 1636740 T2694 oass.FileExchangeRateProvider.reload Reloading exchange rates from file currency.xml
   [junit4]   2> 1636743 T2634 oass.SolrIndexSearcher.<init> Opening Searcher@1a8c4453 main
   [junit4]   2> 1636743 T2653 oass.SolrIndexSearcher.<init> Opening Searcher@6ed9b2c2 main
   [junit4]   2> 1636744 T2680 oass.SolrIndexSearcher.<init> Opening Searcher@7d1e6a56 main
   [junit4]   2> 1636745 T2634 oasu.CommitTracker.<init> Hard AutoCommit: disabled
   [junit4]   2> 1636746 T2653 oasu.CommitTracker.<init> Hard AutoCommit: disabled
   [junit4]   2> 1636746 T2680 oasu.CommitTracker.<init> Hard AutoCommit: disabled
   [junit4]   2> 1636746 T2634 oasu.CommitTracker.<init> Soft AutoCommit: disabled
   [junit4]   2> 1636747 T2680 oasu.CommitTracker.<init> Soft AutoCommit: disabled
   [junit4]   2> 1636746 T2653 oasu.CommitTracker.<init> Soft AutoCommit: disabled
   [junit4]   2> 1636751 T2694 oass.OpenExchangeRatesOrgProvider.reload Reloading exchange rates from open-exchange-rates.json
   [junit4]   2> 1636752 T2711 oasc.SolrCore.registerSearcher [nodes_used_collection_shard2_replica2] Registered new searcher Searcher@1a8c4453 main{StandardDirectoryReader(segments_1:1)}
   [junit4]   2> 1636752 T2710 oasc.SolrCore.registerSearcher [nodes_used_collection_shard2_replica1] Registered new searcher Searcher@6ed9b2c2 main{StandardDirectoryReader(segments_1:1)}
   [junit4]   2> 1636752 T2712 oasc.SolrCore.registerSearcher [nodes_used_collection_shard1_replica1] Registered new searcher Searcher@7d1e6a56 main{StandardDirectoryReader(segments_1:1)}
   [junit4]   2> 1636753 T2694 oass.OpenExchangeRatesOrgProvider$OpenExchangeRates.<init> WARN Unknown key IMPORTANT NOTE
   [junit4]   2> 1636753 T2694 oass.OpenExchangeRatesOrgProvider$OpenExchangeRates.<init> WARN Expected key, got STRING
   [junit4]   2> 1636754 T2694 oass.OpenExchangeRatesOrgProvider.reload Reloading exchange rates from open-exchange-rates.json
   [junit4]   2> 1636754 T2634 oasc.CoreContainer.registerCore registering core: nodes_used_collection_shard2_replica2
   [junit4]   2> 1636754 T2653 oasc.CoreContainer.registerCore registering core: nodes_used_collection_shard2_replica1
   [junit4]   2> 1636755 T2680 oasc.CoreContainer.registerCore registering core: nodes_used_collection_shard1_replica1
   [junit4]   2> 1636755 T2634 oasc.ZkController.register Register replica - core:nodes_used_collection_shard2_replica2 address:http://127.0.0.1:22468/e collection:nodes_used_collection shard:shard2
   [junit4]   2> 1636755 T2680 oasc.ZkController.register Register replica - core:nodes_used_collection_shard1_replica1 address:http://127.0.0.1:53720/e collection:nodes_used_collection shard:shard1
   [junit4]   2> 1636755 T2694 oass.OpenExchangeRatesOrgProvider$OpenExchangeRates.<init> WARN Unknown key IMPORTANT NOTE
   [junit4]   2> 1636755 T2653 oasc.ZkController.register Register replica - core:nodes_used_collection_shard2_replica1 address:http://127.0.0.1:22013/e collection:nodes_used_collection shard:shard2
   [junit4]   2> 1636756 T2694 oass.OpenExchangeRatesOrgProvider$OpenExchangeRates.<init> WARN Expected key, got STRING
   [junit4]   2> 1636756 T2680 oascsi.HttpClientUtil.createClient Creating new http client, config:maxConnections=10000&maxConnectionsPerHost=20&connTimeout=15000&socketTimeout=30000&retry=false
   [junit4]   2> 1636756 T2634 oascsi.HttpClientUtil.createClient Creating new http client, config:maxConnections=10000&maxConnectionsPerHost=20&connTimeout=15000&socketTimeout=30000&retry=false
   [junit4]   2> 1636757 T2694 oasc.SolrCore.initDirectoryFactory org.apache.solr.core.MockDirectoryFactory
   [junit4]   2> 1636757 T2653 oascsi.HttpClientUtil.createClient Creating new http client, config:maxConnections=10000&maxConnectionsPerHost=20&connTimeout=15000&socketTimeout=30000&retry=false
   [junit4]   2> 1636759 T2694 oasc.SolrCore.<init> [nodes_used_collection_shard1_replica2] Opening new SolrCore at /usr/home/hudson/hudson-slave/workspace/Lucene-Solr-Tests-trunk-Java7/solr/build/solr-core/test/J1/./org.apache.solr.cloud.CollectionsAPIDistributedZkTest-jetty4-1375349473127/nodes_used_collection_shard1_replica2/, dataDir=/usr/home/hudson/hudson-slave/workspace/Lucene-Solr-Tests-trunk-Java7/solr/build/solr-core/test/J1/./org.apache.solr.cloud.CollectionsAPIDistributedZkTest-jetty4-1375349473127//nodes_used_collection_shard1_replica2/data/
   [junit4]   2> 1636759 T2694 oasc.JmxMonitoredMap.<init> JMX monitoring is enabled. Adding Solr mbeans to JMX Server: com.sun.jmx.mbeanserver.JmxMBeanServer@57711189
   [junit4]   2> 1636761 T2694 oasc.CachingDirectoryFactory.get return new directory for /usr/home/hudson/hudson-slave/workspace/Lucene-Solr-Tests-trunk-Java7/solr/build/solr-core/test/J1/./org.apache.solr.cloud.CollectionsAPIDistributedZkTest-jetty4-1375349473127//nodes_used_collection_shard1_replica2/data
   [junit4]   2> 1636761 T2694 oasc.SolrCore.getNewIndexDir New index directory detected: old=null new=/usr/home/hudson/hudson-slave/workspace/Lucene-Solr-Tests-trunk-Java7/solr/build/solr-core/test/J1/./org.apache.solr.cloud.CollectionsAPIDistributedZkTest-jetty4-1375349473127//nodes_used_collection_shard1_replica2/data/index/
   [junit4]   2> 1636762 T2694 oasc.SolrCore.initIndex WARN [nodes_used_collection_shard1_replica2] Solr index directory '/usr/home/hudson/hudson-slave/workspace/Lucene-Solr-Tests-trunk-Java7/solr/build/solr-core/test/J1/./org.apache.solr.cloud.CollectionsAPIDistributedZkTest-jetty4-1375349473127/nodes_used_collection_shard1_replica2/data/index' doesn't exist. Creating new index...
   [junit4]   2> 1636762 T2694 oasc.CachingDirectoryFactory.get return new directory for /usr/home/hudson/hudson-slave/workspace/Lucene-Solr-Tests-trunk-Java7/solr/build/solr-core/test/J1/./org.apache.solr.cloud.CollectionsAPIDistributedZkTest-jetty4-1375349473127//nodes_used_collection_shard1_replica2/data/index
   [junit4]   2> 1636768 T2694 oasc.SolrDeletionPolicy.onCommit SolrDeletionPolicy.onCommit: commits: num=1
   [junit4]   2> 		commit{dir=MockDirWrapper(org.apache.lucene.store.RAMDirectory@4c96eda9 lockFactory=org.apache.lucene.store.NativeFSLockFactory@514b19b4),segFN=segments_1,generation=1}
   [junit4]   2> 1636768 T2694 oasc.SolrDeletionPolicy.updateCommits newest commit generation = 1
   [junit4]   2> 1636774 T2694 oasup.UpdateRequestProcessorChain.init inserting DistributedUpdateProcessorFactory into updateRequestProcessorChain "dedupe"
   [junit4]   2> 1636775 T2694 oasup.UpdateRequestProcessorChain.init inserting DistributedUpdateProcessorFactory into updateRequestProcessorChain "stored_sig"
   [junit4]   2> 1636776 T2694 oasup.UpdateRequestProcessorChain.init inserting DistributedUpdateProcessorFactory into updateRequestProcessorChain "distrib-dup-test-chain-implicit"
   [junit4]   2> 1636777 T2694 oasc.RequestHandlers.initHandlersFromConfig created standard: solr.StandardRequestHandler
   [junit4]   2> 1636778 T2694 oasc.RequestHandlers.initHandlersFromConfig created /get: solr.RealTimeGetHandler
   [junit4]   2> 1636778 T2694 oasc.RequestHandlers.initHandlersFromConfig adding lazy requestHandler: solr.ReplicationHandler
   [junit4]   2> 1636779 T2694 oasc.RequestHandlers.initHandlersFromConfig created /replication: solr.ReplicationHandler
   [junit4]   2> 1636779 T2694 oasc.RequestHandlers.initHandlersFromConfig created /update: solr.UpdateRequestHandler
   [junit4]   2> 1636780 T2694 oasc.RequestHandlers.initHandlersFromConfig created /admin/: org.apache.solr.handler.admin.AdminHandlers
   [junit4]   2> 1636786 T2634 oascc.SolrZkClient.makePath makePath: /collections/nodes_used_collection/leader_elect/shard2/election
   [junit4]   2> 1636786 T2653 oascc.SolrZkClient.makePath makePath: /collections/nodes_used_collection/leader_elect/shard2/election
   [junit4]   2> 1636786 T2680 oascc.SolrZkClient.makePath makePath: /collections/nodes_used_collection/leader_elect/shard1/election
   [junit4]   2> 1636800 T2694 oashl.XMLLoader.init xsltCacheLifetimeSeconds=60
   [junit4]   2> 1636807 T2694 oass.SolrIndexSearcher.<init> Opening Searcher@27c03d2a main
   [junit4]   2> 1636809 T2694 oasu.CommitTracker.<init> Hard AutoCommit: disabled
   [junit4]   2> 1636810 T2694 oasu.CommitTracker.<init> Soft AutoCommit: disabled
   [junit4]   2> 1636814 T2713 oasc.SolrCore.registerSearcher [nodes_used_collection_shard1_replica2] Registered new searcher Searcher@27c03d2a main{StandardDirectoryReader(segments_1:1)}
   [junit4]   2> 1636817 T2694 oasc.CoreContainer.registerCore registering core: nodes_used_collection_shard1_replica2
   [junit4]   2> 1636817 T2694 oasc.ZkController.register Register replica - core:nodes_used_collection_shard1_replica2 address:http://127.0.0.1:34679/e collection:nodes_used_collection shard:shard1
   [junit4]   2> 1636818 T2694 oascsi.HttpClientUtil.createClient Creating new http client, config:maxConnections=10000&maxConnectionsPerHost=20&connTimeout=15000&socketTimeout=30000&retry=false
   [junit4]   2> 1636820 T2653 oasc.ShardLeaderElectionContext.runLeaderProcess Running the leader process for shard shard2
   [junit4]   2> 1636821 T2680 oasc.ShardLeaderElectionContext.runLeaderProcess Running the leader process for shard shard1
   [junit4]   2> 1636824 T2653 oasc.ShardLeaderElectionContext.waitForReplicasToComeUp Enough replicas found to continue.
   [junit4]   2> 1636824 T2680 oasc.ShardLeaderElectionContext.waitForReplicasToComeUp Waiting until we see more replicas up for shard shard1: total=2 found=1 timeoutin=180000
   [junit4]   2> 1636824 T2653 oasc.ShardLeaderElectionContext.runLeaderProcess I may be the new leader - try and sync
   [junit4]   2> 1636825 T2653 oasc.SyncStrategy.sync Sync replicas to http://127.0.0.1:22013/e/nodes_used_collection_shard2_replica1/
   [junit4]   2> 1636826 T2653 oasu.PeerSync.sync PeerSync: core=nodes_used_collection_shard2_replica1 url=http://127.0.0.1:22013/e START replicas=[http://127.0.0.1:22468/e/nodes_used_collection_shard2_replica2/] nUpdates=100
   [junit4]   2> 1636827 T2653 oasu.PeerSync.sync PeerSync: core=nodes_used_collection_shard2_replica1 url=http://127.0.0.1:22013/e DONE.  We have no versions.  sync failed.
   [junit4]   2> 1636827 T2653 oasc.SyncStrategy.syncReplicas Leader's attempt to sync with shard failed, moving to the next candidate
   [junit4]   2> 1636828 T2653 oasc.ShardLeaderElectionContext.runLeaderProcess We failed sync, but we have no versions - we can't sync in that case - we were active before, so become leader anyway
   [junit4]   2> 1636829 T2653 oasc.ShardLeaderElectionContext.runLeaderProcess I am the new leader: http://127.0.0.1:22013/e/nodes_used_collection_shard2_replica1/ shard2
   [junit4]   2> 1636829 T2653 oascc.SolrZkClient.makePath makePath: /collections/nodes_used_collection/leaders/shard2
   [junit4]   2> ASYNC  NEW_CORE C874 name=nodes_used_collection_shard2_replica2 org.apache.solr.core.SolrCore@34be827b url=http://127.0.0.1:22468/e/nodes_used_collection_shard2_replica2 node=127.0.0.1:22468_e C874_STATE=coll:nodes_used_collection core:nodes_used_collection_shard2_replica2 props:{state=down, core=nodes_used_collection_shard2_replica2, node_name=127.0.0.1:22468_e, base_url=http://127.0.0.1:22468/e}
   [junit4]   2> 1636836 T2635 C874 P22468 oasc.SolrCore.execute [nodes_used_collection_shard2_replica2] webapp=/e path=/get params={getVersions=100&distrib=false&wt=javabin&qt=/get&version=2} status=0 QTime=0 
   [junit4]   2> 1637326 T2680 oasc.ShardLeaderElectionContext.waitForReplicasToComeUp Enough replicas found to continue.
   [junit4]   2> 1637327 T2680 oasc.ShardLeaderElectionContext.runLeaderProcess I may be the new leader - try and sync
   [junit4]   2> 1637328 T2680 oasc.SyncStrategy.sync Sync replicas to http://127.0.0.1:53720/e/nodes_used_collection_shard1_replica1/
   [junit4]   2> 1637328 T2680 oasu.PeerSync.sync PeerSync: core=nodes_used_collection_shard1_repl

[...truncated too long message...]

nit4]   2> 1795146 T3245 oasc.Overseer$ClusterStateUpdater.amILeader According to ZK I (id=90134902630187020-127.0.0.1:34679_e-n_0000000004) am no longer a leader.
   [junit4]   2> 1795149 T2622 oejsh.ContextHandler.doStop stopped o.e.j.s.ServletContextHandler{/e,null}
   [junit4]   2> 1795205 T2622 oas.SolrTestCaseJ4.tearDown ###Ending testDistribSearch
   [junit4]   2> 1795208 T2622 oasc.ZkTestServer.send4LetterWord connecting to 127.0.0.1:16076 16076
   [junit4]   1> client port:0.0.0.0/0.0.0.0:0
   [junit4]   2> NOTE: reproduce with: ant test  -Dtestcase=CollectionsAPIDistributedZkTest -Dtests.method=testDistribSearch -Dtests.seed=1AD2B6BF02D63BAB -Dtests.multiplier=3 -Dtests.slow=true -Dtests.locale=ga_IE -Dtests.timezone=America/Port-au-Prince -Dtests.file.encoding=US-ASCII
   [junit4] ERROR    171s J1 | CollectionsAPIDistributedZkTest.testDistribSearch <<<
   [junit4]    > Throwable #1: org.apache.solr.client.solrj.SolrServerException: IOException occured when talking to server at: http://127.0.0.1:22013/e
   [junit4]    > 	at __randomizedtesting.SeedInfo.seed([1AD2B6BF02D63BAB:9B3438A775895B97]:0)
   [junit4]    > 	at org.apache.solr.client.solrj.impl.HttpSolrServer.request(HttpSolrServer.java:435)
   [junit4]    > 	at org.apache.solr.client.solrj.impl.HttpSolrServer.request(HttpSolrServer.java:180)
   [junit4]    > 	at org.apache.solr.cloud.AbstractFullDistribZkTestBase.createCollection(AbstractFullDistribZkTestBase.java:1535)
   [junit4]    > 	at org.apache.solr.cloud.CollectionsAPIDistributedZkTest.testCustomCollectionsAPI(CollectionsAPIDistributedZkTest.java:677)
   [junit4]    > 	at org.apache.solr.cloud.CollectionsAPIDistributedZkTest.doTest(CollectionsAPIDistributedZkTest.java:159)
   [junit4]    > 	at org.apache.solr.BaseDistributedSearchTestCase.testDistribSearch(BaseDistributedSearchTestCase.java:835)
   [junit4]    > 	at java.lang.Thread.run(Thread.java:724)
   [junit4]    > Caused by: org.apache.http.conn.ConnectTimeoutException: Connect to 127.0.0.1:22013 timed out
   [junit4]    > 	at org.apache.http.conn.scheme.PlainSocketFactory.connectSocket(PlainSocketFactory.java:129)
   [junit4]    > 	at org.apache.http.impl.conn.DefaultClientConnectionOperator.openConnection(DefaultClientConnectionOperator.java:180)
   [junit4]    > 	at org.apache.http.impl.conn.ManagedClientConnectionImpl.open(ManagedClientConnectionImpl.java:294)
   [junit4]    > 	at org.apache.http.impl.client.DefaultRequestDirector.tryConnect(DefaultRequestDirector.java:645)
   [junit4]    > 	at org.apache.http.impl.client.DefaultRequestDirector.execute(DefaultRequestDirector.java:480)
   [junit4]    > 	at org.apache.http.impl.client.AbstractHttpClient.execute(AbstractHttpClient.java:906)
   [junit4]    > 	at org.apache.http.impl.client.AbstractHttpClient.execute(AbstractHttpClient.java:805)
   [junit4]    > 	at org.apache.http.impl.client.AbstractHttpClient.execute(AbstractHttpClient.java:784)
   [junit4]    > 	at org.apache.solr.client.solrj.impl.HttpSolrServer.request(HttpSolrServer.java:365)
   [junit4]    > 	... 45 more
   [junit4]   2> 1795286 T2622 oas.SolrTestCaseJ4.deleteCore ###deleteCore
   [junit4]   2> 170883 T2621 ccr.ThreadLeakControl.checkThreadLeaks WARNING Will linger awaiting termination of 2 leaked thread(s).
   [junit4]   2> 1796448 T2704 oasc.LeaderElector$1.process WARN  org.apache.zookeeper.KeeperException$SessionExpiredException: KeeperErrorCode = Session expired for /collections/new_implicit_coll_1/leader_elect/c/election
   [junit4]   2> 	at org.apache.zookeeper.KeeperException.create(KeeperException.java:127)
   [junit4]   2> 	at org.apache.zookeeper.KeeperException.create(KeeperException.java:51)
   [junit4]   2> 	at org.apache.zookeeper.ZooKeeper.getChildren(ZooKeeper.java:1468)
   [junit4]   2> 	at org.apache.solr.common.cloud.SolrZkClient$6.execute(SolrZkClient.java:235)
   [junit4]   2> 	at org.apache.solr.common.cloud.SolrZkClient$6.execute(SolrZkClient.java:232)
   [junit4]   2> 	at org.apache.solr.common.cloud.ZkCmdExecutor.retryOperation(ZkCmdExecutor.java:65)
   [junit4]   2> 	at org.apache.solr.common.cloud.SolrZkClient.getChildren(SolrZkClient.java:232)
   [junit4]   2> 	at org.apache.solr.cloud.LeaderElector.checkIfIamLeader(LeaderElector.java:84)
   [junit4]   2> 	at org.apache.solr.cloud.LeaderElector.access$000(LeaderElector.java:55)
   [junit4]   2> 	at org.apache.solr.cloud.LeaderElector$1.process(LeaderElector.java:129)
   [junit4]   2> 	at org.apache.zookeeper.ClientCnxn$EventThread.processEvent(ClientCnxn.java:519)
   [junit4]   2> 	at org.apache.zookeeper.ClientCnxn$EventThread.run(ClientCnxn.java:495)
   [junit4]   2> 
   [junit4]   2> 1796449 T2704 oasc.LeaderElector$1.process WARN  org.apache.zookeeper.KeeperException$SessionExpiredException: KeeperErrorCode = Session expired for /collections/new_implicit_coll_1/leader_elect/b/election
   [junit4]   2> 	at org.apache.zookeeper.KeeperException.create(KeeperException.java:127)
   [junit4]   2> 	at org.apache.zookeeper.KeeperException.create(KeeperException.java:51)
   [junit4]   2> 	at org.apache.zookeeper.ZooKeeper.getChildren(ZooKeeper.java:1468)
   [junit4]   2> 	at org.apache.solr.common.cloud.SolrZkClient$6.execute(SolrZkClient.java:235)
   [junit4]   2> 	at org.apache.solr.common.cloud.SolrZkClient$6.execute(SolrZkClient.java:232)
   [junit4]   2> 	at org.apache.solr.common.cloud.ZkCmdExecutor.retryOperation(ZkCmdExecutor.java:65)
   [junit4]   2> 	at org.apache.solr.common.cloud.SolrZkClient.getChildren(SolrZkClient.java:232)
   [junit4]   2> 	at org.apache.solr.cloud.LeaderElector.checkIfIamLeader(LeaderElector.java:84)
   [junit4]   2> 	at org.apache.solr.cloud.LeaderElector.access$000(LeaderElector.java:55)
   [junit4]   2> 	at org.apache.solr.cloud.LeaderElector$1.process(LeaderElector.java:129)
   [junit4]   2> 	at org.apache.zookeeper.ClientCnxn$EventThread.processEvent(ClientCnxn.java:519)
   [junit4]   2> 	at org.apache.zookeeper.ClientCnxn$EventThread.run(ClientCnxn.java:495)
   [junit4]   2> 
   [junit4]   2> 1796450 T2704 oascc.ZkStateReader$3.process WARN ZooKeeper watch triggered, but Solr cannot talk to ZK
   [junit4]   2> 1796450 T2704 oascc.ZkStateReader$2.process A cluster state change: WatchedEvent state:SyncConnected type:NodeChildrenChanged path:/live_nodes, has occurred - updating... (live nodes size: 1)
   [junit4]   2> 1796450 T2704 oascc.ZkStateReader$2.process WARN ZooKeeper watch triggered, but Solr cannot talk to ZK
   [junit4]   2> NOTE: test params are: codec=Asserting, sim=RandomSimilarityProvider(queryNorm=true,coord=yes): {}, locale=ga_IE, timezone=America/Port-au-Prince
   [junit4]   2> NOTE: FreeBSD 9.1-RELEASE-p3 amd64/Oracle Corporation 1.7.0_25 (64-bit)/cpus=16,threads=18,free=276143800,total=536870912
   [junit4]   2> NOTE: All tests run in this JVM: [NoCacheHeaderTest, TestDistributedGrouping, TestBM25SimilarityFactory, DeleteShardTest, TestCollationField, TestSolrJ, TestJmxIntegration, TestJmxMonitoredMap, CoreAdminCreateDiscoverTest, ShardSplitTest, TermVectorComponentDistributedTest, SortByFunctionTest, BasicDistributedZk2Test, TestAnalyzedSuggestions, HardAutoCommitTest, DistanceFunctionTest, TestUtils, TestRTGBase, OpenExchangeRatesOrgProviderTest, IndexReaderFactoryTest, TestPostingsSolrHighlighter, TestStressReorder, FieldAnalysisRequestHandlerTest, TestIndexingPerformance, TestMergePolicyConfig, HdfsLockFactoryTest, CurrencyFieldXmlFileTest, ConvertedLegacyTest, TestStressLucene, TestCopyFieldCollectionResource, HdfsBasicDistributedZk2Test, DocumentAnalysisRequestHandlerTest, TestZkChroot, StandardRequestHandlerTest, SignatureUpdateProcessorFactoryTest, HdfsSyncSliceTest, PingRequestHandlerTest, NotRequiredUniqueKeyTest, TestPropInject, TestFiltering, TestSchemaResource, HdfsRecoveryZkTest, TestManagedSchemaFieldResource, TestSystemIdResolver, TestSolr4Spatial, TestDistributedSearch, TestQuerySenderNoQuery, BlockCacheTest, IndexBasedSpellCheckerTest, TestCoreDiscovery, TestBinaryField, TestReloadAndDeleteDocs, TestFieldCollectionResource, TestDFRSimilarityFactory, TestFastOutputStream, FullSolrCloudDistribCmdsTest, BasicZkTest, TestCSVResponseWriter, ShardRoutingCustomTest, TestRandomFaceting, HdfsDirectoryTest, HdfsUnloadDistributedZkTest, CoreContainerCoreInitFailuresTest, TestLMJelinekMercerSimilarityFactory, TestIndexSearcher, XmlUpdateRequestHandlerTest, TestAddFieldRealTimeGet, QueryResultKeyTest, OutputWriterTest, TestPartialUpdateDeduplication, TestSchemaSimilarityResource, RequiredFieldsTest, SpellCheckCollatorTest, SolrRequestParserTest, ChaosMonkeySafeLeaderTest, UnloadDistributedZkTest, CollectionsAPIDistributedZkTest]
   [junit4] Completed on J1 in 172.18s, 1 test, 1 error <<< FAILURES!

[...truncated 484 lines...]
BUILD FAILED
/usr/home/hudson/hudson-slave/workspace/Lucene-Solr-Tests-trunk-Java7/build.xml:389: The following error occurred while executing this line:
/usr/home/hudson/hudson-slave/workspace/Lucene-Solr-Tests-trunk-Java7/build.xml:369: The following error occurred while executing this line:
/usr/home/hudson/hudson-slave/workspace/Lucene-Solr-Tests-trunk-Java7/build.xml:39: The following error occurred while executing this line:
/usr/home/hudson/hudson-slave/workspace/Lucene-Solr-Tests-trunk-Java7/solr/build.xml:181: The following error occurred while executing this line:
/usr/home/hudson/hudson-slave/workspace/Lucene-Solr-Tests-trunk-Java7/solr/common-build.xml:449: The following error occurred while executing this line:
/usr/home/hudson/hudson-slave/workspace/Lucene-Solr-Tests-trunk-Java7/lucene/common-build.xml:1230: The following error occurred while executing this line:
/usr/home/hudson/hudson-slave/workspace/Lucene-Solr-Tests-trunk-Java7/lucene/common-build.xml:873: There were test failures: 320 suites, 1345 tests, 1 error, 34 ignored (6 assumptions)

Total time: 60 minutes 42 seconds
Build step 'Invoke Ant' marked build as failure
Archiving artifacts
Recording test results
Email was triggered for: Failure
Sending email for trigger: Failure



Mime
View raw message