lucene-dev mailing list archives

Site index · List index
Message view « Date » · « Thread »
Top « Date » · « Thread »
From Policeman Jenkins Server <jenk...@thetaphi.de>
Subject [JENKINS] Lucene-Solr-trunk-Linux (32bit/jdk1.7.0_25) - Build # 6838 - Still Failing!
Date Fri, 02 Aug 2013 03:25:07 GMT
Build: http://jenkins.thetaphi.de/job/Lucene-Solr-trunk-Linux/6838/
Java: 32bit/jdk1.7.0_25 -server -XX:+UseParallelGC

1 tests failed.
FAILED:  org.apache.solr.cloud.CollectionsAPIDistributedZkTest.testDistribSearch

Error Message:
Server refused connection at: http://127.0.0.1:59450

Stack Trace:
org.apache.solr.client.solrj.SolrServerException: Server refused connection at: http://127.0.0.1:59450
	at __randomizedtesting.SeedInfo.seed([C8A45AD6D04F8F18:4942D4CEA710EF24]:0)
	at org.apache.solr.client.solrj.impl.HttpSolrServer.request(HttpSolrServer.java:428)
	at org.apache.solr.client.solrj.impl.HttpSolrServer.request(HttpSolrServer.java:180)
	at org.apache.solr.cloud.AbstractFullDistribZkTestBase.createCollection(AbstractFullDistribZkTestBase.java:1535)
	at org.apache.solr.cloud.CollectionsAPIDistributedZkTest.testCustomCollectionsAPI(CollectionsAPIDistributedZkTest.java:677)
	at org.apache.solr.cloud.CollectionsAPIDistributedZkTest.doTest(CollectionsAPIDistributedZkTest.java:159)
	at org.apache.solr.BaseDistributedSearchTestCase.testDistribSearch(BaseDistributedSearchTestCase.java:835)
	at sun.reflect.NativeMethodAccessorImpl.invoke0(Native Method)
	at sun.reflect.NativeMethodAccessorImpl.invoke(NativeMethodAccessorImpl.java:57)
	at sun.reflect.DelegatingMethodAccessorImpl.invoke(DelegatingMethodAccessorImpl.java:43)
	at java.lang.reflect.Method.invoke(Method.java:606)
	at com.carrotsearch.randomizedtesting.RandomizedRunner.invoke(RandomizedRunner.java:1559)
	at com.carrotsearch.randomizedtesting.RandomizedRunner.access$600(RandomizedRunner.java:79)
	at com.carrotsearch.randomizedtesting.RandomizedRunner$6.evaluate(RandomizedRunner.java:737)
	at com.carrotsearch.randomizedtesting.RandomizedRunner$7.evaluate(RandomizedRunner.java:773)
	at com.carrotsearch.randomizedtesting.RandomizedRunner$8.evaluate(RandomizedRunner.java:787)
	at com.carrotsearch.randomizedtesting.rules.SystemPropertiesRestoreRule$1.evaluate(SystemPropertiesRestoreRule.java:53)
	at org.apache.lucene.util.TestRuleSetupTeardownChained$1.evaluate(TestRuleSetupTeardownChained.java:50)
	at org.apache.lucene.util.TestRuleFieldCacheSanity$1.evaluate(TestRuleFieldCacheSanity.java:51)
	at org.apache.lucene.util.AbstractBeforeAfterRule$1.evaluate(AbstractBeforeAfterRule.java:46)
	at com.carrotsearch.randomizedtesting.rules.SystemPropertiesInvariantRule$1.evaluate(SystemPropertiesInvariantRule.java:55)
	at org.apache.lucene.util.TestRuleThreadAndTestName$1.evaluate(TestRuleThreadAndTestName.java:49)
	at org.apache.lucene.util.TestRuleIgnoreAfterMaxFailures$1.evaluate(TestRuleIgnoreAfterMaxFailures.java:70)
	at org.apache.lucene.util.TestRuleMarkFailure$1.evaluate(TestRuleMarkFailure.java:48)
	at com.carrotsearch.randomizedtesting.rules.StatementAdapter.evaluate(StatementAdapter.java:36)
	at com.carrotsearch.randomizedtesting.ThreadLeakControl$StatementRunner.run(ThreadLeakControl.java:358)
	at com.carrotsearch.randomizedtesting.ThreadLeakControl.forkTimeoutingTask(ThreadLeakControl.java:782)
	at com.carrotsearch.randomizedtesting.ThreadLeakControl$3.evaluate(ThreadLeakControl.java:442)
	at com.carrotsearch.randomizedtesting.RandomizedRunner.runSingleTest(RandomizedRunner.java:746)
	at com.carrotsearch.randomizedtesting.RandomizedRunner$3.evaluate(RandomizedRunner.java:648)
	at com.carrotsearch.randomizedtesting.RandomizedRunner$4.evaluate(RandomizedRunner.java:682)
	at com.carrotsearch.randomizedtesting.RandomizedRunner$5.evaluate(RandomizedRunner.java:693)
	at com.carrotsearch.randomizedtesting.rules.StatementAdapter.evaluate(StatementAdapter.java:36)
	at com.carrotsearch.randomizedtesting.rules.SystemPropertiesRestoreRule$1.evaluate(SystemPropertiesRestoreRule.java:53)
	at org.apache.lucene.util.AbstractBeforeAfterRule$1.evaluate(AbstractBeforeAfterRule.java:46)
	at org.apache.lucene.util.TestRuleStoreClassName$1.evaluate(TestRuleStoreClassName.java:42)
	at com.carrotsearch.randomizedtesting.rules.SystemPropertiesInvariantRule$1.evaluate(SystemPropertiesInvariantRule.java:55)
	at com.carrotsearch.randomizedtesting.rules.NoShadowingOrOverridesOnMethodsRule$1.evaluate(NoShadowingOrOverridesOnMethodsRule.java:39)
	at com.carrotsearch.randomizedtesting.rules.NoShadowingOrOverridesOnMethodsRule$1.evaluate(NoShadowingOrOverridesOnMethodsRule.java:39)
	at com.carrotsearch.randomizedtesting.rules.StatementAdapter.evaluate(StatementAdapter.java:36)
	at org.apache.lucene.util.TestRuleAssertionsRequired$1.evaluate(TestRuleAssertionsRequired.java:43)
	at org.apache.lucene.util.TestRuleMarkFailure$1.evaluate(TestRuleMarkFailure.java:48)
	at org.apache.lucene.util.TestRuleIgnoreAfterMaxFailures$1.evaluate(TestRuleIgnoreAfterMaxFailures.java:70)
	at org.apache.lucene.util.TestRuleIgnoreTestSuites$1.evaluate(TestRuleIgnoreTestSuites.java:55)
	at com.carrotsearch.randomizedtesting.rules.StatementAdapter.evaluate(StatementAdapter.java:36)
	at com.carrotsearch.randomizedtesting.ThreadLeakControl$StatementRunner.run(ThreadLeakControl.java:358)
	at java.lang.Thread.run(Thread.java:724)
Caused by: org.apache.http.conn.HttpHostConnectException: Connection to http://127.0.0.1:59450 refused
	at org.apache.http.impl.conn.DefaultClientConnectionOperator.openConnection(DefaultClientConnectionOperator.java:190)
	at org.apache.http.impl.conn.ManagedClientConnectionImpl.open(ManagedClientConnectionImpl.java:294)
	at org.apache.http.impl.client.DefaultRequestDirector.tryConnect(DefaultRequestDirector.java:645)
	at org.apache.http.impl.client.DefaultRequestDirector.execute(DefaultRequestDirector.java:480)
	at org.apache.http.impl.client.AbstractHttpClient.execute(AbstractHttpClient.java:906)
	at org.apache.http.impl.client.AbstractHttpClient.execute(AbstractHttpClient.java:805)
	at org.apache.http.impl.client.AbstractHttpClient.execute(AbstractHttpClient.java:784)
	at org.apache.solr.client.solrj.impl.HttpSolrServer.request(HttpSolrServer.java:365)
	... 45 more
Caused by: java.net.ConnectException: Connection refused
	at java.net.PlainSocketImpl.socketConnect(Native Method)
	at java.net.AbstractPlainSocketImpl.doConnect(AbstractPlainSocketImpl.java:339)
	at java.net.AbstractPlainSocketImpl.connectToAddress(AbstractPlainSocketImpl.java:200)
	at java.net.AbstractPlainSocketImpl.connect(AbstractPlainSocketImpl.java:182)
	at java.net.SocksSocketImpl.connect(SocksSocketImpl.java:392)
	at java.net.Socket.connect(Socket.java:579)
	at org.apache.http.conn.scheme.PlainSocketFactory.connectSocket(PlainSocketFactory.java:127)
	at org.apache.http.impl.conn.DefaultClientConnectionOperator.openConnection(DefaultClientConnectionOperator.java:180)
	... 52 more




Build Log:
[...truncated 9665 lines...]
   [junit4] Suite: org.apache.solr.cloud.CollectionsAPIDistributedZkTest
   [junit4]   2> 432799 T1704 oas.BaseDistributedSearchTestCase.initHostContext Setting hostContext system property: /
   [junit4]   2> 432802 T1704 oas.SolrTestCaseJ4.setUp ###Starting testDistribSearch
   [junit4]   2> Creating dataDir: /mnt/ssd/jenkins/workspace/Lucene-Solr-trunk-Linux/solr/build/solr-core/test/J1/./solrtest-CollectionsAPIDistributedZkTest-1375413055495
   [junit4]   2> 432802 T1704 oasc.ZkTestServer.run STARTING ZK TEST SERVER
   [junit4]   2> 432803 T1705 oasc.ZkTestServer$ZKServerMain.runFromConfig Starting server
   [junit4]   2> 432903 T1704 oasc.ZkTestServer.run start zk server on port:36618
   [junit4]   2> 432903 T1704 oascc.ConnectionManager.waitForConnected Waiting for client to connect to ZooKeeper
   [junit4]   2> 433390 T1711 oascc.ConnectionManager.process Watcher org.apache.solr.common.cloud.ConnectionManager@b48506 name:ZooKeeperConnection Watcher:127.0.0.1:36618 got event WatchedEvent state:SyncConnected type:None path:null path:null type:None
   [junit4]   2> 433390 T1704 oascc.ConnectionManager.waitForConnected Client is connected to ZooKeeper
   [junit4]   2> 433391 T1704 oascc.SolrZkClient.makePath makePath: /solr
   [junit4]   2> 433399 T1704 oascc.ConnectionManager.waitForConnected Waiting for client to connect to ZooKeeper
   [junit4]   2> 433401 T1713 oascc.ConnectionManager.process Watcher org.apache.solr.common.cloud.ConnectionManager@1fd6d9 name:ZooKeeperConnection Watcher:127.0.0.1:36618/solr got event WatchedEvent state:SyncConnected type:None path:null path:null type:None
   [junit4]   2> 433401 T1704 oascc.ConnectionManager.waitForConnected Client is connected to ZooKeeper
   [junit4]   2> 433402 T1704 oascc.SolrZkClient.makePath makePath: /collections/collection1
   [junit4]   2> 433407 T1704 oascc.SolrZkClient.makePath makePath: /collections/collection1/shards
   [junit4]   2> 433412 T1704 oascc.SolrZkClient.makePath makePath: /collections/control_collection
   [junit4]   2> 433415 T1704 oascc.SolrZkClient.makePath makePath: /collections/control_collection/shards
   [junit4]   2> 433418 T1704 oasc.AbstractZkTestCase.putConfig put /mnt/ssd/jenkins/workspace/Lucene-Solr-trunk-Linux/solr/build/solr-core/test-files/solr/collection1/conf/solrconfig-tlog.xml to /configs/conf1/solrconfig.xml
   [junit4]   2> 433419 T1704 oascc.SolrZkClient.makePath makePath: /configs/conf1/solrconfig.xml
   [junit4]   2> 433426 T1704 oasc.AbstractZkTestCase.putConfig put /mnt/ssd/jenkins/workspace/Lucene-Solr-trunk-Linux/solr/build/solr-core/test-files/solr/collection1/conf/schema.xml to /configs/conf1/schema.xml
   [junit4]   2> 433426 T1704 oascc.SolrZkClient.makePath makePath: /configs/conf1/schema.xml
   [junit4]   2> 433432 T1704 oasc.AbstractZkTestCase.putConfig put /mnt/ssd/jenkins/workspace/Lucene-Solr-trunk-Linux/solr/build/solr-core/test-files/solr/collection1/conf/stopwords.txt to /configs/conf1/stopwords.txt
   [junit4]   2> 433433 T1704 oascc.SolrZkClient.makePath makePath: /configs/conf1/stopwords.txt
   [junit4]   2> 433437 T1704 oasc.AbstractZkTestCase.putConfig put /mnt/ssd/jenkins/workspace/Lucene-Solr-trunk-Linux/solr/build/solr-core/test-files/solr/collection1/conf/protwords.txt to /configs/conf1/protwords.txt
   [junit4]   2> 433438 T1704 oascc.SolrZkClient.makePath makePath: /configs/conf1/protwords.txt
   [junit4]   2> 433442 T1704 oasc.AbstractZkTestCase.putConfig put /mnt/ssd/jenkins/workspace/Lucene-Solr-trunk-Linux/solr/build/solr-core/test-files/solr/collection1/conf/currency.xml to /configs/conf1/currency.xml
   [junit4]   2> 433442 T1704 oascc.SolrZkClient.makePath makePath: /configs/conf1/currency.xml
   [junit4]   2> 433447 T1704 oasc.AbstractZkTestCase.putConfig put /mnt/ssd/jenkins/workspace/Lucene-Solr-trunk-Linux/solr/build/solr-core/test-files/solr/collection1/conf/open-exchange-rates.json to /configs/conf1/open-exchange-rates.json
   [junit4]   2> 433447 T1704 oascc.SolrZkClient.makePath makePath: /configs/conf1/open-exchange-rates.json
   [junit4]   2> 433452 T1704 oasc.AbstractZkTestCase.putConfig put /mnt/ssd/jenkins/workspace/Lucene-Solr-trunk-Linux/solr/build/solr-core/test-files/solr/collection1/conf/mapping-ISOLatin1Accent.txt to /configs/conf1/mapping-ISOLatin1Accent.txt
   [junit4]   2> 433452 T1704 oascc.SolrZkClient.makePath makePath: /configs/conf1/mapping-ISOLatin1Accent.txt
   [junit4]   2> 433457 T1704 oasc.AbstractZkTestCase.putConfig put /mnt/ssd/jenkins/workspace/Lucene-Solr-trunk-Linux/solr/build/solr-core/test-files/solr/collection1/conf/old_synonyms.txt to /configs/conf1/old_synonyms.txt
   [junit4]   2> 433457 T1704 oascc.SolrZkClient.makePath makePath: /configs/conf1/old_synonyms.txt
   [junit4]   2> 433461 T1704 oasc.AbstractZkTestCase.putConfig put /mnt/ssd/jenkins/workspace/Lucene-Solr-trunk-Linux/solr/build/solr-core/test-files/solr/collection1/conf/synonyms.txt to /configs/conf1/synonyms.txt
   [junit4]   2> 433462 T1704 oascc.SolrZkClient.makePath makePath: /configs/conf1/synonyms.txt
   [junit4]   2> 433530 T1704 oejs.Server.doStart jetty-8.1.10.v20130312
   [junit4]   2> 433533 T1704 oejs.AbstractConnector.doStart Started SelectChannelConnector@127.0.0.1:52713
   [junit4]   2> 433534 T1704 oass.SolrDispatchFilter.init SolrDispatchFilter.init()
   [junit4]   2> 433534 T1704 oasc.SolrResourceLoader.locateSolrHome JNDI not configured for solr (NoInitialContextEx)
   [junit4]   2> 433534 T1704 oasc.SolrResourceLoader.locateSolrHome using system property solr.solr.home: /mnt/ssd/jenkins/workspace/Lucene-Solr-trunk-Linux/solr/build/solr-core/test/J1/./org.apache.solr.cloud.CollectionsAPIDistributedZkTest-controljetty-1375413056161
   [junit4]   2> 433534 T1704 oasc.SolrResourceLoader.<init> new SolrResourceLoader for directory: '/mnt/ssd/jenkins/workspace/Lucene-Solr-trunk-Linux/solr/build/solr-core/test/J1/./org.apache.solr.cloud.CollectionsAPIDistributedZkTest-controljetty-1375413056161/'
   [junit4]   2> 433543 T1704 oasc.ConfigSolr.fromFile Loading container configuration from /mnt/ssd/jenkins/workspace/Lucene-Solr-trunk-Linux/solr/build/solr-core/test/J1/./org.apache.solr.cloud.CollectionsAPIDistributedZkTest-controljetty-1375413056161/solr.xml
   [junit4]   2> 433572 T1704 oasc.ConfigSolrXml.<init> Config-defined core root directory: 
   [junit4]   2> 433573 T1704 oasc.CoreContainer.<init> New CoreContainer 31845868
   [junit4]   2> 433573 T1704 oasc.CoreContainer.load Loading cores into CoreContainer [instanceDir=/mnt/ssd/jenkins/workspace/Lucene-Solr-trunk-Linux/solr/build/solr-core/test/J1/./org.apache.solr.cloud.CollectionsAPIDistributedZkTest-controljetty-1375413056161/]
   [junit4]   2> 433574 T1704 oashc.HttpShardHandlerFactory.getParameter Setting socketTimeout to: 120000
   [junit4]   2> 433574 T1704 oashc.HttpShardHandlerFactory.getParameter Setting urlScheme to: http://
   [junit4]   2> 433574 T1704 oashc.HttpShardHandlerFactory.getParameter Setting connTimeout to: 15000
   [junit4]   2> 433575 T1704 oashc.HttpShardHandlerFactory.getParameter Setting maxConnectionsPerHost to: 20
   [junit4]   2> 433575 T1704 oashc.HttpShardHandlerFactory.getParameter Setting corePoolSize to: 0
   [junit4]   2> 433575 T1704 oashc.HttpShardHandlerFactory.getParameter Setting maximumPoolSize to: 2147483647
   [junit4]   2> 433575 T1704 oashc.HttpShardHandlerFactory.getParameter Setting maxThreadIdleTime to: 5
   [junit4]   2> 433576 T1704 oashc.HttpShardHandlerFactory.getParameter Setting sizeOfQueue to: -1
   [junit4]   2> 433576 T1704 oashc.HttpShardHandlerFactory.getParameter Setting fairnessPolicy to: false
   [junit4]   2> 433576 T1704 oascsi.HttpClientUtil.createClient Creating new http client, config:maxConnectionsPerHost=20&maxConnections=10000&socketTimeout=120000&connTimeout=15000&retry=false
   [junit4]   2> 433579 T1704 oasc.ZkContainer.initZooKeeper Zookeeper client=127.0.0.1:36618/solr
   [junit4]   2> 433579 T1704 oasc.ZkController.checkChrootPath zkHost includes chroot
   [junit4]   2> 433580 T1704 oascc.ConnectionManager.waitForConnected Waiting for client to connect to ZooKeeper
   [junit4]   2> 433581 T1724 oascc.ConnectionManager.process Watcher org.apache.solr.common.cloud.ConnectionManager@8add6c name:ZooKeeperConnection Watcher:127.0.0.1:36618 got event WatchedEvent state:SyncConnected type:None path:null path:null type:None
   [junit4]   2> 433581 T1704 oascc.ConnectionManager.waitForConnected Client is connected to ZooKeeper
   [junit4]   2> 433583 T1704 oascsi.HttpClientUtil.createClient Creating new http client, config:maxConnections=500&maxConnectionsPerHost=16&socketTimeout=120000&connTimeout=15000
   [junit4]   2> 433586 T1704 oascc.ConnectionManager.waitForConnected Waiting for client to connect to ZooKeeper
   [junit4]   2> 433587 T1726 oascc.ConnectionManager.process Watcher org.apache.solr.common.cloud.ConnectionManager@e61146 name:ZooKeeperConnection Watcher:127.0.0.1:36618/solr got event WatchedEvent state:SyncConnected type:None path:null path:null type:None
   [junit4]   2> 433587 T1704 oascc.ConnectionManager.waitForConnected Client is connected to ZooKeeper
   [junit4]   2> 433589 T1704 oascc.SolrZkClient.makePath makePath: /overseer/queue
   [junit4]   2> 433591 T1704 oascc.SolrZkClient.makePath makePath: /overseer/collection-queue-work
   [junit4]   2> 433593 T1704 oascc.SolrZkClient.makePath makePath: /live_nodes
   [junit4]   2> 433595 T1704 oasc.ZkController.createEphemeralLiveNode Register node as live in ZooKeeper:/live_nodes/127.0.0.1:52713_
   [junit4]   2> 433596 T1704 oascc.SolrZkClient.makePath makePath: /live_nodes/127.0.0.1:52713_
   [junit4]   2> 433598 T1704 oascc.SolrZkClient.makePath makePath: /overseer_elect/election
   [junit4]   2> 433602 T1704 oascc.SolrZkClient.makePath makePath: /overseer_elect/leader
   [junit4]   2> 433604 T1704 oasc.Overseer.start Overseer (id=90139070005116931-127.0.0.1:52713_-n_0000000000) starting
   [junit4]   2> 433606 T1704 oascc.SolrZkClient.makePath makePath: /overseer/queue-work
   [junit4]   2> 433609 T1728 oasc.OverseerCollectionProcessor.run Process current queue of collection creations
   [junit4]   2> 433609 T1704 oascc.SolrZkClient.makePath makePath: /clusterstate.json
   [junit4]   2> 433611 T1704 oascc.SolrZkClient.makePath makePath: /aliases.json
   [junit4]   2> 433612 T1704 oascc.ZkStateReader.createClusterStateWatchersAndUpdate Updating cluster state from ZooKeeper... 
   [junit4]   2> 433614 T1727 oasc.Overseer$ClusterStateUpdater.run Starting to work on the main queue
   [junit4]   2> 433617 T1704 oasc.CorePropertiesLocator.discover Looking for core definitions underneath /mnt/ssd/jenkins/workspace/Lucene-Solr-trunk-Linux/solr/build/solr-core/test/J1/./org.apache.solr.cloud.CollectionsAPIDistributedZkTest-controljetty-1375413056161
   [junit4]   2> 433650 T1704 oasc.CorePropertiesLocator.discoverUnder Found core conf in /mnt/ssd/jenkins/workspace/Lucene-Solr-trunk-Linux/solr/build/solr-core/test/J1/./org.apache.solr.cloud.CollectionsAPIDistributedZkTest-controljetty-1375413056161/conf/
   [junit4]   2> 433651 T1704 oasc.CorePropertiesLocator.discover Found 1 core definitions
   [junit4]   2> 433651 T1704 oass.SolrDispatchFilter.init user.dir=/mnt/ssd/jenkins/workspace/Lucene-Solr-trunk-Linux/solr/build/solr-core/test/J1
   [junit4]   2> 433652 T1704 oass.SolrDispatchFilter.init SolrDispatchFilter.init() done
   [junit4]   2> 433652 T1704 oascsi.HttpClientUtil.createClient Creating new http client, config:maxConnections=128&maxConnectionsPerHost=32&followRedirects=false
   [junit4]   2> 433654 T1704 oascsi.HttpClientUtil.createClient Creating new http client, config:
   [junit4]   2> 433655 T1704 oascc.ConnectionManager.waitForConnected Waiting for client to connect to ZooKeeper
   [junit4]   2> 433657 T1731 oascc.ConnectionManager.process Watcher org.apache.solr.common.cloud.ConnectionManager@19806ca name:ZooKeeperConnection Watcher:127.0.0.1:36618/solr got event WatchedEvent state:SyncConnected type:None path:null path:null type:None
   [junit4]   2> 433657 T1704 oascc.ConnectionManager.waitForConnected Client is connected to ZooKeeper
   [junit4]   2> 433659 T1704 oascc.ZkStateReader.createClusterStateWatchersAndUpdate Updating cluster state from ZooKeeper... 
   [junit4]   2> 433662 T1704 oasc.ChaosMonkey.monkeyLog monkey: init - expire sessions:true cause connection loss:true
   [junit4]   2> 433720 T1704 oejs.Server.doStart jetty-8.1.10.v20130312
   [junit4]   2> 433723 T1704 oejs.AbstractConnector.doStart Started SelectChannelConnector@127.0.0.1:59450
   [junit4]   2> 433723 T1704 oass.SolrDispatchFilter.init SolrDispatchFilter.init()
   [junit4]   2> 433723 T1704 oasc.SolrResourceLoader.locateSolrHome JNDI not configured for solr (NoInitialContextEx)
   [junit4]   2> 433724 T1704 oasc.SolrResourceLoader.locateSolrHome using system property solr.solr.home: /mnt/ssd/jenkins/workspace/Lucene-Solr-trunk-Linux/solr/build/solr-core/test/J1/./org.apache.solr.cloud.CollectionsAPIDistributedZkTest-jetty1-1375413056355
   [junit4]   2> 433724 T1704 oasc.SolrResourceLoader.<init> new SolrResourceLoader for directory: '/mnt/ssd/jenkins/workspace/Lucene-Solr-trunk-Linux/solr/build/solr-core/test/J1/./org.apache.solr.cloud.CollectionsAPIDistributedZkTest-jetty1-1375413056355/'
   [junit4]   2> 433733 T1704 oasc.ConfigSolr.fromFile Loading container configuration from /mnt/ssd/jenkins/workspace/Lucene-Solr-trunk-Linux/solr/build/solr-core/test/J1/./org.apache.solr.cloud.CollectionsAPIDistributedZkTest-jetty1-1375413056355/solr.xml
   [junit4]   2> 433762 T1704 oasc.ConfigSolrXml.<init> Config-defined core root directory: 
   [junit4]   2> 433763 T1704 oasc.CoreContainer.<init> New CoreContainer 27006215
   [junit4]   2> 433763 T1704 oasc.CoreContainer.load Loading cores into CoreContainer [instanceDir=/mnt/ssd/jenkins/workspace/Lucene-Solr-trunk-Linux/solr/build/solr-core/test/J1/./org.apache.solr.cloud.CollectionsAPIDistributedZkTest-jetty1-1375413056355/]
   [junit4]   2> 433764 T1704 oashc.HttpShardHandlerFactory.getParameter Setting socketTimeout to: 120000
   [junit4]   2> 433764 T1704 oashc.HttpShardHandlerFactory.getParameter Setting urlScheme to: http://
   [junit4]   2> 433764 T1704 oashc.HttpShardHandlerFactory.getParameter Setting connTimeout to: 15000
   [junit4]   2> 433765 T1704 oashc.HttpShardHandlerFactory.getParameter Setting maxConnectionsPerHost to: 20
   [junit4]   2> 433765 T1704 oashc.HttpShardHandlerFactory.getParameter Setting corePoolSize to: 0
   [junit4]   2> 433765 T1704 oashc.HttpShardHandlerFactory.getParameter Setting maximumPoolSize to: 2147483647
   [junit4]   2> 433765 T1704 oashc.HttpShardHandlerFactory.getParameter Setting maxThreadIdleTime to: 5
   [junit4]   2> 433766 T1704 oashc.HttpShardHandlerFactory.getParameter Setting sizeOfQueue to: -1
   [junit4]   2> 433766 T1704 oashc.HttpShardHandlerFactory.getParameter Setting fairnessPolicy to: false
   [junit4]   2> 433766 T1704 oascsi.HttpClientUtil.createClient Creating new http client, config:maxConnectionsPerHost=20&maxConnections=10000&socketTimeout=120000&connTimeout=15000&retry=false
   [junit4]   2> 433769 T1704 oasc.ZkContainer.initZooKeeper Zookeeper client=127.0.0.1:36618/solr
   [junit4]   2> 433769 T1704 oasc.ZkController.checkChrootPath zkHost includes chroot
   [junit4]   2> 433770 T1704 oascc.ConnectionManager.waitForConnected Waiting for client to connect to ZooKeeper
   [junit4]   2> 433771 T1742 oascc.ConnectionManager.process Watcher org.apache.solr.common.cloud.ConnectionManager@6ea58b name:ZooKeeperConnection Watcher:127.0.0.1:36618 got event WatchedEvent state:SyncConnected type:None path:null path:null type:None
   [junit4]   2> 433771 T1704 oascc.ConnectionManager.waitForConnected Client is connected to ZooKeeper
   [junit4]   2> 433773 T1704 oascsi.HttpClientUtil.createClient Creating new http client, config:maxConnections=500&maxConnectionsPerHost=16&socketTimeout=120000&connTimeout=15000
   [junit4]   2> 433775 T1704 oascc.ConnectionManager.waitForConnected Waiting for client to connect to ZooKeeper
   [junit4]   2> 433777 T1744 oascc.ConnectionManager.process Watcher org.apache.solr.common.cloud.ConnectionManager@1fde1fc name:ZooKeeperConnection Watcher:127.0.0.1:36618/solr got event WatchedEvent state:SyncConnected type:None path:null path:null type:None
   [junit4]   2> 433777 T1704 oascc.ConnectionManager.waitForConnected Client is connected to ZooKeeper
   [junit4]   2> 433783 T1704 oascc.ZkStateReader.createClusterStateWatchersAndUpdate Updating cluster state from ZooKeeper... 
   [junit4]   2> 434786 T1704 oasc.ZkController.createEphemeralLiveNode Register node as live in ZooKeeper:/live_nodes/127.0.0.1:59450_
   [junit4]   2> 434788 T1704 oascc.SolrZkClient.makePath makePath: /live_nodes/127.0.0.1:59450_
   [junit4]   2> 434794 T1731 oascc.ZkStateReader$3.process Updating live nodes... (2)
   [junit4]   2> 434794 T1744 oascc.ZkStateReader$3.process Updating live nodes... (2)
   [junit4]   2> 434794 T1726 oascc.ZkStateReader$3.process Updating live nodes... (2)
   [junit4]   2> 434802 T1704 oasc.CorePropertiesLocator.discover Looking for core definitions underneath /mnt/ssd/jenkins/workspace/Lucene-Solr-trunk-Linux/solr/build/solr-core/test/J1/./org.apache.solr.cloud.CollectionsAPIDistributedZkTest-jetty1-1375413056355
   [junit4]   2> 434828 T1704 oasc.CorePropertiesLocator.discoverUnder Found core conf in /mnt/ssd/jenkins/workspace/Lucene-Solr-trunk-Linux/solr/build/solr-core/test/J1/./org.apache.solr.cloud.CollectionsAPIDistributedZkTest-jetty1-1375413056355/conf/
   [junit4]   2> 434828 T1704 oasc.CorePropertiesLocator.discover Found 1 core definitions
   [junit4]   2> 434829 T1704 oass.SolrDispatchFilter.init user.dir=/mnt/ssd/jenkins/workspace/Lucene-Solr-trunk-Linux/solr/build/solr-core/test/J1
   [junit4]   2> 434829 T1704 oass.SolrDispatchFilter.init SolrDispatchFilter.init() done
   [junit4]   2> 434830 T1704 oascsi.HttpClientUtil.createClient Creating new http client, config:maxConnections=128&maxConnectionsPerHost=32&followRedirects=false
   [junit4]   2> 434885 T1704 oejs.Server.doStart jetty-8.1.10.v20130312
   [junit4]   2> 434888 T1704 oejs.AbstractConnector.doStart Started SelectChannelConnector@127.0.0.1:60557
   [junit4]   2> 434889 T1704 oass.SolrDispatchFilter.init SolrDispatchFilter.init()
   [junit4]   2> 434889 T1704 oasc.SolrResourceLoader.locateSolrHome JNDI not configured for solr (NoInitialContextEx)
   [junit4]   2> 434889 T1704 oasc.SolrResourceLoader.locateSolrHome using system property solr.solr.home: /mnt/ssd/jenkins/workspace/Lucene-Solr-trunk-Linux/solr/build/solr-core/test/J1/./org.apache.solr.cloud.CollectionsAPIDistributedZkTest-jetty2-1375413057525
   [junit4]   2> 434890 T1704 oasc.SolrResourceLoader.<init> new SolrResourceLoader for directory: '/mnt/ssd/jenkins/workspace/Lucene-Solr-trunk-Linux/solr/build/solr-core/test/J1/./org.apache.solr.cloud.CollectionsAPIDistributedZkTest-jetty2-1375413057525/'
   [junit4]   2> 434898 T1704 oasc.ConfigSolr.fromFile Loading container configuration from /mnt/ssd/jenkins/workspace/Lucene-Solr-trunk-Linux/solr/build/solr-core/test/J1/./org.apache.solr.cloud.CollectionsAPIDistributedZkTest-jetty2-1375413057525/solr.xml
   [junit4]   2> 434945 T1704 oasc.ConfigSolrXml.<init> Config-defined core root directory: 
   [junit4]   2> 434946 T1704 oasc.CoreContainer.<init> New CoreContainer 20372122
   [junit4]   2> 434946 T1704 oasc.CoreContainer.load Loading cores into CoreContainer [instanceDir=/mnt/ssd/jenkins/workspace/Lucene-Solr-trunk-Linux/solr/build/solr-core/test/J1/./org.apache.solr.cloud.CollectionsAPIDistributedZkTest-jetty2-1375413057525/]
   [junit4]   2> 434948 T1704 oashc.HttpShardHandlerFactory.getParameter Setting socketTimeout to: 120000
   [junit4]   2> 434949 T1704 oashc.HttpShardHandlerFactory.getParameter Setting urlScheme to: http://
   [junit4]   2> 434949 T1704 oashc.HttpShardHandlerFactory.getParameter Setting connTimeout to: 15000
   [junit4]   2> 434949 T1704 oashc.HttpShardHandlerFactory.getParameter Setting maxConnectionsPerHost to: 20
   [junit4]   2> 434950 T1704 oashc.HttpShardHandlerFactory.getParameter Setting corePoolSize to: 0
   [junit4]   2> 434950 T1704 oashc.HttpShardHandlerFactory.getParameter Setting maximumPoolSize to: 2147483647
   [junit4]   2> 434950 T1704 oashc.HttpShardHandlerFactory.getParameter Setting maxThreadIdleTime to: 5
   [junit4]   2> 434950 T1704 oashc.HttpShardHandlerFactory.getParameter Setting sizeOfQueue to: -1
   [junit4]   2> 434951 T1704 oashc.HttpShardHandlerFactory.getParameter Setting fairnessPolicy to: false
   [junit4]   2> 434951 T1704 oascsi.HttpClientUtil.createClient Creating new http client, config:maxConnectionsPerHost=20&maxConnections=10000&socketTimeout=120000&connTimeout=15000&retry=false
   [junit4]   2> 434953 T1704 oasc.ZkContainer.initZooKeeper Zookeeper client=127.0.0.1:36618/solr
   [junit4]   2> 434953 T1704 oasc.ZkController.checkChrootPath zkHost includes chroot
   [junit4]   2> 434954 T1704 oascc.ConnectionManager.waitForConnected Waiting for client to connect to ZooKeeper
   [junit4]   2> 434956 T1756 oascc.ConnectionManager.process Watcher org.apache.solr.common.cloud.ConnectionManager@177c1b2 name:ZooKeeperConnection Watcher:127.0.0.1:36618 got event WatchedEvent state:SyncConnected type:None path:null path:null type:None
   [junit4]   2> 434957 T1704 oascc.ConnectionManager.waitForConnected Client is connected to ZooKeeper
   [junit4]   2> 434959 T1704 oascsi.HttpClientUtil.createClient Creating new http client, config:maxConnections=500&maxConnectionsPerHost=16&socketTimeout=120000&connTimeout=15000
   [junit4]   2> 434962 T1704 oascc.ConnectionManager.waitForConnected Waiting for client to connect to ZooKeeper
   [junit4]   2> 434964 T1758 oascc.ConnectionManager.process Watcher org.apache.solr.common.cloud.ConnectionManager@1ede3e name:ZooKeeperConnection Watcher:127.0.0.1:36618/solr got event WatchedEvent state:SyncConnected type:None path:null path:null type:None
   [junit4]   2> 434964 T1704 oascc.ConnectionManager.waitForConnected Client is connected to ZooKeeper
   [junit4]   2> 434970 T1704 oascc.ZkStateReader.createClusterStateWatchersAndUpdate Updating cluster state from ZooKeeper... 
   [junit4]   2> 435975 T1704 oasc.ZkController.createEphemeralLiveNode Register node as live in ZooKeeper:/live_nodes/127.0.0.1:60557_
   [junit4]   2> 435977 T1704 oascc.SolrZkClient.makePath makePath: /live_nodes/127.0.0.1:60557_
   [junit4]   2> 435983 T1731 oascc.ZkStateReader$3.process Updating live nodes... (3)
   [junit4]   2> 435983 T1726 oascc.ZkStateReader$3.process Updating live nodes... (3)
   [junit4]   2> 435983 T1758 oascc.ZkStateReader$3.process Updating live nodes... (3)
   [junit4]   2> 435983 T1744 oascc.ZkStateReader$3.process Updating live nodes... (3)
   [junit4]   2> 435992 T1704 oasc.CorePropertiesLocator.discover Looking for core definitions underneath /mnt/ssd/jenkins/workspace/Lucene-Solr-trunk-Linux/solr/build/solr-core/test/J1/./org.apache.solr.cloud.CollectionsAPIDistributedZkTest-jetty2-1375413057525
   [junit4]   2> 436021 T1704 oasc.CorePropertiesLocator.discoverUnder Found core conf in /mnt/ssd/jenkins/workspace/Lucene-Solr-trunk-Linux/solr/build/solr-core/test/J1/./org.apache.solr.cloud.CollectionsAPIDistributedZkTest-jetty2-1375413057525/conf/
   [junit4]   2> 436021 T1704 oasc.CorePropertiesLocator.discover Found 1 core definitions
   [junit4]   2> 436022 T1704 oass.SolrDispatchFilter.init user.dir=/mnt/ssd/jenkins/workspace/Lucene-Solr-trunk-Linux/solr/build/solr-core/test/J1
   [junit4]   2> 436022 T1704 oass.SolrDispatchFilter.init SolrDispatchFilter.init() done
   [junit4]   2> 436022 T1704 oascsi.HttpClientUtil.createClient Creating new http client, config:maxConnections=128&maxConnectionsPerHost=32&followRedirects=false
   [junit4]   2> 436083 T1704 oejs.Server.doStart jetty-8.1.10.v20130312
   [junit4]   2> 436086 T1704 oejs.AbstractConnector.doStart Started SelectChannelConnector@127.0.0.1:48764
   [junit4]   2> 436086 T1704 oass.SolrDispatchFilter.init SolrDispatchFilter.init()
   [junit4]   2> 436086 T1704 oasc.SolrResourceLoader.locateSolrHome JNDI not configured for solr (NoInitialContextEx)
   [junit4]   2> 436086 T1704 oasc.SolrResourceLoader.locateSolrHome using system property solr.solr.home: /mnt/ssd/jenkins/workspace/Lucene-Solr-trunk-Linux/solr/build/solr-core/test/J1/./org.apache.solr.cloud.CollectionsAPIDistributedZkTest-jetty3-1375413058717
   [junit4]   2> 436087 T1704 oasc.SolrResourceLoader.<init> new SolrResourceLoader for directory: '/mnt/ssd/jenkins/workspace/Lucene-Solr-trunk-Linux/solr/build/solr-core/test/J1/./org.apache.solr.cloud.CollectionsAPIDistributedZkTest-jetty3-1375413058717/'
   [junit4]   2> 436095 T1704 oasc.ConfigSolr.fromFile Loading container configuration from /mnt/ssd/jenkins/workspace/Lucene-Solr-trunk-Linux/solr/build/solr-core/test/J1/./org.apache.solr.cloud.CollectionsAPIDistributedZkTest-jetty3-1375413058717/solr.xml
   [junit4]   2> 436120 T1704 oasc.ConfigSolrXml.<init> Config-defined core root directory: 
   [junit4]   2> 436120 T1704 oasc.CoreContainer.<init> New CoreContainer 30693954
   [junit4]   2> 436121 T1704 oasc.CoreContainer.load Loading cores into CoreContainer [instanceDir=/mnt/ssd/jenkins/workspace/Lucene-Solr-trunk-Linux/solr/build/solr-core/test/J1/./org.apache.solr.cloud.CollectionsAPIDistributedZkTest-jetty3-1375413058717/]
   [junit4]   2> 436121 T1704 oashc.HttpShardHandlerFactory.getParameter Setting socketTimeout to: 120000
   [junit4]   2> 436122 T1704 oashc.HttpShardHandlerFactory.getParameter Setting urlScheme to: http://
   [junit4]   2> 436122 T1704 oashc.HttpShardHandlerFactory.getParameter Setting connTimeout to: 15000
   [junit4]   2> 436122 T1704 oashc.HttpShardHandlerFactory.getParameter Setting maxConnectionsPerHost to: 20
   [junit4]   2> 436122 T1704 oashc.HttpShardHandlerFactory.getParameter Setting corePoolSize to: 0
   [junit4]   2> 436123 T1704 oashc.HttpShardHandlerFactory.getParameter Setting maximumPoolSize to: 2147483647
   [junit4]   2> 436123 T1704 oashc.HttpShardHandlerFactory.getParameter Setting maxThreadIdleTime to: 5
   [junit4]   2> 436123 T1704 oashc.HttpShardHandlerFactory.getParameter Setting sizeOfQueue to: -1
   [junit4]   2> 436123 T1704 oashc.HttpShardHandlerFactory.getParameter Setting fairnessPolicy to: false
   [junit4]   2> 436123 T1704 oascsi.HttpClientUtil.createClient Creating new http client, config:maxConnectionsPerHost=20&maxConnections=10000&socketTimeout=120000&connTimeout=15000&retry=false
   [junit4]   2> 436126 T1704 oasc.ZkContainer.initZooKeeper Zookeeper client=127.0.0.1:36618/solr
   [junit4]   2> 436126 T1704 oasc.ZkController.checkChrootPath zkHost includes chroot
   [junit4]   2> 436127 T1704 oascc.ConnectionManager.waitForConnected Waiting for client to connect to ZooKeeper
   [junit4]   2> 436130 T1770 oascc.ConnectionManager.process Watcher org.apache.solr.common.cloud.ConnectionManager@15e110d name:ZooKeeperConnection Watcher:127.0.0.1:36618 got event WatchedEvent state:SyncConnected type:None path:null path:null type:None
   [junit4]   2> 436130 T1704 oascc.ConnectionManager.waitForConnected Client is connected to ZooKeeper
   [junit4]   2> 436133 T1704 oascsi.HttpClientUtil.createClient Creating new http client, config:maxConnections=500&maxConnectionsPerHost=16&socketTimeout=120000&connTimeout=15000
   [junit4]   2> 436135 T1704 oascc.ConnectionManager.waitForConnected Waiting for client to connect to ZooKeeper
   [junit4]   2> 436136 T1772 oascc.ConnectionManager.process Watcher org.apache.solr.common.cloud.ConnectionManager@1ada85e name:ZooKeeperConnection Watcher:127.0.0.1:36618/solr got event WatchedEvent state:SyncConnected type:None path:null path:null type:None
   [junit4]   2> 436137 T1704 oascc.ConnectionManager.waitForConnected Client is connected to ZooKeeper
   [junit4]   2> 436142 T1704 oascc.ZkStateReader.createClusterStateWatchersAndUpdate Updating cluster state from ZooKeeper... 
   [junit4]   2> 437146 T1704 oasc.ZkController.createEphemeralLiveNode Register node as live in ZooKeeper:/live_nodes/127.0.0.1:48764_
   [junit4]   2> 437148 T1704 oascc.SolrZkClient.makePath makePath: /live_nodes/127.0.0.1:48764_
   [junit4]   2> 437154 T1758 oascc.ZkStateReader$3.process Updating live nodes... (4)
   [junit4]   2> 437154 T1731 oascc.ZkStateReader$3.process Updating live nodes... (4)
   [junit4]   2> 437154 T1726 oascc.ZkStateReader$3.process Updating live nodes... (4)
   [junit4]   2> 437154 T1772 oascc.ZkStateReader$3.process Updating live nodes... (4)
   [junit4]   2> 437154 T1744 oascc.ZkStateReader$3.process Updating live nodes... (4)
   [junit4]   2> 437162 T1704 oasc.CorePropertiesLocator.discover Looking for core definitions underneath /mnt/ssd/jenkins/workspace/Lucene-Solr-trunk-Linux/solr/build/solr-core/test/J1/./org.apache.solr.cloud.CollectionsAPIDistributedZkTest-jetty3-1375413058717
   [junit4]   2> 437198 T1704 oasc.CorePropertiesLocator.discoverUnder Found core conf in /mnt/ssd/jenkins/workspace/Lucene-Solr-trunk-Linux/solr/build/solr-core/test/J1/./org.apache.solr.cloud.CollectionsAPIDistributedZkTest-jetty3-1375413058717/conf/
   [junit4]   2> 437198 T1704 oasc.CorePropertiesLocator.discover Found 1 core definitions
   [junit4]   2> 437199 T1704 oass.SolrDispatchFilter.init user.dir=/mnt/ssd/jenkins/workspace/Lucene-Solr-trunk-Linux/solr/build/solr-core/test/J1
   [junit4]   2> 437199 T1704 oass.SolrDispatchFilter.init SolrDispatchFilter.init() done
   [junit4]   2> 437199 T1704 oascsi.HttpClientUtil.createClient Creating new http client, config:maxConnections=128&maxConnectionsPerHost=32&followRedirects=false
   [junit4]   2> 437255 T1704 oejs.Server.doStart jetty-8.1.10.v20130312
   [junit4]   2> 437258 T1704 oejs.AbstractConnector.doStart Started SelectChannelConnector@127.0.0.1:60988
   [junit4]   2> 437259 T1704 oass.SolrDispatchFilter.init SolrDispatchFilter.init()
   [junit4]   2> 437260 T1704 oasc.SolrResourceLoader.locateSolrHome JNDI not configured for solr (NoInitialContextEx)
   [junit4]   2> 437260 T1704 oasc.SolrResourceLoader.locateSolrHome using system property solr.solr.home: /mnt/ssd/jenkins/workspace/Lucene-Solr-trunk-Linux/solr/build/solr-core/test/J1/./org.apache.solr.cloud.CollectionsAPIDistributedZkTest-jetty4-1375413059895
   [junit4]   2> 437261 T1704 oasc.SolrResourceLoader.<init> new SolrResourceLoader for directory: '/mnt/ssd/jenkins/workspace/Lucene-Solr-trunk-Linux/solr/build/solr-core/test/J1/./org.apache.solr.cloud.CollectionsAPIDistributedZkTest-jetty4-1375413059895/'
   [junit4]   2> 437274 T1704 oasc.ConfigSolr.fromFile Loading container configuration from /mnt/ssd/jenkins/workspace/Lucene-Solr-trunk-Linux/solr/build/solr-core/test/J1/./org.apache.solr.cloud.CollectionsAPIDistributedZkTest-jetty4-1375413059895/solr.xml
   [junit4]   2> 437299 T1704 oasc.ConfigSolrXml.<init> Config-defined core root directory: 
   [junit4]   2> 437300 T1704 oasc.CoreContainer.<init> New CoreContainer 15334569
   [junit4]   2> 437300 T1704 oasc.CoreContainer.load Loading cores into CoreContainer [instanceDir=/mnt/ssd/jenkins/workspace/Lucene-Solr-trunk-Linux/solr/build/solr-core/test/J1/./org.apache.solr.cloud.CollectionsAPIDistributedZkTest-jetty4-1375413059895/]
   [junit4]   2> 437301 T1704 oashc.HttpShardHandlerFactory.getParameter Setting socketTimeout to: 120000
   [junit4]   2> 437301 T1704 oashc.HttpShardHandlerFactory.getParameter Setting urlScheme to: http://
   [junit4]   2> 437301 T1704 oashc.HttpShardHandlerFactory.getParameter Setting connTimeout to: 15000
   [junit4]   2> 437301 T1704 oashc.HttpShardHandlerFactory.getParameter Setting maxConnectionsPerHost to: 20
   [junit4]   2> 437302 T1704 oashc.HttpShardHandlerFactory.getParameter Setting corePoolSize to: 0
   [junit4]   2> 437302 T1704 oashc.HttpShardHandlerFactory.getParameter Setting maximumPoolSize to: 2147483647
   [junit4]   2> 437302 T1704 oashc.HttpShardHandlerFactory.getParameter Setting maxThreadIdleTime to: 5
   [junit4]   2> 437302 T1704 oashc.HttpShardHandlerFactory.getParameter Setting sizeOfQueue to: -1
   [junit4]   2> 437302 T1704 oashc.HttpShardHandlerFactory.getParameter Setting fairnessPolicy to: false
   [junit4]   2> 437303 T1704 oascsi.HttpClientUtil.createClient Creating new http client, config:maxConnectionsPerHost=20&maxConnections=10000&socketTimeout=120000&connTimeout=15000&retry=false
   [junit4]   2> 437305 T1704 oasc.ZkContainer.initZooKeeper Zookeeper client=127.0.0.1:36618/solr
   [junit4]   2> 437305 T1704 oasc.ZkController.checkChrootPath zkHost includes chroot
   [junit4]   2> 437306 T1704 oascc.ConnectionManager.waitForConnected Waiting for client to connect to ZooKeeper
   [junit4]   2> 437308 T1784 oascc.ConnectionManager.process Watcher org.apache.solr.common.cloud.ConnectionManager@e322bb name:ZooKeeperConnection Watcher:127.0.0.1:36618 got event WatchedEvent state:SyncConnected type:None path:null path:null type:None
   [junit4]   2> 437308 T1704 oascc.ConnectionManager.waitForConnected Client is connected to ZooKeeper
   [junit4]   2> 437310 T1704 oascsi.HttpClientUtil.createClient Creating new http client, config:maxConnections=500&maxConnectionsPerHost=16&socketTimeout=120000&connTimeout=15000
   [junit4]   2> 437313 T1704 oascc.ConnectionManager.waitForConnected Waiting for client to connect to ZooKeeper
   [junit4]   2> 437314 T1786 oascc.ConnectionManager.process Watcher org.apache.solr.common.cloud.ConnectionManager@174f7c8 name:ZooKeeperConnection Watcher:127.0.0.1:36618/solr got event WatchedEvent state:SyncConnected type:None path:null path:null type:None
   [junit4]   2> 437314 T1704 oascc.ConnectionManager.waitForConnected Client is connected to ZooKeeper
   [junit4]   2> 437320 T1704 oascc.ZkStateReader.createClusterStateWatchersAndUpdate Updating cluster state from ZooKeeper... 
   [junit4]   2> 438326 T1704 oasc.ZkController.createEphemeralLiveNode Register node as live in ZooKeeper:/live_nodes/127.0.0.1:60988_
   [junit4]   2> 438328 T1704 oascc.SolrZkClient.makePath makePath: /live_nodes/127.0.0.1:60988_
   [junit4]   2> 438334 T1758 oascc.ZkStateReader$3.process Updating live nodes... (5)
   [junit4]   2> 438334 T1731 oascc.ZkStateReader$3.process Updating live nodes... (5)
   [junit4]   2> 438335 T1726 oascc.ZkStateReader$3.process Updating live nodes... (5)
   [junit4]   2> 438334 T1786 oascc.ZkStateReader$3.process Updating live nodes... (5)
   [junit4]   2> 438334 T1772 oascc.ZkStateReader$3.process Updating live nodes... (5)
   [junit4]   2> 438335 T1744 oascc.ZkStateReader$3.process Updating live nodes... (5)
   [junit4]   2> 438343 T1704 oasc.CorePropertiesLocator.discover Looking for core definitions underneath /mnt/ssd/jenkins/workspace/Lucene-Solr-trunk-Linux/solr/build/solr-core/test/J1/./org.apache.solr.cloud.CollectionsAPIDistributedZkTest-jetty4-1375413059895
   [junit4]   2> 438366 T1704 oasc.CorePropertiesLocator.discoverUnder Found core conf in /mnt/ssd/jenkins/workspace/Lucene-Solr-trunk-Linux/solr/build/solr-core/test/J1/./org.apache.solr.cloud.CollectionsAPIDistributedZkTest-jetty4-1375413059895/conf/
   [junit4]   2> 438366 T1704 oasc.CorePropertiesLocator.discover Found 1 core definitions
   [junit4]   2> 438367 T1704 oass.SolrDispatchFilter.init user.dir=/mnt/ssd/jenkins/workspace/Lucene-Solr-trunk-Linux/solr/build/solr-core/test/J1
   [junit4]   2> 438367 T1704 oass.SolrDispatchFilter.init SolrDispatchFilter.init() done
   [junit4]   2> 438367 T1704 oascsi.HttpClientUtil.createClient Creating new http client, config:maxConnections=128&maxConnectionsPerHost=32&followRedirects=false
   [junit4]   2> 438370 T1704 oascsi.HttpClientUtil.createClient Creating new http client, config:maxConnections=128&maxConnectionsPerHost=32&followRedirects=false
   [junit4]   2> 438372 T1739 oasha.CollectionsHandler.handleCreateAction Creating Collection : numShards=2&name=nodes_used_collection&replicationFactor=2&action=CREATE&wt=javabin&version=2
   [junit4]   2> 438374 T1726 oasc.DistributedQueue$LatchChildWatcher.process Watcher fired on path: /overseer/collection-queue-work state: SyncConnected type NodeChildrenChanged
   [junit4]   2> 438376 T1728 oasc.OverseerCollectionProcessor.run Overseer Collection Processor: Get the message id:/overseer/collection-queue-work/qn-0000000000 message:{
   [junit4]   2> 	  "operation":"createcollection",
   [junit4]   2> 	  "numShards":"2",
   [junit4]   2> 	  "name":"nodes_used_collection",
   [junit4]   2> 	  "replicationFactor":"2"}
   [junit4]   2> 438376 T1728 oasc.OverseerCollectionProcessor.processMessage WARN OverseerCollectionProcessor.processMessage : createcollection , {
   [junit4]   2> 	  "operation":"createcollection",
   [junit4]   2> 	  "numShards":"2",
   [junit4]   2> 	  "name":"nodes_used_collection",
   [junit4]   2> 	  "replicationFactor":"2"}
   [junit4]   2> 439628 T1727 oascc.ZkStateReader.updateClusterState Updating cloud state from ZooKeeper... 
   [junit4]   2> 439629 T1727 oasc.Overseer$ClusterStateUpdater.buildCollection building a new collection: nodes_used_collection
   [junit4]   2> 439629 T1727 oasc.Overseer$ClusterStateUpdater.createCollection Create collection nodes_used_collection with shards [shard1, shard2]
   [junit4]   2> 439637 T1731 oascc.ZkStateReader$2.process A cluster state change: WatchedEvent state:SyncConnected type:NodeDataChanged path:/clusterstate.json, has occurred - updating... (live nodes size: 5)
   [junit4]   2> 439638 T1758 oascc.ZkStateReader$2.process A cluster state change: WatchedEvent state:SyncConnected type:NodeDataChanged path:/clusterstate.json, has occurred - updating... (live nodes size: 5)
   [junit4]   2> 439638 T1744 oascc.ZkStateReader$2.process A cluster state change: WatchedEvent state:SyncConnected type:NodeDataChanged path:/clusterstate.json, has occurred - updating... (live nodes size: 5)
   [junit4]   2> 439638 T1786 oascc.ZkStateReader$2.process A cluster state change: WatchedEvent state:SyncConnected type:NodeDataChanged path:/clusterstate.json, has occurred - updating... (live nodes size: 5)
   [junit4]   2> 439638 T1772 oascc.ZkStateReader$2.process A cluster state change: WatchedEvent state:SyncConnected type:NodeDataChanged path:/clusterstate.json, has occurred - updating... (live nodes size: 5)
   [junit4]   2> 439638 T1726 oascc.ZkStateReader$2.process A cluster state change: WatchedEvent state:SyncConnected type:NodeDataChanged path:/clusterstate.json, has occurred - updating... (live nodes size: 5)
   [junit4]   2> 439682 T1728 oasc.OverseerCollectionProcessor.createCollection going to create cores replicas shardNames [shard1, shard2] , repFactor : 2
   [junit4]   2> 439682 T1728 oasc.OverseerCollectionProcessor.createCollection Creating shard nodes_used_collection_shard1_replica1 as part of slice shard1 of collection nodes_used_collection on 127.0.0.1:60988_
   [junit4]   2> 439683 T1728 oasc.OverseerCollectionProcessor.createCollection Creating shard nodes_used_collection_shard1_replica2 as part of slice shard1 of collection nodes_used_collection on 127.0.0.1:59450_
   [junit4]   2> 439685 T1728 oasc.OverseerCollectionProcessor.createCollection Creating shard nodes_used_collection_shard2_replica1 as part of slice shard2 of collection nodes_used_collection on 127.0.0.1:52713_
   [junit4]   2> 439685 T1728 oasc.OverseerCollectionProcessor.createCollection Creating shard nodes_used_collection_shard2_replica2 as part of slice shard2 of collection nodes_used_collection on 127.0.0.1:48764_
   [junit4]   2> 439687 T1737 oasc.ZkController.publish publishing core=nodes_used_collection_shard1_replica2 state=down
   [junit4]   2> 439688 T1721 oasc.ZkController.publish publishing core=nodes_used_collection_shard2_replica1 state=down
   [junit4]   2> 439687 T1782 oasc.ZkController.publish publishing core=nodes_used_collection_shard1_replica1 state=down
   [junit4]   2> 439690 T1737 oasc.ZkController.waitForCoreNodeName look for our core node name
   [junit4]   2> 439690 T1721 oasc.ZkController.waitForCoreNodeName look for our core node name
   [junit4]   2> 439691 T1766 oasc.ZkController.publish publishing core=nodes_used_collection_shard2_replica2 state=down
   [junit4]   2> 439690 T1782 oasc.ZkController.waitForCoreNodeName look for our core node name
   [junit4]   2> 439692 T1766 oasc.ZkController.waitForCoreNodeName look for our core node name
   [junit4]   2> 441147 T1727 oascc.ZkStateReader.updateClusterState Updating cloud state from ZooKeeper... 
   [junit4]   2> 441150 T1727 oasc.Overseer$ClusterStateUpdater.updateState WARN Could not find collection node for nodes_used_collection, skipping publish state
   [junit4]   2> 441150 T1727 oasc.Overseer$ClusterStateUpdater.updateState Update state numShards=2 message={
   [junit4]   2> 	  "operation":"state",
   [junit4]   2> 	  "core_node_name":"core_node1",
   [junit4]   2> 	  "numShards":"2",
   [junit4]   2> 	  "shard":"shard1",
   [junit4]   2> 	  "roles":null,
   [junit4]   2> 	  "state":"down",
   [junit4]   2> 	  "shard_state":"active",
   [junit4]   2> 	  "core":"nodes_used_collection_shard1_replica2",
   [junit4]   2> 	  "collection":"nodes_used_collection",
   [junit4]   2> 	  "shard_range":null,
   [junit4]   2> 	  "node_name":"127.0.0.1:59450_",
   [junit4]   2> 	  "base_url":"http://127.0.0.1:59450"}
   [junit4]   2> 441158 T1727 oasc.Overseer$ClusterStateUpdater.updateState WARN Could not find collection node for nodes_used_collection, skipping publish state
   [junit4]   2> 441158 T1727 oasc.Overseer$ClusterStateUpdater.updateState Update state numShards=2 message={
   [junit4]   2> 	  "operation":"state",
   [junit4]   2> 	  "core_node_name":"core_node2",
   [junit4]   2> 	  "numShards":"2",
   [junit4]   2> 	  "shard":"shard2",
   [junit4]   2> 	  "roles":null,
   [junit4]   2> 	  "state":"down",
   [junit4]   2> 	  "shard_state":"active",
   [junit4]   2> 	  "core":"nodes_used_collection_shard2_replica1",
   [junit4]   2> 	  "collection":"nodes_used_collection",
   [junit4]   2> 	  "shard_range":null,
   [junit4]   2> 	  "node_name":"127.0.0.1:52713_",
   [junit4]   2> 	  "base_url":"http://127.0.0.1:52713"}
   [junit4]   2> 441166 T1727 oasc.Overseer$ClusterStateUpdater.updateState WARN Could not find collection node for nodes_used_collection, skipping publish state
   [junit4]   2> 441167 T1727 oasc.Overseer$ClusterStateUpdater.updateState Update state numShards=2 message={
   [junit4]   2> 	  "operation":"state",
   [junit4]   2> 	  "core_node_name":"core_node3",
   [junit4]   2> 	  "numShards":"2",
   [junit4]   2> 	  "shard":"shard1",
   [junit4]   2> 	  "roles":null,
   [junit4]   2> 	  "state":"down",
   [junit4]   2> 	  "shard_state":"active",
   [junit4]   2> 	  "core":"nodes_used_collection_shard1_replica1",
   [junit4]   2> 	  "collection":"nodes_used_collection",
   [junit4]   2> 	  "shard_range":null,
   [junit4]   2> 	  "node_name":"127.0.0.1:60988_",
   [junit4]   2> 	  "base_url":"http://127.0.0.1:60988"}
   [junit4]   2> 441174 T1727 oasc.Overseer$ClusterStateUpdater.updateState WARN Could not find collection node for nodes_used_collection, skipping publish state
   [junit4]   2> 441174 T1727 oasc.Overseer$ClusterStateUpdater.updateState Update state numShards=2 message={
   [junit4]   2> 	  "operation":"state",
   [junit4]   2> 	  "core_node_name":"core_node4",
   [junit4]   2> 	  "numShards":"2",
   [junit4]   2> 	  "shard":"shard2",
   [junit4]   2> 	  "roles":null,
   [junit4]   2> 	  "state":"down",
   [junit4]   2> 	  "shard_state":"active",
   [junit4]   2> 	  "core":"nodes_used_collection_shard2_replica2",
   [junit4]   2> 	  "collection":"nodes_used_collection",
   [junit4]   2> 	  "shard_range":null,
   [junit4]   2> 	  "node_name":"127.0.0.1:48764_",
   [junit4]   2> 	  "base_url":"http://127.0.0.1:48764"}
   [junit4]   2> 441182 T1772 oascc.ZkStateReader$2.process A cluster state change: WatchedEvent state:SyncConnected type:NodeDataChanged path:/clusterstate.json, has occurred - updating... (live nodes size: 5)
   [junit4]   2> 441183 T1744 oascc.ZkStateReader$2.process A cluster state change: WatchedEvent state:SyncConnected type:NodeDataChanged path:/clusterstate.json, has occurred - updating... (live nodes size: 5)
   [junit4]   2> 441183 T1726 oascc.ZkStateReader$2.process A cluster state change: WatchedEvent state:SyncConnected type:NodeDataChanged path:/clusterstate.json, has occurred - updating... (live nodes size: 5)
   [junit4]   2> 441182 T1786 oascc.ZkStateReader$2.process A cluster state change: WatchedEvent state:SyncConnected type:NodeDataChanged path:/clusterstate.json, has occurred - updating... (live nodes size: 5)
   [junit4]   2> 441182 T1758 oascc.ZkStateReader$2.process A cluster state change: WatchedEvent state:SyncConnected type:NodeDataChanged path:/clusterstate.json, has occurred - updating... (live nodes size: 5)
   [junit4]   2> 441182 T1731 oascc.ZkStateReader$2.process A cluster state change: WatchedEvent state:SyncConnected type:NodeDataChanged path:/clusterstate.json, has occurred - updating... (live nodes size: 5)
   [junit4]   2> 441690 T1737 oasc.ZkController.waitForShardId waiting to find shard id in clusterstate for nodes_used_collection_shard1_replica2
   [junit4]   2> 441691 T1721 oasc.ZkController.waitForShardId waiting to find shard id in clusterstate for nodes_used_collection_shard2_replica1
   [junit4]   2> 441691 T1737 oasc.CorePropertiesLocator.writePropertiesFile ERROR Couldn't persist core properties to /mnt/ssd/jenkins/workspace/Lucene-Solr-trunk-Linux/solr/build/solr-core/test/J1/./org.apache.solr.cloud.CollectionsAPIDistributedZkTest-jetty1-1375413056355/nodes_used_collection_shard1_replica2/core.properties: java.io.FileNotFoundException: /mnt/ssd/jenkins/workspace/Lucene-Solr-trunk-Linux/solr/build/solr-core/test/J1/./org.apache.solr.cloud.CollectionsAPIDistributedZkTest-jetty1-1375413056355/nodes_used_collection_shard1_replica2/core.properties (No such file or directory)
   [junit4]   2> 441692 T1721 oasc.CorePropertiesLocator.writePropertiesFile ERROR Couldn't persist core properties to /mnt/ssd/jenkins/workspace/Lucene-Solr-trunk-Linux/solr/build/solr-core/test/J1/./org.apache.solr.cloud.CollectionsAPIDistributedZkTest-controljetty-1375413056161/nodes_used_collection_shard2_replica1/core.properties: java.io.FileNotFoundException: /mnt/ssd/jenkins/workspace/Lucene-Solr-trunk-Linux/solr/build/solr-core/test/J1/./org.apache.solr.cloud.CollectionsAPIDistributedZkTest-controljetty-1375413056161/nodes_used_collection_shard2_replica1/core.properties (No such file or directory)
   [junit4]   2> 441692 T1721 oasc.CoreContainer.create Creating SolrCore 'nodes_used_collection_shard2_replica1' using instanceDir: /mnt/ssd/jenkins/workspace/Lucene-Solr-trunk-Linux/solr/build/solr-core/test/J1/./org.apache.solr.cloud.CollectionsAPIDistributedZkTest-controljetty-1375413056161/nodes_used_collection_shard2_replica1
   [junit4]   2> 441693 T1721 oasc.ZkController.createCollectionZkNode Check for collection zkNode:nodes_used_collection
   [junit4]   2> 441692 T1737 oasc.CoreContainer.create Creating SolrCore 'nodes_used_collection_shard1_replica2' using instanceDir: /mnt/ssd/jenkins/workspace/Lucene-Solr-trunk-Linux/solr/build/solr-core/test/J1/./org.apache.solr.cloud.CollectionsAPIDistributedZkTest-jetty1-1375413056355/nodes_used_collection_shard1_replica2
   [junit4]   2> 441694 T1737 oasc.ZkController.createCollectionZkNode Check for collection zkNode:nodes_used_collection
   [junit4]   2> 441692 T1782 oasc.ZkController.waitForShardId waiting to find shard id in clusterstate for nodes_used_collection_shard1_replica1
   [junit4]   2> 441694 T1721 oasc.ZkController.createCollectionZkNode Creating collection in ZooKeeper:nodes_used_collection
   [junit4]   2> 441693 T1766 oasc.ZkController.waitForShardId waiting to find shard id in clusterstate for nodes_used_collection_shard2_replica2
   [junit4]   2> 441695 T1721 oasc.ZkController.getConfName Looking for collection configName
   [junit4]   2> 441695 T1782 oasc.CorePropertiesLocator.writePropertiesFile ERROR Couldn't persist core properties to /mnt/ssd/jenkins/workspace/Lucene-Solr-trunk-Linux/solr/build/solr-core/test/J1/./org.apache.solr.cloud.CollectionsAPIDistributedZkTest-jetty4-1375413059895/nodes_used_collection_shard1_replica1/core.properties: java.io.FileNotFoundException: /mnt/ssd/jenkins/workspace/Lucene-Solr-trunk-Linux/solr/build/solr-core/test/J1/./org.apache.solr.cloud.CollectionsAPIDistributedZkTest-jetty4-1375413059895/nodes_used_collection_shard1_replica1/core.properties (No such file or directory)
   [junit4]   2> 441695 T1737 oasc.ZkController.createCollectionZkNode Creating collection in ZooKeeper:nodes_used_collection
   [junit4]   2> 441697 T1782 oasc.CoreContainer.create Creating SolrCore 'nodes_used_collection_shard1_replica1' using instanceDir: /mnt/ssd/jenkins/workspace/Lucene-Solr-trunk-Linux/solr/build/solr-core/test/J1/./org.apache.solr.cloud.CollectionsAPIDistributedZkTest-jetty4-1375413059895/nodes_used_collection_shard1_replica1
   [junit4]   2> 441698 T1782 oasc.ZkController.createCollectionZkNode Check for collection zkNode:nodes_used_collection
   [junit4]   2> 441696 T1766 oasc.CorePropertiesLocator.writePropertiesFile ERROR Couldn't persist core properties to /mnt/ssd/jenkins/workspace/Lucene-Solr-trunk-Linux/solr/build/solr-core/test/J1/./org.apache.solr.cloud.CollectionsAPIDistributedZkTest-jetty3-1375413058717/nodes_used_collection_shard2_replica2/core.properties: java.io.FileNotFoundException: /mnt/ssd/jenkins/workspace/Lucene-Solr-trunk-Linux/solr/build/solr-core/test/J1/./org.apache.solr.cloud.CollectionsAPIDistributedZkTest-jetty3-1375413058717/nodes_used_collection_shard2_replica2/core.properties (No such file or directory)
   [junit4]   2> 441698 T1721 oasc.ZkController.getConfName Only one config set found in zk - using it:conf1
   [junit4]   2> 441698 T1737 oasc.ZkController.getConfName Looking for collection configName
   [junit4]   2> 441700 T1721 oascc.SolrZkClient.makePath makePath: /collections/nodes_used_collection
   [junit4]   2> 441699 T1782 oasc.ZkController.createCollectionZkNode Creating collection in ZooKeeper:nodes_used_collection
   [junit4]   2> 441699 T1766 oasc.CoreContainer.create Creating SolrCore 'nodes_used_collection_shard2_replica2' using instanceDir: /mnt/ssd/jenkins/workspace/Lucene-Solr-trunk-Linux/solr/build/solr-core/test/J1/./org.apache.solr.cloud.CollectionsAPIDistributedZkTest-jetty3-1375413058717/nodes_used_collection_shard2_replica2
   [junit4]   2> 441702 T1737 oasc.ZkController.getConfName Only one config set found in zk - using it:conf1
   [junit4]   2> 441702 T1766 oasc.ZkController.createCollectionZkNode Check for collection zkNode:nodes_used_collection
   [junit4]   2> 441701 T1782 oasc.ZkController.getConfName Looking for collection configName
   [junit4]   2> 441702 T1737 oascc.SolrZkClient.makePath makePath: /collections/nodes_used_collection
   [junit4]   2> 441704 T1721 oasc.ZkController.readConfigName Load collection config from:/collections/nodes_used_collection
   [junit4]   2> 441703 T1766 oasc.ZkController.createCollectionZkNode Collection zkNode exists
   [junit4]   2> 441705 T1766 oasc.ZkController.readConfigName Load collection config from:/collections/nodes_used_collection
   [junit4]   2> 441705 T1782 oascc.SolrZkClient.makePath makePath: /collections/nodes_used_collection
   [junit4]   2> 441706 T1721 oasc.SolrResourceLoader.<init> new SolrResourceLoader for directory: '/mnt/ssd/jenkins/workspace/Lucene-Solr-trunk-Linux/solr/build/solr-core/test/J1/./org.apache.solr.cloud.CollectionsAPIDistributedZkTest-controljetty-1375413056161/nodes_used_collection_shard2_replica1/'
   [junit4]   2> 441707 T1737 oasc.ZkController.readConfigName Load collection config from:/collections/nodes_used_collection
   [junit4]   2> 441707 T1766 oasc.SolrResourceLoader.<init> new SolrResourceLoader for directory: '/mnt/ssd/jenkins/workspace/Lucene-Solr-trunk-Linux/solr/build/solr-core/test/J1/./org.apache.solr.cloud.CollectionsAPIDistributedZkTest-jetty3-1375413058717/nodes_used_collection_shard2_replica2/'
   [junit4]   2> 441708 T1737 oasc.SolrResourceLoader.<init> new SolrResourceLoader for directory: '/mnt/ssd/jenkins/workspace/Lucene-Solr-trunk-Linux/solr/build/solr-core/test/J1/./org.apache.solr.cloud.CollectionsAPIDistributedZkTest-jetty1-1375413056355/nodes_used_collection_shard1_replica2/'
   [junit4]   2> 441709 T1782 oasc.ZkController.readConfigName Load collection config from:/collections/nodes_used_collection
   [junit4]   2> 441712 T1782 oasc.SolrResourceLoader.<init> new SolrResourceLoader for directory: '/mnt/ssd/jenkins/workspace/Lucene-Solr-trunk-Linux/solr/build/solr-core/test/J1/./org.apache.solr.cloud.CollectionsAPIDistributedZkTest-jetty4-1375413059895/nodes_used_collection_shard1_replica1/'
   [junit4]   2> 441765 T1766 oasc.SolrConfig.<init> Using Lucene MatchVersion: LUCENE_50
   [junit4]   2> 441766 T1737 oasc.SolrConfig.<init> Using Lucene MatchVersion: LUCENE_50
   [junit4]   2> 441781 T1782 oasc.SolrConfig.<init> Using Lucene MatchVersion: LUCENE_50
   [junit4]   2> 441782 T1721 oasc.SolrConfig.<init> Using Lucene MatchVersion: LUCENE_50
   [junit4]   2> 441808 T1737 oasc.SolrConfig.<init> Loaded SolrConfig: solrconfig.xml
   [junit4]   2> 441809 T1766 oasc.SolrConfig.<init> Loaded SolrConfig: solrconfig.xml
   [junit4]   2> 441810 T1737 oass.IndexSchema.readSchema Reading Solr Schema from schema.xml
   [junit4]   2> 441810 T1766 oass.IndexSchema.readSchema Reading Solr Schema from schema.xml
   [junit4]   2> 441815 T1766 oass.IndexSchema.readSchema [nodes_used_collection_shard2_replica2] Schema name=test
   [junit4]   2> 441815 T1782 oasc.SolrConfig.<init> Loaded SolrConfig: solrconfig.xml
   [junit4]   2> 441815 T1737 oass.IndexSchema.readSchema [nodes_used_collection_shard1_replica2] Schema name=test
   [junit4]   2> 441816 T1721 oasc.SolrConfig.<init> Loaded SolrConfig: solrconfig.xml
   [junit4]   2> 441817 T1782 oass.IndexSchema.readSchema Reading Solr Schema from schema.xml
   [junit4]   2> 441817 T1721 oass.IndexSchema.readSchema Reading Solr Schema from schema.xml
   [junit4]   2> 441825 T1782 oass.IndexSchema.readSchema [nodes_used_collection_shard1_replica1] Schema name=test
   [junit4]   2> 441825 T1721 oass.IndexSchema.readSchema [nodes_used_collection_shard2_replica1] Schema name=test
   [junit4]   2> 442165 T1737 oass.OpenExchangeRatesOrgProvider.init Initialized with rates=open-exchange-rates.json, refreshInterval=1440.
   [junit4]   2> 442173 T1737 oass.IndexSchema.readSchema default search field in schema is text
   [junit4]   2> 442173 T1782 oass.OpenExchangeRatesOrgProvider.init Initialized with rates=open-exchange-rates.json, refreshInterval=1440.
   [junit4]   2> 442175 T1766 oass.OpenExchangeRatesOrgProvider.init Initialized with rates=open-exchange-rates.json, refreshInterval=1440.
   [junit4]   2> 442176 T1737 oass.IndexSchema.readSchema unique key field: id
   [junit4]   2> 442177 T1721 oass.OpenExchangeRatesOrgProvider.init Initialized with rates=open-exchange-rates.json, refreshInterval=1440.
   [junit4]   2> 442178 T1782 oass.IndexSchema.readSchema default search field in schema is text
   [junit4]   2> 442180 T1782 oass.IndexSchema.readSchema unique key field: id
   [junit4]   2> 442181 T1766 oass.IndexSchema.readSchema default search field in schema is text
   [junit4]   2> 442182 T1721 oass.IndexSchema.readSchema default search field in schema is text
   [junit4]   2> 442184 T1766 oass.IndexSchema.readSchema unique key field: id
   [junit4]   2> 442185 T1721 oass.IndexSchema.readSchema unique key field: id
   [junit4]   2> 442190 T1737 oass.FileExchangeRateProvider.reload Reloading exchange rates from file currency.xml
   [junit4]   2> 442193 T1782 oass.FileExchangeRateProvider.reload Reloading exchange rates from file currency.xml
   [junit4]   2> 442193 T1737 oass.FileExchangeRateProvider.reload Reloading exchange rates from file currency.xml
   [junit4]   2> 442196 T1766 oass.FileExchangeRateProvider.reload Reloading exchange rates from file currency.xml
   [junit4]   2> 442196 T1782 oass.FileExchangeRateProvider.reload Reloading exchange rates from file currency.xml
   [junit4]   2> 442196 T1721 oass.FileExchangeRateProvider.reload Reloading exchange rates from file currency.xml
   [junit4]   2> 442196 T1737 oass.OpenExchangeRatesOrgProvider.reload Reloading exchange rates from open-exchange-rates.json
   [junit4]   2> 442198 T1737 oass.OpenExchangeRatesOrgProvider$OpenExchangeRates.<init> WARN Unknown key IMPORTANT NOTE
   [junit4]   2> 442198 T1737 oass.OpenExchangeRatesOrgProvider$OpenExchangeRates.<init> WARN Expected key, got STRING
   [junit4]   2> 442198 T1737 oass.OpenExchangeRatesOrgProvider.reload Reloading exchange rates from open-exchange-rates.json
   [junit4]   2> 442199 T1737 oass.OpenExchangeRatesOrgProvider$OpenExchangeRates.<init> WARN Unknown key IMPORTANT NOTE
   [junit4]   2> 442199 T1737 oass.OpenExchangeRatesOrgProvider$OpenExchangeRates.<init> WARN Expected key, got STRING
   [junit4]   2> 442199 T1766 oass.FileExchangeRateProvider.reload Reloading exchange rates from file currency.xml
   [junit4]   2> 442200 T1721 oass.FileExchangeRateProvider.reload Reloading exchange rates from file currency.xml
   [junit4]   2> 442199 T1737 oasc.SolrCore.initDirectoryFactory org.apache.solr.core.MockDirectoryFactory
   [junit4]   2> 442200 T1782 oass.OpenExchangeRatesOrgProvider.reload Reloading exchange rates from open-exchange-rates.json
   [junit4]   2> 442200 T1737 oasc.SolrCore.<init> [nodes_used_collection_shard1_replica2] Opening new SolrCore at /mnt/ssd/jenkins/workspace/Lucene-Solr-trunk-Linux/solr/build/solr-core/test/J1/./org.apache.solr.cloud.CollectionsAPIDistributedZkTest-jetty1-1375413056355/nodes_used_collection_shard1_replica2/, dataDir=/mnt/ssd/jenkins/workspace/Lucene-Solr-trunk-Linux/solr/build/solr-core/test/J1/./org.apache.solr.cloud.CollectionsAPIDistributedZkTest-jetty1-1375413056355//nodes_used_collection_shard1_replica2/data/
   [junit4]   2> 442201 T1737 oasc.JmxMonitoredMap.<init> JMX monitoring is enabled. Adding Solr mbeans to JMX Server: com.sun.jmx.mbeanserver.JmxMBeanServer@1935a68
   [junit4]   2> 442201 T1782 oass.OpenExchangeRatesOrgProvider$OpenExchangeRates.<init> WARN Unknown key IMPORTANT NOTE
   [junit4]   2> 442202 T1782 oass.OpenExchangeRatesOrgProvider$OpenExchangeRates.<init> WARN Expected key, got STRING
   [junit4]   2> 442202 T1737 oasc.CachingDirectoryFactory.get return new directory for /mnt/ssd/jenkins/workspace/Lucene-Solr-trunk-Linux/solr/build/solr-core/test/J1/./org.apache.solr.cloud.CollectionsAPIDistributedZkTest-jetty1-1375413056355//nodes_used_collection_shard1_replica2/data
   [junit4]   2> 442202 T1782 oass.OpenExchangeRatesOrgProvider.reload Reloading exchange rates from open-exchange-rates.json
   [junit4]   2> 442202 T1721 oass.OpenExchangeRatesOrgProvider.reload Reloading exchange rates from open-exchange-rates.json
   [junit4]   2> 442202 T1766 oass.OpenExchangeRatesOrgProvider.reload Reloading exchange rates from open-exchange-rates.json
   [junit4]   2> 442202 T1737 oasc.SolrCore.getNewIndexDir New index directory detected: old=null new=/mnt/ssd/jenkins/workspace/Lucene-Solr-trunk-Linux/solr/build/solr-core/test/J1/./org.apache.solr.cloud.CollectionsAPIDistributedZkTest-jetty1-1375413056355//nodes_used_collection_shard1_replica2/data/index/
   [junit4]   2> 442203 T1782 oass.OpenExchangeRatesOrgProvider$OpenExchangeRates.<init> WARN Unknown key IMPORTANT NOTE
   [junit4]   2> 442204 T1721 oass.OpenExchangeRatesOrgProvider$OpenExchangeRates.<init> WARN Unknown key IMPORTANT NOTE
   [junit4]   2> 442204 T1766 oass.OpenExchangeRatesOrgProvider$OpenExchangeRates.<init> WARN Unknown key IMPORTANT NOTE
   [junit4]   2> 442204 T1766 oass.OpenExchangeRatesOrgProvider$OpenExchangeRates.<init> WARN Expected key, got STRING
   [junit4]   2> 442204 T1782 oass.OpenExchangeRatesOrgProvider$OpenExchangeRates.<init> WARN Expected key, got STRING
   [junit4]   2> 442203 T1737 oasc.SolrCore.initIndex WARN [nodes_used_collection_shard1_replica2] Solr index directory '/mnt/ssd/jenkins/workspace/Lucene-Solr-trunk-Linux/solr/build/solr-core/test/J1/./org.apache.solr.cloud.CollectionsAPIDistributedZkTest-jetty1-1375413056355/nodes_used_collection_shard1_replica2/data/index' doesn't exist. Creating new index...
   [junit4]   2> 442205 T1782 oasc.SolrCore.initDirectoryFactory org.apache.solr.core.MockDirectoryFactory
   [junit4]   2> 442204 T1766 oass.OpenExchangeRatesOrgProvider.reload Reloading exchange rates from open-exchange-rates.json
   [junit4]   2> 442204 T1721 oass.OpenExchangeRatesOrgProvider$OpenExchangeRates.<init> WARN Expected key, got STRING
   [junit4]   2> 442205 T1782 oasc.SolrCore.<init> [nodes_used_collection_shard1_replica1] Opening new SolrCore at /mnt/ssd/jenkins/workspace/Lucene-Solr-trunk-Linux/solr/build/solr-core/test/J1/./org.apache.solr.cloud.CollectionsAPIDistributedZkTest-jetty4-1375413059895/nodes_used_collection_shard1_replica1/, dataDir=/mnt/ssd/jenkins/workspace/Lucene-Solr-trunk-Linux/solr/build/solr-core/test/J1/./org.apache.solr.cloud.CollectionsAPIDistributedZkTest-jetty4-1375413059895//nodes_used_collection_shard1_replica1/data/
   [junit4]   2> 442205 T1737 oasc.CachingDirectoryFactory.get return new directory for /mnt/ssd/jenkins/workspace/Lucene-Solr-trunk-Linux/solr/build/solr-core/test/J1/./org.apache.solr.cloud.CollectionsAPIDistributedZkTest-jetty1-1375413056355//nodes_used_collection_shard1_replica2/data/index
   [junit4]   2> 442206 T1782 oasc.JmxMonitoredMap.<init> JMX monitoring is enabled. Adding Solr mbeans to JMX Server: com.sun.jmx.mbeanserver.JmxMBeanServer@1935a68
   [junit4]   2> 442206 T1766 oass.OpenExchangeRatesOrgProvider$OpenExchangeRates.<init> WARN Unknown key IMPORTANT NOTE
   [junit4]   2> 442207 T1766 oass.OpenExchangeRatesOrgProvider$OpenExchangeRates.<init> WARN Expected key, got STRING
   [junit4]   2> 442206 T1721 oass.OpenExchangeRatesOrgProvider.reload Reloading exchange rates from open-exchange-rates.json
   [junit4]   2> 442207 T1737 oasc.SolrDeletionPolicy.onCommit SolrDeletionPolicy.onCommit: commits: num=1
   [junit4]   2> 		commit{dir=BaseDirectoryWrapper(org.apache.lucene.store.RAMDirectory@11d91f lockFactory=org.apache.lucene.store.NativeFSLockFactory@1bc5ff7),segFN=segments_1,generation=1}
   [junit4]   2> 442208 T1737 oasc.SolrDeletionPolicy.updateCommits newest commit generation = 1
   [junit4]   2> 442207 T1782 oasc.CachingDirectoryFactory.get return new directory for /mnt/ssd/jenkins/workspace/Lucene-Solr-trunk-Linux/solr/build/solr-core/test/J1/./org.apache.solr.cloud.CollectionsAPIDistributedZkTest-jetty4-1375413059895//nodes_used_collection_shard1_replica1/data
   [junit4]   2> 442207 T1766 oasc.SolrCore.initDirectoryFactory org.apache.solr.core.MockDirectoryFactory
   [junit4]   2> 442208 T1721 oass.OpenExchangeRatesOrgProvider$OpenExchangeRates.<init> WARN Unknown key IMPORTANT NOTE
   [junit4]   2> 442209 T1721 oass.OpenExchangeRatesOrgProvider$OpenExchangeRates.<init> WARN Expected key, got STRING
   [junit4]   2> 442208 T1782 oasc.SolrCore.getNewIndexDir New index directory detected: old=null new=/mnt/ssd/jenkins/workspace/Lucene-Solr-trunk-Linux/solr/build/solr-core/test/J1/./org.apache.solr.cloud.CollectionsAPIDistributedZkTest-jetty4-1375413059895//nodes_used_collection_shard1_replica1/data/index/
   [junit4]   2> 442209 T1721 oasc.SolrCore.initDirectoryFactory org.apache.solr.core.MockDirectoryFactory
   [junit4]   2> 442208 T1766 oasc.SolrCore.<init> [nodes_used_collection_shard2_replica2] Opening new SolrCore at /mnt/ssd/jenkins/workspace/Lucene-Solr-trunk-Linux/solr/build/solr-core/test/J1/./org.apache.solr.cloud.CollectionsAPIDistributedZkTest-jetty3-1375413058717/nodes_used_collection_shard2_replica2/, dataDir=/mnt/ssd/jenkins/workspace/Lucene-Solr-trunk-Linux/solr/build/solr-core/test/J1/./org.apache.solr.cloud.CollectionsAPIDistributedZkTest-jetty3-1375413058717//nodes_used_collection_shard2_replica2/data/
   [junit4]   2> 442210 T1721 oasc.SolrCore.<init> [nodes_used_collection_shard2_replica1] Opening new SolrCore at /mnt/ssd/jenkins/workspace/Lucene-Solr-trunk-Linux/solr/build/solr-core/test/J1/./org.apache.solr.cloud.CollectionsAPIDistributedZkTest-controljetty-1375413056161/nodes_used_collection_shard2_replica1/, dataDir=/mnt/ssd/jenkins/workspace/Lucene-Solr-trunk-Linux/solr/build/solr-core/test/J1/./org.apache.solr.cloud.CollectionsAPIDistributedZkTest-controljetty-1375413056161//nodes_used_collection_shard2_replica1/data/
   [junit4]   2> 442210 T1737 oasup.UpdateRequestProcessorChain.init inserting DistributedUpdateProcessorFactory into updateRequestProcessorChain "dedupe"
   [junit4]   2> 442209 T1782 oasc.SolrCore.initIndex WARN [nodes_used_collection_shard1_replica1] Solr index directory '/mnt/ssd/jenkins/workspace/Lucene-Solr-trunk-Linux/solr/build/solr-core/test/J1/./org.apache.solr.cloud.CollectionsAPIDistributedZkTest-jetty4-1375413059895/nodes_used_collection_shard1_replica1/data/index' doesn't exist. Creating new index...
   [junit4]   2> 442210 T1737 oasup.UpdateRequestProcessorChain.init inserting DistributedUpdateProcessorFactory into updateRequestProcessorChain "stored_sig"
   [junit4]   2> 442211 T1782 oasc.CachingDirectoryFactory.get return new directory for /mnt/ssd/jenkins/workspace/Lucene-Solr-trunk-Linux/solr/build/solr-core/test/J1/./org.apache.solr.cloud.CollectionsAPIDistributedZkTest-jetty4-1375413059895//nodes_used_collection_shard1_replica1/data/index
   [junit4]   2> 442211 T1737 oasup.UpdateRequestProcessorChain.init inserting DistributedUpdateProcessorFactory into updateRequestProcessorChain "distrib-dup-test-chain-implicit"
   [junit4]   2> 442210 T1721 oasc.JmxMonitoredMap.<init> JMX monitoring is enabled. Adding Solr mbeans to JMX Server: com.sun.jmx.mbeanserver.JmxMBeanServer@1935a68
   [junit4]   2> 442212 T1737 oasc.RequestHandlers.initHandlersFromConfig created standard: solr.StandardRequestHandler
   [junit4]   2> 442210 T1766 oasc.JmxMonitoredMap.<init> JMX monitoring is enabled. Adding Solr mbeans to JMX Server: com.sun.jmx.mbeanserver.JmxMBeanServer@1935a68
   [junit4]   2> 442212 T1737 oasc.RequestHandlers.initHandlersFromConfig created /get: solr.RealTimeGetHandler
   [junit4]   2> 442212 T1737 oasc.RequestHandlers.initHandlersFromConfig adding lazy requestHandler: solr.ReplicationHandler
   [junit4]   2> 442213 T1766 oasc.CachingDirectoryFactory.get return new directory for /mnt/ssd/jenkins/workspace/Lucene-Solr-trunk-Linux/solr/build/solr-core/test/J1/./org.apache.solr.cloud.CollectionsAPIDistributedZkTest-jetty3-1375413058717//nodes_used_collection_shard2_replica2/data
   [junit4]   2> 442212 T1721 oasc.CachingDirectoryFactory.get return new directory for /mnt/ssd/jenkins/workspace/Lucene-Solr-trunk-Linux/solr/build/solr-core/test/J1/./org.apache.solr.cloud.CollectionsAPIDistributedZkTest-controljetty-1375413056161//nodes_used_collection_shard2_replica1/data
   [junit4]   2> 442213 T1766 oasc.SolrCore.getNewIndexDir New index directory detected: old=null new=/mnt/ssd/jenkins/workspace/Lucene-Solr-trunk-Linux/solr/build/solr-core/test/J1/./org.apache.solr.cloud.CollectionsAPIDistributedZkTest-jetty3-1375413058717//nodes_used_collection_shard2_replica2/data/index/
   [junit4]   2> 442213 T1782 oasc.SolrDeletionPolicy.onCommit SolrDeletionPolicy.onCommit: commits: num=1
   [junit4]   2> 		commit{dir=BaseDirectoryWrapper(org.apache.lucene.store.RAMDirectory@1cba511 lockFactory=org.apache.lucene.store.NativeFSLockFactory@30d498),segFN=segments_1,generation=1}
   [junit4]   2> 442214 T1782 oasc.SolrDeletionPolicy.updateCommits newest commit generation = 1
   [junit4]   2> 442213 T1737 oasc.RequestHandlers.initHandlersFromConfig created /replication: solr.ReplicationHandler
   [junit4]   2> 442213 T1766 oasc.SolrCore.initIndex WARN [nodes_used_collection_shard2_replica2] Solr index directory '/mnt/ssd/jenkins/workspace/Lucene-Solr-trunk-Linux/solr/build/solr-core/test/J1/./org.apache.solr.cloud.CollectionsAPIDistributedZkTest-jetty3-1375413058717/nodes_used_collection_shard2_replica2/data/index' doesn't exist. Creating new index...
   [junit4]   2> 442215 T1737 oasc.RequestHandlers.initHandlersFromConfig created /update: solr.UpdateRequestHandler
   [junit4]   2> 442213 T1721 oasc.SolrCore.getNewIndexDir New index directory detected: old=null new=/mnt/ssd/jenkins/workspace/Lucene-Solr-trunk-Linux/solr/build/solr-core/test/J1/./org.apache.solr.cloud.CollectionsAPIDistributedZkTest-controljetty-1375413056161//nodes_used_collection_shard2_replica1/data/index/
   [junit4]   2> 442215 T1737 oasc.RequestHandlers.initHandlersFromConfig created /admin/: org.apache.solr.handler.admin.AdminHandlers
   [junit4]   2> 442215 T1766 oasc.CachingDirectoryFactory.get return new directory for /mnt/ssd/jenkins/workspace/Lucene-Solr-trunk-Linux/solr/build/solr-core/test/J1/./org.apache.solr.cloud.CollectionsAPIDistributedZkTest-jetty3-1375413058717//nodes_used_collection_shard2_replica2/data/index
   [junit4]   2> 442215 T1721 oasc.SolrCore.initIndex WARN [nodes_used_collection_shard2_replica1] Solr index directory '/mnt/ssd/jenkins/workspace/Lucene-Solr-trunk-Linux/solr/build/solr-core/test/J1/./org.apache.solr.cloud.CollectionsAPIDistributedZkTest-controljetty-1375413056161/nodes_used_collection_shard2_replica1/data/index' doesn't exist. Creating new index...
   [junit4]   2> 442216 T1721 oasc.CachingDirectoryFactory.get return new directory for /mnt/ssd/jenkins/workspace/Lucene-Solr-trunk-Linux/solr/build/solr-core/test/J1/./org.apache.solr.cloud.CollectionsAPIDistributedZkTest-controljetty-1375413056161//nodes_used_collection_shard2_replica1/data/index
   [junit4]   2> 442217 T1766 oasc.SolrDeletionPolicy.onCommit SolrDeletionPolicy.onCommit: commits: num=1
   [junit4]   2> 		commit{dir=BaseDirectoryWrapper(org.apache.lucene.store.RAMDirectory@55840a lockFactory=org.apache.lucene.store.NativeFSLockFactory@1e4674),segFN=segments_1,generation=1}
   [junit4]   2> 442217 T1766 oasc.SolrDeletionPolicy.updateCommits newest commit generation = 1
   [junit4]   2> 442218 T1782 oasup.UpdateRequestProcessorChain.init inserting DistributedUpdateProcessorFactory into updateRequestProcessorChain "dedupe"
   [junit4]   2> 442218 T1721 oasc.SolrDeletionPolicy.onCommit SolrDeletionPolicy.onCommit: commits: num=1
   [junit4]   2> 		commit{dir=BaseDirectoryWrapper(org.apache.lucene.store.RAMDirectory@1b35286 lockFactory=org.apache.lucene.store.NativeFSLockFactory@7eb06f),segFN=segments_1,generation=1}
   [junit4]   2> 442218 T1721 oasc.SolrDeletionPolicy.updateCommits newest commit generation = 1
   [junit4]   2> 442218 T1782 oasup.UpdateRequestProcessorChain.init inserting DistributedUpdateProcessorFactory into updateRequestProcessorChain "stored_sig"
   [junit4]   2> 442219 T1737 oashl.XMLLoader.init xsltCacheLifetimeSeconds=60
   [junit4]   2> 442219 T1782 oasup.UpdateRequestProcessorChain.init inserting DistributedUpdateProcessorFactory into updateRequestProcessorChain "distrib-dup-test-chain-implicit"
   [junit4]   2> 442220 T1766 oasup.UpdateRequestProcessorChain.init inserting DistributedUpdateProcessorFactory into updateRequestProcessorChain "dedupe"
   [junit4]   2> 442220 T1782 oasc.RequestHandlers.initHandlersFromConfig created standard: solr.StandardRequestHandler
   [junit4]   2> 442220 T1766 oasup.UpdateRequestProcessorChain.init inserting DistributedUpdateProcessorFactory into updateRequestProcessorChain "stored_sig"
   [junit4]   2> 442221 T1782 oasc.RequestHandlers.initHandlersFromConfig created /get: solr.RealTimeGetHandler
   [junit4]   2> 442221 T1782 oasc.RequestHandlers.initHandlersFromConfig adding lazy requestHandler: solr.ReplicationHandler
   [junit4]   2> 442221 T1766 oasup.UpdateRequestProcessorChain.init inserting DistributedUpdateProcessorFactory into updateRequestProcessorChain "distrib-dup-test-chain-implicit"
   [junit4]   2> 442221 T1782 oasc.RequestHandlers.initHandlersFromConfig created /replication: solr.ReplicationHandler
   [junit4]   2> 442222 T1766 oasc.RequestHandlers.initHandlersFromConfig created standard: solr.StandardRequestHandler
   [junit4]   2> 442222 T1782 oasc.RequestHandlers.initHandlersFromConfig created /update: solr.UpdateRequestHandler
   [junit4]   2> 442222 T1766 oasc.RequestHandlers.initHandlersFromConfig created /get: solr.RealTimeGetHandler
   [junit4]   2> 442223 T1766 oasc.RequestHandlers.initHandlersFromConfig adding lazy requestHandler: solr.ReplicationHandler
   [junit4]   2> 442222 T1737 oass.SolrIndexSearcher.<init> Opening Searcher@1550c79 main
   [junit4]   2> 442222 T1721 oasup.UpdateRequestProcessorChain.init inserting DistributedUpdateProcessorFactory into updateRequestProcessorChain "dedupe"
   [junit4]   2> 442223 T1766 oasc.RequestHandlers.initHandlersFromConfig created /replication: solr.ReplicationHandler
   [junit4]   2> 442222 T1782 oasc.RequestHandlers.initHandlersFromConfig created /admin/: org.apache.solr.handler.admin.AdminHandlers
   [junit4]   2> 442224 T1766 oasc.RequestHandlers.initHandlersFromConfig created /update: solr.UpdateRequestHandler
   [junit4]   2> 442223 T1737 oasu.CommitTracker.<init> Hard AutoCommit: disabled
   [junit4]   2> 442223 T1721 oasup.UpdateRequestProcessorChain.init inserting DistributedUpdateProcessorFactory into updateRequestProcessorChain "stored_sig"
   [junit4]   2> 442224 T1737 oasu.CommitTracker.<init> Soft AutoCommit: disabled
   [junit4]   2> 442224 T1766 oasc.RequestHandlers.initHandlersFromConfig created /admin/: org.apache.solr.handler.admin.AdminHandlers
   [junit4]   2> 442225 T1721 oasup.UpdateRequestProcessorChain.init inserting DistributedUpdateProcessorFactory into updateRequestProcessorChain "distrib-dup-test-chain-implicit"
   [junit4]   2> 442226 T1721 oasc.RequestHandlers.initHandlersFromConfig created standard: solr.StandardRequestHandler
   [junit4]   2> 442226 T1721 oasc.RequestHandlers.initHandlersFromConfig created /get: solr.RealTimeGetHandler
   [junit4]   2> 442227 T1721 oasc.RequestHandlers.initHandlersFromConfig adding lazy requestHandler: solr.ReplicationHandler
   [junit4]   2> 442226 T1782 oashl.XMLLoader.init xsltCacheLifetimeSeconds=60
   [junit4]   2> 442226 T1766 oashl.XMLLoader.init xsltCacheLifetimeSeconds=60
   [junit4]   2> 442227 T1721 oasc.RequestHandlers.initHandlersFromConfig created /replication: solr.ReplicationHandler
   [junit4]   2> 442228 T1721 oasc.RequestHandlers.initHandlersFromConfig created /update: solr.UpdateRequestHandler
   [junit4]   2> 442228 T1721 oasc.RequestHandlers.initHandlersFromConfig created /admin/: org.apache.solr.handler.admin.AdminHandlers
   [junit4]   2> 442229 T1766 oass.SolrIndexSearcher.<init> Opening Searcher@10ed1bb main
   [junit4]   2> 442229 T1792 oasc.SolrCore.registerSearcher [nodes_used_collection_shard1_replica2] Registered new searcher Searcher@1550c79 main{StandardDirectoryReader(segments_1:1)}
   [junit4]   2> 442229 T1766 oasu.CommitTracker.<init> Hard AutoCommit: disabled
   [junit4]   2> 442230 T1766 oasu.CommitTracker.<init> Soft AutoCommit: disabled
   [junit4]   2> 442230 T1782 oass.SolrIndexSearcher.<init> Opening Searcher@18a6d5f main
   [junit4]   2> 442230 T1721 oashl.XMLLoader.init xsltCacheLifetimeSeconds=60
   [junit4]   2> 442230 T1737 oasc.CoreContainer.registerCore registering core: nodes_used_collection_shard1_replica2
   [junit4]   2> 442231 T1782 oasu.CommitTracker.<init> Hard AutoCommit: disabled
   [junit4]   2> 442231 T1737 oasc.ZkController.register Register replica - core:nodes_used_collection_shard1_replica2 address:http://127.0.0.1:59450 collection:nodes_used_collection shard:shard1
   [junit4]   2> 442231 T1782 oasu.CommitTracker.<init> Soft AutoCommit: disabled
   [junit4]   2> 442231 T1737 oascsi.HttpClientUtil.createClient Creating new http client, config:maxConnections=10000&maxConnectionsPerHost=20&connTimeout=15000&socketTimeout=30000&retry=false
   [junit4]   2> 442232 T1721 oass.SolrIndexSearcher.<init> Opening Searcher@1527e21 main
   [junit4]   2> 442233 T1721 oasu.CommitTracker.<init> Hard AutoCommit: disabled
   [junit4]   2> 442233 T1721 oasu.CommitTracker.<init> Soft AutoCommit: disabled
   [junit4]   2> 442233 T1793 oasc.SolrCore.registerSearcher [nodes_used_collection_shard2_replica2] Registered new searcher Searcher@10ed1bb main{StandardDirectoryReader(segments_1:1)}
   [junit4]   2> 442235 T1766 oasc.CoreContainer.registerCore registering core: nodes_used_collection_shard2_replica2
   [junit4]   2> 442235 T1794 oasc.SolrCore.registerSearcher [nodes_used_collection_shard1_replica1] Registered new searcher Searcher@18a6d5f main{StandardDirectoryReader(segments_1:1)}
   [junit4]   2> 442235 T1737 oascc.SolrZkClient.makePath makePath: /collections/nodes_used_collection/leader_elect/shard1/election
   [junit4]   2> 442235 T1766 oasc.ZkController.register Register replica - core:nodes_used_collection_shard2_replica2 address:http://127.0.0.1:48764 collection:nodes_used_collection shard:shard2
   [junit4]   2> 442236 T1766 oascsi.HttpClientUtil.createClient Creating new http client, config:maxConnections=10000&maxConnectionsPerHost=20&connTimeout=15000&socketTimeout=30000&retry=false
   [junit4]   2> 442236 T1782 oasc.CoreContainer.registerCore registering core: nodes_used_collection_shard1_replica1
   [junit4]   2> 442236 T1795 oasc.SolrCore.registerSearcher [nodes_used_collection_shard2_replica1] Registered new searcher Searcher@1527e21 main{StandardDirectoryReader(segments_1:1)}
   [junit4]   2> 442237 T1782 oasc.ZkController.register Register replica - core:nodes_used_collection_shard1_replica1 address:http://127.0.0.1:60988 collection:nodes_used_collection shard:shard1
   [junit4]   2> 442237 T1721 oasc.CoreContainer.registerCore registering core: nodes_used_collection_shard2_replica1
   [junit4]   2> 442237 T1721 oasc.ZkController.register Register replica - core:nodes_used_collection_shard2_replica1 address:http://127.0.0.1:52713 collection:nodes_used_collection shard:shard2
   [junit4]   2> 442237 T1782 oascsi.HttpClientUtil.createClient Creating new http client, config:maxConnections=10000&maxConnectionsPerHost=20&connTimeout=15000&socketTimeout=30000&retry=false
   [junit4]   2> 442238 T1721 oascsi.HttpClientUtil.createClient Creating new http client, config:maxConnections=10000&maxConnectionsPerHost=20&connTimeout=15000&socketTimeout=30000&retry=false
   [junit4]   2> 442240 T1766 oascc.SolrZkClient.makePath makePath: /collections/nodes_used_collection/leader_elect/shard2/election
   [junit4]   2> 442241 T1721 oascc.SolrZkClient.makePath makePath: /collections/nodes_used_collection/leader_elect/shard2/election
   [junit4]   2> 442241 T1737 oasc.ShardLeaderElectionContext.runLeaderProcess Running the leader process for shard shard1
   [junit4]   2> 442244 T1737 oasc.ShardLeaderElectionContext.waitForReplicasToComeUp Enough replicas found to continue.
   [junit4]   2> 442245 T1737 oasc.ShardLeaderElectionContext.runLeaderProcess I may be the new leader - try and sync
   [junit4]   2> 442245 T1737 oasc.SyncStrategy.sync Sync replicas to http://127.0.0.1:59450/nodes_used_collection_shard1_replica2/
   [junit4]   2> 442245 T1737 oasu.PeerSync.sync PeerSync: core=nodes_used_collection_shard1_replica2 url=http://127.0.0.1:59450 START replicas=[http://127.0.0.1:60988/nodes_used_collection_shard1_replica1/] nUpdates=100
   [junit4]   2> 442246 T1737 oasu.PeerSync.sync PeerSync: core=nodes_used_collection_shard1_replica2 url=http://127.0.0.1:59450 DONE.  We have no versions.  sync failed.
   [junit4]   2> 442246 T1737 oasc.SyncStrategy.syncReplicas Leader's attempt to sync with shard failed, moving to the next candidate
   [junit4]   2> 442246 T1766 oasc.ShardLeaderElectionContext.runLeaderProcess Running the leader process for shard shard2
   [junit4]   2> 442246 T1737 oasc.ShardLeaderElectionContext.runLeaderProcess We failed sync, but we have no versions - we can't sync in that case - we were active before, so become leader anyway
   [junit4]   2> 442247 T1737 oasc.ShardLeaderElectionContext.runLeaderProcess I am the new leader: http://127.0.0.1:59450/nodes_used_collection_shard1_replica2/ shard1
   [junit4]   2> 442247 T1737 oascc.SolrZkClient.makePath makePath: /collections/nodes_used_collection/leaders/shard1
   [junit4]   2> 442251 T1766 oasc.ShardLeaderElectionContext.waitForReplicasToComeUp Enough replicas found to continue.
   [junit4]   2> 442251 T1766 oasc.ShardLeaderElectionContext.runLeaderProcess I may be the new leader - try and sync
   [junit4]   2> 442251 T1766 oasc.SyncStrategy.sync Sync replicas to http://127.0.0.1:48764/nodes_used_collection_shard2_replica2/
   [junit4]   2> 442252 T1766 oasu.PeerSync.sync PeerSync: core=nodes_used_collection_shard2_replica2 url=http://127.0.0.1:48764 START replicas=[http://127.0.0.1:52713/nodes_used_collection_shard2_replica1/] nUpdates=100
   [junit4]   2> ASYNC  NEW_CORE C408 name=nodes_used_collection_shard1_replica1 org.apache.solr.core.SolrCore@141a8ea url=http://127.0.0.1:60988/nodes_used_collection_shard1_replica1 node=127.0.0.1:60988_ C408_STATE=coll:nodes_used_collection core:nodes_used_collection_shard1_replica1 props:{state=down, core=nodes_used_collection_shard1_replica1, node_name=127.0.0.1:60988_, base_url=http://127.0.0.1:60988}
   [junit4]   2> 442254 T1781 C408 P60988 oasc.SolrCore.execute [nodes_used_collection_shard1_replica1] webapp= path=/get params={getVersions=100&distrib=false&wt=javabin&qt=/get&version=2} status=0 QTime=2 
   [junit4]   2> 442254 T1766 oasu.PeerSync.sync PeerSync: core=nodes_used_collection_shard2_replica2 url=http://127.0.0.1:48764 DONE.  We have no versions.  sync failed.
   [junit4]   2> 442255 T1766 oasc.SyncStrategy.syncReplicas Leader's attempt to sync with shard failed, moving to the next candidate
   [junit4]   2> 442255 T1766 oasc.ShardLeaderElectionContext.runLeaderProcess We failed sync, but we have no versions - we can't sync in that case - we were active before, so become leader anyway
   [junit4]   2> 442255 T1766 oasc.ShardLeaderElectionContext.runLeaderProcess I am the new leader: http://127.0.0.1:48764/nodes_used_collection_shard2_replica2/ shard2
   [junit4]   2> 442256 T1766 oascc.SolrZkClient.makePath makePath: /collections/nodes_used_collection/leaders/shard2
   [junit4]   2> ASYNC  NEW_CORE C409 name=nodes_used_collection_shard2_replica1 org.apache.solr.core.SolrCore@1a6ebef url=http://127.0.0.1:52713/nodes_used_collection_shard2_replica1 node=127.0.0.1:52713_ C409_STATE=coll:nodes_used_collection core:nodes_used_collection_shard2_replica1 props:{state=down, core=nodes_used_collection_shard2_replica1, node_name=127.0.0.1:52713_, base_url=http://127.0.0.1:52713}
   [junit4]   2> 442260 T1719 C409 P52713 oasc.SolrCore.execute [nodes_used_collection_shard2_replica1] webapp= path=/get params={getVersions=100&distrib=false&wt=javabin&qt=/get&version=2} status=0 QTime=1 
   [junit4]   2> 442698 T1727 oascc.ZkStateReader.updateClusterState Updating cloud state from ZooKeeper... 
   [junit4]   2> 442721 T1731 oascc.ZkStateReader$2.process A cluster state change: WatchedEvent state:SyncConnected type:NodeDataChanged path:/clusterstate.json, has occurred - updating... (live nodes 

[...truncated too long message...]

apache.http.impl.conn.DefaultClientConnectionOperator.openConnection(DefaultClientConnectionOperator.java:190)
   [junit4]    > 	at org.apache.http.impl.conn.ManagedClientConnectionImpl.open(ManagedClientConnectionImpl.java:294)
   [junit4]    > 	at org.apache.http.impl.client.DefaultRequestDirector.tryConnect(DefaultRequestDirector.java:645)
   [junit4]    > 	at org.apache.http.impl.client.DefaultRequestDirector.execute(DefaultRequestDirector.java:480)
   [junit4]    > 	at org.apache.http.impl.client.AbstractHttpClient.execute(AbstractHttpClient.java:906)
   [junit4]    > 	at org.apache.http.impl.client.AbstractHttpClient.execute(AbstractHttpClient.java:805)
   [junit4]    > 	at org.apache.http.impl.client.AbstractHttpClient.execute(AbstractHttpClient.java:784)
   [junit4]    > 	at org.apache.solr.client.solrj.impl.HttpSolrServer.request(HttpSolrServer.java:365)
   [junit4]    > 	... 45 more
   [junit4]    > Caused by: java.net.ConnectException: Connection refused
   [junit4]    > 	at java.net.PlainSocketImpl.socketConnect(Native Method)
   [junit4]    > 	at java.net.AbstractPlainSocketImpl.doConnect(AbstractPlainSocketImpl.java:339)
   [junit4]    > 	at java.net.AbstractPlainSocketImpl.connectToAddress(AbstractPlainSocketImpl.java:200)
   [junit4]    > 	at java.net.AbstractPlainSocketImpl.connect(AbstractPlainSocketImpl.java:182)
   [junit4]    > 	at java.net.SocksSocketImpl.connect(SocksSocketImpl.java:392)
   [junit4]    > 	at java.net.Socket.connect(Socket.java:579)
   [junit4]    > 	at org.apache.http.conn.scheme.PlainSocketFactory.connectSocket(PlainSocketFactory.java:127)
   [junit4]    > 	at org.apache.http.impl.conn.DefaultClientConnectionOperator.openConnection(DefaultClientConnectionOperator.java:180)
   [junit4]    > 	... 52 more
   [junit4]   2> 563571 T1704 oas.SolrTestCaseJ4.deleteCore ###deleteCore
   [junit4]   2> 130778 T1703 ccr.ThreadLeakControl.checkThreadLeaks WARNING Will linger awaiting termination of 2 leaked thread(s).
   [junit4]   2> 564771 T1786 oasc.LeaderElector$1.process WARN  org.apache.zookeeper.KeeperException$SessionExpiredException: KeeperErrorCode = Session expired for /collections/new_implicit_coll_1/leader_elect/d/election
   [junit4]   2> 	at org.apache.zookeeper.KeeperException.create(KeeperException.java:127)
   [junit4]   2> 	at org.apache.zookeeper.KeeperException.create(KeeperException.java:51)
   [junit4]   2> 	at org.apache.zookeeper.ZooKeeper.getChildren(ZooKeeper.java:1468)
   [junit4]   2> 	at org.apache.solr.common.cloud.SolrZkClient$6.execute(SolrZkClient.java:235)
   [junit4]   2> 	at org.apache.solr.common.cloud.SolrZkClient$6.execute(SolrZkClient.java:232)
   [junit4]   2> 	at org.apache.solr.common.cloud.ZkCmdExecutor.retryOperation(ZkCmdExecutor.java:65)
   [junit4]   2> 	at org.apache.solr.common.cloud.SolrZkClient.getChildren(SolrZkClient.java:232)
   [junit4]   2> 	at org.apache.solr.cloud.LeaderElector.checkIfIamLeader(LeaderElector.java:84)
   [junit4]   2> 	at org.apache.solr.cloud.LeaderElector.access$000(LeaderElector.java:55)
   [junit4]   2> 	at org.apache.solr.cloud.LeaderElector$1.process(LeaderElector.java:129)
   [junit4]   2> 	at org.apache.zookeeper.ClientCnxn$EventThread.processEvent(ClientCnxn.java:519)
   [junit4]   2> 	at org.apache.zookeeper.ClientCnxn$EventThread.run(ClientCnxn.java:495)
   [junit4]   2> 
   [junit4]   2> 564771 T1786 oasc.LeaderElector$1.process WARN  org.apache.zookeeper.KeeperException$SessionExpiredException: KeeperErrorCode = Session expired for /collections/new_implicit_coll_1/leader_elect/a/election
   [junit4]   2> 	at org.apache.zookeeper.KeeperException.create(KeeperException.java:127)
   [junit4]   2> 	at org.apache.zookeeper.KeeperException.create(KeeperException.java:51)
   [junit4]   2> 	at org.apache.zookeeper.ZooKeeper.getChildren(ZooKeeper.java:1468)
   [junit4]   2> 	at org.apache.solr.common.cloud.SolrZkClient$6.execute(SolrZkClient.java:235)
   [junit4]   2> 	at org.apache.solr.common.cloud.SolrZkClient$6.execute(SolrZkClient.java:232)
   [junit4]   2> 	at org.apache.solr.common.cloud.ZkCmdExecutor.retryOperation(ZkCmdExecutor.java:65)
   [junit4]   2> 	at org.apache.solr.common.cloud.SolrZkClient.getChildren(SolrZkClient.java:232)
   [junit4]   2> 	at org.apache.solr.cloud.LeaderElector.checkIfIamLeader(LeaderElector.java:84)
   [junit4]   2> 	at org.apache.solr.cloud.LeaderElector.access$000(LeaderElector.java:55)
   [junit4]   2> 	at org.apache.solr.cloud.LeaderElector$1.process(LeaderElector.java:129)
   [junit4]   2> 	at org.apache.zookeeper.ClientCnxn$EventThread.processEvent(ClientCnxn.java:519)
   [junit4]   2> 	at org.apache.zookeeper.ClientCnxn$EventThread.run(ClientCnxn.java:495)
   [junit4]   2> 
   [junit4]   2> 564772 T1786 oascc.ZkStateReader$2.process A cluster state change: WatchedEvent state:SyncConnected type:NodeChildrenChanged path:/live_nodes, has occurred - updating... (live nodes size: 1)
   [junit4]   2> 564772 T1786 oascc.ZkStateReader$2.process WARN ZooKeeper watch triggered, but Solr cannot talk to ZK
   [junit4]   2> 564773 T1786 oascc.ZkStateReader$3.process WARN ZooKeeper watch triggered, but Solr cannot talk to ZK
   [junit4]   2> 564773 T1786 oasc.LeaderElector$1.process WARN  org.apache.zookeeper.KeeperException$SessionExpiredException: KeeperErrorCode = Session expired for /collections/new_implicit_coll_0/leader_elect/b/election
   [junit4]   2> 	at org.apache.zookeeper.KeeperException.create(KeeperException.java:127)
   [junit4]   2> 	at org.apache.zookeeper.KeeperException.create(KeeperException.java:51)
   [junit4]   2> 	at org.apache.zookeeper.ZooKeeper.getChildren(ZooKeeper.java:1468)
   [junit4]   2> 	at org.apache.solr.common.cloud.SolrZkClient$6.execute(SolrZkClient.java:235)
   [junit4]   2> 	at org.apache.solr.common.cloud.SolrZkClient$6.execute(SolrZkClient.java:232)
   [junit4]   2> 	at org.apache.solr.common.cloud.ZkCmdExecutor.retryOperation(ZkCmdExecutor.java:65)
   [junit4]   2> 	at org.apache.solr.common.cloud.SolrZkClient.getChildren(SolrZkClient.java:232)
   [junit4]   2> 	at org.apache.solr.cloud.LeaderElector.checkIfIamLeader(LeaderElector.java:84)
   [junit4]   2> 	at org.apache.solr.cloud.LeaderElector.access$000(LeaderElector.java:55)
   [junit4]   2> 	at org.apache.solr.cloud.LeaderElector$1.process(LeaderElector.java:129)
   [junit4]   2> 	at org.apache.zookeeper.ClientCnxn$EventThread.processEvent(ClientCnxn.java:519)
   [junit4]   2> 	at org.apache.zookeeper.ClientCnxn$EventThread.run(ClientCnxn.java:495)
   [junit4]   2> 
   [junit4]   2> NOTE: test params are: codec=Lucene41, sim=RandomSimilarityProvider(queryNorm=false,coord=crazy): {}, locale=no_NO, timezone=Europe/Vaduz
   [junit4]   2> NOTE: Linux 3.2.0-51-generic i386/Oracle Corporation 1.7.0_25 (32-bit)/cpus=8,threads=3,free=46059016,total=342884352
   [junit4]   2> NOTE: All tests run in this JVM: [BadCopyFieldTest, FieldAnalysisRequestHandlerTest, CurrencyFieldXmlFileTest, DeleteShardTest, TestManagedSchema, SpellCheckComponentTest, DirectSolrSpellCheckerTest, TestRecoveryHdfs, TestHashPartitioner, TestPartialUpdateDeduplication, TestIndexingPerformance, TestStressLucene, SolrIndexConfigTest, TestRecovery, TestQuerySenderNoQuery, ClusterStateTest, UpdateParamsTest, TestBM25SimilarityFactory, BadIndexSchemaTest, HighlighterConfigTest, FullSolrCloudDistribCmdsTest, IndexReaderFactoryTest, TestSolrXMLSerializer, TestUniqueKeyFieldResource, TestSuggestSpellingConverter, TestAddFieldRealTimeGet, TestFiltering, TestRTGBase, StandardRequestHandlerTest, TestFoldingMultitermQuery, TestJmxMonitoredMap, UniqFieldsUpdateProcessorFactoryTest, TestReload, DocumentAnalysisRequestHandlerTest, TestBinaryField, TestReloadAndDeleteDocs, MultiTermTest, SimplePostToolTest, QueryResultKeyTest, TestAtomicUpdateErrorCases, SolrRequestParserTest, PathHierarchyTokenizerFactoryTest, TestManagedSchemaFieldResource, HdfsCollectionsAPIDistributedZkTest, TestArbitraryIndexDir, CoreAdminCreateDiscoverTest, TimeZoneUtilsTest, SignatureUpdateProcessorFactoryTest, HdfsLockFactoryTest, TestMultiCoreConfBootstrap, HdfsSyncSliceTest, TestCoreDiscovery, TestCodecSupport, TestIndexSearcher, TestCSVLoader, RequiredFieldsTest, SpellCheckCollatorTest, TestRandomFaceting, DirectUpdateHandlerTest, TestPostingsSolrHighlighter, IndexSchemaRuntimeFieldTest, TestAnalyzedSuggestions, DOMUtilTest, TestElisionMultitermQuery, BasicDistributedZk2Test, OpenExchangeRatesOrgProviderTest, URLClassifyProcessorTest, SolrCoreCheckLockOnStartupTest, TestLazyCores, CopyFieldTest, SampleTest, TestSchemaResource, CurrencyFieldOpenExchangeTest, TestRandomMergePolicy, TestUtils, RequestHandlersTest, ChaosMonkeySafeLeaderTest, CollectionsAPIDistributedZkTest]
   [junit4] Completed on J1 in 132.06s, 1 test, 1 error <<< FAILURES!

[...truncated 619 lines...]
BUILD FAILED
/mnt/ssd/jenkins/workspace/Lucene-Solr-trunk-Linux/build.xml:389: The following error occurred while executing this line:
/mnt/ssd/jenkins/workspace/Lucene-Solr-trunk-Linux/build.xml:369: The following error occurred while executing this line:
/mnt/ssd/jenkins/workspace/Lucene-Solr-trunk-Linux/build.xml:39: The following error occurred while executing this line:
/mnt/ssd/jenkins/workspace/Lucene-Solr-trunk-Linux/solr/build.xml:181: The following error occurred while executing this line:
/mnt/ssd/jenkins/workspace/Lucene-Solr-trunk-Linux/solr/common-build.xml:449: The following error occurred while executing this line:
/mnt/ssd/jenkins/workspace/Lucene-Solr-trunk-Linux/lucene/common-build.xml:1230: The following error occurred while executing this line:
/mnt/ssd/jenkins/workspace/Lucene-Solr-trunk-Linux/lucene/common-build.xml:873: There were test failures: 320 suites, 1347 tests, 1 error, 34 ignored (6 assumptions)

Total time: 40 minutes 13 seconds
Build step 'Invoke Ant' marked build as failure
Description set: Java: 32bit/jdk1.7.0_25 -server -XX:+UseParallelGC
Archiving artifacts
Recording test results
Email was triggered for: Failure
Sending email for trigger: Failure



Mime
View raw message