lucene-dev mailing list archives

Site index · List index
Message view « Date » · « Thread »
Top « Date » · « Thread »
From Apache Jenkins Server <jenk...@builds.apache.org>
Subject [JENKINS] Lucene-Solr-Tests-4.x-Java7 - Build # 1475 - Still Failing
Date Sat, 03 Aug 2013 07:51:23 GMT
Build: https://builds.apache.org/job/Lucene-Solr-Tests-4.x-Java7/1475/

1 tests failed.
FAILED:  org.apache.solr.cloud.CollectionsAPIDistributedZkTest.testDistribSearch

Error Message:
IOException occured when talking to server at: http://127.0.0.1:34827/tl_/wz

Stack Trace:
org.apache.solr.client.solrj.SolrServerException: IOException occured when talking to server at: http://127.0.0.1:34827/tl_/wz
	at __randomizedtesting.SeedInfo.seed([D3F2AB967F1A8211:5214258E0845E22D]:0)
	at org.apache.solr.client.solrj.impl.HttpSolrServer.request(HttpSolrServer.java:435)
	at org.apache.solr.client.solrj.impl.HttpSolrServer.request(HttpSolrServer.java:180)
	at org.apache.solr.cloud.AbstractFullDistribZkTestBase.createCollection(AbstractFullDistribZkTestBase.java:1535)
	at org.apache.solr.cloud.CollectionsAPIDistributedZkTest.testCustomCollectionsAPI(CollectionsAPIDistributedZkTest.java:677)
	at org.apache.solr.cloud.CollectionsAPIDistributedZkTest.doTest(CollectionsAPIDistributedZkTest.java:159)
	at org.apache.solr.BaseDistributedSearchTestCase.testDistribSearch(BaseDistributedSearchTestCase.java:835)
	at sun.reflect.NativeMethodAccessorImpl.invoke0(Native Method)
	at sun.reflect.NativeMethodAccessorImpl.invoke(NativeMethodAccessorImpl.java:57)
	at sun.reflect.DelegatingMethodAccessorImpl.invoke(DelegatingMethodAccessorImpl.java:43)
	at java.lang.reflect.Method.invoke(Method.java:606)
	at com.carrotsearch.randomizedtesting.RandomizedRunner.invoke(RandomizedRunner.java:1559)
	at com.carrotsearch.randomizedtesting.RandomizedRunner.access$600(RandomizedRunner.java:79)
	at com.carrotsearch.randomizedtesting.RandomizedRunner$6.evaluate(RandomizedRunner.java:737)
	at com.carrotsearch.randomizedtesting.RandomizedRunner$7.evaluate(RandomizedRunner.java:773)
	at com.carrotsearch.randomizedtesting.RandomizedRunner$8.evaluate(RandomizedRunner.java:787)
	at com.carrotsearch.randomizedtesting.rules.SystemPropertiesRestoreRule$1.evaluate(SystemPropertiesRestoreRule.java:53)
	at org.apache.lucene.util.TestRuleSetupTeardownChained$1.evaluate(TestRuleSetupTeardownChained.java:50)
	at org.apache.lucene.util.TestRuleFieldCacheSanity$1.evaluate(TestRuleFieldCacheSanity.java:51)
	at org.apache.lucene.util.AbstractBeforeAfterRule$1.evaluate(AbstractBeforeAfterRule.java:46)
	at com.carrotsearch.randomizedtesting.rules.SystemPropertiesInvariantRule$1.evaluate(SystemPropertiesInvariantRule.java:55)
	at org.apache.lucene.util.TestRuleThreadAndTestName$1.evaluate(TestRuleThreadAndTestName.java:49)
	at org.apache.lucene.util.TestRuleIgnoreAfterMaxFailures$1.evaluate(TestRuleIgnoreAfterMaxFailures.java:70)
	at org.apache.lucene.util.TestRuleMarkFailure$1.evaluate(TestRuleMarkFailure.java:48)
	at com.carrotsearch.randomizedtesting.rules.StatementAdapter.evaluate(StatementAdapter.java:36)
	at com.carrotsearch.randomizedtesting.ThreadLeakControl$StatementRunner.run(ThreadLeakControl.java:358)
	at com.carrotsearch.randomizedtesting.ThreadLeakControl.forkTimeoutingTask(ThreadLeakControl.java:782)
	at com.carrotsearch.randomizedtesting.ThreadLeakControl$3.evaluate(ThreadLeakControl.java:442)
	at com.carrotsearch.randomizedtesting.RandomizedRunner.runSingleTest(RandomizedRunner.java:746)
	at com.carrotsearch.randomizedtesting.RandomizedRunner$3.evaluate(RandomizedRunner.java:648)
	at com.carrotsearch.randomizedtesting.RandomizedRunner$4.evaluate(RandomizedRunner.java:682)
	at com.carrotsearch.randomizedtesting.RandomizedRunner$5.evaluate(RandomizedRunner.java:693)
	at com.carrotsearch.randomizedtesting.rules.StatementAdapter.evaluate(StatementAdapter.java:36)
	at com.carrotsearch.randomizedtesting.rules.SystemPropertiesRestoreRule$1.evaluate(SystemPropertiesRestoreRule.java:53)
	at org.apache.lucene.util.AbstractBeforeAfterRule$1.evaluate(AbstractBeforeAfterRule.java:46)
	at org.apache.lucene.util.TestRuleStoreClassName$1.evaluate(TestRuleStoreClassName.java:42)
	at com.carrotsearch.randomizedtesting.rules.SystemPropertiesInvariantRule$1.evaluate(SystemPropertiesInvariantRule.java:55)
	at com.carrotsearch.randomizedtesting.rules.NoShadowingOrOverridesOnMethodsRule$1.evaluate(NoShadowingOrOverridesOnMethodsRule.java:39)
	at com.carrotsearch.randomizedtesting.rules.NoShadowingOrOverridesOnMethodsRule$1.evaluate(NoShadowingOrOverridesOnMethodsRule.java:39)
	at com.carrotsearch.randomizedtesting.rules.StatementAdapter.evaluate(StatementAdapter.java:36)
	at org.apache.lucene.util.TestRuleAssertionsRequired$1.evaluate(TestRuleAssertionsRequired.java:43)
	at org.apache.lucene.util.TestRuleMarkFailure$1.evaluate(TestRuleMarkFailure.java:48)
	at org.apache.lucene.util.TestRuleIgnoreAfterMaxFailures$1.evaluate(TestRuleIgnoreAfterMaxFailures.java:70)
	at org.apache.lucene.util.TestRuleIgnoreTestSuites$1.evaluate(TestRuleIgnoreTestSuites.java:55)
	at com.carrotsearch.randomizedtesting.rules.StatementAdapter.evaluate(StatementAdapter.java:36)
	at com.carrotsearch.randomizedtesting.ThreadLeakControl$StatementRunner.run(ThreadLeakControl.java:358)
	at java.lang.Thread.run(Thread.java:724)
Caused by: org.apache.http.conn.ConnectTimeoutException: Connect to 127.0.0.1:34827 timed out
	at org.apache.http.conn.scheme.PlainSocketFactory.connectSocket(PlainSocketFactory.java:129)
	at org.apache.http.impl.conn.DefaultClientConnectionOperator.openConnection(DefaultClientConnectionOperator.java:180)
	at org.apache.http.impl.conn.ManagedClientConnectionImpl.open(ManagedClientConnectionImpl.java:294)
	at org.apache.http.impl.client.DefaultRequestDirector.tryConnect(DefaultRequestDirector.java:645)
	at org.apache.http.impl.client.DefaultRequestDirector.execute(DefaultRequestDirector.java:480)
	at org.apache.http.impl.client.AbstractHttpClient.execute(AbstractHttpClient.java:906)
	at org.apache.http.impl.client.AbstractHttpClient.execute(AbstractHttpClient.java:805)
	at org.apache.http.impl.client.AbstractHttpClient.execute(AbstractHttpClient.java:784)
	at org.apache.solr.client.solrj.impl.HttpSolrServer.request(HttpSolrServer.java:365)
	... 45 more




Build Log:
[...truncated 9765 lines...]
   [junit4] Suite: org.apache.solr.cloud.CollectionsAPIDistributedZkTest
   [junit4]   2> 945645 T1962 oas.BaseDistributedSearchTestCase.initHostContext Setting hostContext system property: /tl_/wz
   [junit4]   2> 945650 T1962 oas.SolrTestCaseJ4.setUp ###Starting testDistribSearch
   [junit4]   2> Creating dataDir: /usr/home/hudson/hudson-slave/workspace/Lucene-Solr-Tests-4.x-Java7/solr/build/solr-core/test/J1/./solrtest-CollectionsAPIDistributedZkTest-1375515025186
   [junit4]   2> 945652 T1962 oasc.ZkTestServer.run STARTING ZK TEST SERVER
   [junit4]   2> 945653 T1963 oasc.ZkTestServer$ZKServerMain.runFromConfig Starting server
   [junit4]   2> 945754 T1962 oasc.ZkTestServer.run start zk server on port:58091
   [junit4]   2> 945755 T1962 oascc.ConnectionManager.waitForConnected Waiting for client to connect to ZooKeeper
   [junit4]   2> 945779 T1969 oascc.ConnectionManager.process Watcher org.apache.solr.common.cloud.ConnectionManager@3e5bd704 name:ZooKeeperConnection Watcher:127.0.0.1:58091 got event WatchedEvent state:SyncConnected type:None path:null path:null type:None
   [junit4]   2> 945779 T1962 oascc.ConnectionManager.waitForConnected Client is connected to ZooKeeper
   [junit4]   2> 945780 T1962 oascc.SolrZkClient.makePath makePath: /solr
   [junit4]   2> 945855 T1962 oascc.ConnectionManager.waitForConnected Waiting for client to connect to ZooKeeper
   [junit4]   2> 945857 T1971 oascc.ConnectionManager.process Watcher org.apache.solr.common.cloud.ConnectionManager@65dc24dc name:ZooKeeperConnection Watcher:127.0.0.1:58091/solr got event WatchedEvent state:SyncConnected type:None path:null path:null type:None
   [junit4]   2> 945857 T1962 oascc.ConnectionManager.waitForConnected Client is connected to ZooKeeper
   [junit4]   2> 945858 T1962 oascc.SolrZkClient.makePath makePath: /collections/collection1
   [junit4]   2> 945885 T1962 oascc.SolrZkClient.makePath makePath: /collections/collection1/shards
   [junit4]   2> 945888 T1962 oascc.SolrZkClient.makePath makePath: /collections/control_collection
   [junit4]   2> 945921 T1962 oascc.SolrZkClient.makePath makePath: /collections/control_collection/shards
   [junit4]   2> 945925 T1962 oasc.AbstractZkTestCase.putConfig put /usr/home/hudson/hudson-slave/workspace/Lucene-Solr-Tests-4.x-Java7/solr/build/solr-core/test-files/solr/collection1/conf/solrconfig-tlog.xml to /configs/conf1/solrconfig.xml
   [junit4]   2> 945925 T1962 oascc.SolrZkClient.makePath makePath: /configs/conf1/solrconfig.xml
   [junit4]   2> 945938 T1962 oasc.AbstractZkTestCase.putConfig put /usr/home/hudson/hudson-slave/workspace/Lucene-Solr-Tests-4.x-Java7/solr/build/solr-core/test-files/solr/collection1/conf/schema.xml to /configs/conf1/schema.xml
   [junit4]   2> 945939 T1962 oascc.SolrZkClient.makePath makePath: /configs/conf1/schema.xml
   [junit4]   2> 946048 T1962 oasc.AbstractZkTestCase.putConfig put /usr/home/hudson/hudson-slave/workspace/Lucene-Solr-Tests-4.x-Java7/solr/build/solr-core/test-files/solr/collection1/conf/stopwords.txt to /configs/conf1/stopwords.txt
   [junit4]   2> 946049 T1962 oascc.SolrZkClient.makePath makePath: /configs/conf1/stopwords.txt
   [junit4]   2> 946056 T1962 oasc.AbstractZkTestCase.putConfig put /usr/home/hudson/hudson-slave/workspace/Lucene-Solr-Tests-4.x-Java7/solr/build/solr-core/test-files/solr/collection1/conf/protwords.txt to /configs/conf1/protwords.txt
   [junit4]   2> 946056 T1962 oascc.SolrZkClient.makePath makePath: /configs/conf1/protwords.txt
   [junit4]   2> 946066 T1962 oasc.AbstractZkTestCase.putConfig put /usr/home/hudson/hudson-slave/workspace/Lucene-Solr-Tests-4.x-Java7/solr/build/solr-core/test-files/solr/collection1/conf/currency.xml to /configs/conf1/currency.xml
   [junit4]   2> 946066 T1962 oascc.SolrZkClient.makePath makePath: /configs/conf1/currency.xml
   [junit4]   2> 946070 T1962 oasc.AbstractZkTestCase.putConfig put /usr/home/hudson/hudson-slave/workspace/Lucene-Solr-Tests-4.x-Java7/solr/build/solr-core/test-files/solr/collection1/conf/open-exchange-rates.json to /configs/conf1/open-exchange-rates.json
   [junit4]   2> 946071 T1962 oascc.SolrZkClient.makePath makePath: /configs/conf1/open-exchange-rates.json
   [junit4]   2> 946074 T1962 oasc.AbstractZkTestCase.putConfig put /usr/home/hudson/hudson-slave/workspace/Lucene-Solr-Tests-4.x-Java7/solr/build/solr-core/test-files/solr/collection1/conf/mapping-ISOLatin1Accent.txt to /configs/conf1/mapping-ISOLatin1Accent.txt
   [junit4]   2> 946075 T1962 oascc.SolrZkClient.makePath makePath: /configs/conf1/mapping-ISOLatin1Accent.txt
   [junit4]   2> 946078 T1962 oasc.AbstractZkTestCase.putConfig put /usr/home/hudson/hudson-slave/workspace/Lucene-Solr-Tests-4.x-Java7/solr/build/solr-core/test-files/solr/collection1/conf/old_synonyms.txt to /configs/conf1/old_synonyms.txt
   [junit4]   2> 946079 T1962 oascc.SolrZkClient.makePath makePath: /configs/conf1/old_synonyms.txt
   [junit4]   2> 946082 T1962 oasc.AbstractZkTestCase.putConfig put /usr/home/hudson/hudson-slave/workspace/Lucene-Solr-Tests-4.x-Java7/solr/build/solr-core/test-files/solr/collection1/conf/synonyms.txt to /configs/conf1/synonyms.txt
   [junit4]   2> 946083 T1962 oascc.SolrZkClient.makePath makePath: /configs/conf1/synonyms.txt
   [junit4]   2> 946377 T1962 oejs.Server.doStart jetty-8.1.10.v20130312
   [junit4]   2> 946382 T1962 oejs.AbstractConnector.doStart Started SocketConnector@127.0.0.1:51680
   [junit4]   2> 946383 T1962 oass.SolrDispatchFilter.init SolrDispatchFilter.init()
   [junit4]   2> 946384 T1962 oasc.SolrResourceLoader.locateSolrHome JNDI not configured for solr (NoInitialContextEx)
   [junit4]   2> 946384 T1962 oasc.SolrResourceLoader.locateSolrHome using system property solr.solr.home: /usr/home/hudson/hudson-slave/workspace/Lucene-Solr-Tests-4.x-Java7/solr/build/solr-core/test/J1/./org.apache.solr.cloud.CollectionsAPIDistributedZkTest-controljetty-1375515025628
   [junit4]   2> 946385 T1962 oasc.SolrResourceLoader.<init> new SolrResourceLoader for directory: '/usr/home/hudson/hudson-slave/workspace/Lucene-Solr-Tests-4.x-Java7/solr/build/solr-core/test/J1/./org.apache.solr.cloud.CollectionsAPIDistributedZkTest-controljetty-1375515025628/'
   [junit4]   2> 946425 T1962 oasc.ConfigSolr.fromFile Loading container configuration from /usr/home/hudson/hudson-slave/workspace/Lucene-Solr-Tests-4.x-Java7/solr/build/solr-core/test/J1/./org.apache.solr.cloud.CollectionsAPIDistributedZkTest-controljetty-1375515025628/solr.xml
   [junit4]   2> 946517 T1962 oasc.ConfigSolrXml.<init> Config-defined core root directory: 
   [junit4]   2> 946524 T1962 oasc.CoreContainer.<init> New CoreContainer 1377504736
   [junit4]   2> 946524 T1962 oasc.CoreContainer.load Loading cores into CoreContainer [instanceDir=/usr/home/hudson/hudson-slave/workspace/Lucene-Solr-Tests-4.x-Java7/solr/build/solr-core/test/J1/./org.apache.solr.cloud.CollectionsAPIDistributedZkTest-controljetty-1375515025628/]
   [junit4]   2> 946526 T1962 oashc.HttpShardHandlerFactory.getParameter Setting socketTimeout to: 120000
   [junit4]   2> 946527 T1962 oashc.HttpShardHandlerFactory.getParameter Setting urlScheme to: http://
   [junit4]   2> 946527 T1962 oashc.HttpShardHandlerFactory.getParameter Setting connTimeout to: 15000
   [junit4]   2> 946528 T1962 oashc.HttpShardHandlerFactory.getParameter Setting maxConnectionsPerHost to: 20
   [junit4]   2> 946528 T1962 oashc.HttpShardHandlerFactory.getParameter Setting corePoolSize to: 0
   [junit4]   2> 946529 T1962 oashc.HttpShardHandlerFactory.getParameter Setting maximumPoolSize to: 2147483647
   [junit4]   2> 946529 T1962 oashc.HttpShardHandlerFactory.getParameter Setting maxThreadIdleTime to: 5
   [junit4]   2> 946530 T1962 oashc.HttpShardHandlerFactory.getParameter Setting sizeOfQueue to: -1
   [junit4]   2> 946530 T1962 oashc.HttpShardHandlerFactory.getParameter Setting fairnessPolicy to: false
   [junit4]   2> 946531 T1962 oascsi.HttpClientUtil.createClient Creating new http client, config:maxConnectionsPerHost=20&maxConnections=10000&socketTimeout=120000&connTimeout=15000&retry=false
   [junit4]   2> 946549 T1962 oasc.ZkContainer.initZooKeeper Zookeeper client=127.0.0.1:58091/solr
   [junit4]   2> 946549 T1962 oasc.ZkController.checkChrootPath zkHost includes chroot
   [junit4]   2> 946550 T1962 oascc.ConnectionManager.waitForConnected Waiting for client to connect to ZooKeeper
   [junit4]   2> 946556 T1982 oascc.ConnectionManager.process Watcher org.apache.solr.common.cloud.ConnectionManager@6f6b5ed5 name:ZooKeeperConnection Watcher:127.0.0.1:58091 got event WatchedEvent state:SyncConnected type:None path:null path:null type:None
   [junit4]   2> 946556 T1962 oascc.ConnectionManager.waitForConnected Client is connected to ZooKeeper
   [junit4]   2> 946571 T1962 oascsi.HttpClientUtil.createClient Creating new http client, config:maxConnections=500&maxConnectionsPerHost=16&socketTimeout=120000&connTimeout=15000
   [junit4]   2> 946584 T1962 oascc.ConnectionManager.waitForConnected Waiting for client to connect to ZooKeeper
   [junit4]   2> 946586 T1984 oascc.ConnectionManager.process Watcher org.apache.solr.common.cloud.ConnectionManager@5c5f718b name:ZooKeeperConnection Watcher:127.0.0.1:58091/solr got event WatchedEvent state:SyncConnected type:None path:null path:null type:None
   [junit4]   2> 946586 T1962 oascc.ConnectionManager.waitForConnected Client is connected to ZooKeeper
   [junit4]   2> 946593 T1962 oascc.SolrZkClient.makePath makePath: /overseer/queue
   [junit4]   2> 946597 T1962 oascc.SolrZkClient.makePath makePath: /overseer/collection-queue-work
   [junit4]   2> 946607 T1962 oascc.SolrZkClient.makePath makePath: /live_nodes
   [junit4]   2> 946609 T1962 oasc.ZkController.createEphemeralLiveNode Register node as live in ZooKeeper:/live_nodes/127.0.0.1:51680_tl_%2Fwz
   [junit4]   2> 946616 T1962 oascc.SolrZkClient.makePath makePath: /live_nodes/127.0.0.1:51680_tl_%2Fwz
   [junit4]   2> 946620 T1962 oascc.SolrZkClient.makePath makePath: /overseer_elect/election
   [junit4]   2> 946634 T1962 oascc.SolrZkClient.makePath makePath: /overseer_elect/leader
   [junit4]   2> 946637 T1962 oasc.Overseer.start Overseer (id=90145752691113987-127.0.0.1:51680_tl_%2Fwz-n_0000000000) starting
   [junit4]   2> 946649 T1962 oascc.SolrZkClient.makePath makePath: /overseer/queue-work
   [junit4]   2> 946659 T1986 oasc.OverseerCollectionProcessor.run Process current queue of collection creations
   [junit4]   2> 946660 T1962 oascc.SolrZkClient.makePath makePath: /clusterstate.json
   [junit4]   2> 946663 T1962 oascc.SolrZkClient.makePath makePath: /aliases.json
   [junit4]   2> 946670 T1962 oascc.ZkStateReader.createClusterStateWatchersAndUpdate Updating cluster state from ZooKeeper... 
   [junit4]   2> 946673 T1985 oasc.Overseer$ClusterStateUpdater.run Starting to work on the main queue
   [junit4]   2> 946677 T1962 oasc.CorePropertiesLocator.discover Looking for core definitions underneath /usr/home/hudson/hudson-slave/workspace/Lucene-Solr-Tests-4.x-Java7/solr/build/solr-core/test/J1/./org.apache.solr.cloud.CollectionsAPIDistributedZkTest-controljetty-1375515025628
   [junit4]   2> 946854 T1962 oasc.CorePropertiesLocator.discoverUnder Found core conf in /usr/home/hudson/hudson-slave/workspace/Lucene-Solr-Tests-4.x-Java7/solr/build/solr-core/test/J1/./org.apache.solr.cloud.CollectionsAPIDistributedZkTest-controljetty-1375515025628/conf/
   [junit4]   2> 946855 T1962 oasc.CorePropertiesLocator.discover Found 1 core definitions
   [junit4]   2> 946856 T1962 oass.SolrDispatchFilter.init user.dir=/usr/home/hudson/hudson-slave/workspace/Lucene-Solr-Tests-4.x-Java7/solr/build/solr-core/test/J1
   [junit4]   2> 946856 T1962 oass.SolrDispatchFilter.init SolrDispatchFilter.init() done
   [junit4]   2> 946857 T1962 oascsi.HttpClientUtil.createClient Creating new http client, config:maxConnections=128&maxConnectionsPerHost=32&followRedirects=false
   [junit4]   2> 946875 T1962 oascsi.HttpClientUtil.createClient Creating new http client, config:
   [junit4]   2> 946877 T1962 oascc.ConnectionManager.waitForConnected Waiting for client to connect to ZooKeeper
   [junit4]   2> 946880 T1989 oascc.ConnectionManager.process Watcher org.apache.solr.common.cloud.ConnectionManager@cd14e7a name:ZooKeeperConnection Watcher:127.0.0.1:58091/solr got event WatchedEvent state:SyncConnected type:None path:null path:null type:None
   [junit4]   2> 946880 T1962 oascc.ConnectionManager.waitForConnected Client is connected to ZooKeeper
   [junit4]   2> 946882 T1962 oascc.ZkStateReader.createClusterStateWatchersAndUpdate Updating cluster state from ZooKeeper... 
   [junit4]   2> 946884 T1962 oasc.ChaosMonkey.monkeyLog monkey: init - expire sessions:true cause connection loss:true
   [junit4]   2> 947170 T1962 oejs.Server.doStart jetty-8.1.10.v20130312
   [junit4]   2> 947173 T1962 oejs.AbstractConnector.doStart Started SocketConnector@127.0.0.1:34827
   [junit4]   2> 947174 T1962 oass.SolrDispatchFilter.init SolrDispatchFilter.init()
   [junit4]   2> 947175 T1962 oasc.SolrResourceLoader.locateSolrHome JNDI not configured for solr (NoInitialContextEx)
   [junit4]   2> 947175 T1962 oasc.SolrResourceLoader.locateSolrHome using system property solr.solr.home: /usr/home/hudson/hudson-slave/workspace/Lucene-Solr-Tests-4.x-Java7/solr/build/solr-core/test/J1/./org.apache.solr.cloud.CollectionsAPIDistributedZkTest-jetty1-1375515026419
   [junit4]   2> 947176 T1962 oasc.SolrResourceLoader.<init> new SolrResourceLoader for directory: '/usr/home/hudson/hudson-slave/workspace/Lucene-Solr-Tests-4.x-Java7/solr/build/solr-core/test/J1/./org.apache.solr.cloud.CollectionsAPIDistributedZkTest-jetty1-1375515026419/'
   [junit4]   2> 947219 T1962 oasc.ConfigSolr.fromFile Loading container configuration from /usr/home/hudson/hudson-slave/workspace/Lucene-Solr-Tests-4.x-Java7/solr/build/solr-core/test/J1/./org.apache.solr.cloud.CollectionsAPIDistributedZkTest-jetty1-1375515026419/solr.xml
   [junit4]   2> 947330 T1962 oasc.ConfigSolrXml.<init> Config-defined core root directory: 
   [junit4]   2> 947331 T1962 oasc.CoreContainer.<init> New CoreContainer 1403321993
   [junit4]   2> 947332 T1962 oasc.CoreContainer.load Loading cores into CoreContainer [instanceDir=/usr/home/hudson/hudson-slave/workspace/Lucene-Solr-Tests-4.x-Java7/solr/build/solr-core/test/J1/./org.apache.solr.cloud.CollectionsAPIDistributedZkTest-jetty1-1375515026419/]
   [junit4]   2> 947334 T1962 oashc.HttpShardHandlerFactory.getParameter Setting socketTimeout to: 120000
   [junit4]   2> 947334 T1962 oashc.HttpShardHandlerFactory.getParameter Setting urlScheme to: http://
   [junit4]   2> 947335 T1962 oashc.HttpShardHandlerFactory.getParameter Setting connTimeout to: 15000
   [junit4]   2> 947335 T1962 oashc.HttpShardHandlerFactory.getParameter Setting maxConnectionsPerHost to: 20
   [junit4]   2> 947336 T1962 oashc.HttpShardHandlerFactory.getParameter Setting corePoolSize to: 0
   [junit4]   2> 947336 T1962 oashc.HttpShardHandlerFactory.getParameter Setting maximumPoolSize to: 2147483647
   [junit4]   2> 947336 T1962 oashc.HttpShardHandlerFactory.getParameter Setting maxThreadIdleTime to: 5
   [junit4]   2> 947337 T1962 oashc.HttpShardHandlerFactory.getParameter Setting sizeOfQueue to: -1
   [junit4]   2> 947337 T1962 oashc.HttpShardHandlerFactory.getParameter Setting fairnessPolicy to: false
   [junit4]   2> 947338 T1962 oascsi.HttpClientUtil.createClient Creating new http client, config:maxConnectionsPerHost=20&maxConnections=10000&socketTimeout=120000&connTimeout=15000&retry=false
   [junit4]   2> 947357 T1962 oasc.ZkContainer.initZooKeeper Zookeeper client=127.0.0.1:58091/solr
   [junit4]   2> 947357 T1962 oasc.ZkController.checkChrootPath zkHost includes chroot
   [junit4]   2> 947358 T1962 oascc.ConnectionManager.waitForConnected Waiting for client to connect to ZooKeeper
   [junit4]   2> 947362 T2000 oascc.ConnectionManager.process Watcher org.apache.solr.common.cloud.ConnectionManager@550293df name:ZooKeeperConnection Watcher:127.0.0.1:58091 got event WatchedEvent state:SyncConnected type:None path:null path:null type:None
   [junit4]   2> 947362 T1962 oascc.ConnectionManager.waitForConnected Client is connected to ZooKeeper
   [junit4]   2> 947377 T1962 oascsi.HttpClientUtil.createClient Creating new http client, config:maxConnections=500&maxConnectionsPerHost=16&socketTimeout=120000&connTimeout=15000
   [junit4]   2> 947389 T1962 oascc.ConnectionManager.waitForConnected Waiting for client to connect to ZooKeeper
   [junit4]   2> 947391 T2002 oascc.ConnectionManager.process Watcher org.apache.solr.common.cloud.ConnectionManager@4f6749b5 name:ZooKeeperConnection Watcher:127.0.0.1:58091/solr got event WatchedEvent state:SyncConnected type:None path:null path:null type:None
   [junit4]   2> 947392 T1962 oascc.ConnectionManager.waitForConnected Client is connected to ZooKeeper
   [junit4]   2> 947402 T1962 oascc.ZkStateReader.createClusterStateWatchersAndUpdate Updating cluster state from ZooKeeper... 
   [junit4]   2> 948406 T1962 oasc.ZkController.createEphemeralLiveNode Register node as live in ZooKeeper:/live_nodes/127.0.0.1:34827_tl_%2Fwz
   [junit4]   2> 948409 T1962 oascc.SolrZkClient.makePath makePath: /live_nodes/127.0.0.1:34827_tl_%2Fwz
   [junit4]   2> 948413 T1984 oascc.ZkStateReader$3.process Updating live nodes... (2)
   [junit4]   2> 948413 T1989 oascc.ZkStateReader$3.process Updating live nodes... (2)
   [junit4]   2> 948413 T2002 oascc.ZkStateReader$3.process Updating live nodes... (2)
   [junit4]   2> 948421 T1962 oasc.CorePropertiesLocator.discover Looking for core definitions underneath /usr/home/hudson/hudson-slave/workspace/Lucene-Solr-Tests-4.x-Java7/solr/build/solr-core/test/J1/./org.apache.solr.cloud.CollectionsAPIDistributedZkTest-jetty1-1375515026419
   [junit4]   2> 948424 T1962 oasc.CorePropertiesLocator.discoverUnder Found core conf in /usr/home/hudson/hudson-slave/workspace/Lucene-Solr-Tests-4.x-Java7/solr/build/solr-core/test/J1/./org.apache.solr.cloud.CollectionsAPIDistributedZkTest-jetty1-1375515026419/conf/
   [junit4]   2> 948638 T1962 oasc.CorePropertiesLocator.discover Found 1 core definitions
   [junit4]   2> 948639 T1962 oass.SolrDispatchFilter.init user.dir=/usr/home/hudson/hudson-slave/workspace/Lucene-Solr-Tests-4.x-Java7/solr/build/solr-core/test/J1
   [junit4]   2> 948639 T1962 oass.SolrDispatchFilter.init SolrDispatchFilter.init() done
   [junit4]   2> 948640 T1962 oascsi.HttpClientUtil.createClient Creating new http client, config:maxConnections=128&maxConnectionsPerHost=32&followRedirects=false
   [junit4]   2> 948972 T1962 oejs.Server.doStart jetty-8.1.10.v20130312
   [junit4]   2> 948975 T1962 oejs.AbstractConnector.doStart Started SocketConnector@127.0.0.1:31586
   [junit4]   2> 948976 T1962 oass.SolrDispatchFilter.init SolrDispatchFilter.init()
   [junit4]   2> 948977 T1962 oasc.SolrResourceLoader.locateSolrHome JNDI not configured for solr (NoInitialContextEx)
   [junit4]   2> 948977 T1962 oasc.SolrResourceLoader.locateSolrHome using system property solr.solr.home: /usr/home/hudson/hudson-slave/workspace/Lucene-Solr-Tests-4.x-Java7/solr/build/solr-core/test/J1/./org.apache.solr.cloud.CollectionsAPIDistributedZkTest-jetty2-1375515028194
   [junit4]   2> 948978 T1962 oasc.SolrResourceLoader.<init> new SolrResourceLoader for directory: '/usr/home/hudson/hudson-slave/workspace/Lucene-Solr-Tests-4.x-Java7/solr/build/solr-core/test/J1/./org.apache.solr.cloud.CollectionsAPIDistributedZkTest-jetty2-1375515028194/'
   [junit4]   2> 949021 T1962 oasc.ConfigSolr.fromFile Loading container configuration from /usr/home/hudson/hudson-slave/workspace/Lucene-Solr-Tests-4.x-Java7/solr/build/solr-core/test/J1/./org.apache.solr.cloud.CollectionsAPIDistributedZkTest-jetty2-1375515028194/solr.xml
   [junit4]   2> 949149 T1962 oasc.ConfigSolrXml.<init> Config-defined core root directory: 
   [junit4]   2> 949150 T1962 oasc.CoreContainer.<init> New CoreContainer 1685420548
   [junit4]   2> 949150 T1962 oasc.CoreContainer.load Loading cores into CoreContainer [instanceDir=/usr/home/hudson/hudson-slave/workspace/Lucene-Solr-Tests-4.x-Java7/solr/build/solr-core/test/J1/./org.apache.solr.cloud.CollectionsAPIDistributedZkTest-jetty2-1375515028194/]
   [junit4]   2> 949152 T1962 oashc.HttpShardHandlerFactory.getParameter Setting socketTimeout to: 120000
   [junit4]   2> 949153 T1962 oashc.HttpShardHandlerFactory.getParameter Setting urlScheme to: http://
   [junit4]   2> 949153 T1962 oashc.HttpShardHandlerFactory.getParameter Setting connTimeout to: 15000
   [junit4]   2> 949154 T1962 oashc.HttpShardHandlerFactory.getParameter Setting maxConnectionsPerHost to: 20
   [junit4]   2> 949154 T1962 oashc.HttpShardHandlerFactory.getParameter Setting corePoolSize to: 0
   [junit4]   2> 949155 T1962 oashc.HttpShardHandlerFactory.getParameter Setting maximumPoolSize to: 2147483647
   [junit4]   2> 949155 T1962 oashc.HttpShardHandlerFactory.getParameter Setting maxThreadIdleTime to: 5
   [junit4]   2> 949156 T1962 oashc.HttpShardHandlerFactory.getParameter Setting sizeOfQueue to: -1
   [junit4]   2> 949156 T1962 oashc.HttpShardHandlerFactory.getParameter Setting fairnessPolicy to: false
   [junit4]   2> 949157 T1962 oascsi.HttpClientUtil.createClient Creating new http client, config:maxConnectionsPerHost=20&maxConnections=10000&socketTimeout=120000&connTimeout=15000&retry=false
   [junit4]   2> 949175 T1962 oasc.ZkContainer.initZooKeeper Zookeeper client=127.0.0.1:58091/solr
   [junit4]   2> 949176 T1962 oasc.ZkController.checkChrootPath zkHost includes chroot
   [junit4]   2> 949177 T1962 oascc.ConnectionManager.waitForConnected Waiting for client to connect to ZooKeeper
   [junit4]   2> 949180 T2014 oascc.ConnectionManager.process Watcher org.apache.solr.common.cloud.ConnectionManager@1a536084 name:ZooKeeperConnection Watcher:127.0.0.1:58091 got event WatchedEvent state:SyncConnected type:None path:null path:null type:None
   [junit4]   2> 949180 T1962 oascc.ConnectionManager.waitForConnected Client is connected to ZooKeeper
   [junit4]   2> 949182 T1962 oascsi.HttpClientUtil.createClient Creating new http client, config:maxConnections=500&maxConnectionsPerHost=16&socketTimeout=120000&connTimeout=15000
   [junit4]   2> 949194 T1962 oascc.ConnectionManager.waitForConnected Waiting for client to connect to ZooKeeper
   [junit4]   2> 949196 T2016 oascc.ConnectionManager.process Watcher org.apache.solr.common.cloud.ConnectionManager@1c15725 name:ZooKeeperConnection Watcher:127.0.0.1:58091/solr got event WatchedEvent state:SyncConnected type:None path:null path:null type:None
   [junit4]   2> 949197 T1962 oascc.ConnectionManager.waitForConnected Client is connected to ZooKeeper
   [junit4]   2> 949209 T1962 oascc.ZkStateReader.createClusterStateWatchersAndUpdate Updating cluster state from ZooKeeper... 
   [junit4]   2> 950212 T1962 oasc.ZkController.createEphemeralLiveNode Register node as live in ZooKeeper:/live_nodes/127.0.0.1:31586_tl_%2Fwz
   [junit4]   2> 950223 T1962 oascc.SolrZkClient.makePath makePath: /live_nodes/127.0.0.1:31586_tl_%2Fwz
   [junit4]   2> 950227 T1989 oascc.ZkStateReader$3.process Updating live nodes... (3)
   [junit4]   2> 950227 T2016 oascc.ZkStateReader$3.process Updating live nodes... (3)
   [junit4]   2> 950227 T2002 oascc.ZkStateReader$3.process Updating live nodes... (3)
   [junit4]   2> 950227 T1984 oascc.ZkStateReader$3.process Updating live nodes... (3)
   [junit4]   2> 950243 T1962 oasc.CorePropertiesLocator.discover Looking for core definitions underneath /usr/home/hudson/hudson-slave/workspace/Lucene-Solr-Tests-4.x-Java7/solr/build/solr-core/test/J1/./org.apache.solr.cloud.CollectionsAPIDistributedZkTest-jetty2-1375515028194
   [junit4]   2> 950422 T1962 oasc.CorePropertiesLocator.discoverUnder Found core conf in /usr/home/hudson/hudson-slave/workspace/Lucene-Solr-Tests-4.x-Java7/solr/build/solr-core/test/J1/./org.apache.solr.cloud.CollectionsAPIDistributedZkTest-jetty2-1375515028194/conf/
   [junit4]   2> 950425 T1962 oasc.CorePropertiesLocator.discover Found 1 core definitions
   [junit4]   2> 950426 T1962 oass.SolrDispatchFilter.init user.dir=/usr/home/hudson/hudson-slave/workspace/Lucene-Solr-Tests-4.x-Java7/solr/build/solr-core/test/J1
   [junit4]   2> 950426 T1962 oass.SolrDispatchFilter.init SolrDispatchFilter.init() done
   [junit4]   2> 950427 T1962 oascsi.HttpClientUtil.createClient Creating new http client, config:maxConnections=128&maxConnectionsPerHost=32&followRedirects=false
   [junit4]   2> 950762 T1962 oejs.Server.doStart jetty-8.1.10.v20130312
   [junit4]   2> 950765 T1962 oejs.AbstractConnector.doStart Started SocketConnector@127.0.0.1:31597
   [junit4]   2> 950766 T1962 oass.SolrDispatchFilter.init SolrDispatchFilter.init()
   [junit4]   2> 950766 T1962 oasc.SolrResourceLoader.locateSolrHome JNDI not configured for solr (NoInitialContextEx)
   [junit4]   2> 950767 T1962 oasc.SolrResourceLoader.locateSolrHome using system property solr.solr.home: /usr/home/hudson/hudson-slave/workspace/Lucene-Solr-Tests-4.x-Java7/solr/build/solr-core/test/J1/./org.apache.solr.cloud.CollectionsAPIDistributedZkTest-jetty3-1375515029979
   [junit4]   2> 950767 T1962 oasc.SolrResourceLoader.<init> new SolrResourceLoader for directory: '/usr/home/hudson/hudson-slave/workspace/Lucene-Solr-Tests-4.x-Java7/solr/build/solr-core/test/J1/./org.apache.solr.cloud.CollectionsAPIDistributedZkTest-jetty3-1375515029979/'
   [junit4]   2> 950808 T1962 oasc.ConfigSolr.fromFile Loading container configuration from /usr/home/hudson/hudson-slave/workspace/Lucene-Solr-Tests-4.x-Java7/solr/build/solr-core/test/J1/./org.apache.solr.cloud.CollectionsAPIDistributedZkTest-jetty3-1375515029979/solr.xml
   [junit4]   2> 950894 T1962 oasc.ConfigSolrXml.<init> Config-defined core root directory: 
   [junit4]   2> 950895 T1962 oasc.CoreContainer.<init> New CoreContainer 881448589
   [junit4]   2> 950896 T1962 oasc.CoreContainer.load Loading cores into CoreContainer [instanceDir=/usr/home/hudson/hudson-slave/workspace/Lucene-Solr-Tests-4.x-Java7/solr/build/solr-core/test/J1/./org.apache.solr.cloud.CollectionsAPIDistributedZkTest-jetty3-1375515029979/]
   [junit4]   2> 950897 T1962 oashc.HttpShardHandlerFactory.getParameter Setting socketTimeout to: 120000
   [junit4]   2> 950898 T1962 oashc.HttpShardHandlerFactory.getParameter Setting urlScheme to: http://
   [junit4]   2> 950898 T1962 oashc.HttpShardHandlerFactory.getParameter Setting connTimeout to: 15000
   [junit4]   2> 950899 T1962 oashc.HttpShardHandlerFactory.getParameter Setting maxConnectionsPerHost to: 20
   [junit4]   2> 950899 T1962 oashc.HttpShardHandlerFactory.getParameter Setting corePoolSize to: 0
   [junit4]   2> 950900 T1962 oashc.HttpShardHandlerFactory.getParameter Setting maximumPoolSize to: 2147483647
   [junit4]   2> 950900 T1962 oashc.HttpShardHandlerFactory.getParameter Setting maxThreadIdleTime to: 5
   [junit4]   2> 950901 T1962 oashc.HttpShardHandlerFactory.getParameter Setting sizeOfQueue to: -1
   [junit4]   2> 950901 T1962 oashc.HttpShardHandlerFactory.getParameter Setting fairnessPolicy to: false
   [junit4]   2> 950902 T1962 oascsi.HttpClientUtil.createClient Creating new http client, config:maxConnectionsPerHost=20&maxConnections=10000&socketTimeout=120000&connTimeout=15000&retry=false
   [junit4]   2> 950916 T1962 oasc.ZkContainer.initZooKeeper Zookeeper client=127.0.0.1:58091/solr
   [junit4]   2> 950917 T1962 oasc.ZkController.checkChrootPath zkHost includes chroot
   [junit4]   2> 950918 T1962 oascc.ConnectionManager.waitForConnected Waiting for client to connect to ZooKeeper
   [junit4]   2> 950926 T2028 oascc.ConnectionManager.process Watcher org.apache.solr.common.cloud.ConnectionManager@b7b5e72 name:ZooKeeperConnection Watcher:127.0.0.1:58091 got event WatchedEvent state:SyncConnected type:None path:null path:null type:None
   [junit4]   2> 950926 T1962 oascc.ConnectionManager.waitForConnected Client is connected to ZooKeeper
   [junit4]   2> 950934 T1962 oascsi.HttpClientUtil.createClient Creating new http client, config:maxConnections=500&maxConnectionsPerHost=16&socketTimeout=120000&connTimeout=15000
   [junit4]   2> 950945 T1962 oascc.ConnectionManager.waitForConnected Waiting for client to connect to ZooKeeper
   [junit4]   2> 950951 T2030 oascc.ConnectionManager.process Watcher org.apache.solr.common.cloud.ConnectionManager@6b58988b name:ZooKeeperConnection Watcher:127.0.0.1:58091/solr got event WatchedEvent state:SyncConnected type:None path:null path:null type:None
   [junit4]   2> 950951 T1962 oascc.ConnectionManager.waitForConnected Client is connected to ZooKeeper
   [junit4]   2> 950966 T1962 oascc.ZkStateReader.createClusterStateWatchersAndUpdate Updating cluster state from ZooKeeper... 
   [junit4]   2> 951969 T1962 oasc.ZkController.createEphemeralLiveNode Register node as live in ZooKeeper:/live_nodes/127.0.0.1:31597_tl_%2Fwz
   [junit4]   2> 952003 T1962 oascc.SolrZkClient.makePath makePath: /live_nodes/127.0.0.1:31597_tl_%2Fwz
   [junit4]   2> 952007 T1984 oascc.ZkStateReader$3.process Updating live nodes... (4)
   [junit4]   2> 952007 T2016 oascc.ZkStateReader$3.process Updating live nodes... (4)
   [junit4]   2> 952007 T2030 oascc.ZkStateReader$3.process Updating live nodes... (4)
   [junit4]   2> 952007 T2002 oascc.ZkStateReader$3.process Updating live nodes... (4)
   [junit4]   2> 952007 T1989 oascc.ZkStateReader$3.process Updating live nodes... (4)
   [junit4]   2> 952022 T1962 oasc.CorePropertiesLocator.discover Looking for core definitions underneath /usr/home/hudson/hudson-slave/workspace/Lucene-Solr-Tests-4.x-Java7/solr/build/solr-core/test/J1/./org.apache.solr.cloud.CollectionsAPIDistributedZkTest-jetty3-1375515029979
   [junit4]   2> 952028 T1962 oasc.CorePropertiesLocator.discoverUnder Found core conf in /usr/home/hudson/hudson-slave/workspace/Lucene-Solr-Tests-4.x-Java7/solr/build/solr-core/test/J1/./org.apache.solr.cloud.CollectionsAPIDistributedZkTest-jetty3-1375515029979/conf/
   [junit4]   2> 952228 T1962 oasc.CorePropertiesLocator.discover Found 1 core definitions
   [junit4]   2> 952229 T1962 oass.SolrDispatchFilter.init user.dir=/usr/home/hudson/hudson-slave/workspace/Lucene-Solr-Tests-4.x-Java7/solr/build/solr-core/test/J1
   [junit4]   2> 952230 T1962 oass.SolrDispatchFilter.init SolrDispatchFilter.init() done
   [junit4]   2> 952230 T1962 oascsi.HttpClientUtil.createClient Creating new http client, config:maxConnections=128&maxConnectionsPerHost=32&followRedirects=false
   [junit4]   2> 952535 T1962 oejs.Server.doStart jetty-8.1.10.v20130312
   [junit4]   2> 952539 T1962 oejs.AbstractConnector.doStart Started SocketConnector@127.0.0.1:31606
   [junit4]   2> 952540 T1962 oass.SolrDispatchFilter.init SolrDispatchFilter.init()
   [junit4]   2> 952540 T1962 oasc.SolrResourceLoader.locateSolrHome JNDI not configured for solr (NoInitialContextEx)
   [junit4]   2> 952541 T1962 oasc.SolrResourceLoader.locateSolrHome using system property solr.solr.home: /usr/home/hudson/hudson-slave/workspace/Lucene-Solr-Tests-4.x-Java7/solr/build/solr-core/test/J1/./org.apache.solr.cloud.CollectionsAPIDistributedZkTest-jetty4-1375515031781
   [junit4]   2> 952541 T1962 oasc.SolrResourceLoader.<init> new SolrResourceLoader for directory: '/usr/home/hudson/hudson-slave/workspace/Lucene-Solr-Tests-4.x-Java7/solr/build/solr-core/test/J1/./org.apache.solr.cloud.CollectionsAPIDistributedZkTest-jetty4-1375515031781/'
   [junit4]   2> 952582 T1962 oasc.ConfigSolr.fromFile Loading container configuration from /usr/home/hudson/hudson-slave/workspace/Lucene-Solr-Tests-4.x-Java7/solr/build/solr-core/test/J1/./org.apache.solr.cloud.CollectionsAPIDistributedZkTest-jetty4-1375515031781/solr.xml
   [junit4]   2> 952674 T1962 oasc.ConfigSolrXml.<init> Config-defined core root directory: 
   [junit4]   2> 952675 T1962 oasc.CoreContainer.<init> New CoreContainer 1786177672
   [junit4]   2> 952676 T1962 oasc.CoreContainer.load Loading cores into CoreContainer [instanceDir=/usr/home/hudson/hudson-slave/workspace/Lucene-Solr-Tests-4.x-Java7/solr/build/solr-core/test/J1/./org.apache.solr.cloud.CollectionsAPIDistributedZkTest-jetty4-1375515031781/]
   [junit4]   2> 952678 T1962 oashc.HttpShardHandlerFactory.getParameter Setting socketTimeout to: 120000
   [junit4]   2> 952678 T1962 oashc.HttpShardHandlerFactory.getParameter Setting urlScheme to: http://
   [junit4]   2> 952679 T1962 oashc.HttpShardHandlerFactory.getParameter Setting connTimeout to: 15000
   [junit4]   2> 952679 T1962 oashc.HttpShardHandlerFactory.getParameter Setting maxConnectionsPerHost to: 20
   [junit4]   2> 952680 T1962 oashc.HttpShardHandlerFactory.getParameter Setting corePoolSize to: 0
   [junit4]   2> 952680 T1962 oashc.HttpShardHandlerFactory.getParameter Setting maximumPoolSize to: 2147483647
   [junit4]   2> 952681 T1962 oashc.HttpShardHandlerFactory.getParameter Setting maxThreadIdleTime to: 5
   [junit4]   2> 952681 T1962 oashc.HttpShardHandlerFactory.getParameter Setting sizeOfQueue to: -1
   [junit4]   2> 952682 T1962 oashc.HttpShardHandlerFactory.getParameter Setting fairnessPolicy to: false
   [junit4]   2> 952682 T1962 oascsi.HttpClientUtil.createClient Creating new http client, config:maxConnectionsPerHost=20&maxConnections=10000&socketTimeout=120000&connTimeout=15000&retry=false
   [junit4]   2> 952698 T1962 oasc.ZkContainer.initZooKeeper Zookeeper client=127.0.0.1:58091/solr
   [junit4]   2> 952699 T1962 oasc.ZkController.checkChrootPath zkHost includes chroot
   [junit4]   2> 952700 T1962 oascc.ConnectionManager.waitForConnected Waiting for client to connect to ZooKeeper
   [junit4]   2> 952703 T2042 oascc.ConnectionManager.process Watcher org.apache.solr.common.cloud.ConnectionManager@2cb06f73 name:ZooKeeperConnection Watcher:127.0.0.1:58091 got event WatchedEvent state:SyncConnected type:None path:null path:null type:None
   [junit4]   2> 952703 T1962 oascc.ConnectionManager.waitForConnected Client is connected to ZooKeeper
   [junit4]   2> 952705 T1962 oascsi.HttpClientUtil.createClient Creating new http client, config:maxConnections=500&maxConnectionsPerHost=16&socketTimeout=120000&connTimeout=15000
   [junit4]   2> 952713 T1962 oascc.ConnectionManager.waitForConnected Waiting for client to connect to ZooKeeper
   [junit4]   2> 952719 T2044 oascc.ConnectionManager.process Watcher org.apache.solr.common.cloud.ConnectionManager@37409cc3 name:ZooKeeperConnection Watcher:127.0.0.1:58091/solr got event WatchedEvent state:SyncConnected type:None path:null path:null type:None
   [junit4]   2> 952719 T1962 oascc.ConnectionManager.waitForConnected Client is connected to ZooKeeper
   [junit4]   2> 952724 T1962 oascc.ZkStateReader.createClusterStateWatchersAndUpdate Updating cluster state from ZooKeeper... 
   [junit4]   2> 953727 T1962 oasc.ZkController.createEphemeralLiveNode Register node as live in ZooKeeper:/live_nodes/127.0.0.1:31606_tl_%2Fwz
   [junit4]   2> 953730 T1962 oascc.SolrZkClient.makePath makePath: /live_nodes/127.0.0.1:31606_tl_%2Fwz
   [junit4]   2> 953734 T1984 oascc.ZkStateReader$3.process Updating live nodes... (5)
   [junit4]   2> 953734 T2002 oascc.ZkStateReader$3.process Updating live nodes... (5)
   [junit4]   2> 953735 T2030 oascc.ZkStateReader$3.process Updating live nodes... (5)
   [junit4]   2> 953734 T2016 oascc.ZkStateReader$3.process Updating live nodes... (5)
   [junit4]   2> 953734 T2044 oascc.ZkStateReader$3.process Updating live nodes... (5)
   [junit4]   2> 953734 T1989 oascc.ZkStateReader$3.process Updating live nodes... (5)
   [junit4]   2> 953741 T1962 oasc.CorePropertiesLocator.discover Looking for core definitions underneath /usr/home/hudson/hudson-slave/workspace/Lucene-Solr-Tests-4.x-Java7/solr/build/solr-core/test/J1/./org.apache.solr.cloud.CollectionsAPIDistributedZkTest-jetty4-1375515031781
   [junit4]   2> 953961 T1962 oasc.CorePropertiesLocator.discoverUnder Found core conf in /usr/home/hudson/hudson-slave/workspace/Lucene-Solr-Tests-4.x-Java7/solr/build/solr-core/test/J1/./org.apache.solr.cloud.CollectionsAPIDistributedZkTest-jetty4-1375515031781/conf/
   [junit4]   2> 953962 T1962 oasc.CorePropertiesLocator.discover Found 1 core definitions
   [junit4]   2> 953963 T1962 oass.SolrDispatchFilter.init user.dir=/usr/home/hudson/hudson-slave/workspace/Lucene-Solr-Tests-4.x-Java7/solr/build/solr-core/test/J1
   [junit4]   2> 953964 T1962 oass.SolrDispatchFilter.init SolrDispatchFilter.init() done
   [junit4]   2> 953964 T1962 oascsi.HttpClientUtil.createClient Creating new http client, config:maxConnections=128&maxConnectionsPerHost=32&followRedirects=false
   [junit4]   2> 953981 T1962 oascsi.HttpClientUtil.createClient Creating new http client, config:maxConnections=128&maxConnectionsPerHost=32&followRedirects=false
   [junit4]   2> 953996 T1992 oasha.CollectionsHandler.handleCreateAction Creating Collection : numShards=2&name=nodes_used_collection&replicationFactor=2&action=CREATE&wt=javabin&version=2
   [junit4]   2> 953998 T1984 oasc.DistributedQueue$LatchChildWatcher.process Watcher fired on path: /overseer/collection-queue-work state: SyncConnected type NodeChildrenChanged
   [junit4]   2> 954000 T1986 oasc.OverseerCollectionProcessor.run Overseer Collection Processor: Get the message id:/overseer/collection-queue-work/qn-0000000000 message:{
   [junit4]   2> 	  "operation":"createcollection",
   [junit4]   2> 	  "numShards":"2",
   [junit4]   2> 	  "name":"nodes_used_collection",
   [junit4]   2> 	  "replicationFactor":"2"}
   [junit4]   2> 954000 T1986 oasc.OverseerCollectionProcessor.processMessage WARN OverseerCollectionProcessor.processMessage : createcollection , {
   [junit4]   2> 	  "operation":"createcollection",
   [junit4]   2> 	  "numShards":"2",
   [junit4]   2> 	  "name":"nodes_used_collection",
   [junit4]   2> 	  "replicationFactor":"2"}
   [junit4]   2> 954185 T1985 oascc.ZkStateReader.updateClusterState Updating cloud state from ZooKeeper... 
   [junit4]   2> 954185 T1985 oasc.Overseer$ClusterStateUpdater.buildCollection building a new collection: nodes_used_collection
   [junit4]   2> 954186 T1985 oasc.Overseer$ClusterStateUpdater.createCollection Create collection nodes_used_collection with shards [shard1, shard2]
   [junit4]   2> 954214 T1984 oascc.ZkStateReader$2.process A cluster state change: WatchedEvent state:SyncConnected type:NodeDataChanged path:/clusterstate.json, has occurred - updating... (live nodes size: 5)
   [junit4]   2> 954215 T2002 oascc.ZkStateReader$2.process A cluster state change: WatchedEvent state:SyncConnected type:NodeDataChanged path:/clusterstate.json, has occurred - updating... (live nodes size: 5)
   [junit4]   2> 954215 T2030 oascc.ZkStateReader$2.process A cluster state change: WatchedEvent state:SyncConnected type:NodeDataChanged path:/clusterstate.json, has occurred - updating... (live nodes size: 5)
   [junit4]   2> 954215 T2016 oascc.ZkStateReader$2.process A cluster state change: WatchedEvent state:SyncConnected type:NodeDataChanged path:/clusterstate.json, has occurred - updating... (live nodes size: 5)
   [junit4]   2> 954215 T2044 oascc.ZkStateReader$2.process A cluster state change: WatchedEvent state:SyncConnected type:NodeDataChanged path:/clusterstate.json, has occurred - updating... (live nodes size: 5)
   [junit4]   2> 954215 T1989 oascc.ZkStateReader$2.process A cluster state change: WatchedEvent state:SyncConnected type:NodeDataChanged path:/clusterstate.json, has occurred - updating... (live nodes size: 5)
   [junit4]   2> 954318 T1986 oasc.OverseerCollectionProcessor.createCollection going to create cores replicas shardNames [shard1, shard2] , repFactor : 2
   [junit4]   2> 954318 T1986 oasc.OverseerCollectionProcessor.createCollection Creating shard nodes_used_collection_shard1_replica1 as part of slice shard1 of collection nodes_used_collection on 127.0.0.1:34827_tl_%2Fwz
   [junit4]   2> 954318 T1986 oasc.OverseerCollectionProcessor.createCollection Creating shard nodes_used_collection_shard1_replica2 as part of slice shard1 of collection nodes_used_collection on 127.0.0.1:51680_tl_%2Fwz
   [junit4]   2> 954320 T1986 oasc.OverseerCollectionProcessor.createCollection Creating shard nodes_used_collection_shard2_replica1 as part of slice shard2 of collection nodes_used_collection on 127.0.0.1:31606_tl_%2Fwz
   [junit4]   2> 954320 T1986 oasc.OverseerCollectionProcessor.createCollection Creating shard nodes_used_collection_shard2_replica2 as part of slice shard2 of collection nodes_used_collection on 127.0.0.1:31597_tl_%2Fwz
   [junit4]   2> 954324 T1974 oasc.ZkController.publish publishing core=nodes_used_collection_shard1_replica2 state=down
   [junit4]   2> 954325 T2020 oasc.ZkController.publish publishing core=nodes_used_collection_shard2_replica2 state=down
   [junit4]   2> 954324 T1993 oasc.ZkController.publish publishing core=nodes_used_collection_shard1_replica1 state=down
   [junit4]   2> 954324 T2034 oasc.ZkController.publish publishing core=nodes_used_collection_shard2_replica1 state=down
   [junit4]   2> 954327 T1974 oasc.ZkController.waitForCoreNodeName look for our core node name
   [junit4]   2> 954327 T2020 oasc.ZkController.waitForCoreNodeName look for our core node name
   [junit4]   2> 954327 T1993 oasc.ZkController.waitForCoreNodeName look for our core node name
   [junit4]   2> 954338 T2034 oasc.ZkController.waitForCoreNodeName look for our core node name
   [junit4]   2> 955720 T1985 oascc.ZkStateReader.updateClusterState Updating cloud state from ZooKeeper... 
   [junit4]   2> 955721 T1985 oasc.Overseer$ClusterStateUpdater.updateState WARN Could not find collection node for nodes_used_collection, skipping publish state
   [junit4]   2> 955721 T1985 oasc.Overseer$ClusterStateUpdater.updateState Update state numShards=2 message={
   [junit4]   2> 	  "operation":"state",
   [junit4]   2> 	  "core_node_name":"core_node1",
   [junit4]   2> 	  "numShards":"2",
   [junit4]   2> 	  "shard":"shard1",
   [junit4]   2> 	  "roles":null,
   [junit4]   2> 	  "state":"down",
   [junit4]   2> 	  "shard_state":"active",
   [junit4]   2> 	  "core":"nodes_used_collection_shard1_replica2",
   [junit4]   2> 	  "collection":"nodes_used_collection",
   [junit4]   2> 	  "shard_range":null,
   [junit4]   2> 	  "node_name":"127.0.0.1:51680_tl_%2Fwz",
   [junit4]   2> 	  "base_url":"http://127.0.0.1:51680/tl_/wz"}
   [junit4]   2> 955800 T1985 oasc.Overseer$ClusterStateUpdater.updateState WARN Could not find collection node for nodes_used_collection, skipping publish state
   [junit4]   2> 955801 T1985 oasc.Overseer$ClusterStateUpdater.updateState Update state numShards=2 message={
   [junit4]   2> 	  "operation":"state",
   [junit4]   2> 	  "core_node_name":"core_node2",
   [junit4]   2> 	  "numShards":"2",
   [junit4]   2> 	  "shard":"shard2",
   [junit4]   2> 	  "roles":null,
   [junit4]   2> 	  "state":"down",
   [junit4]   2> 	  "shard_state":"active",
   [junit4]   2> 	  "core":"nodes_used_collection_shard2_replica2",
   [junit4]   2> 	  "collection":"nodes_used_collection",
   [junit4]   2> 	  "shard_range":null,
   [junit4]   2> 	  "node_name":"127.0.0.1:31597_tl_%2Fwz",
   [junit4]   2> 	  "base_url":"http://127.0.0.1:31597/tl_/wz"}
   [junit4]   2> 955851 T1985 oasc.Overseer$ClusterStateUpdater.updateState WARN Could not find collection node for nodes_used_collection, skipping publish state
   [junit4]   2> 955851 T1985 oasc.Overseer$ClusterStateUpdater.updateState Update state numShards=2 message={
   [junit4]   2> 	  "operation":"state",
   [junit4]   2> 	  "core_node_name":"core_node3",
   [junit4]   2> 	  "numShards":"2",
   [junit4]   2> 	  "shard":"shard1",
   [junit4]   2> 	  "roles":null,
   [junit4]   2> 	  "state":"down",
   [junit4]   2> 	  "shard_state":"active",
   [junit4]   2> 	  "core":"nodes_used_collection_shard1_replica1",
   [junit4]   2> 	  "collection":"nodes_used_collection",
   [junit4]   2> 	  "shard_range":null,
   [junit4]   2> 	  "node_name":"127.0.0.1:34827_tl_%2Fwz",
   [junit4]   2> 	  "base_url":"http://127.0.0.1:34827/tl_/wz"}
   [junit4]   2> 955861 T1985 oasc.Overseer$ClusterStateUpdater.updateState WARN Could not find collection node for nodes_used_collection, skipping publish state
   [junit4]   2> 955861 T1985 oasc.Overseer$ClusterStateUpdater.updateState Update state numShards=2 message={
   [junit4]   2> 	  "operation":"state",
   [junit4]   2> 	  "core_node_name":"core_node4",
   [junit4]   2> 	  "numShards":"2",
   [junit4]   2> 	  "shard":"shard2",
   [junit4]   2> 	  "roles":null,
   [junit4]   2> 	  "state":"down",
   [junit4]   2> 	  "shard_state":"active",
   [junit4]   2> 	  "core":"nodes_used_collection_shard2_replica1",
   [junit4]   2> 	  "collection":"nodes_used_collection",
   [junit4]   2> 	  "shard_range":null,
   [junit4]   2> 	  "node_name":"127.0.0.1:31606_tl_%2Fwz",
   [junit4]   2> 	  "base_url":"http://127.0.0.1:31606/tl_/wz"}
   [junit4]   2> 955872 T1984 oascc.ZkStateReader$2.process A cluster state change: WatchedEvent state:SyncConnected type:NodeDataChanged path:/clusterstate.json, has occurred - updating... (live nodes size: 5)
   [junit4]   2> 955873 T2016 oascc.ZkStateReader$2.process A cluster state change: WatchedEvent state:SyncConnected type:NodeDataChanged path:/clusterstate.json, has occurred - updating... (live nodes size: 5)
   [junit4]   2> 955873 T2002 oascc.ZkStateReader$2.process A cluster state change: WatchedEvent state:SyncConnected type:NodeDataChanged path:/clusterstate.json, has occurred - updating... (live nodes size: 5)
   [junit4]   2> 955872 T2030 oascc.ZkStateReader$2.process A cluster state change: WatchedEvent state:SyncConnected type:NodeDataChanged path:/clusterstate.json, has occurred - updating... (live nodes size: 5)
   [junit4]   2> 955872 T2044 oascc.ZkStateReader$2.process A cluster state change: WatchedEvent state:SyncConnected type:NodeDataChanged path:/clusterstate.json, has occurred - updating... (live nodes size: 5)
   [junit4]   2> 955872 T1989 oascc.ZkStateReader$2.process A cluster state change: WatchedEvent state:SyncConnected type:NodeDataChanged path:/clusterstate.json, has occurred - updating... (live nodes size: 5)
   [junit4]   2> 956329 T1974 oasc.ZkController.waitForShardId waiting to find shard id in clusterstate for nodes_used_collection_shard1_replica2
   [junit4]   2> 956330 T1993 oasc.ZkController.waitForShardId waiting to find shard id in clusterstate for nodes_used_collection_shard1_replica1
   [junit4]   2> 956330 T2020 oasc.ZkController.waitForShardId waiting to find shard id in clusterstate for nodes_used_collection_shard2_replica2
   [junit4]   2> 956330 T1974 oasc.CorePropertiesLocator.writePropertiesFile ERROR Couldn't persist core properties to /usr/home/hudson/hudson-slave/workspace/Lucene-Solr-Tests-4.x-Java7/solr/build/solr-core/test/J1/./org.apache.solr.cloud.CollectionsAPIDistributedZkTest-controljetty-1375515025628/nodes_used_collection_shard1_replica2/core.properties: java.io.FileNotFoundException: /usr/home/hudson/hudson-slave/workspace/Lucene-Solr-Tests-4.x-Java7/solr/build/solr-core/test/J1/./org.apache.solr.cloud.CollectionsAPIDistributedZkTest-controljetty-1375515025628/nodes_used_collection_shard1_replica2/core.properties (No such file or directory)
   [junit4]   2> 956332 T1993 oasc.CorePropertiesLocator.writePropertiesFile ERROR Couldn't persist core properties to /usr/home/hudson/hudson-slave/workspace/Lucene-Solr-Tests-4.x-Java7/solr/build/solr-core/test/J1/./org.apache.solr.cloud.CollectionsAPIDistributedZkTest-jetty1-1375515026419/nodes_used_collection_shard1_replica1/core.properties: java.io.FileNotFoundException: /usr/home/hudson/hudson-slave/workspace/Lucene-Solr-Tests-4.x-Java7/solr/build/solr-core/test/J1/./org.apache.solr.cloud.CollectionsAPIDistributedZkTest-jetty1-1375515026419/nodes_used_collection_shard1_replica1/core.properties (No such file or directory)
   [junit4]   2> 956333 T2020 oasc.CorePropertiesLocator.writePropertiesFile ERROR Couldn't persist core properties to /usr/home/hudson/hudson-slave/workspace/Lucene-Solr-Tests-4.x-Java7/solr/build/solr-core/test/J1/./org.apache.solr.cloud.CollectionsAPIDistributedZkTest-jetty3-1375515029979/nodes_used_collection_shard2_replica2/core.properties: java.io.FileNotFoundException: /usr/home/hudson/hudson-slave/workspace/Lucene-Solr-Tests-4.x-Java7/solr/build/solr-core/test/J1/./org.apache.solr.cloud.CollectionsAPIDistributedZkTest-jetty3-1375515029979/nodes_used_collection_shard2_replica2/core.properties (No such file or directory)
   [junit4]   2> 956333 T1993 oasc.CoreContainer.create Creating SolrCore 'nodes_used_collection_shard1_replica1' using instanceDir: /usr/home/hudson/hudson-slave/workspace/Lucene-Solr-Tests-4.x-Java7/solr/build/solr-core/test/J1/./org.apache.solr.cloud.CollectionsAPIDistributedZkTest-jetty1-1375515026419/nodes_used_collection_shard1_replica1
   [junit4]   2> 956332 T1974 oasc.CoreContainer.create Creating SolrCore 'nodes_used_collection_shard1_replica2' using instanceDir: /usr/home/hudson/hudson-slave/workspace/Lucene-Solr-Tests-4.x-Java7/solr/build/solr-core/test/J1/./org.apache.solr.cloud.CollectionsAPIDistributedZkTest-controljetty-1375515025628/nodes_used_collection_shard1_replica2
   [junit4]   2> 956334 T1974 oasc.ZkController.createCollectionZkNode Check for collection zkNode:nodes_used_collection
   [junit4]   2> 956334 T1993 oasc.ZkController.createCollectionZkNode Check for collection zkNode:nodes_used_collection
   [junit4]   2> 956333 T2020 oasc.CoreContainer.create Creating SolrCore 'nodes_used_collection_shard2_replica2' using instanceDir: /usr/home/hudson/hudson-slave/workspace/Lucene-Solr-Tests-4.x-Java7/solr/build/solr-core/test/J1/./org.apache.solr.cloud.CollectionsAPIDistributedZkTest-jetty3-1375515029979/nodes_used_collection_shard2_replica2
   [junit4]   2> 956335 T1974 oasc.ZkController.createCollectionZkNode Creating collection in ZooKeeper:nodes_used_collection
   [junit4]   2> 956335 T1993 oasc.ZkController.createCollectionZkNode Creating collection in ZooKeeper:nodes_used_collection
   [junit4]   2> 956335 T2020 oasc.ZkController.createCollectionZkNode Check for collection zkNode:nodes_used_collection
   [junit4]   2> 956336 T1993 oasc.ZkController.getConfName Looking for collection configName
   [junit4]   2> 956335 T1974 oasc.ZkController.getConfName Looking for collection configName
   [junit4]   2> 956337 T2020 oasc.ZkController.createCollectionZkNode Creating collection in ZooKeeper:nodes_used_collection
   [junit4]   2> 956337 T2020 oasc.ZkController.getConfName Looking for collection configName
   [junit4]   2> 956337 T1993 oasc.ZkController.getConfName Only one config set found in zk - using it:conf1
   [junit4]   2> 956338 T1974 oasc.ZkController.getConfName Only one config set found in zk - using it:conf1
   [junit4]   2> 956338 T1993 oascc.SolrZkClient.makePath makePath: /collections/nodes_used_collection
   [junit4]   2> 956338 T2020 oasc.ZkController.getConfName Only one config set found in zk - using it:conf1
   [junit4]   2> 956338 T1974 oascc.SolrZkClient.makePath makePath: /collections/nodes_used_collection
   [junit4]   2> 956339 T2020 oascc.SolrZkClient.makePath makePath: /collections/nodes_used_collection
   [junit4]   2> 956341 T2034 oasc.ZkController.waitForShardId waiting to find shard id in clusterstate for nodes_used_collection_shard2_replica1
   [junit4]   2> 956342 T2034 oasc.CorePropertiesLocator.writePropertiesFile ERROR Couldn't persist core properties to /usr/home/hudson/hudson-slave/workspace/Lucene-Solr-Tests-4.x-Java7/solr/build/solr-core/test/J1/./org.apache.solr.cloud.CollectionsAPIDistributedZkTest-jetty4-1375515031781/nodes_used_collection_shard2_replica1/core.properties: java.io.FileNotFoundException: /usr/home/hudson/hudson-slave/workspace/Lucene-Solr-Tests-4.x-Java7/solr/build/solr-core/test/J1/./org.apache.solr.cloud.CollectionsAPIDistributedZkTest-jetty4-1375515031781/nodes_used_collection_shard2_replica1/core.properties (No such file or directory)
   [junit4]   2> 956342 T2034 oasc.CoreContainer.create Creating SolrCore 'nodes_used_collection_shard2_replica1' using instanceDir: /usr/home/hudson/hudson-slave/workspace/Lucene-Solr-Tests-4.x-Java7/solr/build/solr-core/test/J1/./org.apache.solr.cloud.CollectionsAPIDistributedZkTest-jetty4-1375515031781/nodes_used_collection_shard2_replica1
   [junit4]   2> 956343 T2034 oasc.ZkController.createCollectionZkNode Check for collection zkNode:nodes_used_collection
   [junit4]   2> 956343 T1993 oasc.ZkController.readConfigName Load collection config from:/collections/nodes_used_collection
   [junit4]   2> 956343 T1974 oasc.ZkController.readConfigName Load collection config from:/collections/nodes_used_collection
   [junit4]   2> 956358 T2020 oasc.ZkController.readConfigName Load collection config from:/collections/nodes_used_collection
   [junit4]   2> 956358 T2034 oasc.ZkController.createCollectionZkNode Collection zkNode exists
   [junit4]   2> 956359 T1993 oasc.SolrResourceLoader.<init> new SolrResourceLoader for directory: '/usr/home/hudson/hudson-slave/workspace/Lucene-Solr-Tests-4.x-Java7/solr/build/solr-core/test/J1/./org.apache.solr.cloud.CollectionsAPIDistributedZkTest-jetty1-1375515026419/nodes_used_collection_shard1_replica1/'
   [junit4]   2> 956359 T1974 oasc.SolrResourceLoader.<init> new SolrResourceLoader for directory: '/usr/home/hudson/hudson-slave/workspace/Lucene-Solr-Tests-4.x-Java7/solr/build/solr-core/test/J1/./org.apache.solr.cloud.CollectionsAPIDistributedZkTest-controljetty-1375515025628/nodes_used_collection_shard1_replica2/'
   [junit4]   2> 956359 T2034 oasc.ZkController.readConfigName Load collection config from:/collections/nodes_used_collection
   [junit4]   2> 956359 T2020 oasc.SolrResourceLoader.<init> new SolrResourceLoader for directory: '/usr/home/hudson/hudson-slave/workspace/Lucene-Solr-Tests-4.x-Java7/solr/build/solr-core/test/J1/./org.apache.solr.cloud.CollectionsAPIDistributedZkTest-jetty3-1375515029979/nodes_used_collection_shard2_replica2/'
   [junit4]   2> 956361 T2034 oasc.SolrResourceLoader.<init> new SolrResourceLoader for directory: '/usr/home/hudson/hudson-slave/workspace/Lucene-Solr-Tests-4.x-Java7/solr/build/solr-core/test/J1/./org.apache.solr.cloud.CollectionsAPIDistributedZkTest-jetty4-1375515031781/nodes_used_collection_shard2_replica1/'
   [junit4]   2> 956518 T2020 oasc.SolrConfig.<init> Using Lucene MatchVersion: LUCENE_45
   [junit4]   2> 956519 T1993 oasc.SolrConfig.<init> Using Lucene MatchVersion: LUCENE_45
   [junit4]   2> 956521 T1974 oasc.SolrConfig.<init> Using Lucene MatchVersion: LUCENE_45
   [junit4]   2> 956521 T2034 oasc.SolrConfig.<init> Using Lucene MatchVersion: LUCENE_45
   [junit4]   2> 956608 T1993 oasc.SolrConfig.<init> Loaded SolrConfig: solrconfig.xml
   [junit4]   2> 956610 T1974 oasc.SolrConfig.<init> Loaded SolrConfig: solrconfig.xml
   [junit4]   2> 956610 T2020 oasc.SolrConfig.<init> Loaded SolrConfig: solrconfig.xml
   [junit4]   2> 956611 T2034 oasc.SolrConfig.<init> Loaded SolrConfig: solrconfig.xml
   [junit4]   2> 956710 T1993 oass.IndexSchema.readSchema Reading Solr Schema from schema.xml
   [junit4]   2> 956711 T1974 oass.IndexSchema.readSchema Reading Solr Schema from schema.xml
   [junit4]   2> 956712 T2020 oass.IndexSchema.readSchema Reading Solr Schema from schema.xml
   [junit4]   2> 956712 T2034 oass.IndexSchema.readSchema Reading Solr Schema from schema.xml
   [junit4]   2> 956724 T1974 oass.IndexSchema.readSchema [nodes_used_collection_shard1_replica2] Schema name=test
   [junit4]   2> 956724 T1993 oass.IndexSchema.readSchema [nodes_used_collection_shard1_replica1] Schema name=test
   [junit4]   2> 956726 T2034 oass.IndexSchema.readSchema [nodes_used_collection_shard2_replica1] Schema name=test
   [junit4]   2> 956726 T2020 oass.IndexSchema.readSchema [nodes_used_collection_shard2_replica2] Schema name=test
   [junit4]   2> 957589 T2034 oass.ByteField.init WARN ByteField is deprecated and will be removed in 5.0. You should use TrieIntField instead.
   [junit4]   2> 957590 T2020 oass.ByteField.init WARN ByteField is deprecated and will be removed in 5.0. You should use TrieIntField instead.
   [junit4]   2> 957590 T2034 oass.ShortField.init WARN ShortField is deprecated and will be removed in 5.0. You should use TrieIntField instead.
   [junit4]   2> 957590 T2020 oass.ShortField.init WARN ShortField is deprecated and will be removed in 5.0. You should use TrieIntField instead.
   [junit4]   2> 957591 T1993 oass.ByteField.init WARN ByteField is deprecated and will be removed in 5.0. You should use TrieIntField instead.
   [junit4]   2> 957592 T2020 oass.OpenExchangeRatesOrgProvider.init Initialized with rates=open-exchange-rates.json, refreshInterval=1440.
   [junit4]   2> 957592 T1993 oass.ShortField.init WARN ShortField is deprecated and will be removed in 5.0. You should use TrieIntField instead.
   [junit4]   2> 957591 T2034 oass.OpenExchangeRatesOrgProvider.init Initialized with rates=open-exchange-rates.json, refreshInterval=1440.
   [junit4]   2> 957591 T1974 oass.ByteField.init WARN ByteField is deprecated and will be removed in 5.0. You should use TrieIntField instead.
   [junit4]   2> 957593 T1993 oass.OpenExchangeRatesOrgProvider.init Initialized with rates=open-exchange-rates.json, refreshInterval=1440.
   [junit4]   2> 957594 T1974 oass.ShortField.init WARN ShortField is deprecated and will be removed in 5.0. You should use TrieIntField instead.
   [junit4]   2> 957595 T1974 oass.OpenExchangeRatesOrgProvider.init Initialized with rates=open-exchange-rates.json, refreshInterval=1440.
   [junit4]   2> 957605 T2020 oass.IndexSchema.readSchema default search field in schema is text
   [junit4]   2> 957606 T1974 oass.IndexSchema.readSchema default search field in schema is text
   [junit4]   2> 957606 T1993 oass.IndexSchema.readSchema default search field in schema is text
   [junit4]   2> 957607 T2034 oass.IndexSchema.readSchema default search field in schema is text
   [junit4]   2> 957610 T2020 oass.IndexSchema.readSchema unique key field: id
   [junit4]   2> 957610 T1974 oass.IndexSchema.readSchema unique key field: id
   [junit4]   2> 957611 T1993 oass.IndexSchema.readSchema unique key field: id
   [junit4]   2> 957612 T2034 oass.IndexSchema.readSchema unique key field: id
   [junit4]   2> 957630 T2020 oass.FileExchangeRateProvider.reload Reloading exchange rates from file currency.xml
   [junit4]   2> 957630 T1993 oass.FileExchangeRateProvider.reload Reloading exchange rates from file currency.xml
   [junit4]   2> 957630 T1974 oass.FileExchangeRateProvider.reload Reloading exchange rates from file currency.xml
   [junit4]   2> 957630 T2034 oass.FileExchangeRateProvider.reload Reloading exchange rates from file currency.xml
   [junit4]   2> 957636 T2020 oass.FileExchangeRateProvider.reload Reloading exchange rates from file currency.xml
   [junit4]   2> 957637 T1993 oass.FileExchangeRateProvider.reload Reloading exchange rates from file currency.xml
   [junit4]   2> 957637 T2034 oass.FileExchangeRateProvider.reload Reloading exchange rates from file currency.xml
   [junit4]   2> 957637 T1974 oass.FileExchangeRateProvider.reload Reloading exchange rates from file currency.xml
   [junit4]   2> 957642 T2020 oass.OpenExchangeRatesOrgProvider.reload Reloading exchange rates from open-exchange-rates.json
   [junit4]   2> 957643 T1993 oass.OpenExchangeRatesOrgProvider.reload Reloading exchange rates from open-exchange-rates.json
   [junit4]   2> 957644 T1974 oass.OpenExchangeRatesOrgProvider.reload Reloading exchange rates from open-exchange-rates.json
   [junit4]   2> 957644 T2020 oass.OpenExchangeRatesOrgProvider$OpenExchangeRates.<init> WARN Unknown key IMPORTANT NOTE
   [junit4]   2> 957643 T2034 oass.OpenExchangeRatesOrgProvider.reload Reloading exchange rates from open-exchange-rates.json
   [junit4]   2> 957645 T1993 oass.OpenExchangeRatesOrgProvider$OpenExchangeRates.<init> WARN Unknown key IMPORTANT NOTE
   [junit4]   2> 957645 T1993 oass.OpenExchangeRatesOrgProvider$OpenExchangeRates.<init> WARN Expected key, got STRING
   [junit4]   2> 957644 T2020 oass.OpenExchangeRatesOrgProvider$OpenExchangeRates.<init> WARN Expected key, got STRING
   [junit4]   2> 957646 T2034 oass.OpenExchangeRatesOrgProvider$OpenExchangeRates.<init> WARN Unknown key IMPORTANT NOTE
   [junit4]   2> 957646 T1993 oass.OpenExchangeRatesOrgProvider.reload Reloading exchange rates from open-exchange-rates.json
   [junit4]   2> 957645 T1974 oass.OpenExchangeRatesOrgProvider$OpenExchangeRates.<init> WARN Unknown key IMPORTANT NOTE
   [junit4]   2> 957647 T1974 oass.OpenExchangeRatesOrgProvider$OpenExchangeRates.<init> WARN Expected key, got STRING
   [junit4]   2> 957647 T2034 oass.OpenExchangeRatesOrgProvider$OpenExchangeRates.<init> WARN Expected key, got STRING
   [junit4]   2> 957646 T2020 oass.OpenExchangeRatesOrgProvider.reload Reloading exchange rates from open-exchange-rates.json
   [junit4]   2> 957648 T2034 oass.OpenExchangeRatesOrgProvider.reload Reloading exchange rates from open-exchange-rates.json
   [junit4]   2> 957648 T1993 oass.OpenExchangeRatesOrgProvider$OpenExchangeRates.<init> WARN Unknown key IMPORTANT NOTE
   [junit4]   2> 957648 T1974 oass.OpenExchangeRatesOrgProvider.reload Reloading exchange rates from open-exchange-rates.json
   [junit4]   2> 957650 T2020 oass.OpenExchangeRatesOrgProvider$OpenExchangeRates.<init> WARN Unknown key IMPORTANT NOTE
   [junit4]   2> 957650 T1993 oass.OpenExchangeRatesOrgProvider$OpenExchangeRates.<init> WARN Expected key, got STRING
   [junit4]   2> 957650 T2020 oass.OpenExchangeRatesOrgProvider$OpenExchangeRates.<init> WARN Expected key, got STRING
   [junit4]   2> 957650 T2034 oass.OpenExchangeRatesOrgProvider$OpenExchangeRates.<init> WARN Unknown key IMPORTANT NOTE
   [junit4]   2> 957651 T2020 oasc.SolrCore.initDirectoryFactory org.apache.solr.core.MockDirectoryFactory
   [junit4]   2> 957651 T1993 oasc.SolrCore.initDirectoryFactory org.apache.solr.core.MockDirectoryFactory
   [junit4]   2> 957651 T1974 oass.OpenExchangeRatesOrgProvider$OpenExchangeRates.<init> WARN Unknown key IMPORTANT NOTE
   [junit4]   2> 957653 T1974 oass.OpenExchangeRatesOrgProvider$OpenExchangeRates.<init> WARN Expected key, got STRING
   [junit4]   2> 957653 T1993 oasc.SolrCore.<init> [nodes_used_collection_shard1_replica1] Opening new SolrCore at /usr/home/hudson/hudson-slave/workspace/Lucene-Solr-Tests-4.x-Java7/solr/build/solr-core/test/J1/./org.apache.solr.cloud.CollectionsAPIDistributedZkTest-jetty1-1375515026419/nodes_used_collection_shard1_replica1/, dataDir=/usr/home/hudson/hudson-slave/workspace/Lucene-Solr-Tests-4.x-Java7/solr/build/solr-core/test/J1/./org.apache.solr.cloud.CollectionsAPIDistributedZkTest-jetty1-1375515026419//nodes_used_collection_shard1_replica1/data/
   [junit4]   2> 957652 T2020 oasc.SolrCore.<init> [nodes_used_collection_shard2_replica2] Opening new SolrCore at /usr/home/hudson/hudson-slave/workspace/Lucene-Solr-Tests-4.x-Java7/solr/build/solr-core/test/J1/./org.apache.solr.cloud.CollectionsAPIDistributedZkTest-jetty3-1375515029979/nodes_used_collection_shard2_replica2/, dataDir=/usr/home/hudson/hudson-slave/workspace/Lucene-Solr-Tests-4.x-Java7/solr/build/solr-core/test/J1/./org.apache.solr.cloud.CollectionsAPIDistributedZkTest-jetty3-1375515029979//nodes_used_collection_shard2_replica2/data/
   [junit4]   2> 957652 T2034 oass.OpenExchangeRatesOrgProvider$OpenExchangeRates.<init> WARN Expected key, got STRING
   [junit4]   2> 957654 T2020 oasc.JmxMonitoredMap.<init> JMX monitoring is enabled. Adding Solr mbeans to JMX Server: com.sun.jmx.mbeanserver.JmxMBeanServer@5b89b979
   [junit4]   2> 957654 T1993 oasc.JmxMonitoredMap.<init> JMX monitoring is enabled. Adding Solr mbeans to JMX Server: com.sun.jmx.mbeanserver.JmxMBeanServer@5b89b979
   [junit4]   2> 957653 T1974 oasc.SolrCore.initDirectoryFactory org.apache.solr.core.MockDirectoryFactory
   [junit4]   2> 957655 T2034 oasc.SolrCore.initDirectoryFactory org.apache.solr.core.MockDirectoryFactory
   [junit4]   2> 957656 T1974 oasc.SolrCore.<init> [nodes_used_collection_shard1_replica2] Opening new SolrCore at /usr/home/hudson/hudson-slave/workspace/Lucene-Solr-Tests-4.x-Java7/solr/build/solr-core/test/J1/./org.apache.solr.cloud.CollectionsAPIDistributedZkTest-controljetty-1375515025628/nodes_used_collection_shard1_replica2/, dataDir=/usr/home/hudson/hudson-slave/workspace/Lucene-Solr-Tests-4.x-Java7/solr/build/solr-core/test/J1/./org.apache.solr.cloud.CollectionsAPIDistributedZkTest-controljetty-1375515025628//nodes_used_collection_shard1_replica2/data/
   [junit4]   2> 957657 T1993 oasc.CachingDirectoryFactory.get return new directory for /usr/home/hudson/hudson-slave/workspace/Lucene-Solr-Tests-4.x-Java7/solr/build/solr-core/test/J1/./org.apache.solr.cloud.CollectionsAPIDistributedZkTest-jetty1-1375515026419//nodes_used_collection_shard1_replica1/data
   [junit4]   2> 957656 T2020 oasc.CachingDirectoryFactory.get return new directory for /usr/home/hudson/hudson-slave/workspace/Lucene-Solr-Tests-4.x-Java7/solr/build/solr-core/test/J1/./org.apache.solr.cloud.CollectionsAPIDistributedZkTest-jetty3-1375515029979//nodes_used_collection_shard2_replica2/data
   [junit4]   2> 957656 T2034 oasc.SolrCore.<init> [nodes_used_collection_shard2_replica1] Opening new SolrCore at /usr/home/hudson/hudson-slave/workspace/Lucene-Solr-Tests-4.x-Java7/solr/build/solr-core/test/J1/./org.apache.solr.cloud.CollectionsAPIDistributedZkTest-jetty4-1375515031781/nodes_used_collection_shard2_replica1/, dataDir=/usr/home/hudson/hudson-slave/workspace/Lucene-Solr-Tests-4.x-Java7/solr/build/solr-core/test/J1/./org.apache.solr.cloud.CollectionsAPIDistributedZkTest-jetty4-1375515031781//nodes_used_collection_shard2_replica1/data/
   [junit4]   2> 957657 T2020 oasc.SolrCore.getNewIndexDir New index directory detected: old=null new=/usr/home/hudson/hudson-slave/workspace/Lucene-Solr-Tests-4.x-Java7/solr/build/solr-core/test/J1/./org.apache.solr.cloud.CollectionsAPIDistributedZkTest-jetty3-1375515029979//nodes_used_collection_shard2_replica2/data/index/
   [junit4]   2> 957657 T1993 oasc.SolrCore.getNewIndexDir New index directory detected: old=null new=/usr/home/hudson/hudson-slave/workspace/Lucene-Solr-Tests-4.x-Java7/solr/build/solr-core/test/J1/./org.apache.solr.cloud.CollectionsAPIDistributedZkTest-jetty1-1375515026419//nodes_used_collection_shard1_replica1/data/index/
   [junit4]   2> 957657 T1974 oasc.JmxMonitoredMap.<init> JMX monitoring is enabled. Adding Solr mbeans to JMX Server: com.sun.jmx.mbeanserver.JmxMBeanServer@5b89b979
   [junit4]   2> 957659 T1993 oasc.SolrCore.initIndex WARN [nodes_used_collection_shard1_replica1] Solr index directory '/usr/home/hudson/hudson-slave/workspace/Lucene-Solr-Tests-4.x-Java7/solr/build/solr-core/test/J1/./org.apache.solr.cloud.CollectionsAPIDistributedZkTest-jetty1-1375515026419/nodes_used_collection_shard1_replica1/data/index' doesn't exist. Creating new index...
   [junit4]   2> 957658 T2020 oasc.SolrCore.initIndex WARN [nodes_used_collection_shard2_replica2] Solr index directory '/usr/home/hudson/hudson-slave/workspace/Lucene-Solr-Tests-4.x-Java7/solr/build/solr-core/test/J1/./org.apache.solr.cloud.CollectionsAPIDistributedZkTest-jetty3-1375515029979/nodes_used_collection_shard2_replica2/data/index' doesn't exist. Creating new index...
   [junit4]   2> 957658 T2034 oasc.JmxMonitoredMap.<init> JMX monitoring is enabled. Adding Solr mbeans to JMX Server: com.sun.jmx.mbeanserver.JmxMBeanServer@5b89b979
   [junit4]   2> 957660 T1993 oasc.CachingDirectoryFactory.get return new directory for /usr/home/hudson/hudson-slave/workspace/Lucene-Solr-Tests-4.x-Java7/solr/build/solr-core/test/J1/./org.apache.solr.cloud.CollectionsAPIDistributedZkTest-jetty1-1375515026419//nodes_used_collection_shard1_replica1/data/index
   [junit4]   2> 957660 T1974 oasc.CachingDirectoryFactory.get return new directory for /usr/home/hudson/hudson-slave/workspace/Lucene-Solr-Tests-4.x-Java7/solr/build/solr-core/test/J1/./org.apache.solr.cloud.CollectionsAPIDistributedZkTest-controljetty-1375515025628//nodes_used_collection_shard1_replica2/data
   [junit4]   2> 957660 T2020 oasc.CachingDirectoryFactory.get return new directory for /usr/home/hudson/hudson-slave/workspace/Lucene-Solr-Tests-4.x-Java7/solr/build/solr-core/test/J1/./org.apache.solr.cloud.CollectionsAPIDistributedZkTest-jetty3-1375515029979//nodes_used_collection_shard2_replica2/data/index
   [junit4]   2> 957661 T2034 oasc.CachingDirectoryFactory.get return new directory for /usr/home/hudson/hudson-slave/workspace/Lucene-Solr-Tests-4.x-Java7/solr/build/solr-core/test/J1/./org.apache.solr.cloud.CollectionsAPIDistributedZkTest-jetty4-1375515031781//nodes_used_collection_shard2_replica1/data
   [junit4]   2> 957661 T1974 oasc.SolrCore.getNewIndexDir New index directory detected: old=null new=/usr/home/hudson/hudson-slave/workspace/Lucene-Solr-Tests-4.x-Java7/solr/build/solr-core/test/J1/./org.apache.solr.cloud.CollectionsAPIDistributedZkTest-controljetty-1375515025628//nodes_used_collection_shard1_replica2/data/index/
   [junit4]   2> 957662 T2034 oasc.SolrCore.getNewIndexDir New index directory detected: old=null new=/usr/home/hudson/hudson-slave/workspace/Lucene-Solr-Tests-4.x-Java7/solr/build/solr-core/test/J1/./org.apache.solr.cloud.CollectionsAPIDistributedZkTest-jetty4-1375515031781//nodes_used_collection_shard2_replica1/data/index/
   [junit4]   2> 957663 T1974 oasc.SolrCore.initIndex WARN [nodes_used_collection_shard1_replica2] Solr index directory '/usr/home/hudson/hudson-slave/workspace/Lucene-Solr-Tests-4.x-Java7/solr/build/solr-core/test/J1/./org.apache.solr.cloud.CollectionsAPIDistributedZkTest-controljetty-1375515025628/nodes_used_collection_shard1_replica2/data/index' doesn't exist. Creating new index...
   [junit4]   2> 957663 T2034 oasc.SolrCore.initIndex WARN [nodes_used_collection_shard2_replica1] Solr index directory '/usr/home/hudson/hudson-slave/workspace/Lucene-Solr-Tests-4.x-Java7/solr/build/solr-core/test/J1/./org.apache.solr.cloud.CollectionsAPIDistributedZkTest-jetty4-1375515031781/nodes_used_collection_shard2_replica1/data/index' doesn't exist. Creating new index...
   [junit4]   2> 957664 T1974 oasc.CachingDirectoryFactory.get return new directory for /usr/home/hudson/hudson-slave/workspace/Lucene-Solr-Tests-4.x-Java7/solr/build/solr-core/test/J1/./org.apache.solr.cloud.CollectionsAPIDistributedZkTest-controljetty-1375515025628//nodes_used_collection_shard1_replica2/data/index
   [junit4]   2> 957664 T2034 oasc.CachingDirectoryFactory.get return new directory for /usr/home/hudson/hudson-slave/workspace/Lucene-Solr-Tests-4.x-Java7/solr/build/solr-core/test/J1/./org.apache.solr.cloud.CollectionsAPIDistributedZkTest-jetty4-1375515031781//nodes_used_collection_shard2_replica1/data/index
   [junit4]   2> 957667 T1993 oasc.SolrDeletionPolicy.onCommit SolrDeletionPolicy.onCommit: commits: num=1
   [junit4]   2> 		commit{dir=MockDirWrapper(org.apache.lucene.store.RAMDirectory@14196455 lockFactory=org.apache.lucene.store.NativeFSLockFactory@7dab65e5),segFN=segments_1,generation=1}
   [junit4]   2> 957667 T1993 oasc.SolrDeletionPolicy.updateCommits newest commit generation = 1
   [junit4]   2> 957668 T2020 oasc.SolrDeletionPolicy.onCommit SolrDeletionPolicy.onCommit: commits: num=1
   [junit4]   2> 		commit{dir=MockDirWrapper(org.apache.lucene.store.RAMDirectory@31668fbe lockFactory=org.apache.lucene.store.NativeFSLockFactory@6ea94f33),segFN=segments_1,generation=1}
   [junit4]   2> 957669 T2020 oasc.SolrDeletionPolicy.updateCommits newest commit generation = 1
   [junit4]   2> 957670 T1974 oasc.SolrDeletionPolicy.onCommit SolrDeletionPolicy.onCommit: commits: num=1
   [junit4]   2> 		commit{dir=MockDirWrapper(org.apache.lucene.store.RAMDirectory@bfcdada lockFactory=org.apache.lucene.store.NativeFSLockFactory@4744d29e),segFN=segments_1,generation=1}
   [junit4]   2> 957671 T1974 oasc.SolrDeletionPolicy.updateCommits newest commit generation = 1
   [junit4]   2> 957672 T2034 oasc.SolrDeletionPolicy.onCommit SolrDeletionPolicy.onCommit: commits: num=1
   [junit4]   2> 		commit{dir=MockDirWrapper(org.apache.lucene.store.RAMDirectory@28f5f4f3 lockFactory=org.apache.lucene.store.NativeFSLockFactory@51b824a5),segFN=segments_1,generation=1}
   [junit4]   2> 957672 T2034 oasc.SolrDeletionPolicy.updateCommits newest commit generation = 1
   [junit4]   2> 957674 T1993 oasup.UpdateRequestProcessorChain.init inserting DistributedUpdateProcessorFactory into updateRequestProcessorChain "dedupe"
   [junit4]   2> 957674 T1993 oasup.UpdateRequestProcessorChain.init inserting DistributedUpdateProcessorFactory into updateRequestProcessorChain "stored_sig"
   [junit4]   2> 957675 T1993 oasup.UpdateRequestProcessorChain.init inserting DistributedUpdateProcessorFactory into updateRequestProcessorChain "distrib-dup-test-chain-implicit"
   [junit4]   2> 957676 T1993 oasc.RequestHandlers.initHandlersFromConfig created standard: solr.StandardRequestHandler
   [junit4]   2> 957676 T2020 oasup.UpdateRequestProcessorChain.init inserting DistributedUpdateProcessorFactory into updateRequestProcessorChain "dedupe"
   [junit4]   2> 957677 T1993 oasc.RequestHandlers.initHandlersFromConfig created /get: solr.RealTimeGetHandler
   [junit4]   2> 957677 T1993 oasc.RequestHandlers.initHandlersFromConfig adding lazy requestHandler: solr.ReplicationHandler
   [junit4]   2> 957677 T2020 oasup.UpdateRequestProcessorChain.init inserting DistributedUpdateProcessorFactory into updateRequestProcessorChain "stored_sig"
   [junit4]   2> 957677 T1974 oasup.UpdateRequestProcessorChain.init inserting DistributedUpdateProcessorFactory into updateRequestProcessorChain "dedupe"
   [junit4]   2> 957678 T1993 oasc.RequestHandlers.initHandlersFromConfig created /replication: solr.ReplicationHandler
   [junit4]   2> 957679 T2020 oasup.UpdateRequestProcessorChain.init inserting DistributedUpdateProcessorFactory into updateRequestProcessorChain "distrib-dup-test-chain-implicit"
   [junit4]   2> 957679 T1993 oasc.RequestHandlers.initHandlersFromConfig created /update: solr.UpdateRequestHandler
   [junit4]   2> 957679 T2034 oasup.UpdateRequestProcessorChain.init inserting DistributedUpdateProcessorFactory into updateRequestProcessorChain "dedupe"
   [junit4]   2> 957679 T1974 oasup.UpdateRequestProcessorChain.init inserting DistributedUpdateProcessorFactory into updateRequestProcessorChain "stored_sig"
   [junit4]   2> 957680 T2034 oasup.UpdateRequestProcessorChain.init inserting DistributedUpdateProcessorFactory into updateRequestProcessorChain "stored_sig"
   [junit4]   2> 957680 T1993 oasc.RequestHandlers.initHandlersFromConfig created /admin/: org.apache.solr.handler.admin.AdminHandlers
   [junit4]   2> 957680 T2020 oasc.RequestHandlers.initHandlersFromConfig created standard: solr.StandardRequestHandler
   [junit4]   2> 957682 T2034 oasup.UpdateRequestProcessorChain.init inserting DistributedUpdateProcessorFactory into updateRequestProcessorChain "distrib-dup-test-chain-implicit"
   [junit4]   2> 957681 T1974 oasup.UpdateRequestProcessorChain.init inserting DistributedUpdateProcessorFactory into updateRequestProcessorChain "distrib-dup-test-chain-implicit"
   [junit4]   2> 957682 T2020 oasc.RequestHandlers.initHandlersFromConfig created /get: solr.RealTimeGetHandler
   [junit4]   2> 957683 T2020 oasc.RequestHandlers.initHandlersFromConfig adding lazy requestHandler: solr.ReplicationHandler
   [junit4]   2> 957683 T2034 oasc.RequestHandlers.initHandlersFromConfig created standard: solr.StandardRequestHandler
   [junit4]   2> 957684 T2020 oasc.RequestHandlers.initHandlersFromConfig created /replication: solr.ReplicationHandler
   [junit4]   2> 957683 T1974 oasc.RequestHandlers.initHandlersFromConfig created standard: solr.StandardRequestHandler
   [junit4]   2> 957684 T2034 oasc.RequestHandlers.initHandlersFromConfig created /get: solr.RealTimeGetHandler
   [junit4]   2> 957685 T2034 oasc.RequestHandlers.initHandlersFromConfig adding lazy requestHandler: solr.ReplicationHandler
   [junit4]   2> 957685 T2020 oasc.RequestHandlers.initHandlersFromConfig created /update: solr.UpdateRequestHandler
   [junit4]   2> 957686 T2034 oasc.RequestHandlers.initHandlersFromConfig created /replication: solr.ReplicationHandler
   [junit4]   2> 957685 T1974 oasc.RequestHandlers.initHandlersFromConfig created /get: solr.RealTimeGetHandler
   [junit4]   2> 957687 T1974 oasc.RequestHandlers.initHandlersFromConfig adding lazy requestHandler: solr.ReplicationHandler
   [junit4]   2> 957686 T2020 oasc.RequestHandlers.initHandlersFromConfig created /admin/: org.apache.solr.handler.admin.AdminHandlers
   [junit4]   2> 957687 T1974 oasc.RequestHandlers.initHandlersFromConfig created /replication: solr.ReplicationHandler
   [junit4]   2> 957687 T2034 oasc.RequestHandlers.initHandlersFromConfig created /update: solr.UpdateRequestHandler
   [junit4]   2> 957688 T1974 oasc.RequestHandlers.initHandlersFromConfig created /update: solr.UpdateRequestHandler
   [junit4]   2> 957688 T2034 oasc.RequestHandlers.initHandlersFromConfig created /admin/: org.apache.solr.handler.admin.AdminHandlers
   [junit4]   2> 957689 T1974 oasc.RequestHandlers.initHandlersFromConfig created /admin/: org.apache.solr.handler.admin.AdminHandlers
   [junit4]   2> 957706 T1993 oashl.XMLLoader.init xsltCacheLifetimeSeconds=60
   [junit4]   2> 957706 T2034 oashl.XMLLoader.init xsltCacheLifetimeSeconds=60
   [junit4]   2> 957706 T1974 oashl.XMLLoader.init xsltCacheLifetimeSeconds=60
   [junit4]   2> 957707 T2020 oashl.XMLLoader.init xsltCacheLifetimeSeconds=60
   [junit4]   2> 957717 T1974 oass.SolrIndexSearcher.<init> Opening Searcher@2c8ff228 main
   [junit4]   2> 957717 T2020 oass.SolrIndexSearcher.<init> Opening Searcher@15f18e5 main
   [junit4]   2> 957717 T2034 oass.SolrIndexSearcher.<init> Opening Searcher@189957f3 main
   [junit4]   2> 957717 T1993 oass.SolrIndexSearcher.<init> Opening Searcher@1e6336f3 main
   [junit4]   2> 957719 T1974 oasu.CommitTracker.<init> Hard AutoCommit: disabled
   [junit4]   2> 957719 T1974 oasu.CommitTracker.<init> Soft AutoCommit: disabled
   [junit4]   2> 957720 T2020 oasu.CommitTracker.<init> Hard AutoCommit: disabled
   [junit4]   2> 957720 T1993 oasu.CommitTracker.<init> Hard AutoCommit: disabled
   [junit4]   2> 957720 T2034 oasu.CommitTracker.<init> Hard AutoCommit: disabled
   [junit4]   2> 957721 T1993 oasu.CommitTracker.<init> Soft AutoCommit: disabled
   [junit4]   2> 957720 T2020 oasu.CommitTracker.<init> Soft AutoCommit: disabled
   [junit4]   2> 957721 T2034 oasu.CommitTracker.<init> Soft AutoCommit: disabled
   [junit4]   2> 957725 T2051 oasc.SolrCore.registerSearcher [nodes_used_collection_shard1_replica2] Registered new searcher Searcher@2c8ff228 main{StandardDirectoryReader(segments_1:1)}
   [junit4]   2> 957726 T2050 oasc.SolrCore.registerSearcher [nodes_used_collection_shard1_replica1] Registered new searcher Searcher@1e6336f3 main{StandardDirectoryReader(segments_1:1)}
   [junit4]   2> 957727 T2053 oasc.SolrCore.registerSearcher [nodes_used_collection_shard2_replica2] Registered new searcher Searcher@15f18e5 main{StandardDirectoryReader(segments_1:1)}
   [junit4]   2> 957727 T2052 oasc.SolrCore.registerSearcher [nodes_used_collection_shard2_replica1] Registered new searcher Searcher@189957f3 main{StandardDirectoryReader(segments_1:1)}
   [junit4]   2> 957728 T1974 oasc.CoreContainer.registerCore registering core: nodes_used_collection_shard1_replica2
   [junit4]   2> 957728 T1974 oasc.ZkController.register Register replica - core:nodes_used_collection_shard1_replica2 address:http://127.0.0.1:51680/tl_/wz collection:nodes_used_collection shard:shard1
   [junit4]   2> 957729 T1974 oascsi.HttpClientUtil.createClient Creating new http client, config:maxConnections=10000&maxConnectionsPerHost=20&connTimeout=15000&socketTimeout=30000&retry=false
   [junit4]   2> 957729 T1993 oasc.CoreContainer.registerCore registering core: nodes_used_collection_shard1_replica1
   [junit4]   2> 957729 T1993 oasc.ZkController.register Register replica - core:nodes_used_collection_shard1_replica1 address:http://127.0.0.1:34827/tl_/wz collection:nodes_used_collection shard:shard1
   [junit4]   2> 957730 T2034 oasc.CoreContainer.registerCore registering core: nodes_used_collection_shard2_replica1
   [junit4]   2> 957729 T2020 oasc.CoreContainer.registerCore registering core: nodes_used_collection_shard2_replica2
   [junit4]   2> 957730 T2034 oasc.ZkController.register Register replica - core:nodes_used_collection_shard2_replica1 address:http://127.0.0.1:31606/tl_/wz collection:nodes_used_collection shard:shard2
   [junit4]   2> 957730 T1993 oascsi.HttpClientUtil.createClient Creating new http client, config:maxConnections=10000&maxConnectionsPerHost=20&connTimeout=15000&socketTimeout=30000&retry=false
   [junit4]   2> 957731 T2034 oascsi.HttpClientUtil.createClient Creating new http client, config:maxConnections=10000&maxConnectionsPerHost=20&connTimeout=15000&socketTimeout=30000&retry=false
   [junit4]   2> 957731 T2020 oasc.ZkController.register Register replica - core:nodes_used_collection_shard2_replica2 address:http://127.0.0.1:31597/tl_/wz collection:nodes_used_collection shard:shard2
   [junit4]   2> 957732 T2020 oascsi.HttpClientUtil.createClient Creating new http client, config:maxConnections=10000&maxConnectionsPerHost=20&connTimeout=15000&socketTimeout=30000&retry=false
   [junit4]   2> 957748 T1974 oascc.SolrZkClient.makePath makePath: /collections/nodes_used_collection/leader_elect/shard1/election
   [junit4]   2> 957748 T2034 oascc.SolrZkClient.makePath makePath: /collections/nodes_used_collection/leader_elect/shard2/election
   [junit4]   2> 957748 T1993 oascc.SolrZkClient.makePath makePath: /collections/nodes_used_collection/leader_elect/shard1/election
   [junit4]   2> 957752 T2020 oascc.SolrZkClient.makePath makePath: /collections/nodes_used_collection/leader_elect/shard2/election
   [junit4]   2> 957790 T1993 oasc.ShardLeaderElectionContext.runLeaderProcess Running the leader process for shard shard1
   [junit4]   2> 957792 T2034 oasc.ShardLeaderElectionContext.runLeaderProcess Running the leader process for shard shard2
   [junit4]   2> 957805 T1993 oasc.ShardLeaderElectionContext.waitForReplicasToComeUp Enough replicas found to continue.
   [junit4]   2> 957805 T1993 oasc.ShardLeaderElectionContext.runLeaderProcess I may be the new leader - try and sync
   [junit4]   2> 957805 T2034 oasc.ShardLeaderElectionContext.waitForReplicasToComeUp Enough replicas found to continue.
   [junit4]   2> 957806 T2034 oasc.ShardLeaderElectionContext.runLeaderProcess I may be the new leader - try and sync
   [junit4]   2> 957806 T1993 oasc.SyncStrategy.sync Sync replicas to http://127.0.0.1:34827/tl_/wz/nodes_used_collection_shard1_replica1/
   [junit4]   2> 957807 T2034 oasc.SyncStrategy.sync Sync replicas to http://127.0.0.1:31606/tl_/wz/nodes_used_collection_shard2_replica1/
   [junit4]   2> 957807 T1993 oasu.PeerSync.sync PeerSync: core=nodes_used_collection_shard1_replica1 url=http://127.0.0.1:34827/tl_/wz START replicas=[http://127.0.0.1:51680/tl_/wz/nodes_used_collection_shard1_replica2/] nUpdates=100
   [junit4]   2> 957808 T2034 oasu.PeerSync.sync PeerSync: core=nodes_used_collection_shard2_replica1 url=http://127.0.0.1:31606/tl_/wz START replicas=[http://127.0.0.1:31597/tl_/wz/nodes_used_collection_shard2_replica2/] nUpdates=100
   [junit4]   2> 957808 T1993 oasu.PeerSync.sync PeerSync: core=nodes_used_collection_shard1_replica1 url=http://127.0.0.1:34827/tl_/wz DONE.  We have no versions.  sync failed.
   [junit4]   2> 957809 T2034 oasu.PeerSync.sync PeerSync: core=nodes_used_collection_shard2_replica1 url=http://127.0.0.1:31606/tl_/wz DONE.  We have no versions.  sync failed.
   [junit4]   2> 957809 T2034 oasc.SyncStrategy.syncReplicas Leader's attempt to sync with shard failed, moving to the next candidate
   [junit4]   2> 957809 T1993 oasc.SyncStrategy.syncReplicas Leader's attempt to sync with shard failed, moving to the next candidate
   [junit4]   2> 957810 T2034 

[...truncated too long message...]

ent.DefaultRequestDirector.execute(DefaultRequestDirector.java:480)
   [junit4]    > 	at org.apache.http.impl.client.AbstractHttpClient.execute(AbstractHttpClient.java:906)
   [junit4]    > 	at org.apache.http.impl.client.AbstractHttpClient.execute(AbstractHttpClient.java:805)
   [junit4]    > 	at org.apache.http.impl.client.AbstractHttpClient.execute(AbstractHttpClient.java:784)
   [junit4]    > 	at org.apache.solr.client.solrj.impl.HttpSolrServer.request(HttpSolrServer.java:365)
   [junit4]    > 	... 45 more
   [junit4]   2> 1088819 T1962 oas.SolrTestCaseJ4.deleteCore ###deleteCore
   [junit4]   2> 143186 T1961 ccr.ThreadLeakControl.checkThreadLeaks WARNING Will linger awaiting termination of 2 leaked thread(s).
   [junit4]   2> 1089976 T2044 oascc.ZkStateReader$2.process WARN ZooKeeper watch triggered, but Solr cannot talk to ZK
   [junit4]   2> 1089976 T2044 oascc.ZkStateReader$3.process WARN ZooKeeper watch triggered, but Solr cannot talk to ZK
   [junit4]   2> 1089976 T2044 oasc.LeaderElector$1.process WARN  org.apache.zookeeper.KeeperException$SessionExpiredException: KeeperErrorCode = Session expired for /collections/new_implicit_coll_1/leader_elect/b/election
   [junit4]   2> 	at org.apache.zookeeper.KeeperException.create(KeeperException.java:127)
   [junit4]   2> 	at org.apache.zookeeper.KeeperException.create(KeeperException.java:51)
   [junit4]   2> 	at org.apache.zookeeper.ZooKeeper.getChildren(ZooKeeper.java:1468)
   [junit4]   2> 	at org.apache.solr.common.cloud.SolrZkClient$6.execute(SolrZkClient.java:235)
   [junit4]   2> 	at org.apache.solr.common.cloud.SolrZkClient$6.execute(SolrZkClient.java:232)
   [junit4]   2> 	at org.apache.solr.common.cloud.ZkCmdExecutor.retryOperation(ZkCmdExecutor.java:65)
   [junit4]   2> 	at org.apache.solr.common.cloud.SolrZkClient.getChildren(SolrZkClient.java:232)
   [junit4]   2> 	at org.apache.solr.cloud.LeaderElector.checkIfIamLeader(LeaderElector.java:84)
   [junit4]   2> 	at org.apache.solr.cloud.LeaderElector.access$000(LeaderElector.java:55)
   [junit4]   2> 	at org.apache.solr.cloud.LeaderElector$1.process(LeaderElector.java:129)
   [junit4]   2> 	at org.apache.zookeeper.ClientCnxn$EventThread.processEvent(ClientCnxn.java:519)
   [junit4]   2> 	at org.apache.zookeeper.ClientCnxn$EventThread.run(ClientCnxn.java:495)
   [junit4]   2> 
   [junit4]   2> 1089977 T2044 oasc.LeaderElector$1.process WARN  org.apache.zookeeper.KeeperException$SessionExpiredException: KeeperErrorCode = Session expired for /collections/new_implicit_coll_0/leader_elect/d/election
   [junit4]   2> 	at org.apache.zookeeper.KeeperException.create(KeeperException.java:127)
   [junit4]   2> 	at org.apache.zookeeper.KeeperException.create(KeeperException.java:51)
   [junit4]   2> 	at org.apache.zookeeper.ZooKeeper.getChildren(ZooKeeper.java:1468)
   [junit4]   2> 	at org.apache.solr.common.cloud.SolrZkClient$6.execute(SolrZkClient.java:235)
   [junit4]   2> 	at org.apache.solr.common.cloud.SolrZkClient$6.execute(SolrZkClient.java:232)
   [junit4]   2> 	at org.apache.solr.common.cloud.ZkCmdExecutor.retryOperation(ZkCmdExecutor.java:65)
   [junit4]   2> 	at org.apache.solr.common.cloud.SolrZkClient.getChildren(SolrZkClient.java:232)
   [junit4]   2> 	at org.apache.solr.cloud.LeaderElector.checkIfIamLeader(LeaderElector.java:84)
   [junit4]   2> 	at org.apache.solr.cloud.LeaderElector.access$000(LeaderElector.java:55)
   [junit4]   2> 	at org.apache.solr.cloud.LeaderElector$1.process(LeaderElector.java:129)
   [junit4]   2> 	at org.apache.zookeeper.ClientCnxn$EventThread.processEvent(ClientCnxn.java:519)
   [junit4]   2> 	at org.apache.zookeeper.ClientCnxn$EventThread.run(ClientCnxn.java:495)
   [junit4]   2> 
   [junit4]   2> 1089978 T2044 oasc.LeaderElector$1.process WARN  org.apache.zookeeper.KeeperException$SessionExpiredException: KeeperErrorCode = Session expired for /collections/new_implicit_coll_0/leader_elect/c/election
   [junit4]   2> 	at org.apache.zookeeper.KeeperException.create(KeeperException.java:127)
   [junit4]   2> 	at org.apache.zookeeper.KeeperException.create(KeeperException.java:51)
   [junit4]   2> 	at org.apache.zookeeper.ZooKeeper.getChildren(ZooKeeper.java:1468)
   [junit4]   2> 	at org.apache.solr.common.cloud.SolrZkClient$6.execute(SolrZkClient.java:235)
   [junit4]   2> 	at org.apache.solr.common.cloud.SolrZkClient$6.execute(SolrZkClient.java:232)
   [junit4]   2> 	at org.apache.solr.common.cloud.ZkCmdExecutor.retryOperation(ZkCmdExecutor.java:65)
   [junit4]   2> 	at org.apache.solr.common.cloud.SolrZkClient.getChildren(SolrZkClient.java:232)
   [junit4]   2> 	at org.apache.solr.cloud.LeaderElector.checkIfIamLeader(LeaderElector.java:84)
   [junit4]   2> 	at org.apache.solr.cloud.LeaderElector.access$000(LeaderElector.java:55)
   [junit4]   2> 	at org.apache.solr.cloud.LeaderElector$1.process(LeaderElector.java:129)
   [junit4]   2> 	at org.apache.zookeeper.ClientCnxn$EventThread.processEvent(ClientCnxn.java:519)
   [junit4]   2> 	at org.apache.zookeeper.ClientCnxn$EventThread.run(ClientCnxn.java:495)
   [junit4]   2> 
   [junit4]   2> 1089978 T2044 oasc.LeaderElector$1.process WARN  org.apache.zookeeper.KeeperException$SessionExpiredException: KeeperErrorCode = Session expired for /collections/new_implicit_coll_0/leader_elect/a/election
   [junit4]   2> 	at org.apache.zookeeper.KeeperException.create(KeeperException.java:127)
   [junit4]   2> 	at org.apache.zookeeper.KeeperException.create(KeeperException.java:51)
   [junit4]   2> 	at org.apache.zookeeper.ZooKeeper.getChildren(ZooKeeper.java:1468)
   [junit4]   2> 	at org.apache.solr.common.cloud.SolrZkClient$6.execute(SolrZkClient.java:235)
   [junit4]   2> 	at org.apache.solr.common.cloud.SolrZkClient$6.execute(SolrZkClient.java:232)
   [junit4]   2> 	at org.apache.solr.common.cloud.ZkCmdExecutor.retryOperation(ZkCmdExecutor.java:65)
   [junit4]   2> 	at org.apache.solr.common.cloud.SolrZkClient.getChildren(SolrZkClient.java:232)
   [junit4]   2> 	at org.apache.solr.cloud.LeaderElector.checkIfIamLeader(LeaderElector.java:84)
   [junit4]   2> 	at org.apache.solr.cloud.LeaderElector.access$000(LeaderElector.java:55)
   [junit4]   2> 	at org.apache.solr.cloud.LeaderElector$1.process(LeaderElector.java:129)
   [junit4]   2> 	at org.apache.zookeeper.ClientCnxn$EventThread.processEvent(ClientCnxn.java:519)
   [junit4]   2> 	at org.apache.zookeeper.ClientCnxn$EventThread.run(ClientCnxn.java:495)
   [junit4]   2> 
   [junit4]   2> NOTE: test params are: codec=FastDecompressionCompressingStoredFields(storedFieldsFormat=CompressingStoredFieldsFormat(compressionMode=FAST_DECOMPRESSION, chunkSize=95), termVectorsFormat=CompressingTermVectorsFormat(compressionMode=FAST_DECOMPRESSION, chunkSize=95)), sim=RandomSimilarityProvider(queryNorm=false,coord=crazy): {}, locale=el_CY, timezone=Asia/Rangoon
   [junit4]   2> NOTE: FreeBSD 9.1-RELEASE-p3 amd64/Oracle Corporation 1.7.0_25 (64-bit)/cpus=16,threads=4,free=270153352,total=536870912
   [junit4]   2> NOTE: All tests run in this JVM: [TestExtendedDismaxParser, SOLR749Test, TermsComponentTest, UpdateParamsTest, HighlighterConfigTest, TestLuceneMatchVersion, SolrIndexSplitterTest, TestSolrXmlPersistence, TestFastWriter, ShardRoutingTest, PathHierarchyTokenizerFactoryTest, SpellCheckCollatorTest, SolrIndexConfigTest, SliceStateTest, TestSchemaResource, TestGroupingSearch, ZkControllerTest, SpatialFilterTest, IndexReaderFactoryTest, NumericFieldsTest, ExternalFileFieldSortTest, PeerSyncTest, SolrPluginUtilsTest, TestSerializedLuceneMatchVersion, QueryEqualityTest, TestSolr4Spatial, TestLFUCache, AliasIntegrationTest, TestRTGBase, HdfsDirectoryTest, TestSolrDeletionPolicy2, SortByFunctionTest, ZkSolrClientTest, ResponseLogComponentTest, TestSchemaSimilarityResource, ClusterStateUpdateTest, LeaderElectionTest, TestMultiCoreConfBootstrap, SchemaVersionSpecificBehaviorTest, TestElisionMultitermQuery, JSONWriterTest, TestAddFieldRealTimeGet, DateMathParserTest, LoggingHandlerTest, SimpleFacetsTest, CurrencyFieldOpenExchangeTest, HdfsBasicDistributedZkTest, TestCSVResponseWriter, PluginInfoTest, FieldMutatingUpdateProcessorTest, RecoveryZkTest, TestPropInjectDefaults, TestDFRSimilarityFactory, HdfsCollectionsAPIDistributedZkTest, HdfsUnloadDistributedZkTest, IndexSchemaTest, SampleTest, ShardSplitTest, SolrInfoMBeanTest, MinimalSchemaTest, SpellPossibilityIteratorTest, TestStressReorder, TestReloadAndDeleteDocs, BasicDistributedZk2Test, PrimUtilsTest, TestSolrCoreProperties, DirectSolrSpellCheckerTest, ScriptEngineTest, TestSchemaNameResource, CacheHeaderTest, TestLMJelinekMercerSimilarityFactory, SliceStateUpdateTest, CollectionsAPIDistributedZkTest]
   [junit4] Completed on J1 in 144.47s, 1 test, 1 error <<< FAILURES!

[...truncated 534 lines...]
BUILD FAILED
/usr/home/hudson/hudson-slave/workspace/Lucene-Solr-Tests-4.x-Java7/build.xml:395: The following error occurred while executing this line:
/usr/home/hudson/hudson-slave/workspace/Lucene-Solr-Tests-4.x-Java7/build.xml:375: The following error occurred while executing this line:
/usr/home/hudson/hudson-slave/workspace/Lucene-Solr-Tests-4.x-Java7/build.xml:39: The following error occurred while executing this line:
/usr/home/hudson/hudson-slave/workspace/Lucene-Solr-Tests-4.x-Java7/solr/build.xml:181: The following error occurred while executing this line:
/usr/home/hudson/hudson-slave/workspace/Lucene-Solr-Tests-4.x-Java7/solr/common-build.xml:449: The following error occurred while executing this line:
/usr/home/hudson/hudson-slave/workspace/Lucene-Solr-Tests-4.x-Java7/lucene/common-build.xml:1233: The following error occurred while executing this line:
/usr/home/hudson/hudson-slave/workspace/Lucene-Solr-Tests-4.x-Java7/lucene/common-build.xml:876: There were test failures: 321 suites, 1352 tests, 1 error, 34 ignored (6 assumptions)

Total time: 62 minutes 34 seconds
Build step 'Invoke Ant' marked build as failure
Archiving artifacts
Recording test results
Email was triggered for: Failure
Sending email for trigger: Failure



Mime
View raw message