lucene-dev mailing list archives

Site index · List index
Message view « Date » · « Thread »
Top « Date » · « Thread »
From Policeman Jenkins Server <jenk...@thetaphi.de>
Subject [JENKINS] Lucene-Solr-4.x-Linux (64bit/jdk1.6.0_45) - Build # 6765 - Still Failing!
Date Fri, 02 Aug 2013 11:41:51 GMT
Build: http://jenkins.thetaphi.de/job/Lucene-Solr-4.x-Linux/6765/
Java: 64bit/jdk1.6.0_45 -XX:+UseCompressedOops -XX:+UseSerialGC

1 tests failed.
FAILED:  org.apache.solr.cloud.CollectionsAPIDistributedZkTest.testDistribSearch

Error Message:
Server refused connection at: http://127.0.0.1:46363/xo_

Stack Trace:
org.apache.solr.client.solrj.SolrServerException: Server refused connection at: http://127.0.0.1:46363/xo_
	at __randomizedtesting.SeedInfo.seed([6FD82255B0DC208F:EE3EAC4DC78340B3]:0)
	at org.apache.solr.client.solrj.impl.HttpSolrServer.request(HttpSolrServer.java:428)
	at org.apache.solr.client.solrj.impl.HttpSolrServer.request(HttpSolrServer.java:180)
	at org.apache.solr.cloud.CollectionsAPIDistributedZkTest.testCustomCollectionsAPI(CollectionsAPIDistributedZkTest.java:764)
	at org.apache.solr.cloud.CollectionsAPIDistributedZkTest.doTest(CollectionsAPIDistributedZkTest.java:159)
	at org.apache.solr.BaseDistributedSearchTestCase.testDistribSearch(BaseDistributedSearchTestCase.java:835)
	at sun.reflect.NativeMethodAccessorImpl.invoke0(Native Method)
	at sun.reflect.NativeMethodAccessorImpl.invoke(NativeMethodAccessorImpl.java:39)
	at sun.reflect.DelegatingMethodAccessorImpl.invoke(DelegatingMethodAccessorImpl.java:25)
	at java.lang.reflect.Method.invoke(Method.java:597)
	at com.carrotsearch.randomizedtesting.RandomizedRunner.invoke(RandomizedRunner.java:1559)
	at com.carrotsearch.randomizedtesting.RandomizedRunner.access$600(RandomizedRunner.java:79)
	at com.carrotsearch.randomizedtesting.RandomizedRunner$6.evaluate(RandomizedRunner.java:737)
	at com.carrotsearch.randomizedtesting.RandomizedRunner$7.evaluate(RandomizedRunner.java:773)
	at com.carrotsearch.randomizedtesting.RandomizedRunner$8.evaluate(RandomizedRunner.java:787)
	at com.carrotsearch.randomizedtesting.rules.SystemPropertiesRestoreRule$1.evaluate(SystemPropertiesRestoreRule.java:53)
	at org.apache.lucene.util.TestRuleSetupTeardownChained$1.evaluate(TestRuleSetupTeardownChained.java:50)
	at org.apache.lucene.util.TestRuleFieldCacheSanity$1.evaluate(TestRuleFieldCacheSanity.java:51)
	at org.apache.lucene.util.AbstractBeforeAfterRule$1.evaluate(AbstractBeforeAfterRule.java:46)
	at com.carrotsearch.randomizedtesting.rules.SystemPropertiesInvariantRule$1.evaluate(SystemPropertiesInvariantRule.java:55)
	at org.apache.lucene.util.TestRuleThreadAndTestName$1.evaluate(TestRuleThreadAndTestName.java:49)
	at org.apache.lucene.util.TestRuleIgnoreAfterMaxFailures$1.evaluate(TestRuleIgnoreAfterMaxFailures.java:70)
	at org.apache.lucene.util.TestRuleMarkFailure$1.evaluate(TestRuleMarkFailure.java:48)
	at com.carrotsearch.randomizedtesting.rules.StatementAdapter.evaluate(StatementAdapter.java:36)
	at com.carrotsearch.randomizedtesting.ThreadLeakControl$StatementRunner.run(ThreadLeakControl.java:358)
	at com.carrotsearch.randomizedtesting.ThreadLeakControl.forkTimeoutingTask(ThreadLeakControl.java:782)
	at com.carrotsearch.randomizedtesting.ThreadLeakControl$3.evaluate(ThreadLeakControl.java:442)
	at com.carrotsearch.randomizedtesting.RandomizedRunner.runSingleTest(RandomizedRunner.java:746)
	at com.carrotsearch.randomizedtesting.RandomizedRunner$3.evaluate(RandomizedRunner.java:648)
	at com.carrotsearch.randomizedtesting.RandomizedRunner$4.evaluate(RandomizedRunner.java:682)
	at com.carrotsearch.randomizedtesting.RandomizedRunner$5.evaluate(RandomizedRunner.java:693)
	at com.carrotsearch.randomizedtesting.rules.StatementAdapter.evaluate(StatementAdapter.java:36)
	at com.carrotsearch.randomizedtesting.rules.SystemPropertiesRestoreRule$1.evaluate(SystemPropertiesRestoreRule.java:53)
	at org.apache.lucene.util.AbstractBeforeAfterRule$1.evaluate(AbstractBeforeAfterRule.java:46)
	at org.apache.lucene.util.TestRuleStoreClassName$1.evaluate(TestRuleStoreClassName.java:42)
	at com.carrotsearch.randomizedtesting.rules.SystemPropertiesInvariantRule$1.evaluate(SystemPropertiesInvariantRule.java:55)
	at com.carrotsearch.randomizedtesting.rules.NoShadowingOrOverridesOnMethodsRule$1.evaluate(NoShadowingOrOverridesOnMethodsRule.java:39)
	at com.carrotsearch.randomizedtesting.rules.NoShadowingOrOverridesOnMethodsRule$1.evaluate(NoShadowingOrOverridesOnMethodsRule.java:39)
	at com.carrotsearch.randomizedtesting.rules.StatementAdapter.evaluate(StatementAdapter.java:36)
	at org.apache.lucene.util.TestRuleAssertionsRequired$1.evaluate(TestRuleAssertionsRequired.java:43)
	at org.apache.lucene.util.TestRuleMarkFailure$1.evaluate(TestRuleMarkFailure.java:48)
	at org.apache.lucene.util.TestRuleIgnoreAfterMaxFailures$1.evaluate(TestRuleIgnoreAfterMaxFailures.java:70)
	at org.apache.lucene.util.TestRuleIgnoreTestSuites$1.evaluate(TestRuleIgnoreTestSuites.java:55)
	at com.carrotsearch.randomizedtesting.rules.StatementAdapter.evaluate(StatementAdapter.java:36)
	at com.carrotsearch.randomizedtesting.ThreadLeakControl$StatementRunner.run(ThreadLeakControl.java:358)
	at java.lang.Thread.run(Thread.java:662)
Caused by: org.apache.http.conn.HttpHostConnectException: Connection to http://127.0.0.1:46363 refused
	at org.apache.http.impl.conn.DefaultClientConnectionOperator.openConnection(DefaultClientConnectionOperator.java:190)
	at org.apache.http.impl.conn.ManagedClientConnectionImpl.open(ManagedClientConnectionImpl.java:294)
	at org.apache.http.impl.client.DefaultRequestDirector.tryConnect(DefaultRequestDirector.java:645)
	at org.apache.http.impl.client.DefaultRequestDirector.execute(DefaultRequestDirector.java:480)
	at org.apache.http.impl.client.AbstractHttpClient.execute(AbstractHttpClient.java:906)
	at org.apache.http.impl.client.AbstractHttpClient.execute(AbstractHttpClient.java:805)
	at org.apache.http.impl.client.AbstractHttpClient.execute(AbstractHttpClient.java:784)
	at org.apache.solr.client.solrj.impl.HttpSolrServer.request(HttpSolrServer.java:365)
	... 44 more
Caused by: java.net.ConnectException: Connection refused
	at java.net.PlainSocketImpl.socketConnect(Native Method)
	at java.net.PlainSocketImpl.doConnect(PlainSocketImpl.java:351)
	at java.net.PlainSocketImpl.connectToAddress(PlainSocketImpl.java:213)
	at java.net.PlainSocketImpl.connect(PlainSocketImpl.java:200)
	at java.net.SocksSocketImpl.connect(SocksSocketImpl.java:366)
	at java.net.Socket.connect(Socket.java:529)
	at org.apache.http.conn.scheme.PlainSocketFactory.connectSocket(PlainSocketFactory.java:127)
	at org.apache.http.impl.conn.DefaultClientConnectionOperator.openConnection(DefaultClientConnectionOperator.java:180)
	... 51 more




Build Log:
[...truncated 8826 lines...]
   [junit4] Suite: org.apache.solr.cloud.CollectionsAPIDistributedZkTest
   [junit4]   2> 89886 T263 oas.BaseDistributedSearchTestCase.initHostContext Setting hostContext system property: /xo_/
   [junit4]   2> 89890 T263 oas.SolrTestCaseJ4.setUp ###Starting testDistribSearch
   [junit4]   2> Creating dataDir: /mnt/ssd/jenkins/workspace/Lucene-Solr-4.x-Linux/solr/build/solr-core/test/J1/./solrtest-CollectionsAPIDistributedZkTest-1375442358230
   [junit4]   2> 89891 T263 oasc.ZkTestServer.run STARTING ZK TEST SERVER
   [junit4]   2> 89891 T264 oasc.ZkTestServer$ZKServerMain.runFromConfig Starting server
   [junit4]   2> 89991 T263 oasc.ZkTestServer.run start zk server on port:36400
   [junit4]   2> 89993 T263 oascc.ConnectionManager.waitForConnected Waiting for client to connect to ZooKeeper
   [junit4]   2> 90012 T270 oascc.ConnectionManager.process Watcher org.apache.solr.common.cloud.ConnectionManager@67efb699 name:ZooKeeperConnection Watcher:127.0.0.1:36400 got event WatchedEvent state:SyncConnected type:None path:null path:null type:None
   [junit4]   2> 90013 T263 oascc.ConnectionManager.waitForConnected Client is connected to ZooKeeper
   [junit4]   2> 90013 T263 oascc.SolrZkClient.makePath makePath: /solr
   [junit4]   2> 90024 T263 oascc.ConnectionManager.waitForConnected Waiting for client to connect to ZooKeeper
   [junit4]   2> 90025 T272 oascc.ConnectionManager.process Watcher org.apache.solr.common.cloud.ConnectionManager@439b38d7 name:ZooKeeperConnection Watcher:127.0.0.1:36400/solr got event WatchedEvent state:SyncConnected type:None path:null path:null type:None
   [junit4]   2> 90026 T263 oascc.ConnectionManager.waitForConnected Client is connected to ZooKeeper
   [junit4]   2> 90026 T263 oascc.SolrZkClient.makePath makePath: /collections/collection1
   [junit4]   2> 90031 T263 oascc.SolrZkClient.makePath makePath: /collections/collection1/shards
   [junit4]   2> 90036 T263 oascc.SolrZkClient.makePath makePath: /collections/control_collection
   [junit4]   2> 90040 T263 oascc.SolrZkClient.makePath makePath: /collections/control_collection/shards
   [junit4]   2> 90046 T263 oasc.AbstractZkTestCase.putConfig put /mnt/ssd/jenkins/workspace/Lucene-Solr-4.x-Linux/solr/build/solr-core/test-files/solr/collection1/conf/solrconfig-tlog.xml to /configs/conf1/solrconfig.xml
   [junit4]   2> 90046 T263 oascc.SolrZkClient.makePath makePath: /configs/conf1/solrconfig.xml
   [junit4]   2> 90055 T263 oasc.AbstractZkTestCase.putConfig put /mnt/ssd/jenkins/workspace/Lucene-Solr-4.x-Linux/solr/build/solr-core/test-files/solr/collection1/conf/schema.xml to /configs/conf1/schema.xml
   [junit4]   2> 90055 T263 oascc.SolrZkClient.makePath makePath: /configs/conf1/schema.xml
   [junit4]   2> 90065 T263 oasc.AbstractZkTestCase.putConfig put /mnt/ssd/jenkins/workspace/Lucene-Solr-4.x-Linux/solr/build/solr-core/test-files/solr/collection1/conf/stopwords.txt to /configs/conf1/stopwords.txt
   [junit4]   2> 90066 T263 oascc.SolrZkClient.makePath makePath: /configs/conf1/stopwords.txt
   [junit4]   2> 90076 T263 oasc.AbstractZkTestCase.putConfig put /mnt/ssd/jenkins/workspace/Lucene-Solr-4.x-Linux/solr/build/solr-core/test-files/solr/collection1/conf/protwords.txt to /configs/conf1/protwords.txt
   [junit4]   2> 90077 T263 oascc.SolrZkClient.makePath makePath: /configs/conf1/protwords.txt
   [junit4]   2> 90087 T263 oasc.AbstractZkTestCase.putConfig put /mnt/ssd/jenkins/workspace/Lucene-Solr-4.x-Linux/solr/build/solr-core/test-files/solr/collection1/conf/currency.xml to /configs/conf1/currency.xml
   [junit4]   2> 90088 T263 oascc.SolrZkClient.makePath makePath: /configs/conf1/currency.xml
   [junit4]   2> 90098 T263 oasc.AbstractZkTestCase.putConfig put /mnt/ssd/jenkins/workspace/Lucene-Solr-4.x-Linux/solr/build/solr-core/test-files/solr/collection1/conf/open-exchange-rates.json to /configs/conf1/open-exchange-rates.json
   [junit4]   2> 90099 T263 oascc.SolrZkClient.makePath makePath: /configs/conf1/open-exchange-rates.json
   [junit4]   2> 90108 T263 oasc.AbstractZkTestCase.putConfig put /mnt/ssd/jenkins/workspace/Lucene-Solr-4.x-Linux/solr/build/solr-core/test-files/solr/collection1/conf/mapping-ISOLatin1Accent.txt to /configs/conf1/mapping-ISOLatin1Accent.txt
   [junit4]   2> 90109 T263 oascc.SolrZkClient.makePath makePath: /configs/conf1/mapping-ISOLatin1Accent.txt
   [junit4]   2> 90115 T263 oasc.AbstractZkTestCase.putConfig put /mnt/ssd/jenkins/workspace/Lucene-Solr-4.x-Linux/solr/build/solr-core/test-files/solr/collection1/conf/old_synonyms.txt to /configs/conf1/old_synonyms.txt
   [junit4]   2> 90116 T263 oascc.SolrZkClient.makePath makePath: /configs/conf1/old_synonyms.txt
   [junit4]   2> 90121 T263 oasc.AbstractZkTestCase.putConfig put /mnt/ssd/jenkins/workspace/Lucene-Solr-4.x-Linux/solr/build/solr-core/test-files/solr/collection1/conf/synonyms.txt to /configs/conf1/synonyms.txt
   [junit4]   2> 90121 T263 oascc.SolrZkClient.makePath makePath: /configs/conf1/synonyms.txt
   [junit4]   2> 90218 T263 oejs.Server.doStart jetty-8.1.10.v20130312
   [junit4]   2> 90221 T263 oejs.AbstractConnector.doStart Started SelectChannelConnector@127.0.0.1:43026
   [junit4]   2> 90222 T263 oass.SolrDispatchFilter.init SolrDispatchFilter.init()
   [junit4]   2> 90223 T263 oasc.SolrResourceLoader.locateSolrHome JNDI not configured for solr (NoInitialContextEx)
   [junit4]   2> 90224 T263 oasc.SolrResourceLoader.locateSolrHome using system property solr.solr.home: /mnt/ssd/jenkins/workspace/Lucene-Solr-4.x-Linux/solr/build/solr-core/test/J1/./org.apache.solr.cloud.CollectionsAPIDistributedZkTest-controljetty-1375442358478
   [junit4]   2> 90224 T263 oasc.SolrResourceLoader.<init> new SolrResourceLoader for directory: '/mnt/ssd/jenkins/workspace/Lucene-Solr-4.x-Linux/solr/build/solr-core/test/J1/./org.apache.solr.cloud.CollectionsAPIDistributedZkTest-controljetty-1375442358478/'
   [junit4]   2> 90243 T263 oasc.ConfigSolr.fromFile Loading container configuration from /mnt/ssd/jenkins/workspace/Lucene-Solr-4.x-Linux/solr/build/solr-core/test/J1/./org.apache.solr.cloud.CollectionsAPIDistributedZkTest-controljetty-1375442358478/solr.xml
   [junit4]   2> 90283 T263 oasc.ConfigSolrXml.<init> Config-defined core root directory: 
   [junit4]   2> 90285 T263 oasc.CoreContainer.<init> New CoreContainer 958487567
   [junit4]   2> 90285 T263 oasc.CoreContainer.load Loading cores into CoreContainer [instanceDir=/mnt/ssd/jenkins/workspace/Lucene-Solr-4.x-Linux/solr/build/solr-core/test/J1/./org.apache.solr.cloud.CollectionsAPIDistributedZkTest-controljetty-1375442358478/]
   [junit4]   2> 90286 T263 oashc.HttpShardHandlerFactory.getParameter Setting socketTimeout to: 120000
   [junit4]   2> 90286 T263 oashc.HttpShardHandlerFactory.getParameter Setting urlScheme to: http://
   [junit4]   2> 90287 T263 oashc.HttpShardHandlerFactory.getParameter Setting connTimeout to: 15000
   [junit4]   2> 90287 T263 oashc.HttpShardHandlerFactory.getParameter Setting maxConnectionsPerHost to: 20
   [junit4]   2> 90287 T263 oashc.HttpShardHandlerFactory.getParameter Setting corePoolSize to: 0
   [junit4]   2> 90288 T263 oashc.HttpShardHandlerFactory.getParameter Setting maximumPoolSize to: 2147483647
   [junit4]   2> 90288 T263 oashc.HttpShardHandlerFactory.getParameter Setting maxThreadIdleTime to: 5
   [junit4]   2> 90288 T263 oashc.HttpShardHandlerFactory.getParameter Setting sizeOfQueue to: -1
   [junit4]   2> 90289 T263 oashc.HttpShardHandlerFactory.getParameter Setting fairnessPolicy to: false
   [junit4]   2> 90289 T263 oascsi.HttpClientUtil.createClient Creating new http client, config:maxConnectionsPerHost=20&maxConnections=10000&socketTimeout=120000&connTimeout=15000&retry=false
   [junit4]   2> 90293 T263 oasc.ZkContainer.initZooKeeper Zookeeper client=127.0.0.1:36400/solr
   [junit4]   2> 90293 T263 oasc.ZkController.checkChrootPath zkHost includes chroot
   [junit4]   2> 90295 T263 oascc.ConnectionManager.waitForConnected Waiting for client to connect to ZooKeeper
   [junit4]   2> 90296 T283 oascc.ConnectionManager.process Watcher org.apache.solr.common.cloud.ConnectionManager@4350d9b5 name:ZooKeeperConnection Watcher:127.0.0.1:36400 got event WatchedEvent state:SyncConnected type:None path:null path:null type:None
   [junit4]   2> 90297 T263 oascc.ConnectionManager.waitForConnected Client is connected to ZooKeeper
   [junit4]   2> 90300 T263 oascsi.HttpClientUtil.createClient Creating new http client, config:maxConnections=500&maxConnectionsPerHost=16&socketTimeout=120000&connTimeout=15000
   [junit4]   2> 90303 T263 oascc.ConnectionManager.waitForConnected Waiting for client to connect to ZooKeeper
   [junit4]   2> 90305 T285 oascc.ConnectionManager.process Watcher org.apache.solr.common.cloud.ConnectionManager@464dcf72 name:ZooKeeperConnection Watcher:127.0.0.1:36400/solr got event WatchedEvent state:SyncConnected type:None path:null path:null type:None
   [junit4]   2> 90305 T263 oascc.ConnectionManager.waitForConnected Client is connected to ZooKeeper
   [junit4]   2> 90309 T263 oascc.SolrZkClient.makePath makePath: /overseer/queue
   [junit4]   2> 90319 T263 oascc.SolrZkClient.makePath makePath: /overseer/collection-queue-work
   [junit4]   2> 90326 T263 oascc.SolrZkClient.makePath makePath: /live_nodes
   [junit4]   2> 90330 T263 oasc.ZkController.createEphemeralLiveNode Register node as live in ZooKeeper:/live_nodes/127.0.0.1:43026_xo_
   [junit4]   2> 90332 T263 oascc.SolrZkClient.makePath makePath: /live_nodes/127.0.0.1:43026_xo_
   [junit4]   2> 90340 T263 oascc.SolrZkClient.makePath makePath: /overseer_elect/election
   [junit4]   2> 90348 T263 oascc.SolrZkClient.makePath makePath: /overseer_elect/leader
   [junit4]   2> 90353 T263 oasc.Overseer.start Overseer (id=90140990389092355-127.0.0.1:43026_xo_-n_0000000000) starting
   [junit4]   2> 90358 T263 oascc.SolrZkClient.makePath makePath: /overseer/queue-work
   [junit4]   2> 90364 T287 oasc.OverseerCollectionProcessor.run Process current queue of collection creations
   [junit4]   2> 90365 T263 oascc.SolrZkClient.makePath makePath: /clusterstate.json
   [junit4]   2> 90370 T263 oascc.SolrZkClient.makePath makePath: /aliases.json
   [junit4]   2> 90373 T263 oascc.ZkStateReader.createClusterStateWatchersAndUpdate Updating cluster state from ZooKeeper... 
   [junit4]   2> 90378 T286 oasc.Overseer$ClusterStateUpdater.run Starting to work on the main queue
   [junit4]   2> 90380 T263 oasc.CorePropertiesLocator.discover Looking for core definitions underneath /mnt/ssd/jenkins/workspace/Lucene-Solr-4.x-Linux/solr/build/solr-core/test/J1/./org.apache.solr.cloud.CollectionsAPIDistributedZkTest-controljetty-1375442358478
   [junit4]   2> 90407 T263 oasc.CorePropertiesLocator.discoverUnder Found core conf in /mnt/ssd/jenkins/workspace/Lucene-Solr-4.x-Linux/solr/build/solr-core/test/J1/./org.apache.solr.cloud.CollectionsAPIDistributedZkTest-controljetty-1375442358478/conf/
   [junit4]   2> 90407 T263 oasc.CorePropertiesLocator.discover Found 1 core definitions
   [junit4]   2> 90408 T263 oass.SolrDispatchFilter.init user.dir=/mnt/ssd/jenkins/workspace/Lucene-Solr-4.x-Linux/solr/build/solr-core/test/J1
   [junit4]   2> 90408 T263 oass.SolrDispatchFilter.init SolrDispatchFilter.init() done
   [junit4]   2> 90409 T263 oascsi.HttpClientUtil.createClient Creating new http client, config:maxConnections=128&maxConnectionsPerHost=32&followRedirects=false
   [junit4]   2> 90412 T263 oascsi.HttpClientUtil.createClient Creating new http client, config:
   [junit4]   2> 90413 T263 oascc.ConnectionManager.waitForConnected Waiting for client to connect to ZooKeeper
   [junit4]   2> 90415 T290 oascc.ConnectionManager.process Watcher org.apache.solr.common.cloud.ConnectionManager@17c34b3c name:ZooKeeperConnection Watcher:127.0.0.1:36400/solr got event WatchedEvent state:SyncConnected type:None path:null path:null type:None
   [junit4]   2> 90415 T263 oascc.ConnectionManager.waitForConnected Client is connected to ZooKeeper
   [junit4]   2> 90417 T263 oascc.ZkStateReader.createClusterStateWatchersAndUpdate Updating cluster state from ZooKeeper... 
   [junit4]   2> 90422 T263 oasc.ChaosMonkey.monkeyLog monkey: init - expire sessions:true cause connection loss:true
   [junit4]   2> 90498 T263 oejs.Server.doStart jetty-8.1.10.v20130312
   [junit4]   2> 90500 T263 oejs.AbstractConnector.doStart Started SelectChannelConnector@127.0.0.1:46363
   [junit4]   2> 90500 T263 oass.SolrDispatchFilter.init SolrDispatchFilter.init()
   [junit4]   2> 90501 T263 oasc.SolrResourceLoader.locateSolrHome JNDI not configured for solr (NoInitialContextEx)
   [junit4]   2> 90501 T263 oasc.SolrResourceLoader.locateSolrHome using system property solr.solr.home: /mnt/ssd/jenkins/workspace/Lucene-Solr-4.x-Linux/solr/build/solr-core/test/J1/./org.apache.solr.cloud.CollectionsAPIDistributedZkTest-jetty1-1375442358761
   [junit4]   2> 90501 T263 oasc.SolrResourceLoader.<init> new SolrResourceLoader for directory: '/mnt/ssd/jenkins/workspace/Lucene-Solr-4.x-Linux/solr/build/solr-core/test/J1/./org.apache.solr.cloud.CollectionsAPIDistributedZkTest-jetty1-1375442358761/'
   [junit4]   2> 90517 T263 oasc.ConfigSolr.fromFile Loading container configuration from /mnt/ssd/jenkins/workspace/Lucene-Solr-4.x-Linux/solr/build/solr-core/test/J1/./org.apache.solr.cloud.CollectionsAPIDistributedZkTest-jetty1-1375442358761/solr.xml
   [junit4]   2> 90551 T263 oasc.ConfigSolrXml.<init> Config-defined core root directory: 
   [junit4]   2> 90552 T263 oasc.CoreContainer.<init> New CoreContainer 1491674787
   [junit4]   2> 90552 T263 oasc.CoreContainer.load Loading cores into CoreContainer [instanceDir=/mnt/ssd/jenkins/workspace/Lucene-Solr-4.x-Linux/solr/build/solr-core/test/J1/./org.apache.solr.cloud.CollectionsAPIDistributedZkTest-jetty1-1375442358761/]
   [junit4]   2> 90553 T263 oashc.HttpShardHandlerFactory.getParameter Setting socketTimeout to: 120000
   [junit4]   2> 90554 T263 oashc.HttpShardHandlerFactory.getParameter Setting urlScheme to: http://
   [junit4]   2> 90554 T263 oashc.HttpShardHandlerFactory.getParameter Setting connTimeout to: 15000
   [junit4]   2> 90554 T263 oashc.HttpShardHandlerFactory.getParameter Setting maxConnectionsPerHost to: 20
   [junit4]   2> 90555 T263 oashc.HttpShardHandlerFactory.getParameter Setting corePoolSize to: 0
   [junit4]   2> 90555 T263 oashc.HttpShardHandlerFactory.getParameter Setting maximumPoolSize to: 2147483647
   [junit4]   2> 90555 T263 oashc.HttpShardHandlerFactory.getParameter Setting maxThreadIdleTime to: 5
   [junit4]   2> 90556 T263 oashc.HttpShardHandlerFactory.getParameter Setting sizeOfQueue to: -1
   [junit4]   2> 90556 T263 oashc.HttpShardHandlerFactory.getParameter Setting fairnessPolicy to: false
   [junit4]   2> 90556 T263 oascsi.HttpClientUtil.createClient Creating new http client, config:maxConnectionsPerHost=20&maxConnections=10000&socketTimeout=120000&connTimeout=15000&retry=false
   [junit4]   2> 90560 T263 oasc.ZkContainer.initZooKeeper Zookeeper client=127.0.0.1:36400/solr
   [junit4]   2> 90560 T263 oasc.ZkController.checkChrootPath zkHost includes chroot
   [junit4]   2> 90561 T263 oascc.ConnectionManager.waitForConnected Waiting for client to connect to ZooKeeper
   [junit4]   2> 90564 T301 oascc.ConnectionManager.process Watcher org.apache.solr.common.cloud.ConnectionManager@32e7c4ef name:ZooKeeperConnection Watcher:127.0.0.1:36400 got event WatchedEvent state:SyncConnected type:None path:null path:null type:None
   [junit4]   2> 90565 T263 oascc.ConnectionManager.waitForConnected Client is connected to ZooKeeper
   [junit4]   2> 90570 T263 oascsi.HttpClientUtil.createClient Creating new http client, config:maxConnections=500&maxConnectionsPerHost=16&socketTimeout=120000&connTimeout=15000
   [junit4]   2> 90573 T263 oascc.ConnectionManager.waitForConnected Waiting for client to connect to ZooKeeper
   [junit4]   2> 90575 T303 oascc.ConnectionManager.process Watcher org.apache.solr.common.cloud.ConnectionManager@4db8738f name:ZooKeeperConnection Watcher:127.0.0.1:36400/solr got event WatchedEvent state:SyncConnected type:None path:null path:null type:None
   [junit4]   2> 90576 T263 oascc.ConnectionManager.waitForConnected Client is connected to ZooKeeper
   [junit4]   2> 90590 T263 oascc.ZkStateReader.createClusterStateWatchersAndUpdate Updating cluster state from ZooKeeper... 
   [junit4]   2> 91602 T263 oasc.ZkController.createEphemeralLiveNode Register node as live in ZooKeeper:/live_nodes/127.0.0.1:46363_xo_
   [junit4]   2> 91605 T263 oascc.SolrZkClient.makePath makePath: /live_nodes/127.0.0.1:46363_xo_
   [junit4]   2> 91615 T303 oascc.ZkStateReader$3.process Updating live nodes... (2)
   [junit4]   2> 91617 T290 oascc.ZkStateReader$3.process Updating live nodes... (2)
   [junit4]   2> 91618 T285 oascc.ZkStateReader$3.process Updating live nodes... (2)
   [junit4]   2> 91633 T263 oasc.CorePropertiesLocator.discover Looking for core definitions underneath /mnt/ssd/jenkins/workspace/Lucene-Solr-4.x-Linux/solr/build/solr-core/test/J1/./org.apache.solr.cloud.CollectionsAPIDistributedZkTest-jetty1-1375442358761
   [junit4]   2> 91675 T263 oasc.CorePropertiesLocator.discoverUnder Found core conf in /mnt/ssd/jenkins/workspace/Lucene-Solr-4.x-Linux/solr/build/solr-core/test/J1/./org.apache.solr.cloud.CollectionsAPIDistributedZkTest-jetty1-1375442358761/conf/
   [junit4]   2> 91676 T263 oasc.CorePropertiesLocator.discover Found 1 core definitions
   [junit4]   2> 91677 T263 oass.SolrDispatchFilter.init user.dir=/mnt/ssd/jenkins/workspace/Lucene-Solr-4.x-Linux/solr/build/solr-core/test/J1
   [junit4]   2> 91678 T263 oass.SolrDispatchFilter.init SolrDispatchFilter.init() done
   [junit4]   2> 91678 T263 oascsi.HttpClientUtil.createClient Creating new http client, config:maxConnections=128&maxConnectionsPerHost=32&followRedirects=false
   [junit4]   2> 91758 T263 oejs.Server.doStart jetty-8.1.10.v20130312
   [junit4]   2> 91760 T263 oejs.AbstractConnector.doStart Started SelectChannelConnector@127.0.0.1:53657
   [junit4]   2> 91761 T263 oass.SolrDispatchFilter.init SolrDispatchFilter.init()
   [junit4]   2> 91761 T263 oasc.SolrResourceLoader.locateSolrHome JNDI not configured for solr (NoInitialContextEx)
   [junit4]   2> 91762 T263 oasc.SolrResourceLoader.locateSolrHome using system property solr.solr.home: /mnt/ssd/jenkins/workspace/Lucene-Solr-4.x-Linux/solr/build/solr-core/test/J1/./org.apache.solr.cloud.CollectionsAPIDistributedZkTest-jetty2-1375442360021
   [junit4]   2> 91762 T263 oasc.SolrResourceLoader.<init> new SolrResourceLoader for directory: '/mnt/ssd/jenkins/workspace/Lucene-Solr-4.x-Linux/solr/build/solr-core/test/J1/./org.apache.solr.cloud.CollectionsAPIDistributedZkTest-jetty2-1375442360021/'
   [junit4]   2> 91774 T263 oasc.ConfigSolr.fromFile Loading container configuration from /mnt/ssd/jenkins/workspace/Lucene-Solr-4.x-Linux/solr/build/solr-core/test/J1/./org.apache.solr.cloud.CollectionsAPIDistributedZkTest-jetty2-1375442360021/solr.xml
   [junit4]   2> 91808 T263 oasc.ConfigSolrXml.<init> Config-defined core root directory: 
   [junit4]   2> 91809 T263 oasc.CoreContainer.<init> New CoreContainer 1221834129
   [junit4]   2> 91809 T263 oasc.CoreContainer.load Loading cores into CoreContainer [instanceDir=/mnt/ssd/jenkins/workspace/Lucene-Solr-4.x-Linux/solr/build/solr-core/test/J1/./org.apache.solr.cloud.CollectionsAPIDistributedZkTest-jetty2-1375442360021/]
   [junit4]   2> 91810 T263 oashc.HttpShardHandlerFactory.getParameter Setting socketTimeout to: 120000
   [junit4]   2> 91810 T263 oashc.HttpShardHandlerFactory.getParameter Setting urlScheme to: http://
   [junit4]   2> 91811 T263 oashc.HttpShardHandlerFactory.getParameter Setting connTimeout to: 15000
   [junit4]   2> 91811 T263 oashc.HttpShardHandlerFactory.getParameter Setting maxConnectionsPerHost to: 20
   [junit4]   2> 91811 T263 oashc.HttpShardHandlerFactory.getParameter Setting corePoolSize to: 0
   [junit4]   2> 91812 T263 oashc.HttpShardHandlerFactory.getParameter Setting maximumPoolSize to: 2147483647
   [junit4]   2> 91812 T263 oashc.HttpShardHandlerFactory.getParameter Setting maxThreadIdleTime to: 5
   [junit4]   2> 91813 T263 oashc.HttpShardHandlerFactory.getParameter Setting sizeOfQueue to: -1
   [junit4]   2> 91813 T263 oashc.HttpShardHandlerFactory.getParameter Setting fairnessPolicy to: false
   [junit4]   2> 91813 T263 oascsi.HttpClientUtil.createClient Creating new http client, config:maxConnectionsPerHost=20&maxConnections=10000&socketTimeout=120000&connTimeout=15000&retry=false
   [junit4]   2> 91817 T263 oasc.ZkContainer.initZooKeeper Zookeeper client=127.0.0.1:36400/solr
   [junit4]   2> 91817 T263 oasc.ZkController.checkChrootPath zkHost includes chroot
   [junit4]   2> 91818 T263 oascc.ConnectionManager.waitForConnected Waiting for client to connect to ZooKeeper
   [junit4]   2> 91820 T315 oascc.ConnectionManager.process Watcher org.apache.solr.common.cloud.ConnectionManager@433567f1 name:ZooKeeperConnection Watcher:127.0.0.1:36400 got event WatchedEvent state:SyncConnected type:None path:null path:null type:None
   [junit4]   2> 91821 T263 oascc.ConnectionManager.waitForConnected Client is connected to ZooKeeper
   [junit4]   2> 91823 T263 oascsi.HttpClientUtil.createClient Creating new http client, config:maxConnections=500&maxConnectionsPerHost=16&socketTimeout=120000&connTimeout=15000
   [junit4]   2> 91827 T263 oascc.ConnectionManager.waitForConnected Waiting for client to connect to ZooKeeper
   [junit4]   2> 91829 T317 oascc.ConnectionManager.process Watcher org.apache.solr.common.cloud.ConnectionManager@250fc185 name:ZooKeeperConnection Watcher:127.0.0.1:36400/solr got event WatchedEvent state:SyncConnected type:None path:null path:null type:None
   [junit4]   2> 91829 T263 oascc.ConnectionManager.waitForConnected Client is connected to ZooKeeper
   [junit4]   2> 91838 T263 oascc.ZkStateReader.createClusterStateWatchersAndUpdate Updating cluster state from ZooKeeper... 
   [junit4]   2> 92846 T263 oasc.ZkController.createEphemeralLiveNode Register node as live in ZooKeeper:/live_nodes/127.0.0.1:53657_xo_
   [junit4]   2> 92849 T263 oascc.SolrZkClient.makePath makePath: /live_nodes/127.0.0.1:53657_xo_
   [junit4]   2> 92860 T290 oascc.ZkStateReader$3.process Updating live nodes... (3)
   [junit4]   2> 92861 T317 oascc.ZkStateReader$3.process Updating live nodes... (3)
   [junit4]   2> 92862 T303 oascc.ZkStateReader$3.process Updating live nodes... (3)
   [junit4]   2> 92864 T285 oascc.ZkStateReader$3.process Updating live nodes... (3)
   [junit4]   2> 92879 T263 oasc.CorePropertiesLocator.discover Looking for core definitions underneath /mnt/ssd/jenkins/workspace/Lucene-Solr-4.x-Linux/solr/build/solr-core/test/J1/./org.apache.solr.cloud.CollectionsAPIDistributedZkTest-jetty2-1375442360021
   [junit4]   2> 92908 T263 oasc.CorePropertiesLocator.discoverUnder Found core conf in /mnt/ssd/jenkins/workspace/Lucene-Solr-4.x-Linux/solr/build/solr-core/test/J1/./org.apache.solr.cloud.CollectionsAPIDistributedZkTest-jetty2-1375442360021/conf/
   [junit4]   2> 92909 T263 oasc.CorePropertiesLocator.discover Found 1 core definitions
   [junit4]   2> 92909 T263 oass.SolrDispatchFilter.init user.dir=/mnt/ssd/jenkins/workspace/Lucene-Solr-4.x-Linux/solr/build/solr-core/test/J1
   [junit4]   2> 92910 T263 oass.SolrDispatchFilter.init SolrDispatchFilter.init() done
   [junit4]   2> 92910 T263 oascsi.HttpClientUtil.createClient Creating new http client, config:maxConnections=128&maxConnectionsPerHost=32&followRedirects=false
   [junit4]   2> 92999 T263 oejs.Server.doStart jetty-8.1.10.v20130312
   [junit4]   2> 93001 T263 oejs.AbstractConnector.doStart Started SelectChannelConnector@127.0.0.1:58803
   [junit4]   2> 93002 T263 oass.SolrDispatchFilter.init SolrDispatchFilter.init()
   [junit4]   2> 93002 T263 oasc.SolrResourceLoader.locateSolrHome JNDI not configured for solr (NoInitialContextEx)
   [junit4]   2> 93003 T263 oasc.SolrResourceLoader.locateSolrHome using system property solr.solr.home: /mnt/ssd/jenkins/workspace/Lucene-Solr-4.x-Linux/solr/build/solr-core/test/J1/./org.apache.solr.cloud.CollectionsAPIDistributedZkTest-jetty3-1375442361252
   [junit4]   2> 93003 T263 oasc.SolrResourceLoader.<init> new SolrResourceLoader for directory: '/mnt/ssd/jenkins/workspace/Lucene-Solr-4.x-Linux/solr/build/solr-core/test/J1/./org.apache.solr.cloud.CollectionsAPIDistributedZkTest-jetty3-1375442361252/'
   [junit4]   2> 93013 T263 oasc.ConfigSolr.fromFile Loading container configuration from /mnt/ssd/jenkins/workspace/Lucene-Solr-4.x-Linux/solr/build/solr-core/test/J1/./org.apache.solr.cloud.CollectionsAPIDistributedZkTest-jetty3-1375442361252/solr.xml
   [junit4]   2> 93043 T263 oasc.ConfigSolrXml.<init> Config-defined core root directory: 
   [junit4]   2> 93044 T263 oasc.CoreContainer.<init> New CoreContainer 155599386
   [junit4]   2> 93044 T263 oasc.CoreContainer.load Loading cores into CoreContainer [instanceDir=/mnt/ssd/jenkins/workspace/Lucene-Solr-4.x-Linux/solr/build/solr-core/test/J1/./org.apache.solr.cloud.CollectionsAPIDistributedZkTest-jetty3-1375442361252/]
   [junit4]   2> 93045 T263 oashc.HttpShardHandlerFactory.getParameter Setting socketTimeout to: 120000
   [junit4]   2> 93046 T263 oashc.HttpShardHandlerFactory.getParameter Setting urlScheme to: http://
   [junit4]   2> 93046 T263 oashc.HttpShardHandlerFactory.getParameter Setting connTimeout to: 15000
   [junit4]   2> 93046 T263 oashc.HttpShardHandlerFactory.getParameter Setting maxConnectionsPerHost to: 20
   [junit4]   2> 93047 T263 oashc.HttpShardHandlerFactory.getParameter Setting corePoolSize to: 0
   [junit4]   2> 93047 T263 oashc.HttpShardHandlerFactory.getParameter Setting maximumPoolSize to: 2147483647
   [junit4]   2> 93047 T263 oashc.HttpShardHandlerFactory.getParameter Setting maxThreadIdleTime to: 5
   [junit4]   2> 93047 T263 oashc.HttpShardHandlerFactory.getParameter Setting sizeOfQueue to: -1
   [junit4]   2> 93048 T263 oashc.HttpShardHandlerFactory.getParameter Setting fairnessPolicy to: false
   [junit4]   2> 93048 T263 oascsi.HttpClientUtil.createClient Creating new http client, config:maxConnectionsPerHost=20&maxConnections=10000&socketTimeout=120000&connTimeout=15000&retry=false
   [junit4]   2> 93051 T263 oasc.ZkContainer.initZooKeeper Zookeeper client=127.0.0.1:36400/solr
   [junit4]   2> 93052 T263 oasc.ZkController.checkChrootPath zkHost includes chroot
   [junit4]   2> 93052 T263 oascc.ConnectionManager.waitForConnected Waiting for client to connect to ZooKeeper
   [junit4]   2> 93055 T329 oascc.ConnectionManager.process Watcher org.apache.solr.common.cloud.ConnectionManager@639dbdb7 name:ZooKeeperConnection Watcher:127.0.0.1:36400 got event WatchedEvent state:SyncConnected type:None path:null path:null type:None
   [junit4]   2> 93055 T263 oascc.ConnectionManager.waitForConnected Client is connected to ZooKeeper
   [junit4]   2> 93060 T263 oascsi.HttpClientUtil.createClient Creating new http client, config:maxConnections=500&maxConnectionsPerHost=16&socketTimeout=120000&connTimeout=15000
   [junit4]   2> 93063 T263 oascc.ConnectionManager.waitForConnected Waiting for client to connect to ZooKeeper
   [junit4]   2> 93065 T331 oascc.ConnectionManager.process Watcher org.apache.solr.common.cloud.ConnectionManager@15dcae3b name:ZooKeeperConnection Watcher:127.0.0.1:36400/solr got event WatchedEvent state:SyncConnected type:None path:null path:null type:None
   [junit4]   2> 93065 T263 oascc.ConnectionManager.waitForConnected Client is connected to ZooKeeper
   [junit4]   2> 93078 T263 oascc.ZkStateReader.createClusterStateWatchersAndUpdate Updating cluster state from ZooKeeper... 
   [junit4]   2> 94089 T263 oasc.ZkController.createEphemeralLiveNode Register node as live in ZooKeeper:/live_nodes/127.0.0.1:58803_xo_
   [junit4]   2> 94093 T263 oascc.SolrZkClient.makePath makePath: /live_nodes/127.0.0.1:58803_xo_
   [junit4]   2> 94105 T317 oascc.ZkStateReader$3.process Updating live nodes... (4)
   [junit4]   2> 94105 T303 oascc.ZkStateReader$3.process Updating live nodes... (4)
   [junit4]   2> 94105 T331 oascc.ZkStateReader$3.process Updating live nodes... (4)
   [junit4]   2> 94107 T285 oascc.ZkStateReader$3.process Updating live nodes... (4)
   [junit4]   2> 94107 T290 oascc.ZkStateReader$3.process Updating live nodes... (4)
   [junit4]   2> 94119 T263 oasc.CorePropertiesLocator.discover Looking for core definitions underneath /mnt/ssd/jenkins/workspace/Lucene-Solr-4.x-Linux/solr/build/solr-core/test/J1/./org.apache.solr.cloud.CollectionsAPIDistributedZkTest-jetty3-1375442361252
   [junit4]   2> 94161 T263 oasc.CorePropertiesLocator.discoverUnder Found core conf in /mnt/ssd/jenkins/workspace/Lucene-Solr-4.x-Linux/solr/build/solr-core/test/J1/./org.apache.solr.cloud.CollectionsAPIDistributedZkTest-jetty3-1375442361252/conf/
   [junit4]   2> 94161 T263 oasc.CorePropertiesLocator.discover Found 1 core definitions
   [junit4]   2> 94162 T263 oass.SolrDispatchFilter.init user.dir=/mnt/ssd/jenkins/workspace/Lucene-Solr-4.x-Linux/solr/build/solr-core/test/J1
   [junit4]   2> 94162 T263 oass.SolrDispatchFilter.init SolrDispatchFilter.init() done
   [junit4]   2> 94162 T263 oascsi.HttpClientUtil.createClient Creating new http client, config:maxConnections=128&maxConnectionsPerHost=32&followRedirects=false
   [junit4]   2> 94244 T263 oejs.Server.doStart jetty-8.1.10.v20130312
   [junit4]   2> 94246 T263 oejs.AbstractConnector.doStart Started SelectChannelConnector@127.0.0.1:33626
   [junit4]   2> 94247 T263 oass.SolrDispatchFilter.init SolrDispatchFilter.init()
   [junit4]   2> 94247 T263 oasc.SolrResourceLoader.locateSolrHome JNDI not configured for solr (NoInitialContextEx)
   [junit4]   2> 94248 T263 oasc.SolrResourceLoader.locateSolrHome using system property solr.solr.home: /mnt/ssd/jenkins/workspace/Lucene-Solr-4.x-Linux/solr/build/solr-core/test/J1/./org.apache.solr.cloud.CollectionsAPIDistributedZkTest-jetty4-1375442362505
   [junit4]   2> 94248 T263 oasc.SolrResourceLoader.<init> new SolrResourceLoader for directory: '/mnt/ssd/jenkins/workspace/Lucene-Solr-4.x-Linux/solr/build/solr-core/test/J1/./org.apache.solr.cloud.CollectionsAPIDistributedZkTest-jetty4-1375442362505/'
   [junit4]   2> 94258 T263 oasc.ConfigSolr.fromFile Loading container configuration from /mnt/ssd/jenkins/workspace/Lucene-Solr-4.x-Linux/solr/build/solr-core/test/J1/./org.apache.solr.cloud.CollectionsAPIDistributedZkTest-jetty4-1375442362505/solr.xml
   [junit4]   2> 94289 T263 oasc.ConfigSolrXml.<init> Config-defined core root directory: 
   [junit4]   2> 94290 T263 oasc.CoreContainer.<init> New CoreContainer 2139227531
   [junit4]   2> 94290 T263 oasc.CoreContainer.load Loading cores into CoreContainer [instanceDir=/mnt/ssd/jenkins/workspace/Lucene-Solr-4.x-Linux/solr/build/solr-core/test/J1/./org.apache.solr.cloud.CollectionsAPIDistributedZkTest-jetty4-1375442362505/]
   [junit4]   2> 94291 T263 oashc.HttpShardHandlerFactory.getParameter Setting socketTimeout to: 120000
   [junit4]   2> 94291 T263 oashc.HttpShardHandlerFactory.getParameter Setting urlScheme to: http://
   [junit4]   2> 94292 T263 oashc.HttpShardHandlerFactory.getParameter Setting connTimeout to: 15000
   [junit4]   2> 94292 T263 oashc.HttpShardHandlerFactory.getParameter Setting maxConnectionsPerHost to: 20
   [junit4]   2> 94292 T263 oashc.HttpShardHandlerFactory.getParameter Setting corePoolSize to: 0
   [junit4]   2> 94293 T263 oashc.HttpShardHandlerFactory.getParameter Setting maximumPoolSize to: 2147483647
   [junit4]   2> 94293 T263 oashc.HttpShardHandlerFactory.getParameter Setting maxThreadIdleTime to: 5
   [junit4]   2> 94293 T263 oashc.HttpShardHandlerFactory.getParameter Setting sizeOfQueue to: -1
   [junit4]   2> 94294 T263 oashc.HttpShardHandlerFactory.getParameter Setting fairnessPolicy to: false
   [junit4]   2> 94294 T263 oascsi.HttpClientUtil.createClient Creating new http client, config:maxConnectionsPerHost=20&maxConnections=10000&socketTimeout=120000&connTimeout=15000&retry=false
   [junit4]   2> 94297 T263 oasc.ZkContainer.initZooKeeper Zookeeper client=127.0.0.1:36400/solr
   [junit4]   2> 94298 T263 oasc.ZkController.checkChrootPath zkHost includes chroot
   [junit4]   2> 94299 T263 oascc.ConnectionManager.waitForConnected Waiting for client to connect to ZooKeeper
   [junit4]   2> 94301 T343 oascc.ConnectionManager.process Watcher org.apache.solr.common.cloud.ConnectionManager@313a2a13 name:ZooKeeperConnection Watcher:127.0.0.1:36400 got event WatchedEvent state:SyncConnected type:None path:null path:null type:None
   [junit4]   2> 94302 T263 oascc.ConnectionManager.waitForConnected Client is connected to ZooKeeper
   [junit4]   2> 94305 T263 oascsi.HttpClientUtil.createClient Creating new http client, config:maxConnections=500&maxConnectionsPerHost=16&socketTimeout=120000&connTimeout=15000
   [junit4]   2> 94308 T263 oascc.ConnectionManager.waitForConnected Waiting for client to connect to ZooKeeper
   [junit4]   2> 94310 T345 oascc.ConnectionManager.process Watcher org.apache.solr.common.cloud.ConnectionManager@52934ea0 name:ZooKeeperConnection Watcher:127.0.0.1:36400/solr got event WatchedEvent state:SyncConnected type:None path:null path:null type:None
   [junit4]   2> 94310 T263 oascc.ConnectionManager.waitForConnected Client is connected to ZooKeeper
   [junit4]   2> 94317 T263 oascc.ZkStateReader.createClusterStateWatchersAndUpdate Updating cluster state from ZooKeeper... 
   [junit4]   2> 95324 T263 oasc.ZkController.createEphemeralLiveNode Register node as live in ZooKeeper:/live_nodes/127.0.0.1:33626_xo_
   [junit4]   2> 95326 T263 oascc.SolrZkClient.makePath makePath: /live_nodes/127.0.0.1:33626_xo_
   [junit4]   2> 95333 T317 oascc.ZkStateReader$3.process Updating live nodes... (5)
   [junit4]   2> 95333 T303 oascc.ZkStateReader$3.process Updating live nodes... (5)
   [junit4]   2> 95334 T290 oascc.ZkStateReader$3.process Updating live nodes... (5)
   [junit4]   2> 95334 T331 oascc.ZkStateReader$3.process Updating live nodes... (5)
   [junit4]   2> 95335 T285 oascc.ZkStateReader$3.process Updating live nodes... (5)
   [junit4]   2> 95335 T345 oascc.ZkStateReader$3.process Updating live nodes... (5)
   [junit4]   2> 95347 T263 oasc.CorePropertiesLocator.discover Looking for core definitions underneath /mnt/ssd/jenkins/workspace/Lucene-Solr-4.x-Linux/solr/build/solr-core/test/J1/./org.apache.solr.cloud.CollectionsAPIDistributedZkTest-jetty4-1375442362505
   [junit4]   2> 95397 T263 oasc.CorePropertiesLocator.discoverUnder Found core conf in /mnt/ssd/jenkins/workspace/Lucene-Solr-4.x-Linux/solr/build/solr-core/test/J1/./org.apache.solr.cloud.CollectionsAPIDistributedZkTest-jetty4-1375442362505/conf/
   [junit4]   2> 95398 T263 oasc.CorePropertiesLocator.discover Found 1 core definitions
   [junit4]   2> 95398 T263 oass.SolrDispatchFilter.init user.dir=/mnt/ssd/jenkins/workspace/Lucene-Solr-4.x-Linux/solr/build/solr-core/test/J1
   [junit4]   2> 95399 T263 oass.SolrDispatchFilter.init SolrDispatchFilter.init() done
   [junit4]   2> 95399 T263 oascsi.HttpClientUtil.createClient Creating new http client, config:maxConnections=128&maxConnectionsPerHost=32&followRedirects=false
   [junit4]   2> 95404 T263 oascsi.HttpClientUtil.createClient Creating new http client, config:maxConnections=128&maxConnectionsPerHost=32&followRedirects=false
   [junit4]   2> 95411 T296 oasha.CollectionsHandler.handleCreateAction Creating Collection : numShards=2&name=nodes_used_collection&replicationFactor=2&action=CREATE&wt=javabin&version=2
   [junit4]   2> 95413 T285 oasc.DistributedQueue$LatchChildWatcher.process Watcher fired on path: /overseer/collection-queue-work state: SyncConnected type NodeChildrenChanged
   [junit4]   2> 95415 T285 oasc.DistributedQueue$LatchChildWatcher.process Watcher fired on path: /overseer/collection-queue-work state: SyncConnected type NodeChildrenChanged
   [junit4]   2> 95417 T287 oasc.OverseerCollectionProcessor.run Overseer Collection Processor: Get the message id:/overseer/collection-queue-work/qn-0000000000 message:{
   [junit4]   2> 	  "operation":"createcollection",
   [junit4]   2> 	  "numShards":"2",
   [junit4]   2> 	  "name":"nodes_used_collection",
   [junit4]   2> 	  "replicationFactor":"2"}
   [junit4]   2> 95417 T287 oasc.OverseerCollectionProcessor.processMessage WARN OverseerCollectionProcessor.processMessage : createcollection , {
   [junit4]   2> 	  "operation":"createcollection",
   [junit4]   2> 	  "numShards":"2",
   [junit4]   2> 	  "name":"nodes_used_collection",
   [junit4]   2> 	  "replicationFactor":"2"}
   [junit4]   2> 96401 T286 oascc.ZkStateReader.updateClusterState Updating cloud state from ZooKeeper... 
   [junit4]   2> 96403 T286 oasc.Overseer$ClusterStateUpdater.buildCollection building a new collection: nodes_used_collection
   [junit4]   2> 96403 T286 oasc.Overseer$ClusterStateUpdater.createCollection Create collection nodes_used_collection with shards [shard1, shard2]
   [junit4]   2> 96415 T285 oascc.ZkStateReader$2.process A cluster state change: WatchedEvent state:SyncConnected type:NodeDataChanged path:/clusterstate.json, has occurred - updating... (live nodes size: 5)
   [junit4]   2> 96415 T317 oascc.ZkStateReader$2.process A cluster state change: WatchedEvent state:SyncConnected type:NodeDataChanged path:/clusterstate.json, has occurred - updating... (live nodes size: 5)
   [junit4]   2> 96415 T303 oascc.ZkStateReader$2.process A cluster state change: WatchedEvent state:SyncConnected type:NodeDataChanged path:/clusterstate.json, has occurred - updating... (live nodes size: 5)
   [junit4]   2> 96415 T345 oascc.ZkStateReader$2.process A cluster state change: WatchedEvent state:SyncConnected type:NodeDataChanged path:/clusterstate.json, has occurred - updating... (live nodes size: 5)
   [junit4]   2> 96416 T331 oascc.ZkStateReader$2.process A cluster state change: WatchedEvent state:SyncConnected type:NodeDataChanged path:/clusterstate.json, has occurred - updating... (live nodes size: 5)
   [junit4]   2> 96417 T290 oascc.ZkStateReader$2.process A cluster state change: WatchedEvent state:SyncConnected type:NodeDataChanged path:/clusterstate.json, has occurred - updating... (live nodes size: 5)
   [junit4]   2> 96523 T287 oasc.OverseerCollectionProcessor.createCollection going to create cores replicas shardNames [shard1, shard2] , repFactor : 2
   [junit4]   2> 96524 T287 oasc.OverseerCollectionProcessor.createCollection Creating shard nodes_used_collection_shard1_replica1 as part of slice shard1 of collection nodes_used_collection on 127.0.0.1:53657_xo_
   [junit4]   2> 96525 T287 oasc.OverseerCollectionProcessor.createCollection Creating shard nodes_used_collection_shard1_replica2 as part of slice shard1 of collection nodes_used_collection on 127.0.0.1:58803_xo_
   [junit4]   2> 96526 T287 oasc.OverseerCollectionProcessor.createCollection Creating shard nodes_used_collection_shard2_replica1 as part of slice shard2 of collection nodes_used_collection on 127.0.0.1:46363_xo_
   [junit4]   2> 96527 T287 oasc.OverseerCollectionProcessor.createCollection Creating shard nodes_used_collection_shard2_replica2 as part of slice shard2 of collection nodes_used_collection on 127.0.0.1:43026_xo_
   [junit4]   2> 96533 T326 oasc.ZkController.publish publishing core=nodes_used_collection_shard1_replica2 state=down
   [junit4]   2> 96533 T279 oasc.ZkController.publish publishing core=nodes_used_collection_shard2_replica2 state=down
   [junit4]   2> 96533 T297 oasc.ZkController.publish publishing core=nodes_used_collection_shard2_replica1 state=down
   [junit4]   2> 96533 T310 oasc.ZkController.publish publishing core=nodes_used_collection_shard1_replica1 state=down
   [junit4]   2> 96536 T326 oasc.ZkController.waitForCoreNodeName look for our core node name
   [junit4]   2> 96537 T279 oasc.ZkController.waitForCoreNodeName look for our core node name
   [junit4]   2> 96539 T297 oasc.ZkController.waitForCoreNodeName look for our core node name
   [junit4]   2> 96539 T310 oasc.ZkController.waitForCoreNodeName look for our core node name
   [junit4]   2> 97944 T286 oascc.ZkStateReader.updateClusterState Updating cloud state from ZooKeeper... 
   [junit4]   2> 97948 T286 oasc.Overseer$ClusterStateUpdater.updateState WARN Could not find collection node for nodes_used_collection, skipping publish state
   [junit4]   2> 97948 T286 oasc.Overseer$ClusterStateUpdater.updateState Update state numShards=2 message={
   [junit4]   2> 	  "operation":"state",
   [junit4]   2> 	  "core_node_name":"core_node1",
   [junit4]   2> 	  "numShards":"2",
   [junit4]   2> 	  "shard":"shard1",
   [junit4]   2> 	  "roles":null,
   [junit4]   2> 	  "state":"down",
   [junit4]   2> 	  "shard_state":"active",
   [junit4]   2> 	  "core":"nodes_used_collection_shard1_replica2",
   [junit4]   2> 	  "collection":"nodes_used_collection",
   [junit4]   2> 	  "shard_range":null,
   [junit4]   2> 	  "node_name":"127.0.0.1:58803_xo_",
   [junit4]   2> 	  "base_url":"http://127.0.0.1:58803/xo_"}
   [junit4]   2> 97961 T286 oasc.Overseer$ClusterStateUpdater.updateState WARN Could not find collection node for nodes_used_collection, skipping publish state
   [junit4]   2> 97961 T286 oasc.Overseer$ClusterStateUpdater.updateState Update state numShards=2 message={
   [junit4]   2> 	  "operation":"state",
   [junit4]   2> 	  "core_node_name":"core_node2",
   [junit4]   2> 	  "numShards":"2",
   [junit4]   2> 	  "shard":"shard2",
   [junit4]   2> 	  "roles":null,
   [junit4]   2> 	  "state":"down",
   [junit4]   2> 	  "shard_state":"active",
   [junit4]   2> 	  "core":"nodes_used_collection_shard2_replica2",
   [junit4]   2> 	  "collection":"nodes_used_collection",
   [junit4]   2> 	  "shard_range":null,
   [junit4]   2> 	  "node_name":"127.0.0.1:43026_xo_",
   [junit4]   2> 	  "base_url":"http://127.0.0.1:43026/xo_"}
   [junit4]   2> 97975 T286 oasc.Overseer$ClusterStateUpdater.updateState WARN Could not find collection node for nodes_used_collection, skipping publish state
   [junit4]   2> 97976 T286 oasc.Overseer$ClusterStateUpdater.updateState Update state numShards=2 message={
   [junit4]   2> 	  "operation":"state",
   [junit4]   2> 	  "core_node_name":"core_node3",
   [junit4]   2> 	  "numShards":"2",
   [junit4]   2> 	  "shard":"shard2",
   [junit4]   2> 	  "roles":null,
   [junit4]   2> 	  "state":"down",
   [junit4]   2> 	  "shard_state":"active",
   [junit4]   2> 	  "core":"nodes_used_collection_shard2_replica1",
   [junit4]   2> 	  "collection":"nodes_used_collection",
   [junit4]   2> 	  "shard_range":null,
   [junit4]   2> 	  "node_name":"127.0.0.1:46363_xo_",
   [junit4]   2> 	  "base_url":"http://127.0.0.1:46363/xo_"}
   [junit4]   2> 97991 T286 oasc.Overseer$ClusterStateUpdater.updateState WARN Could not find collection node for nodes_used_collection, skipping publish state
   [junit4]   2> 97992 T286 oasc.Overseer$ClusterStateUpdater.updateState Update state numShards=2 message={
   [junit4]   2> 	  "operation":"state",
   [junit4]   2> 	  "core_node_name":"core_node4",
   [junit4]   2> 	  "numShards":"2",
   [junit4]   2> 	  "shard":"shard1",
   [junit4]   2> 	  "roles":null,
   [junit4]   2> 	  "state":"down",
   [junit4]   2> 	  "shard_state":"active",
   [junit4]   2> 	  "core":"nodes_used_collection_shard1_replica1",
   [junit4]   2> 	  "collection":"nodes_used_collection",
   [junit4]   2> 	  "shard_range":null,
   [junit4]   2> 	  "node_name":"127.0.0.1:53657_xo_",
   [junit4]   2> 	  "base_url":"http://127.0.0.1:53657/xo_"}
   [junit4]   2> 98003 T285 oascc.ZkStateReader$2.process A cluster state change: WatchedEvent state:SyncConnected type:NodeDataChanged path:/clusterstate.json, has occurred - updating... (live nodes size: 5)
   [junit4]   2> 98004 T303 oascc.ZkStateReader$2.process A cluster state change: WatchedEvent state:SyncConnected type:NodeDataChanged path:/clusterstate.json, has occurred - updating... (live nodes size: 5)
   [junit4]   2> 98004 T345 oascc.ZkStateReader$2.process A cluster state change: WatchedEvent state:SyncConnected type:NodeDataChanged path:/clusterstate.json, has occurred - updating... (live nodes size: 5)
   [junit4]   2> 98004 T331 oascc.ZkStateReader$2.process A cluster state change: WatchedEvent state:SyncConnected type:NodeDataChanged path:/clusterstate.json, has occurred - updating... (live nodes size: 5)
   [junit4]   2> 98005 T290 oascc.ZkStateReader$2.process A cluster state change: WatchedEvent state:SyncConnected type:NodeDataChanged path:/clusterstate.json, has occurred - updating... (live nodes size: 5)
   [junit4]   2> 98006 T317 oascc.ZkStateReader$2.process A cluster state change: WatchedEvent state:SyncConnected type:NodeDataChanged path:/clusterstate.json, has occurred - updating... (live nodes size: 5)
   [junit4]   2> 98537 T326 oasc.ZkController.waitForShardId waiting to find shard id in clusterstate for nodes_used_collection_shard1_replica2
   [junit4]   2> 98538 T279 oasc.ZkController.waitForShardId waiting to find shard id in clusterstate for nodes_used_collection_shard2_replica2
   [junit4]   2> 98538 T326 oasc.CorePropertiesLocator.writePropertiesFile ERROR Couldn't persist core properties to /mnt/ssd/jenkins/workspace/Lucene-Solr-4.x-Linux/solr/build/solr-core/test/J1/./org.apache.solr.cloud.CollectionsAPIDistributedZkTest-jetty3-1375442361252/nodes_used_collection_shard1_replica2/core.properties: java.io.FileNotFoundException: /mnt/ssd/jenkins/workspace/Lucene-Solr-4.x-Linux/solr/build/solr-core/test/J1/./org.apache.solr.cloud.CollectionsAPIDistributedZkTest-jetty3-1375442361252/nodes_used_collection_shard1_replica2/core.properties (No such file or directory)
   [junit4]   2> 98540 T297 oasc.ZkController.waitForShardId waiting to find shard id in clusterstate for nodes_used_collection_shard2_replica1
   [junit4]   2> 98540 T279 oasc.CorePropertiesLocator.writePropertiesFile ERROR Couldn't persist core properties to /mnt/ssd/jenkins/workspace/Lucene-Solr-4.x-Linux/solr/build/solr-core/test/J1/./org.apache.solr.cloud.CollectionsAPIDistributedZkTest-controljetty-1375442358478/nodes_used_collection_shard2_replica2/core.properties: java.io.FileNotFoundException: /mnt/ssd/jenkins/workspace/Lucene-Solr-4.x-Linux/solr/build/solr-core/test/J1/./org.apache.solr.cloud.CollectionsAPIDistributedZkTest-controljetty-1375442358478/nodes_used_collection_shard2_replica2/core.properties (No such file or directory)
   [junit4]   2> 98541 T279 oasc.CoreContainer.create Creating SolrCore 'nodes_used_collection_shard2_replica2' using instanceDir: /mnt/ssd/jenkins/workspace/Lucene-Solr-4.x-Linux/solr/build/solr-core/test/J1/./org.apache.solr.cloud.CollectionsAPIDistributedZkTest-controljetty-1375442358478/nodes_used_collection_shard2_replica2
   [junit4]   2> 98542 T279 oasc.ZkController.createCollectionZkNode Check for collection zkNode:nodes_used_collection
   [junit4]   2> 98541 T297 oasc.CorePropertiesLocator.writePropertiesFile ERROR Couldn't persist core properties to /mnt/ssd/jenkins/workspace/Lucene-Solr-4.x-Linux/solr/build/solr-core/test/J1/./org.apache.solr.cloud.CollectionsAPIDistributedZkTest-jetty1-1375442358761/nodes_used_collection_shard2_replica1/core.properties: java.io.FileNotFoundException: /mnt/ssd/jenkins/workspace/Lucene-Solr-4.x-Linux/solr/build/solr-core/test/J1/./org.apache.solr.cloud.CollectionsAPIDistributedZkTest-jetty1-1375442358761/nodes_used_collection_shard2_replica1/core.properties (No such file or directory)
   [junit4]   2> 98540 T310 oasc.ZkController.waitForShardId waiting to find shard id in clusterstate for nodes_used_collection_shard1_replica1
   [junit4]   2> 98540 T326 oasc.CoreContainer.create Creating SolrCore 'nodes_used_collection_shard1_replica2' using instanceDir: /mnt/ssd/jenkins/workspace/Lucene-Solr-4.x-Linux/solr/build/solr-core/test/J1/./org.apache.solr.cloud.CollectionsAPIDistributedZkTest-jetty3-1375442361252/nodes_used_collection_shard1_replica2
   [junit4]   2> 98544 T326 oasc.ZkController.createCollectionZkNode Check for collection zkNode:nodes_used_collection
   [junit4]   2> 98544 T310 oasc.CorePropertiesLocator.writePropertiesFile ERROR Couldn't persist core properties to /mnt/ssd/jenkins/workspace/Lucene-Solr-4.x-Linux/solr/build/solr-core/test/J1/./org.apache.solr.cloud.CollectionsAPIDistributedZkTest-jetty2-1375442360021/nodes_used_collection_shard1_replica1/core.properties: java.io.FileNotFoundException: /mnt/ssd/jenkins/workspace/Lucene-Solr-4.x-Linux/solr/build/solr-core/test/J1/./org.apache.solr.cloud.CollectionsAPIDistributedZkTest-jetty2-1375442360021/nodes_used_collection_shard1_replica1/core.properties (No such file or directory)
   [junit4]   2> 98543 T297 oasc.CoreContainer.create Creating SolrCore 'nodes_used_collection_shard2_replica1' using instanceDir: /mnt/ssd/jenkins/workspace/Lucene-Solr-4.x-Linux/solr/build/solr-core/test/J1/./org.apache.solr.cloud.CollectionsAPIDistributedZkTest-jetty1-1375442358761/nodes_used_collection_shard2_replica1
   [junit4]   2> 98546 T297 oasc.ZkController.createCollectionZkNode Check for collection zkNode:nodes_used_collection
   [junit4]   2> 98546 T326 oasc.ZkController.createCollectionZkNode Creating collection in ZooKeeper:nodes_used_collection
   [junit4]   2> 98545 T310 oasc.CoreContainer.create Creating SolrCore 'nodes_used_collection_shard1_replica1' using instanceDir: /mnt/ssd/jenkins/workspace/Lucene-Solr-4.x-Linux/solr/build/solr-core/test/J1/./org.apache.solr.cloud.CollectionsAPIDistributedZkTest-jetty2-1375442360021/nodes_used_collection_shard1_replica1
   [junit4]   2> 98548 T310 oasc.ZkController.createCollectionZkNode Check for collection zkNode:nodes_used_collection
   [junit4]   2> 98544 T279 oasc.ZkController.createCollectionZkNode Creating collection in ZooKeeper:nodes_used_collection
   [junit4]   2> 98548 T297 oasc.ZkController.createCollectionZkNode Creating collection in ZooKeeper:nodes_used_collection
   [junit4]   2> 98547 T326 oasc.ZkController.getConfName Looking for collection configName
   [junit4]   2> 98550 T310 oasc.ZkController.createCollectionZkNode Creating collection in ZooKeeper:nodes_used_collection
   [junit4]   2> 98549 T297 oasc.ZkController.getConfName Looking for collection configName
   [junit4]   2> 98549 T279 oasc.ZkController.getConfName Looking for collection configName
   [junit4]   2> 98550 T310 oasc.ZkController.getConfName Looking for collection configName
   [junit4]   2> 98556 T326 oasc.ZkController.getConfName Only one config set found in zk - using it:conf1
   [junit4]   2> 98557 T326 oascc.SolrZkClient.makePath makePath: /collections/nodes_used_collection
   [junit4]   2> 98558 T279 oasc.ZkController.getConfName Only one config set found in zk - using it:conf1
   [junit4]   2> 98559 T279 oascc.SolrZkClient.makePath makePath: /collections/nodes_used_collection
   [junit4]   2> 98563 T297 oasc.ZkController.getConfName Only one config set found in zk - using it:conf1
   [junit4]   2> 98564 T297 oascc.SolrZkClient.makePath makePath: /collections/nodes_used_collection
   [junit4]   2> 98567 T310 oasc.ZkController.getConfName Only one config set found in zk - using it:conf1
   [junit4]   2> 98568 T310 oascc.SolrZkClient.makePath makePath: /collections/nodes_used_collection
   [junit4]   2> 98571 T279 oasc.ZkController.readConfigName Load collection config from:/collections/nodes_used_collection
   [junit4]   2> 98579 T326 oasc.ZkController.readConfigName Load collection config from:/collections/nodes_used_collection
   [junit4]   2> 98579 T279 oasc.SolrResourceLoader.<init> new SolrResourceLoader for directory: '/mnt/ssd/jenkins/workspace/Lucene-Solr-4.x-Linux/solr/build/solr-core/test/J1/./org.apache.solr.cloud.CollectionsAPIDistributedZkTest-controljetty-1375442358478/nodes_used_collection_shard2_replica2/'
   [junit4]   2> 98580 T310 oasc.ZkController.readConfigName Load collection config from:/collections/nodes_used_collection
   [junit4]   2> 98584 T297 oasc.ZkController.readConfigName Load collection config from:/collections/nodes_used_collection
   [junit4]   2> 98587 T326 oasc.SolrResourceLoader.<init> new SolrResourceLoader for directory: '/mnt/ssd/jenkins/workspace/Lucene-Solr-4.x-Linux/solr/build/solr-core/test/J1/./org.apache.solr.cloud.CollectionsAPIDistributedZkTest-jetty3-1375442361252/nodes_used_collection_shard1_replica2/'
   [junit4]   2> 98589 T310 oasc.SolrResourceLoader.<init> new SolrResourceLoader for directory: '/mnt/ssd/jenkins/workspace/Lucene-Solr-4.x-Linux/solr/build/solr-core/test/J1/./org.apache.solr.cloud.CollectionsAPIDistributedZkTest-jetty2-1375442360021/nodes_used_collection_shard1_replica1/'
   [junit4]   2> 98592 T297 oasc.SolrResourceLoader.<init> new SolrResourceLoader for directory: '/mnt/ssd/jenkins/workspace/Lucene-Solr-4.x-Linux/solr/build/solr-core/test/J1/./org.apache.solr.cloud.CollectionsAPIDistributedZkTest-jetty1-1375442358761/nodes_used_collection_shard2_replica1/'
   [junit4]   2> 98685 T326 oasc.SolrConfig.<init> Using Lucene MatchVersion: LUCENE_45
   [junit4]   2> 98696 T297 oasc.SolrConfig.<init> Using Lucene MatchVersion: LUCENE_45
   [junit4]   2> 98698 T279 oasc.SolrConfig.<init> Using Lucene MatchVersion: LUCENE_45
   [junit4]   2> 98700 T310 oasc.SolrConfig.<init> Using Lucene MatchVersion: LUCENE_45
   [junit4]   2> 98755 T326 oasc.SolrConfig.<init> Loaded SolrConfig: solrconfig.xml
   [junit4]   2> 98757 T297 oasc.SolrConfig.<init> Loaded SolrConfig: solrconfig.xml
   [junit4]   2> 98758 T326 oass.IndexSchema.readSchema Reading Solr Schema from schema.xml
   [junit4]   2> 98760 T297 oass.IndexSchema.readSchema Reading Solr Schema from schema.xml
   [junit4]   2> 98769 T297 oass.IndexSchema.readSchema [nodes_used_collection_shard2_replica1] Schema name=test
   [junit4]   2> 98773 T326 oass.IndexSchema.readSchema [nodes_used_collection_shard1_replica2] Schema name=test
   [junit4]   2> 98776 T310 oasc.SolrConfig.<init> Loaded SolrConfig: solrconfig.xml
   [junit4]   2> 98778 T279 oasc.SolrConfig.<init> Loaded SolrConfig: solrconfig.xml
   [junit4]   2> 98780 T310 oass.IndexSchema.readSchema Reading Solr Schema from schema.xml
   [junit4]   2> 98796 T279 oass.IndexSchema.readSchema Reading Solr Schema from schema.xml
   [junit4]   2> 98805 T310 oass.IndexSchema.readSchema [nodes_used_collection_shard1_replica1] Schema name=test
   [junit4]   2> 98810 T279 oass.IndexSchema.readSchema [nodes_used_collection_shard2_replica2] Schema name=test
   [junit4]   2> 99381 T326 oass.ByteField.init WARN ByteField is deprecated and will be removed in 5.0. You should use TrieIntField instead.
   [junit4]   2> 99381 T326 oass.ShortField.init WARN ShortField is deprecated and will be removed in 5.0. You should use TrieIntField instead.
   [junit4]   2> 99382 T326 oass.OpenExchangeRatesOrgProvider.init Initialized with rates=open-exchange-rates.json, refreshInterval=1440.
   [junit4]   2> 99389 T326 oass.IndexSchema.readSchema default search field in schema is text
   [junit4]   2> 99399 T326 oass.IndexSchema.readSchema unique key field: id
   [junit4]   2> 99430 T310 oass.ByteField.init WARN ByteField is deprecated and will be removed in 5.0. You should use TrieIntField instead.
   [junit4]   2> 99431 T310 oass.ShortField.init WARN ShortField is deprecated and will be removed in 5.0. You should use TrieIntField instead.
   [junit4]   2> 99432 T310 oass.OpenExchangeRatesOrgProvider.init Initialized with rates=open-exchange-rates.json, refreshInterval=1440.
   [junit4]   2> 99432 T326 oass.FileExchangeRateProvider.reload Reloading exchange rates from file currency.xml
   [junit4]   2> 99438 T326 oass.FileExchangeRateProvider.reload Reloading exchange rates from file currency.xml
   [junit4]   2> 99443 T326 oass.OpenExchangeRatesOrgProvider.reload Reloading exchange rates from open-exchange-rates.json
   [junit4]   2> 99445 T310 oass.IndexSchema.readSchema default search field in schema is text
   [junit4]   2> 99446 T326 oass.OpenExchangeRatesOrgProvider$OpenExchangeRates.<init> WARN Unknown key IMPORTANT NOTE
   [junit4]   2> 99447 T326 oass.OpenExchangeRatesOrgProvider$OpenExchangeRates.<init> WARN Expected key, got STRING
   [junit4]   2> 99448 T326 oass.OpenExchangeRatesOrgProvider.reload Reloading exchange rates from open-exchange-rates.json
   [junit4]   2> 99453 T310 oass.IndexSchema.readSchema unique key field: id
   [junit4]   2> 99454 T297 oass.ByteField.init WARN ByteField is deprecated and will be removed in 5.0. You should use TrieIntField instead.
   [junit4]   2> 99454 T297 oass.ShortField.init WARN ShortField is deprecated and will be removed in 5.0. You should use TrieIntField instead.
   [junit4]   2> 99455 T297 oass.OpenExchangeRatesOrgProvider.init Initialized with rates=open-exchange-rates.json, refreshInterval=1440.
   [junit4]   2> 99460 T326 oass.OpenExchangeRatesOrgProvider$OpenExchangeRates.<init> WARN Unknown key IMPORTANT NOTE
   [junit4]   2> 99461 T326 oass.OpenExchangeRatesOrgProvider$OpenExchangeRates.<init> WARN Expected key, got STRING
   [junit4]   2> 99462 T326 oasc.SolrCore.initDirectoryFactory org.apache.solr.core.MockDirectoryFactory
   [junit4]   2> 99462 T326 oasc.SolrCore.<init> [nodes_used_collection_shard1_replica2] Opening new SolrCore at /mnt/ssd/jenkins/workspace/Lucene-Solr-4.x-Linux/solr/build/solr-core/test/J1/./org.apache.solr.cloud.CollectionsAPIDistributedZkTest-jetty3-1375442361252/nodes_used_collection_shard1_replica2/, dataDir=/mnt/ssd/jenkins/workspace/Lucene-Solr-4.x-Linux/solr/build/solr-core/test/J1/./org.apache.solr.cloud.CollectionsAPIDistributedZkTest-jetty3-1375442361252//nodes_used_collection_shard1_replica2/data/
   [junit4]   2> 99463 T326 oasc.JmxMonitoredMap.<init> JMX monitoring is enabled. Adding Solr mbeans to JMX Server: com.sun.jmx.mbeanserver.JmxMBeanServer@6185e90f
   [junit4]   2> 99466 T326 oasc.CachingDirectoryFactory.get return new directory for /mnt/ssd/jenkins/workspace/Lucene-Solr-4.x-Linux/solr/build/solr-core/test/J1/./org.apache.solr.cloud.CollectionsAPIDistributedZkTest-jetty3-1375442361252//nodes_used_collection_shard1_replica2/data
   [junit4]   2> 99467 T326 oasc.SolrCore.getNewIndexDir New index directory detected: old=null new=/mnt/ssd/jenkins/workspace/Lucene-Solr-4.x-Linux/solr/build/solr-core/test/J1/./org.apache.solr.cloud.CollectionsAPIDistributedZkTest-jetty3-1375442361252//nodes_used_collection_shard1_replica2/data/index/
   [junit4]   2> 99470 T326 oasc.SolrCore.initIndex WARN [nodes_used_collection_shard1_replica2] Solr index directory '/mnt/ssd/jenkins/workspace/Lucene-Solr-4.x-Linux/solr/build/solr-core/test/J1/./org.apache.solr.cloud.CollectionsAPIDistributedZkTest-jetty3-1375442361252/nodes_used_collection_shard1_replica2/data/index' doesn't exist. Creating new index...
   [junit4]   2> 99471 T326 oasc.CachingDirectoryFactory.get return new directory for /mnt/ssd/jenkins/workspace/Lucene-Solr-4.x-Linux/solr/build/solr-core/test/J1/./org.apache.solr.cloud.CollectionsAPIDistributedZkTest-jetty3-1375442361252//nodes_used_collection_shard1_replica2/data/index
   [junit4]   2> 99472 T297 oass.IndexSchema.readSchema default search field in schema is text
   [junit4]   2> 99473 T326 oasc.SolrDeletionPolicy.onCommit SolrDeletionPolicy.onCommit: commits: num=1
   [junit4]   2> 		commit{dir=MockDirWrapper(org.apache.lucene.store.RAMDirectory@120d1e63 lockFactory=org.apache.lucene.store.NativeFSLockFactory@3f203d7),segFN=segments_1,generation=1}
   [junit4]   2> 99474 T326 oasc.SolrDeletionPolicy.updateCommits newest commit generation = 1
   [junit4]   2> 99475 T297 oass.IndexSchema.readSchema unique key field: id
   [junit4]   2> 99485 T326 oasup.UpdateRequestProcessorChain.init inserting DistributedUpdateProcessorFactory into updateRequestProcessorChain "dedupe"
   [junit4]   2> 99486 T326 oasup.UpdateRequestProcessorChain.init inserting DistributedUpdateProcessorFactory into updateRequestProcessorChain "stored_sig"
   [junit4]   2> 99487 T326 oasup.UpdateRequestProcessorChain.init inserting DistributedUpdateProcessorFactory into updateRequestProcessorChain "distrib-dup-test-chain-implicit"
   [junit4]   2> 99488 T326 oasc.RequestHandlers.initHandlersFromConfig created standard: solr.StandardRequestHandler
   [junit4]   2> 99489 T326 oasc.RequestHandlers.initHandlersFromConfig created /get: solr.RealTimeGetHandler
   [junit4]   2> 99489 T326 oasc.RequestHandlers.initHandlersFromConfig adding lazy requestHandler: solr.ReplicationHandler
   [junit4]   2> 99489 T279 oass.ByteField.init WARN ByteField is deprecated and will be removed in 5.0. You should use TrieIntField instead.
   [junit4]   2> 99490 T326 oasc.RequestHandlers.initHandlersFromConfig created /replication: solr.ReplicationHandler
   [junit4]   2> 99490 T279 oass.ShortField.init WARN ShortField is deprecated and will be removed in 5.0. You should use TrieIntField instead.
   [junit4]   2> 99491 T326 oasc.RequestHandlers.initHandlersFromConfig created /update: solr.UpdateRequestHandler
   [junit4]   2> 99491 T326 oasc.RequestHandlers.initHandlersFromConfig created /admin/: org.apache.solr.handler.admin.AdminHandlers
   [junit4]   2> 99491 T279 oass.OpenExchangeRatesOrgProvider.init Initialized with rates=open-exchange-rates.json, refreshInterval=1440.
   [junit4]   2> 99494 T326 oashl.XMLLoader.init xsltCacheLifetimeSeconds=60
   [junit4]   2> 99498 T326 oass.SolrIndexSearcher.<init> Opening Searcher@28071488 main
   [junit4]   2> 99499 T326 oasu.CommitTracker.<init> Hard AutoCommit: disabled
   [junit4]   2> 99499 T326 oasu.CommitTracker.<init> Soft AutoCommit: disabled
   [junit4]   2> 99501 T279 oass.IndexSchema.readSchema default search field in schema is text
   [junit4]   2> 99504 T279 oass.IndexSchema.readSchema unique key field: id
   [junit4]   2> 99506 T351 oasc.SolrCore.registerSearcher [nodes_used_collection_shard1_replica2] Registered new searcher Searcher@28071488 main{StandardDirectoryReader(segments_1:1)}
   [junit4]   2> 99507 T326 oasc.CoreContainer.registerCore registering core: nodes_used_collection_shard1_replica2
   [junit4]   2> 99508 T326 oasc.ZkController.register Register replica - core:nodes_used_collection_shard1_replica2 address:http://127.0.0.1:58803/xo_ collection:nodes_used_collection shard:shard1
   [junit4]   2> 99508 T326 oascsi.HttpClientUtil.createClient Creating new http client, config:maxConnections=10000&maxConnectionsPerHost=20&connTimeout=15000&socketTimeout=30000&retry=false
   [junit4]   2> 99513 T326 oascc.SolrZkClient.makePath makePath: /collections/nodes_used_collection/leader_elect/shard1/election
   [junit4]   2> 99522 T310 oass.FileExchangeRateProvider.reload Reloading exchange rates from file currency.xml
   [junit4]   2> 99535 T297 oass.FileExchangeRateProvider.reload Reloading exchange rates from file currency.xml
   [junit4]   2> 99535 T310 oass.FileExchangeRateProvider.reload Reloading exchange rates from file currency.xml
   [junit4]   2> 99543 T310 oass.OpenExchangeRatesOrgProvider.reload Reloading exchange rates from open-exchange-rates.json
   [junit4]   2> 99544 T326 oasc.ShardLeaderElectionContext.runLeaderProcess Running the leader process for shard shard1
   [junit4]   2> 99545 T297 oass.FileExchangeRateProvider.reload Reloading exchange rates from file currency.xml
   [junit4]   2> 99550 T310 oass.OpenExchangeRatesOrgProvider$OpenExchangeRates.<init> WARN Unknown key IMPORTANT NOTE
   [junit4]   2> 99550 T310 oass.OpenExchangeRatesOrgProvider$OpenExchangeRates.<init> WARN Expected key, got STRING
   [junit4]   2> 99551 T310 oass.OpenExchangeRatesOrgProvider.reload Reloading exchange rates from open-exchange-rates.json
   [junit4]   2> 99552 T297 oass.OpenExchangeRatesOrgProvider.reload Reloading exchange rates from open-exchange-rates.json
   [junit4]   2> 99554 T310 oass.OpenExchangeRatesOrgProvider$OpenExchangeRates.<init> WARN Unknown key IMPORTANT NOTE
   [junit4]   2> 99555 T310 oass.OpenExchangeRatesOrgProvider$OpenExchangeRates.<init> WARN Expected key, got STRING
   [junit4]   2> 99555 T310 oasc.SolrCore.initDirectoryFactory org.apache.solr.core.MockDirectoryFactory
   [junit4]   2> 99556 T310 oasc.SolrCore.<init> [nodes_used_collection_shard1_replica1] Opening new SolrCore at /mnt/ssd/jenkins/workspace/Lucene-Solr-4.x-Linux/solr/build/solr-core/test/J1/./org.apache.solr.cloud.CollectionsAPIDistributedZkTest-jetty2-1375442360021/nodes_used_collection_shard1_replica1/, dataDir=/mnt/ssd/jenkins/workspace/Lucene-Solr-4.x-Linux/solr/build/solr-core/test/J1/./org.apache.solr.cloud.CollectionsAPIDistributedZkTest-jetty2-1375442360021//nodes_used_collection_shard1_replica1/data/
   [junit4]   2> 99557 T310 oasc.JmxMonitoredMap.<init> JMX monitoring is enabled. Adding Solr mbeans to JMX Server: com.sun.jmx.mbeanserver.JmxMBeanServer@6185e90f
   [junit4]   2> 99557 T326 oasc.ShardLeaderElectionContext.waitForReplicasToComeUp Waiting until we see more replicas up for shard shard1: total=2 found=1 timeoutin=179998
   [junit4]   2> 99559 T310 oasc.CachingDirectoryFactory.get return new directory for /mnt/ssd/jenkins/workspace/Lucene-Solr-4.x-Linux/solr/build/solr-core/test/J1/./org.apache.solr.cloud.CollectionsAPIDistributedZkTest-jetty2-1375442360021//nodes_used_collection_shard1_replica1/data
   [junit4]   2> 99560 T297 oass.OpenExchangeRatesOrgProvider$OpenExchangeRates.<init> WARN Unknown key IMPORTANT NOTE
   [junit4]   2> 99561 T297 oass.OpenExchangeRatesOrgProvider$OpenExchangeRates.<init> WARN Expected key, got STRING
   [junit4]   2> 99560 T310 oasc.SolrCore.getNewIndexDir New index directory detected: old=null new=/mnt/ssd/jenkins/workspace/Lucene-Solr-4.x-Linux/solr/build/solr-core/test/J1/./org.apache.solr.cloud.CollectionsAPIDistributedZkTest-jetty2-1375442360021//nodes_used_collection_shard1_replica1/data/index/
   [junit4]   2> 99561 T279 oass.FileExchangeRateProvider.reload Reloading exchange rates from file currency.xml
   [junit4]   2> 99561 T297 oass.OpenExchangeRatesOrgProvider.reload Reloading exchange rates from open-exchange-rates.json
   [junit4]   2> 99561 T310 oasc.SolrCore.initIndex WARN [nodes_used_collection_shard1_replica1] Solr index directory '/mnt/ssd/jenkins/workspace/Lucene-Solr-4.x-Linux/solr/build/solr-core/test/J1/./org.apache.solr.cloud.CollectionsAPIDistributedZkTest-jetty2-1375442360021/nodes_used_collection_shard1_replica1/data/index' doesn't exist. Creating new index...
   [junit4]   2> 99563 T310 oasc.CachingDirectoryFactory.get return new directory for /mnt/ssd/jenkins/workspace/Lucene-Solr-4.x-Linux/solr/build/solr-core/test/J1/./org.apache.solr.cloud.CollectionsAPIDistributedZkTest-jetty2-1375442360021//nodes_used_collection_shard1_replica1/data/index
   [junit4]   2> 99565 T297 oass.OpenExchangeRatesOrgProvider$OpenExchangeRates.<init> WARN Unknown key IMPORTANT NOTE
   [junit4]   2> 99566 T297 oass.OpenExchangeRatesOrgProvider$OpenExchangeRates.<init> WARN Expected key, got STRING
   [junit4]   2> 99566 T297 oasc.SolrCore.initDirectoryFactory org.apache.solr.core.MockDirectoryFactory
   [junit4]   2> 99567 T297 oasc.SolrCore.<init> [nodes_used_collection_shard2_replica1] Opening new SolrCore at /mnt/ssd/jenkins/workspace/Lucene-Solr-4.x-Linux/solr/build/solr-core/test/J1/./org.apache.solr.cloud.CollectionsAPIDistributedZkTest-jetty1-1375442358761/nodes_used_collection_shard2_replica1/, dataDir=/mnt/ssd/jenkins/workspace/Lucene-Solr-4.x-Linux/solr/build/solr-core/test/J1/./org.apache.solr.cloud.CollectionsAPIDistributedZkTest-jetty1-1375442358761//nodes_used_collection_shard2_replica1/data/
   [junit4]   2> 99567 T297 oasc.JmxMonitoredMap.<init> JMX monitoring is enabled. Adding Solr mbeans to JMX Server: com.sun.jmx.mbeanserver.JmxMBeanServer@6185e90f
   [junit4]   2> 99567 T279 oass.FileExchangeRateProvider.reload Reloading exchange rates from file currency.xml
   [junit4]   2> 99568 T310 oasc.SolrDeletionPolicy.onCommit SolrDeletionPolicy.onCommit: commits: num=1
   [junit4]   2> 		commit{dir=MockDirWrapper(org.apache.lucene.store.RAMDirectory@729c5167 lockFactory=org.apache.lucene.store.NativeFSLockFactory@546ce79d),segFN=segments_1,generation=1}
   [junit4]   2> 99568 T310 oasc.SolrDeletionPolicy.updateCommits newest commit generation = 1
   [junit4]   2> 99568 T297 oasc.CachingDirectoryFactory.get return new directory for /mnt/ssd/jenkins/workspace/Lucene-Solr-4.x-Linux/solr/build/solr-core/test/J1/./org.apache.solr.cloud.CollectionsAPIDistributedZkTest-jetty1-1375442358761//nodes_used_collection_shard2_replica1/data
   [junit4]   2> 99569 T297 oasc.SolrCore.getNewIndexDir New index directory detected: old=null new=/mnt/ssd/jenkins/workspace/Lucene-Solr-4.x-Linux/solr/build/solr-core/test/J1/./org.apache.solr.cloud.CollectionsAPIDistributedZkTest-jetty1-1375442358761//nodes_used_collection_shard2_replica1/data/index/
   [junit4]   2> 99570 T297 oasc.SolrCore.initIndex WARN [nodes_used_collection_shard2_replica1] Solr index directory '/mnt/ssd/jenkins/workspace/Lucene-Solr-4.x-Linux/solr/build/solr-core/test/J1/./org.apache.solr.cloud.CollectionsAPIDistributedZkTest-jetty1-1375442358761/nodes_used_collection_shard2_replica1/data/index' doesn't exist. Creating new index...
   [junit4]   2> 99571 T297 oasc.CachingDirectoryFactory.get return new directory for /mnt/ssd/jenkins/workspace/Lucene-Solr-4.x-Linux/solr/build/solr-core/test/J1/./org.apache.solr.cloud.CollectionsAPIDistributedZkTest-jetty1-1375442358761//nodes_used_collection_shard2_replica1/data/index
   [junit4]   2> 99573 T297 oasc.SolrDeletionPolicy.onCommit SolrDeletionPolicy.onCommit: commits: num=1
   [junit4]   2> 		commit{dir=MockDirWrapper(org.apache.lucene.store.RAMDirectory@5c6647cb lockFactory=org.apache.lucene.store.NativeFSLockFactory@42dd8bec),segFN=segments_1,generation=1}
   [junit4]   2> 99573 T297 oasc.SolrDeletionPolicy.updateCommits newest commit generation = 1
   [junit4]   2> 99573 T310 oasup.UpdateRequestProcessorChain.init inserting DistributedUpdateProcessorFactory into updateRequestProcessorChain "dedupe"
   [junit4]   2> 99574 T310 oasup.UpdateRequestProcessorChain.init inserting DistributedUpdateProcessorFactory into updateRequestProcessorChain "stored_sig"
   [junit4]   2> 99574 T279 oass.OpenExchangeRatesOrgProvider.reload Reloading exchange rates from open-exchange-rates.json
   [junit4]   2> 99575 T310 oasup.UpdateRequestProcessorChain.init inserting DistributedUpdateProcessorFactory into updateRequestProcessorChain "distrib-dup-test-chain-implicit"
   [junit4]   2> 99575 T310 oasc.RequestHandlers.initHandlersFromConfig created standard: solr.StandardRequestHandler
   [junit4]   2> 99576 T310 oasc.RequestHandlers.initHandlersFromConfig created /get: solr.RealTimeGetHandler
   [junit4]   2> 99577 T310 oasc.RequestHandlers.initHandlersFromConfig adding lazy requestHandler: solr.ReplicationHandler
   [junit4]   2> 99577 T310 oasc.RequestHandlers.initHandlersFromConfig created /replication: solr.ReplicationHandler
   [junit4]   2> 99578 T310 oasc.RequestHandlers.initHandlersFromConfig created /update: solr.UpdateRequestHandler
   [junit4]   2> 99578 T297 oasup.UpdateRequestProcessorChain.init inserting DistributedUpdateProcessorFactory into updateRequestProcessorChain "dedupe"
   [junit4]   2> 99578 T310 oasc.RequestHandlers.initHandlersFromConfig created /admin/: org.apache.solr.handler.admin.AdminHandlers
   [junit4]   2> 99578 T279 oass.OpenExchangeRatesOrgProvider$OpenExchangeRates.<init> WARN Unknown key IMPORTANT NOTE
   [junit4]   2> 99579 T279 oass.OpenExchangeRatesOrgProvider$OpenExchangeRates.<init> WARN Expected key, got STRING
   [junit4]   2> 99579 T279 oass.OpenExchangeRatesOrgProvider.reload Reloading exchange rates from open-exchange-rates.json
   [junit4]   2> 99578 T297 oasup.UpdateRequestProcessorChain.init inserting DistributedUpdateProcessorFactory into updateRequestProcessorChain "stored_sig"
   [junit4]   2> 99580 T310 oashl.XMLLoader.init xsltCacheLifetimeSeconds=60
   [junit4]   2> 99580 T297 oasup.UpdateRequestProcessorChain.init inserting DistributedUpdateProcessorFactory into updateRequestProcessorChain "distrib-dup-test-chain-implicit"
   [junit4]   2> 99581 T297 oasc.RequestHandlers.initHandlersFromConfig created standard: solr.StandardRequestHandler
   [junit4]   2> 99581 T279 oass.OpenExchangeRatesOrgProvider$OpenExchangeRates.<init> WARN Unknown key IMPORTANT NOTE
   [junit4]   2> 99582 T279 oass.OpenExchangeRatesOrgProvider$OpenExchangeRates.<init> WARN Expected key, got STRING
   [junit4]   2> 99582 T297 oasc.RequestHandlers.initHandlersFromConfig created /get: solr.RealTimeGetHandler
   [junit4]   2> 99582 T297 oasc.RequestHandlers.initHandlersFromConfig adding lazy requestHandler: solr.ReplicationHandler
   [junit4]   2> 99582 T279 oasc.SolrCore.initDirectoryFactory org.apache.solr.core.MockDirectoryFactory
   [junit4]   2> 99583 T297 oasc.RequestHandlers.initHandlersFromConfig created /replication: solr.ReplicationHandler
   [junit4]   2> 99583 T310 oass.SolrIndexSearcher.<init> Opening Searcher@6e10fcd4 main
   [junit4]   2> 99583 T279 oasc.SolrCore.<init> [nodes_used_collection_shard2_replica2] Opening new SolrCore at /mnt/ssd/jenkins/workspace/Lucene-Solr-4.x-Linux/solr/build/solr-core/test/J1/./org.apache.solr.cloud.CollectionsAPIDistributedZkTest-controljetty-1375442358478/nodes_used_collection_shard2_replica2/, dataDir=/mnt/ssd/jenkins/workspace/Lucene-Solr-4.x-Linux/solr/build/solr-core/test/J1/./org.apache.solr.cloud.CollectionsAPIDistributedZkTest-controljetty-1375442358478//nodes_used_collection_shard2_replica2/data/
   [junit4]   2> 99584 T297 oasc.RequestHandlers.initHandlersFromConfig created /update: solr.UpdateRequestHandler
   [junit4]   2> 99584 T310 oasu.CommitTracker.<init> Hard AutoCommit: disabled
   [junit4]   2> 99584 T279 oasc.JmxMonitoredMap.<init> JMX monitoring is enabled. Adding Solr mbeans to JMX Server: com.sun.jmx.mbeanserver.JmxMBeanServer@6185e90f
   [junit4]   2> 99584 T310 oasu.CommitTracker.<init> Soft AutoCommit: disabled
   [junit4]   2> 99584 T297 oasc.RequestHandlers.initHandlersFromConfig created /admin/: org.apache.solr.handler.admin.AdminHandlers
   [junit4]   2> 99586 T279 oasc.CachingDirectoryFactory.get return new directory for /mnt/ssd/jenkins/workspace/Lucene-Solr-4.x-Linux/solr/build/solr-core/test/J1/./org.apache.solr.cloud.CollectionsAPIDistributedZkTest-controljetty-1375442358478//nodes_used_collection_shard2_replica2/data
   [junit4]   2> 99587 T297 oashl.XMLLoader.init xsltCacheLifetimeSeconds=60
   [junit4]   2> 99587 T279 oasc.SolrCore.getNewIndexDir New index directory detected: old=null new=/mnt/ssd/jenkins/workspace/Lucene-Solr-4.x-Linux/solr/build/solr-core/test/J1/./org.apache.solr.cloud.CollectionsAPIDistributedZkTest-controljetty-1375442358478//nodes_used_collection_shard2_replica2/data/index/
   [junit4]   2> 99587 T279 oasc.SolrCore.initIndex WARN [nodes_used_collection_shard2_replica2] Solr index directory '/mnt/ssd/jenkins/workspace/Lucene-Solr-4.x-Linux/solr/build/solr-core/test/J1/./org.apache.solr.cloud.CollectionsAPIDistributedZkTest-controljetty-1375442358478/nodes_used_collection_shard2_replica2/data/index' doesn't exist. Creating new index...
   [junit4]   2> 99588 T352 oasc.SolrCore.registerSearcher [nodes_used_collection_shard1_replica1] Registered new searcher Searcher@6e10fcd4 main{StandardDirectoryReader(segments_1:1)}
   [junit4]   2> 99588 T279 oasc.CachingDirectoryFactory.get return new directory for /mnt/ssd/jenkins/workspace/Lucene-Solr-4.x-Linux/solr/build/solr-core/test/J1/./org.apache.solr.cloud.CollectionsAPIDistributedZkTest-controljetty-1375442358478//nodes_used_collection_shard2_replica2/data/index
   [junit4]   2> 99589 T297 oass.SolrIndexSearcher.<init> Opening Searcher@5e4f1ec main
   [junit4]   2> 99590 T297 oasu.CommitTracker.<init> Hard AutoCommit: disabled
   [junit4]   2> 99590 T310 oasc.CoreContainer.registerCore registering core: nodes_used_collection_shard1_replica1
   [junit4]   2> 99590 T297 oasu.CommitTracker.<init> Soft AutoCommit: disabled
   [junit4]   2> 99591 T279 oasc.SolrDeletionPolicy.onCommit SolrDeletionPolicy.onCommit: commits: num=1
   [junit4]   2> 		commit{dir=MockDirWrapper(org.apache.lucene.store.RAMDirectory@3086b277 lockFactory=org.apache.lucene.store.NativeFSLockFactory@79d0e2d2),segFN=segments_1,generation=1}
   [junit4]   2> 99591 T279 oasc.SolrDeletionPolicy.updateCommits newest commit generation = 1
   [junit4]   2> 99591 T310 oasc.ZkController.register Register replica - core:nodes_used_collection_shard1_replica1 address:http://127.0.0.1:53657/xo_ collection:nodes_used_collection shard:shard1
   [junit4]   2> 99592 T310 oascsi.HttpClientUtil.createClient Creating new http client, config:maxConnections=10000&maxConnectionsPerHost=20&connTimeout=15000&socketTimeout=30000&retry=false
   [junit4]   2> 99596 T279 oasup.UpdateRequestProcessorChain.init inserting DistributedUpdateProcessorFactory into updateRequestProcessorChain "dedupe"
   [junit4]   2> 99597 T279 oasup.UpdateRequestProcessorChain.init inserting DistributedUpdateProcessorFactory into updateRequestProcessorChain "stored_sig"
   [junit4]   2> 99598 T279 oasup.UpdateRequestProcessorChain.init inserting DistributedUpdateProcessorFactory into updateRequestProcessorChain "distrib-dup-test-chain-implicit"
   [junit4]   2> 99599 T279 oasc.RequestHandlers.initHandlersFromConfig created standard: solr.StandardRequestHandler
   [junit4]   2> 99599 T353 oasc.SolrCore.registerSearcher [nodes_used_collection_shard2_replica1] Registered new searcher Searcher@5e4f1ec main{StandardDirectoryReader(segments_1:1)}
   [junit4]   2> 99599 T279 oasc.RequestHandlers.initHandlersFromConfig created /get: solr.RealTimeGetHandler
   [junit4]   2> 99600 T279 oasc.RequestHandlers.initHandlersFromConfig adding lazy requestHandler: solr.ReplicationHandler
   [junit4]   2> 99600 T279 oasc.RequestHandlers.initHandlersFromConfig created /replication: solr.ReplicationHandler
   [junit4]   2> 99601 T297 oasc.CoreContainer.registerCore registering core: nodes_used_collection_shard2_replica1
   [junit4]   2> 99601 T297 oasc.ZkController.register Register replica - core:nodes_used_collection_shard2_replica1 address:http://127.0.0.1:46363/xo_ collection:nodes_used_collection shard:shard2
   [junit4]   2> 99601 T279 oasc.RequestHandlers.initHandlersFromConfig created /update: solr.UpdateRequestHandler
   [junit4]   2> 99601 T297 oascsi.HttpClientUtil.createClient Creating new http client, config:maxConnections=10000&maxConnectionsPerHost=20&connTimeout=15000&socketTimeout=30000&retry=false
   [junit4]   2> 99602 T279 oasc.RequestHandlers.initHandlersFromConfig created /admin/: org.apache.solr.handler.admin.AdminHandlers
   [junit4]   2> 99604 T279 oashl.XMLLoader.init xsltCacheLifetimeSeconds=60
   [junit4]   2> 99606 T297 oascc.SolrZkClient.makePath makePath: /collections/nodes_used_collection/leader_elect/shard2/election
   [junit4]   2> 99607 T279 oass.SolrIndexSearcher.<init> Opening Searcher@546fd7d9 main
   [junit4]   2> 99608 T279 oasu.CommitTracker.<init> Hard AutoCommit: disabled
   [junit4]   2> 99608 T279 oasu.CommitTracker.<init> Soft AutoCommit: disabled
   [junit4]   2> 99621 T354 oasc.SolrCore.registerSearcher [nodes_used_collection_shard2_replica2] Registered new searcher Searcher@546fd7d9 main{StandardDirectoryReader(segments_1:1)}
   [junit4]   2> 99623 T279 oasc.CoreContainer.registerCore registering core: nodes_used_collection_shard2_replica2
   [junit4]   2> 99624 T279 oasc.ZkController.register Register replica - core:nodes_used_collection_shard2_replica2 address:http://127.0.0.1:43026/xo_ collection:nodes_used_collection shard:shard2
   [junit4]   2> 99624 T279 oascsi.HttpClientUtil.createClient Creating new http client, config:maxConnections=10000&maxConnectionsPerHost=20&connTimeout=15000&socketTimeout=30000&retry=false
   [junit4]   2> 99627 T297 oasc.ShardLeaderElectionContext.runLeaderProcess Running the leader process for shard shard2
   [junit4]   2> 99633 T297 oasc.ShardLeaderElectionContext.waitForReplicasToComeUp Enough replicas found to continue.
   [junit4]   2> 99634 T297 oasc.ShardLeaderElectionContext.runLeaderProcess I may be the new leader - try and sync
   [junit4]   2> 99634 T297 oasc.SyncStrategy.sync Sync replicas to http://127.0.0.1:46363/xo_/nodes_used_collection_shard2_replica1/
   [junit4]   2> 99634 T297 oasu.PeerSync.sync PeerSync: core=nodes_used_collection_shard2_replica1 url=http://127.0.0.1:46363/xo_ START replicas=[http://127.0.0.1:43026/xo_/nodes_used_collection_shard2_replica2/] nUpdates=100
   [junit4]   2> 99635 T297 oasu.PeerSync.sync PeerSync: core=nodes_used_collection_shard2_replica1 url=http://127.0.0.1:46363/xo_ DONE.  We have no versions.  sync failed.
   [junit4]   2> 99635 T297 oasc.SyncStrategy.syncReplicas Leader's attempt to sync with shard failed, moving to the next candidate
   [junit4]   2> 99636 T297 oasc.ShardLeaderElectionContext.runLeaderProcess We failed sync, but we have no versions - we can't sync in that case - we were active before, so become leader anyway
   [junit4]   2> 99636 T297 oasc.ShardLeaderElectionContext.runLeaderProcess I am the new leader: http://127.0.0.1:46363/xo_/nodes_used_collection_shard2_replica1/ shard2
   [junit4]   2> 99636 T297 oascc.SolrZkClient.makePath makePath: /collections/nodes_used_collection/leaders/shard2
   [junit4]   2> ASYNC  NEW_CORE C631 name=nodes_used_collection_shard2_replica2 org.apache.solr.core.SolrCore@1ef86244 url=http://127.0.0.1:43026/xo_/nodes_used_collection_shard2_replica2 node=127.0.0.1:43026_xo_ C631_STATE=coll:nodes_used_collection core:nodes_used_collection_shard2_replica2 props:{state=down, core=nodes_used_collection_shard2_replica2, node_name=127.0.0.1:43026_xo_, base_url=http://127.0.0.1:43026/xo_}
   [junit4]   2> 99641 T278 C631 P43026 oasc.SolrCore.execute [nodes_used_collection_shard2_replica2] webapp=/xo_ path=/get params={getVersions=100&distrib=false&wt=javabin&qt=/get&version=2} status=0 QTime=0 
   [junit4]   2> 100061 T326 oasc.ShardLeaderElectionContext.waitForReplicasToComeUp Enough replicas found to continue.
   [junit4]   2> 100061 T326 oasc.ShardLeaderElectionContext.runLeaderProcess I may be the new leader - try and sync
   [junit4]   2> 100062 T326 oasc.SyncStrategy.sync Sync replicas to http://127.0.0.1:58803/xo_/nodes_used_collection_shard1_replica2/
   [junit4]   2> 100063 T326 oasu.PeerSync.sync PeerSync: core=nodes_used_collection_shard1_replica2 url=http://127.0.0.1:58803/xo_ START replicas=[http://127.0.0.1:53657/xo_/nodes_used_collection_shard1_replica1/] nUpdates=100
   [junit4]   2> 100064 T326 oasu.PeerSync.sync PeerSync: core=nodes_used_collection_shard1_replica2 url=http://127.0.0.1:58803/xo_ DONE.  We have no versions.  sync failed.
   [junit4]   2> 100064 T326 oasc.SyncStrategy.syncReplicas Leader's attempt to sync with shard failed, moving to the next candidate
   [junit4]   2> 100065 T326 oasc.ShardLeaderElectionContext.runLeaderProcess We failed sync, but we have no versions - we can't sync in that case - we were active before, so become leader anyway
   [junit4]   2> 100066 T326 oasc.ShardLeaderElectionContext.runLeaderProcess I am the new leader: http://127.0.0.1:58803/xo_/nodes_used_collection_shard1_replica2/ shard1
   [junit4]   2> 100066 T326 oascc.SolrZkClient.makePath makePath: /collections/nodes_used_collection/leaders/shard1
   [junit4]   2> ASYNC  NEW_CORE C632 name=nodes_used_collection_shard1_replica1 org.apache.solr.core.SolrCore@4d4a74b1 url=http://127.0.0.1:53657/xo_/nodes_used_collection_shard1_replica1 node=127.0.0.1:53657_xo_ C632_STATE=coll:nodes_used_collection core:nodes_used_collection_shard1_replica1 props:{sta

[...truncated too long message...]

362505//new_implicit_coll_0_b_replica1/data/index;done=false>>]
   [junit4]   2> 231223 T263 oasc.CachingDirectoryFactory.close Closing directory: /mnt/ssd/jenkins/workspace/Lucene-Solr-4.x-Linux/solr/build/solr-core/test/J1/./org.apache.solr.cloud.CollectionsAPIDistributedZkTest-jetty4-1375442362505//new_implicit_coll_0_b_replica1/data/index
   [junit4]   2> 231223 T263 oasc.SolrCore.close [new_implicit_coll_0_c_replica2]  CLOSING SolrCore org.apache.solr.core.SolrCore@7d7d298b
   [junit4]   2> 231230 T263 oasu.DirectUpdateHandler2.close closing DirectUpdateHandler2{commits=4,autocommits=0,soft autocommits=0,optimizes=0,rollbacks=0,expungeDeletes=0,docsPending=0,adds=0,deletesById=0,deletesByQuery=0,errors=0,cumulative_adds=3,cumulative_deletesById=0,cumulative_deletesByQuery=1,cumulative_errors=0}
   [junit4]   2> 231230 T263 oasu.SolrCoreState.decrefSolrCoreState Closing SolrCoreState
   [junit4]   2> 231231 T263 oasu.DefaultSolrCoreState.closeIndexWriter SolrCoreState ref count has reached 0 - closing IndexWriter
   [junit4]   2> 231231 T263 oasu.DefaultSolrCoreState.closeIndexWriter closing IndexWriter with IndexWriterCloser
   [junit4]   2> 231233 T263 oasc.SolrCore.closeSearcher [new_implicit_coll_0_c_replica2] Closing main searcher on request.
   [junit4]   2> 231233 T263 oasc.CachingDirectoryFactory.close Closing MockDirectoryFactory - 2 directories currently being tracked
   [junit4]   2> 231234 T263 oasc.CachingDirectoryFactory.closeCacheValue looking to close /mnt/ssd/jenkins/workspace/Lucene-Solr-4.x-Linux/solr/build/solr-core/test/J1/./org.apache.solr.cloud.CollectionsAPIDistributedZkTest-jetty4-1375442362505//new_implicit_coll_0_c_replica2/data/index [CachedDir<<refCount=0;path=/mnt/ssd/jenkins/workspace/Lucene-Solr-4.x-Linux/solr/build/solr-core/test/J1/./org.apache.solr.cloud.CollectionsAPIDistributedZkTest-jetty4-1375442362505//new_implicit_coll_0_c_replica2/data/index;done=false>>]
   [junit4]   2> 231234 T263 oasc.CachingDirectoryFactory.close Closing directory: /mnt/ssd/jenkins/workspace/Lucene-Solr-4.x-Linux/solr/build/solr-core/test/J1/./org.apache.solr.cloud.CollectionsAPIDistributedZkTest-jetty4-1375442362505//new_implicit_coll_0_c_replica2/data/index
   [junit4]   2> 231234 T263 oasc.CachingDirectoryFactory.closeCacheValue looking to close /mnt/ssd/jenkins/workspace/Lucene-Solr-4.x-Linux/solr/build/solr-core/test/J1/./org.apache.solr.cloud.CollectionsAPIDistributedZkTest-jetty4-1375442362505//new_implicit_coll_0_c_replica2/data [CachedDir<<refCount=0;path=/mnt/ssd/jenkins/workspace/Lucene-Solr-4.x-Linux/solr/build/solr-core/test/J1/./org.apache.solr.cloud.CollectionsAPIDistributedZkTest-jetty4-1375442362505//new_implicit_coll_0_c_replica2/data;done=false>>]
   [junit4]   2> 231234 T263 oasc.CachingDirectoryFactory.close Closing directory: /mnt/ssd/jenkins/workspace/Lucene-Solr-4.x-Linux/solr/build/solr-core/test/J1/./org.apache.solr.cloud.CollectionsAPIDistributedZkTest-jetty4-1375442362505//new_implicit_coll_0_c_replica2/data
   [junit4]   2> 231236 T816 oasc.Overseer$ClusterStateUpdater.amILeader According to ZK I (id=90140990389092364-127.0.0.1:33626_xo_-n_0000000004) am no longer a leader.
   [junit4]   2> 231262 T263 oejsh.ContextHandler.doStop stopped o.e.j.s.ServletContextHandler{/xo_,null}
   [junit4]   2> 231317 T263 oas.SolrTestCaseJ4.tearDown ###Ending testDistribSearch
   [junit4]   2> 231321 T263 oasc.ZkTestServer.send4LetterWord connecting to 127.0.0.1:36400 36400
   [junit4]   1> client port:0.0.0.0/0.0.0.0:0
   [junit4]   2> NOTE: reproduce with: ant test  -Dtestcase=CollectionsAPIDistributedZkTest -Dtests.method=testDistribSearch -Dtests.seed=6FD82255B0DC208F -Dtests.multiplier=3 -Dtests.slow=true -Dtests.locale=fr_CA -Dtests.timezone=Pacific/Fakaofo -Dtests.file.encoding=ISO-8859-1
   [junit4] ERROR    141s J1 | CollectionsAPIDistributedZkTest.testDistribSearch <<<
   [junit4]    > Throwable #1: org.apache.solr.client.solrj.SolrServerException: Server refused connection at: http://127.0.0.1:46363/xo_
   [junit4]    > 	at __randomizedtesting.SeedInfo.seed([6FD82255B0DC208F:EE3EAC4DC78340B3]:0)
   [junit4]    > 	at org.apache.solr.client.solrj.impl.HttpSolrServer.request(HttpSolrServer.java:428)
   [junit4]    > 	at org.apache.solr.client.solrj.impl.HttpSolrServer.request(HttpSolrServer.java:180)
   [junit4]    > 	at org.apache.solr.cloud.CollectionsAPIDistributedZkTest.testCustomCollectionsAPI(CollectionsAPIDistributedZkTest.java:764)
   [junit4]    > 	at org.apache.solr.cloud.CollectionsAPIDistributedZkTest.doTest(CollectionsAPIDistributedZkTest.java:159)
   [junit4]    > 	at org.apache.solr.BaseDistributedSearchTestCase.testDistribSearch(BaseDistributedSearchTestCase.java:835)
   [junit4]    > 	at java.lang.Thread.run(Thread.java:662)
   [junit4]    > Caused by: org.apache.http.conn.HttpHostConnectException: Connection to http://127.0.0.1:46363 refused
   [junit4]    > 	at org.apache.http.impl.conn.DefaultClientConnectionOperator.openConnection(DefaultClientConnectionOperator.java:190)
   [junit4]    > 	at org.apache.http.impl.conn.ManagedClientConnectionImpl.open(ManagedClientConnectionImpl.java:294)
   [junit4]    > 	at org.apache.http.impl.client.DefaultRequestDirector.tryConnect(DefaultRequestDirector.java:645)
   [junit4]    > 	at org.apache.http.impl.client.DefaultRequestDirector.execute(DefaultRequestDirector.java:480)
   [junit4]    > 	at org.apache.http.impl.client.AbstractHttpClient.execute(AbstractHttpClient.java:906)
   [junit4]    > 	at org.apache.http.impl.client.AbstractHttpClient.execute(AbstractHttpClient.java:805)
   [junit4]    > 	at org.apache.http.impl.client.AbstractHttpClient.execute(AbstractHttpClient.java:784)
   [junit4]    > 	at org.apache.solr.client.solrj.impl.HttpSolrServer.request(HttpSolrServer.java:365)
   [junit4]    > 	... 44 more
   [junit4]    > Caused by: java.net.ConnectException: Connection refused
   [junit4]    > 	at java.net.PlainSocketImpl.socketConnect(Native Method)
   [junit4]    > 	at java.net.PlainSocketImpl.doConnect(PlainSocketImpl.java:351)
   [junit4]    > 	at java.net.PlainSocketImpl.connectToAddress(PlainSocketImpl.java:213)
   [junit4]    > 	at java.net.PlainSocketImpl.connect(PlainSocketImpl.java:200)
   [junit4]    > 	at java.net.SocksSocketImpl.connect(SocksSocketImpl.java:366)
   [junit4]    > 	at java.net.Socket.connect(Socket.java:529)
   [junit4]    > 	at org.apache.http.conn.scheme.PlainSocketFactory.connectSocket(PlainSocketFactory.java:127)
   [junit4]    > 	at org.apache.http.impl.conn.DefaultClientConnectionOperator.openConnection(DefaultClientConnectionOperator.java:180)
   [junit4]    > 	... 51 more
   [junit4]   2> 231349 T263 oas.SolrTestCaseJ4.deleteCore ###deleteCore
   [junit4]   2> 141469 T262 ccr.ThreadLeakControl.checkThreadLeaks WARNING Will linger awaiting termination of 2 leaked thread(s).
   [junit4]   2> 232537 T345 oascc.ZkStateReader$3.process WARN ZooKeeper watch triggered, but Solr cannot talk to ZK
   [junit4]   2> 232538 T345 oascc.ZkStateReader$2.process A cluster state change: WatchedEvent state:SyncConnected type:NodeChildrenChanged path:/live_nodes, has occurred - updating... (live nodes size: 1)
   [junit4]   2> 232538 T345 oascc.ZkStateReader$2.process WARN ZooKeeper watch triggered, but Solr cannot talk to ZK
   [junit4]   2> NOTE: test params are: codec=Lucene42: {range_facet_l=PostingsFormat(name=MockSep), _route_=PostingsFormat(name=NestedPulsing), text=PostingsFormat(name=NestedPulsing), _version_=PostingsFormat(name=MockSep), intDefault=PostingsFormat(name=MockSep), id=PostingsFormat(name=TestBloomFilteredLucene41Postings), timestamp=PostingsFormat(name=MockSep), a_t=PostingsFormat(name=MockSep), range_facet_sl=PostingsFormat(name=NestedPulsing), range_facet_si=PostingsFormat(name=Memory doPackFST= true), other_tl1=PostingsFormat(name=MockSep), multiDefault=PostingsFormat(name=Memory doPackFST= true), a_si=PostingsFormat(name=Memory doPackFST= true)}, docValues:{}, sim=RandomSimilarityProvider(queryNorm=false,coord=no): {}, locale=fr_CA, timezone=Pacific/Fakaofo
   [junit4]   2> NOTE: Linux 3.2.0-51-generic amd64/Sun Microsystems Inc. 1.6.0_45 (64-bit)/cpus=8,threads=3,free=58566448,total=210022400
   [junit4]   2> NOTE: All tests run in this JVM: [SolrCoreCheckLockOnStartupTest, TimeZoneUtilsTest, TestBM25SimilarityFactory, MultiTermTest, TestFoldingMultitermQuery, BlockCacheTest, HdfsRecoveryZkTest, IndexReaderFactoryTest, TestJmxMonitoredMap, TestBinaryResponseWriter, TestFiltering, JSONWriterTest, TestAnalyzedSuggestions, RequiredFieldsTest, TestIndexSearcher, FullSolrCloudDistribCmdsTest, UniqFieldsUpdateProcessorFactoryTest, TestIndexingPerformance, CollectionsAPIDistributedZkTest]
   [junit4] Completed on J1 in 142.76s, 1 test, 1 error <<< FAILURES!

[...truncated 907 lines...]
BUILD FAILED
/mnt/ssd/jenkins/workspace/Lucene-Solr-4.x-Linux/build.xml:395: The following error occurred while executing this line:
/mnt/ssd/jenkins/workspace/Lucene-Solr-4.x-Linux/build.xml:375: The following error occurred while executing this line:
/mnt/ssd/jenkins/workspace/Lucene-Solr-4.x-Linux/build.xml:39: The following error occurred while executing this line:
/mnt/ssd/jenkins/workspace/Lucene-Solr-4.x-Linux/solr/build.xml:181: The following error occurred while executing this line:
/mnt/ssd/jenkins/workspace/Lucene-Solr-4.x-Linux/solr/common-build.xml:449: The following error occurred while executing this line:
/mnt/ssd/jenkins/workspace/Lucene-Solr-4.x-Linux/lucene/common-build.xml:1233: The following error occurred while executing this line:
/mnt/ssd/jenkins/workspace/Lucene-Solr-4.x-Linux/lucene/common-build.xml:876: There were test failures: 321 suites, 1352 tests, 1 error, 34 ignored (6 assumptions)

Total time: 41 minutes 30 seconds
Build step 'Invoke Ant' marked build as failure
Description set: Java: 64bit/jdk1.6.0_45 -XX:+UseCompressedOops -XX:+UseSerialGC
Archiving artifacts
Recording test results
Email was triggered for: Failure
Sending email for trigger: Failure



Mime
View raw message