lucene-dev mailing list archives

Site index · List index
Message view « Date » · « Thread »
Top « Date » · « Thread »
From Policeman Jenkins Server <jenk...@thetaphi.de>
Subject [JENKINS] Lucene-Solr-trunk-Linux (64bit/jdk1.7.0_25) - Build # 6832 - Failure!
Date Thu, 01 Aug 2013 18:41:58 GMT
Build: http://jenkins.thetaphi.de/job/Lucene-Solr-trunk-Linux/6832/
Java: 64bit/jdk1.7.0_25 -XX:-UseCompressedOops -XX:+UseParallelGC

2 tests failed.
REGRESSION:  org.apache.solr.cloud.SliceStateUpdateTest.testSliceStateUpdate

Error Message:
expected:<[in]active> but was:<[]active>

Stack Trace:
org.junit.ComparisonFailure: expected:<[in]active> but was:<[]active>
	at __randomizedtesting.SeedInfo.seed([DF8A5C3F83955E82:FE8D173DD408406]:0)
	at org.junit.Assert.assertEquals(Assert.java:125)
	at org.junit.Assert.assertEquals(Assert.java:147)
	at org.apache.solr.cloud.SliceStateUpdateTest.testSliceStateUpdate(SliceStateUpdateTest.java:183)
	at sun.reflect.NativeMethodAccessorImpl.invoke0(Native Method)
	at sun.reflect.NativeMethodAccessorImpl.invoke(NativeMethodAccessorImpl.java:57)
	at sun.reflect.DelegatingMethodAccessorImpl.invoke(DelegatingMethodAccessorImpl.java:43)
	at java.lang.reflect.Method.invoke(Method.java:606)
	at com.carrotsearch.randomizedtesting.RandomizedRunner.invoke(RandomizedRunner.java:1559)
	at com.carrotsearch.randomizedtesting.RandomizedRunner.access$600(RandomizedRunner.java:79)
	at com.carrotsearch.randomizedtesting.RandomizedRunner$6.evaluate(RandomizedRunner.java:737)
	at com.carrotsearch.randomizedtesting.RandomizedRunner$7.evaluate(RandomizedRunner.java:773)
	at com.carrotsearch.randomizedtesting.RandomizedRunner$8.evaluate(RandomizedRunner.java:787)
	at com.carrotsearch.randomizedtesting.rules.SystemPropertiesRestoreRule$1.evaluate(SystemPropertiesRestoreRule.java:53)
	at org.apache.lucene.util.TestRuleSetupTeardownChained$1.evaluate(TestRuleSetupTeardownChained.java:50)
	at org.apache.lucene.util.TestRuleFieldCacheSanity$1.evaluate(TestRuleFieldCacheSanity.java:51)
	at org.apache.lucene.util.AbstractBeforeAfterRule$1.evaluate(AbstractBeforeAfterRule.java:46)
	at com.carrotsearch.randomizedtesting.rules.SystemPropertiesInvariantRule$1.evaluate(SystemPropertiesInvariantRule.java:55)
	at org.apache.lucene.util.TestRuleThreadAndTestName$1.evaluate(TestRuleThreadAndTestName.java:49)
	at org.apache.lucene.util.TestRuleIgnoreAfterMaxFailures$1.evaluate(TestRuleIgnoreAfterMaxFailures.java:70)
	at org.apache.lucene.util.TestRuleMarkFailure$1.evaluate(TestRuleMarkFailure.java:48)
	at com.carrotsearch.randomizedtesting.rules.StatementAdapter.evaluate(StatementAdapter.java:36)
	at com.carrotsearch.randomizedtesting.ThreadLeakControl$StatementRunner.run(ThreadLeakControl.java:358)
	at com.carrotsearch.randomizedtesting.ThreadLeakControl.forkTimeoutingTask(ThreadLeakControl.java:782)
	at com.carrotsearch.randomizedtesting.ThreadLeakControl$3.evaluate(ThreadLeakControl.java:442)
	at com.carrotsearch.randomizedtesting.RandomizedRunner.runSingleTest(RandomizedRunner.java:746)
	at com.carrotsearch.randomizedtesting.RandomizedRunner$3.evaluate(RandomizedRunner.java:648)
	at com.carrotsearch.randomizedtesting.RandomizedRunner$4.evaluate(RandomizedRunner.java:682)
	at com.carrotsearch.randomizedtesting.RandomizedRunner$5.evaluate(RandomizedRunner.java:693)
	at com.carrotsearch.randomizedtesting.rules.StatementAdapter.evaluate(StatementAdapter.java:36)
	at com.carrotsearch.randomizedtesting.rules.SystemPropertiesRestoreRule$1.evaluate(SystemPropertiesRestoreRule.java:53)
	at org.apache.lucene.util.AbstractBeforeAfterRule$1.evaluate(AbstractBeforeAfterRule.java:46)
	at org.apache.lucene.util.TestRuleStoreClassName$1.evaluate(TestRuleStoreClassName.java:42)
	at com.carrotsearch.randomizedtesting.rules.SystemPropertiesInvariantRule$1.evaluate(SystemPropertiesInvariantRule.java:55)
	at com.carrotsearch.randomizedtesting.rules.NoShadowingOrOverridesOnMethodsRule$1.evaluate(NoShadowingOrOverridesOnMethodsRule.java:39)
	at com.carrotsearch.randomizedtesting.rules.NoShadowingOrOverridesOnMethodsRule$1.evaluate(NoShadowingOrOverridesOnMethodsRule.java:39)
	at com.carrotsearch.randomizedtesting.rules.StatementAdapter.evaluate(StatementAdapter.java:36)
	at org.apache.lucene.util.TestRuleAssertionsRequired$1.evaluate(TestRuleAssertionsRequired.java:43)
	at org.apache.lucene.util.TestRuleMarkFailure$1.evaluate(TestRuleMarkFailure.java:48)
	at org.apache.lucene.util.TestRuleIgnoreAfterMaxFailures$1.evaluate(TestRuleIgnoreAfterMaxFailures.java:70)
	at org.apache.lucene.util.TestRuleIgnoreTestSuites$1.evaluate(TestRuleIgnoreTestSuites.java:55)
	at com.carrotsearch.randomizedtesting.rules.StatementAdapter.evaluate(StatementAdapter.java:36)
	at com.carrotsearch.randomizedtesting.ThreadLeakControl$StatementRunner.run(ThreadLeakControl.java:358)
	at java.lang.Thread.run(Thread.java:724)


FAILED:  org.apache.solr.cloud.CollectionsAPIDistributedZkTest.testDistribSearch

Error Message:
Server refused connection at: http://127.0.0.1:37480/vtmq/ck

Stack Trace:
org.apache.solr.client.solrj.SolrServerException: Server refused connection at: http://127.0.0.1:37480/vtmq/ck
	at __randomizedtesting.SeedInfo.seed([DF8A5C3F83955E82:5E6CD227F4CA3EBE]:0)
	at org.apache.solr.client.solrj.impl.HttpSolrServer.request(HttpSolrServer.java:428)
	at org.apache.solr.client.solrj.impl.HttpSolrServer.request(HttpSolrServer.java:180)
	at org.apache.solr.cloud.AbstractFullDistribZkTestBase.createCollection(AbstractFullDistribZkTestBase.java:1535)
	at org.apache.solr.cloud.CollectionsAPIDistributedZkTest.testCustomCollectionsAPI(CollectionsAPIDistributedZkTest.java:677)
	at org.apache.solr.cloud.CollectionsAPIDistributedZkTest.doTest(CollectionsAPIDistributedZkTest.java:159)
	at org.apache.solr.BaseDistributedSearchTestCase.testDistribSearch(BaseDistributedSearchTestCase.java:835)
	at sun.reflect.NativeMethodAccessorImpl.invoke0(Native Method)
	at sun.reflect.NativeMethodAccessorImpl.invoke(NativeMethodAccessorImpl.java:57)
	at sun.reflect.DelegatingMethodAccessorImpl.invoke(DelegatingMethodAccessorImpl.java:43)
	at java.lang.reflect.Method.invoke(Method.java:606)
	at com.carrotsearch.randomizedtesting.RandomizedRunner.invoke(RandomizedRunner.java:1559)
	at com.carrotsearch.randomizedtesting.RandomizedRunner.access$600(RandomizedRunner.java:79)
	at com.carrotsearch.randomizedtesting.RandomizedRunner$6.evaluate(RandomizedRunner.java:737)
	at com.carrotsearch.randomizedtesting.RandomizedRunner$7.evaluate(RandomizedRunner.java:773)
	at com.carrotsearch.randomizedtesting.RandomizedRunner$8.evaluate(RandomizedRunner.java:787)
	at com.carrotsearch.randomizedtesting.rules.SystemPropertiesRestoreRule$1.evaluate(SystemPropertiesRestoreRule.java:53)
	at org.apache.lucene.util.TestRuleSetupTeardownChained$1.evaluate(TestRuleSetupTeardownChained.java:50)
	at org.apache.lucene.util.TestRuleFieldCacheSanity$1.evaluate(TestRuleFieldCacheSanity.java:51)
	at org.apache.lucene.util.AbstractBeforeAfterRule$1.evaluate(AbstractBeforeAfterRule.java:46)
	at com.carrotsearch.randomizedtesting.rules.SystemPropertiesInvariantRule$1.evaluate(SystemPropertiesInvariantRule.java:55)
	at org.apache.lucene.util.TestRuleThreadAndTestName$1.evaluate(TestRuleThreadAndTestName.java:49)
	at org.apache.lucene.util.TestRuleIgnoreAfterMaxFailures$1.evaluate(TestRuleIgnoreAfterMaxFailures.java:70)
	at org.apache.lucene.util.TestRuleMarkFailure$1.evaluate(TestRuleMarkFailure.java:48)
	at com.carrotsearch.randomizedtesting.rules.StatementAdapter.evaluate(StatementAdapter.java:36)
	at com.carrotsearch.randomizedtesting.ThreadLeakControl$StatementRunner.run(ThreadLeakControl.java:358)
	at com.carrotsearch.randomizedtesting.ThreadLeakControl.forkTimeoutingTask(ThreadLeakControl.java:782)
	at com.carrotsearch.randomizedtesting.ThreadLeakControl$3.evaluate(ThreadLeakControl.java:442)
	at com.carrotsearch.randomizedtesting.RandomizedRunner.runSingleTest(RandomizedRunner.java:746)
	at com.carrotsearch.randomizedtesting.RandomizedRunner$3.evaluate(RandomizedRunner.java:648)
	at com.carrotsearch.randomizedtesting.RandomizedRunner$4.evaluate(RandomizedRunner.java:682)
	at com.carrotsearch.randomizedtesting.RandomizedRunner$5.evaluate(RandomizedRunner.java:693)
	at com.carrotsearch.randomizedtesting.rules.StatementAdapter.evaluate(StatementAdapter.java:36)
	at com.carrotsearch.randomizedtesting.rules.SystemPropertiesRestoreRule$1.evaluate(SystemPropertiesRestoreRule.java:53)
	at org.apache.lucene.util.AbstractBeforeAfterRule$1.evaluate(AbstractBeforeAfterRule.java:46)
	at org.apache.lucene.util.TestRuleStoreClassName$1.evaluate(TestRuleStoreClassName.java:42)
	at com.carrotsearch.randomizedtesting.rules.SystemPropertiesInvariantRule$1.evaluate(SystemPropertiesInvariantRule.java:55)
	at com.carrotsearch.randomizedtesting.rules.NoShadowingOrOverridesOnMethodsRule$1.evaluate(NoShadowingOrOverridesOnMethodsRule.java:39)
	at com.carrotsearch.randomizedtesting.rules.NoShadowingOrOverridesOnMethodsRule$1.evaluate(NoShadowingOrOverridesOnMethodsRule.java:39)
	at com.carrotsearch.randomizedtesting.rules.StatementAdapter.evaluate(StatementAdapter.java:36)
	at org.apache.lucene.util.TestRuleAssertionsRequired$1.evaluate(TestRuleAssertionsRequired.java:43)
	at org.apache.lucene.util.TestRuleMarkFailure$1.evaluate(TestRuleMarkFailure.java:48)
	at org.apache.lucene.util.TestRuleIgnoreAfterMaxFailures$1.evaluate(TestRuleIgnoreAfterMaxFailures.java:70)
	at org.apache.lucene.util.TestRuleIgnoreTestSuites$1.evaluate(TestRuleIgnoreTestSuites.java:55)
	at com.carrotsearch.randomizedtesting.rules.StatementAdapter.evaluate(StatementAdapter.java:36)
	at com.carrotsearch.randomizedtesting.ThreadLeakControl$StatementRunner.run(ThreadLeakControl.java:358)
	at java.lang.Thread.run(Thread.java:724)
Caused by: org.apache.http.conn.HttpHostConnectException: Connection to http://127.0.0.1:37480 refused
	at org.apache.http.impl.conn.DefaultClientConnectionOperator.openConnection(DefaultClientConnectionOperator.java:190)
	at org.apache.http.impl.conn.ManagedClientConnectionImpl.open(ManagedClientConnectionImpl.java:294)
	at org.apache.http.impl.client.DefaultRequestDirector.tryConnect(DefaultRequestDirector.java:645)
	at org.apache.http.impl.client.DefaultRequestDirector.execute(DefaultRequestDirector.java:480)
	at org.apache.http.impl.client.AbstractHttpClient.execute(AbstractHttpClient.java:906)
	at org.apache.http.impl.client.AbstractHttpClient.execute(AbstractHttpClient.java:805)
	at org.apache.http.impl.client.AbstractHttpClient.execute(AbstractHttpClient.java:784)
	at org.apache.solr.client.solrj.impl.HttpSolrServer.request(HttpSolrServer.java:365)
	... 45 more
Caused by: java.net.ConnectException: Connection refused
	at java.net.PlainSocketImpl.socketConnect(Native Method)
	at java.net.AbstractPlainSocketImpl.doConnect(AbstractPlainSocketImpl.java:339)
	at java.net.AbstractPlainSocketImpl.connectToAddress(AbstractPlainSocketImpl.java:200)
	at java.net.AbstractPlainSocketImpl.connect(AbstractPlainSocketImpl.java:182)
	at java.net.SocksSocketImpl.connect(SocksSocketImpl.java:392)
	at java.net.Socket.connect(Socket.java:579)
	at org.apache.http.conn.scheme.PlainSocketFactory.connectSocket(PlainSocketFactory.java:127)
	at org.apache.http.impl.conn.DefaultClientConnectionOperator.openConnection(DefaultClientConnectionOperator.java:180)
	... 52 more




Build Log:
[...truncated 9829 lines...]
   [junit4] Suite: org.apache.solr.cloud.CollectionsAPIDistributedZkTest
   [junit4]   2> 653507 T2345 oas.BaseDistributedSearchTestCase.initHostContext Setting hostContext system property: /vtmq/ck
   [junit4]   2> 653511 T2345 oas.SolrTestCaseJ4.setUp ###Starting testDistribSearch
   [junit4]   2> Creating dataDir: /mnt/ssd/jenkins/workspace/Lucene-Solr-trunk-Linux/solr/build/solr-core/test/J1/./solrtest-CollectionsAPIDistributedZkTest-1375381835688
   [junit4]   2> 653512 T2345 oasc.ZkTestServer.run STARTING ZK TEST SERVER
   [junit4]   2> 653513 T2346 oasc.ZkTestServer$ZKServerMain.runFromConfig Starting server
   [junit4]   2> 653613 T2345 oasc.ZkTestServer.run start zk server on port:41572
   [junit4]   2> 653614 T2345 oascc.ConnectionManager.waitForConnected Waiting for client to connect to ZooKeeper
   [junit4]   2> 653788 T2352 oascc.ConnectionManager.process Watcher org.apache.solr.common.cloud.ConnectionManager@237a2fcd name:ZooKeeperConnection Watcher:127.0.0.1:41572 got event WatchedEvent state:SyncConnected type:None path:null path:null type:None
   [junit4]   2> 653788 T2345 oascc.ConnectionManager.waitForConnected Client is connected to ZooKeeper
   [junit4]   2> 653788 T2345 oascc.SolrZkClient.makePath makePath: /solr
   [junit4]   2> 653793 T2345 oascc.ConnectionManager.waitForConnected Waiting for client to connect to ZooKeeper
   [junit4]   2> 653794 T2354 oascc.ConnectionManager.process Watcher org.apache.solr.common.cloud.ConnectionManager@7315bcc4 name:ZooKeeperConnection Watcher:127.0.0.1:41572/solr got event WatchedEvent state:SyncConnected type:None path:null path:null type:None
   [junit4]   2> 653794 T2345 oascc.ConnectionManager.waitForConnected Client is connected to ZooKeeper
   [junit4]   2> 653795 T2345 oascc.SolrZkClient.makePath makePath: /collections/collection1
   [junit4]   2> 653797 T2345 oascc.SolrZkClient.makePath makePath: /collections/collection1/shards
   [junit4]   2> 653798 T2345 oascc.SolrZkClient.makePath makePath: /collections/control_collection
   [junit4]   2> 653800 T2345 oascc.SolrZkClient.makePath makePath: /collections/control_collection/shards
   [junit4]   2> 653801 T2345 oasc.AbstractZkTestCase.putConfig put /mnt/ssd/jenkins/workspace/Lucene-Solr-trunk-Linux/solr/build/solr-core/test-files/solr/collection1/conf/solrconfig-tlog.xml to /configs/conf1/solrconfig.xml
   [junit4]   2> 653802 T2345 oascc.SolrZkClient.makePath makePath: /configs/conf1/solrconfig.xml
   [junit4]   2> 653804 T2345 oasc.AbstractZkTestCase.putConfig put /mnt/ssd/jenkins/workspace/Lucene-Solr-trunk-Linux/solr/build/solr-core/test-files/solr/collection1/conf/schema.xml to /configs/conf1/schema.xml
   [junit4]   2> 653805 T2345 oascc.SolrZkClient.makePath makePath: /configs/conf1/schema.xml
   [junit4]   2> 653807 T2345 oasc.AbstractZkTestCase.putConfig put /mnt/ssd/jenkins/workspace/Lucene-Solr-trunk-Linux/solr/build/solr-core/test-files/solr/collection1/conf/stopwords.txt to /configs/conf1/stopwords.txt
   [junit4]   2> 653807 T2345 oascc.SolrZkClient.makePath makePath: /configs/conf1/stopwords.txt
   [junit4]   2> 653808 T2345 oasc.AbstractZkTestCase.putConfig put /mnt/ssd/jenkins/workspace/Lucene-Solr-trunk-Linux/solr/build/solr-core/test-files/solr/collection1/conf/protwords.txt to /configs/conf1/protwords.txt
   [junit4]   2> 653809 T2345 oascc.SolrZkClient.makePath makePath: /configs/conf1/protwords.txt
   [junit4]   2> 653810 T2345 oasc.AbstractZkTestCase.putConfig put /mnt/ssd/jenkins/workspace/Lucene-Solr-trunk-Linux/solr/build/solr-core/test-files/solr/collection1/conf/currency.xml to /configs/conf1/currency.xml
   [junit4]   2> 653810 T2345 oascc.SolrZkClient.makePath makePath: /configs/conf1/currency.xml
   [junit4]   2> 653812 T2345 oasc.AbstractZkTestCase.putConfig put /mnt/ssd/jenkins/workspace/Lucene-Solr-trunk-Linux/solr/build/solr-core/test-files/solr/collection1/conf/open-exchange-rates.json to /configs/conf1/open-exchange-rates.json
   [junit4]   2> 653812 T2345 oascc.SolrZkClient.makePath makePath: /configs/conf1/open-exchange-rates.json
   [junit4]   2> 653814 T2345 oasc.AbstractZkTestCase.putConfig put /mnt/ssd/jenkins/workspace/Lucene-Solr-trunk-Linux/solr/build/solr-core/test-files/solr/collection1/conf/mapping-ISOLatin1Accent.txt to /configs/conf1/mapping-ISOLatin1Accent.txt
   [junit4]   2> 653814 T2345 oascc.SolrZkClient.makePath makePath: /configs/conf1/mapping-ISOLatin1Accent.txt
   [junit4]   2> 653816 T2345 oasc.AbstractZkTestCase.putConfig put /mnt/ssd/jenkins/workspace/Lucene-Solr-trunk-Linux/solr/build/solr-core/test-files/solr/collection1/conf/old_synonyms.txt to /configs/conf1/old_synonyms.txt
   [junit4]   2> 653816 T2345 oascc.SolrZkClient.makePath makePath: /configs/conf1/old_synonyms.txt
   [junit4]   2> 653818 T2345 oasc.AbstractZkTestCase.putConfig put /mnt/ssd/jenkins/workspace/Lucene-Solr-trunk-Linux/solr/build/solr-core/test-files/solr/collection1/conf/synonyms.txt to /configs/conf1/synonyms.txt
   [junit4]   2> 653818 T2345 oascc.SolrZkClient.makePath makePath: /configs/conf1/synonyms.txt
   [junit4]   2> 653882 T2345 oejs.Server.doStart jetty-8.1.10.v20130312
   [junit4]   2> 653883 T2345 oejs.AbstractConnector.doStart Started SelectChannelConnector@127.0.0.1:33320
   [junit4]   2> 653884 T2345 oass.SolrDispatchFilter.init SolrDispatchFilter.init()
   [junit4]   2> 653884 T2345 oasc.SolrResourceLoader.locateSolrHome JNDI not configured for solr (NoInitialContextEx)
   [junit4]   2> 653884 T2345 oasc.SolrResourceLoader.locateSolrHome using system property solr.solr.home: /mnt/ssd/jenkins/workspace/Lucene-Solr-trunk-Linux/solr/build/solr-core/test/J1/./org.apache.solr.cloud.CollectionsAPIDistributedZkTest-controljetty-1375381835996
   [junit4]   2> 653884 T2345 oasc.SolrResourceLoader.<init> new SolrResourceLoader for directory: '/mnt/ssd/jenkins/workspace/Lucene-Solr-trunk-Linux/solr/build/solr-core/test/J1/./org.apache.solr.cloud.CollectionsAPIDistributedZkTest-controljetty-1375381835996/'
   [junit4]   2> 653894 T2345 oasc.ConfigSolr.fromFile Loading container configuration from /mnt/ssd/jenkins/workspace/Lucene-Solr-trunk-Linux/solr/build/solr-core/test/J1/./org.apache.solr.cloud.CollectionsAPIDistributedZkTest-controljetty-1375381835996/solr.xml
   [junit4]   2> 653923 T2345 oasc.ConfigSolrXml.<init> Config-defined core root directory: 
   [junit4]   2> 653923 T2345 oasc.CoreContainer.<init> New CoreContainer 2138350937
   [junit4]   2> 653923 T2345 oasc.CoreContainer.load Loading cores into CoreContainer [instanceDir=/mnt/ssd/jenkins/workspace/Lucene-Solr-trunk-Linux/solr/build/solr-core/test/J1/./org.apache.solr.cloud.CollectionsAPIDistributedZkTest-controljetty-1375381835996/]
   [junit4]   2> 653924 T2345 oashc.HttpShardHandlerFactory.getParameter Setting socketTimeout to: 120000
   [junit4]   2> 653924 T2345 oashc.HttpShardHandlerFactory.getParameter Setting urlScheme to: http://
   [junit4]   2> 653925 T2345 oashc.HttpShardHandlerFactory.getParameter Setting connTimeout to: 15000
   [junit4]   2> 653925 T2345 oashc.HttpShardHandlerFactory.getParameter Setting maxConnectionsPerHost to: 20
   [junit4]   2> 653925 T2345 oashc.HttpShardHandlerFactory.getParameter Setting corePoolSize to: 0
   [junit4]   2> 653925 T2345 oashc.HttpShardHandlerFactory.getParameter Setting maximumPoolSize to: 2147483647
   [junit4]   2> 653925 T2345 oashc.HttpShardHandlerFactory.getParameter Setting maxThreadIdleTime to: 5
   [junit4]   2> 653926 T2345 oashc.HttpShardHandlerFactory.getParameter Setting sizeOfQueue to: -1
   [junit4]   2> 653926 T2345 oashc.HttpShardHandlerFactory.getParameter Setting fairnessPolicy to: false
   [junit4]   2> 653926 T2345 oascsi.HttpClientUtil.createClient Creating new http client, config:maxConnectionsPerHost=20&maxConnections=10000&socketTimeout=120000&connTimeout=15000&retry=false
   [junit4]   2> 653929 T2345 oasc.ZkContainer.initZooKeeper Zookeeper client=127.0.0.1:41572/solr
   [junit4]   2> 653929 T2345 oasc.ZkController.checkChrootPath zkHost includes chroot
   [junit4]   2> 653930 T2345 oascc.ConnectionManager.waitForConnected Waiting for client to connect to ZooKeeper
   [junit4]   2> 653931 T2365 oascc.ConnectionManager.process Watcher org.apache.solr.common.cloud.ConnectionManager@2d456e95 name:ZooKeeperConnection Watcher:127.0.0.1:41572 got event WatchedEvent state:SyncConnected type:None path:null path:null type:None
   [junit4]   2> 653932 T2345 oascc.ConnectionManager.waitForConnected Client is connected to ZooKeeper
   [junit4]   2> 653933 T2345 oascsi.HttpClientUtil.createClient Creating new http client, config:maxConnections=500&maxConnectionsPerHost=16&socketTimeout=120000&connTimeout=15000
   [junit4]   2> 653936 T2345 oascc.ConnectionManager.waitForConnected Waiting for client to connect to ZooKeeper
   [junit4]   2> 653937 T2367 oascc.ConnectionManager.process Watcher org.apache.solr.common.cloud.ConnectionManager@6ae4d38 name:ZooKeeperConnection Watcher:127.0.0.1:41572/solr got event WatchedEvent state:SyncConnected type:None path:null path:null type:None
   [junit4]   2> 653937 T2345 oascc.ConnectionManager.waitForConnected Client is connected to ZooKeeper
   [junit4]   2> 653938 T2345 oascc.SolrZkClient.makePath makePath: /overseer/queue
   [junit4]   2> 653940 T2345 oascc.SolrZkClient.makePath makePath: /overseer/collection-queue-work
   [junit4]   2> 653942 T2345 oascc.SolrZkClient.makePath makePath: /live_nodes
   [junit4]   2> 653943 T2345 oasc.ZkController.createEphemeralLiveNode Register node as live in ZooKeeper:/live_nodes/127.0.0.1:33320_vtmq%2Fck
   [junit4]   2> 653944 T2345 oascc.SolrZkClient.makePath makePath: /live_nodes/127.0.0.1:33320_vtmq%2Fck
   [junit4]   2> 653946 T2345 oascc.SolrZkClient.makePath makePath: /overseer_elect/election
   [junit4]   2> 653949 T2345 oascc.SolrZkClient.makePath makePath: /overseer_elect/leader
   [junit4]   2> 653951 T2345 oasc.Overseer.start Overseer (id=90137023983779843-127.0.0.1:33320_vtmq%2Fck-n_0000000000) starting
   [junit4]   2> 653953 T2345 oascc.SolrZkClient.makePath makePath: /overseer/queue-work
   [junit4]   2> 653955 T2369 oasc.OverseerCollectionProcessor.run Process current queue of collection creations
   [junit4]   2> 653955 T2345 oascc.SolrZkClient.makePath makePath: /clusterstate.json
   [junit4]   2> 653957 T2345 oascc.SolrZkClient.makePath makePath: /aliases.json
   [junit4]   2> 653958 T2345 oascc.ZkStateReader.createClusterStateWatchersAndUpdate Updating cluster state from ZooKeeper... 
   [junit4]   2> 653960 T2368 oasc.Overseer$ClusterStateUpdater.run Starting to work on the main queue
   [junit4]   2> 653962 T2345 oasc.CorePropertiesLocator.discover Looking for core definitions underneath /mnt/ssd/jenkins/workspace/Lucene-Solr-trunk-Linux/solr/build/solr-core/test/J1/./org.apache.solr.cloud.CollectionsAPIDistributedZkTest-controljetty-1375381835996
   [junit4]   2> 653984 T2345 oasc.CorePropertiesLocator.discoverUnder Found core conf in /mnt/ssd/jenkins/workspace/Lucene-Solr-trunk-Linux/solr/build/solr-core/test/J1/./org.apache.solr.cloud.CollectionsAPIDistributedZkTest-controljetty-1375381835996/conf/
   [junit4]   2> 653984 T2345 oasc.CorePropertiesLocator.discover Found 1 core definitions
   [junit4]   2> 653985 T2345 oass.SolrDispatchFilter.init user.dir=/mnt/ssd/jenkins/workspace/Lucene-Solr-trunk-Linux/solr/build/solr-core/test/J1
   [junit4]   2> 653985 T2345 oass.SolrDispatchFilter.init SolrDispatchFilter.init() done
   [junit4]   2> 653985 T2345 oascsi.HttpClientUtil.createClient Creating new http client, config:maxConnections=128&maxConnectionsPerHost=32&followRedirects=false
   [junit4]   2> 653988 T2345 oascsi.HttpClientUtil.createClient Creating new http client, config:
   [junit4]   2> 653989 T2345 oascc.ConnectionManager.waitForConnected Waiting for client to connect to ZooKeeper
   [junit4]   2> 653990 T2372 oascc.ConnectionManager.process Watcher org.apache.solr.common.cloud.ConnectionManager@1679b6bd name:ZooKeeperConnection Watcher:127.0.0.1:41572/solr got event WatchedEvent state:SyncConnected type:None path:null path:null type:None
   [junit4]   2> 653990 T2345 oascc.ConnectionManager.waitForConnected Client is connected to ZooKeeper
   [junit4]   2> 653992 T2345 oascc.ZkStateReader.createClusterStateWatchersAndUpdate Updating cluster state from ZooKeeper... 
   [junit4]   2> 653993 T2345 oasc.ChaosMonkey.monkeyLog monkey: init - expire sessions:true cause connection loss:true
   [junit4]   2> 654051 T2345 oejs.Server.doStart jetty-8.1.10.v20130312
   [junit4]   2> 654053 T2345 oejs.AbstractConnector.doStart Started SelectChannelConnector@127.0.0.1:37480
   [junit4]   2> 654053 T2345 oass.SolrDispatchFilter.init SolrDispatchFilter.init()
   [junit4]   2> 654053 T2345 oasc.SolrResourceLoader.locateSolrHome JNDI not configured for solr (NoInitialContextEx)
   [junit4]   2> 654054 T2345 oasc.SolrResourceLoader.locateSolrHome using system property solr.solr.home: /mnt/ssd/jenkins/workspace/Lucene-Solr-trunk-Linux/solr/build/solr-core/test/J1/./org.apache.solr.cloud.CollectionsAPIDistributedZkTest-jetty1-1375381836169
   [junit4]   2> 654054 T2345 oasc.SolrResourceLoader.<init> new SolrResourceLoader for directory: '/mnt/ssd/jenkins/workspace/Lucene-Solr-trunk-Linux/solr/build/solr-core/test/J1/./org.apache.solr.cloud.CollectionsAPIDistributedZkTest-jetty1-1375381836169/'
   [junit4]   2> 654063 T2345 oasc.ConfigSolr.fromFile Loading container configuration from /mnt/ssd/jenkins/workspace/Lucene-Solr-trunk-Linux/solr/build/solr-core/test/J1/./org.apache.solr.cloud.CollectionsAPIDistributedZkTest-jetty1-1375381836169/solr.xml
   [junit4]   2> 654091 T2345 oasc.ConfigSolrXml.<init> Config-defined core root directory: 
   [junit4]   2> 654092 T2345 oasc.CoreContainer.<init> New CoreContainer 1721813714
   [junit4]   2> 654092 T2345 oasc.CoreContainer.load Loading cores into CoreContainer [instanceDir=/mnt/ssd/jenkins/workspace/Lucene-Solr-trunk-Linux/solr/build/solr-core/test/J1/./org.apache.solr.cloud.CollectionsAPIDistributedZkTest-jetty1-1375381836169/]
   [junit4]   2> 654093 T2345 oashc.HttpShardHandlerFactory.getParameter Setting socketTimeout to: 120000
   [junit4]   2> 654093 T2345 oashc.HttpShardHandlerFactory.getParameter Setting urlScheme to: http://
   [junit4]   2> 654093 T2345 oashc.HttpShardHandlerFactory.getParameter Setting connTimeout to: 15000
   [junit4]   2> 654093 T2345 oashc.HttpShardHandlerFactory.getParameter Setting maxConnectionsPerHost to: 20
   [junit4]   2> 654094 T2345 oashc.HttpShardHandlerFactory.getParameter Setting corePoolSize to: 0
   [junit4]   2> 654094 T2345 oashc.HttpShardHandlerFactory.getParameter Setting maximumPoolSize to: 2147483647
   [junit4]   2> 654094 T2345 oashc.HttpShardHandlerFactory.getParameter Setting maxThreadIdleTime to: 5
   [junit4]   2> 654094 T2345 oashc.HttpShardHandlerFactory.getParameter Setting sizeOfQueue to: -1
   [junit4]   2> 654095 T2345 oashc.HttpShardHandlerFactory.getParameter Setting fairnessPolicy to: false
   [junit4]   2> 654095 T2345 oascsi.HttpClientUtil.createClient Creating new http client, config:maxConnectionsPerHost=20&maxConnections=10000&socketTimeout=120000&connTimeout=15000&retry=false
   [junit4]   2> 654097 T2345 oasc.ZkContainer.initZooKeeper Zookeeper client=127.0.0.1:41572/solr
   [junit4]   2> 654098 T2345 oasc.ZkController.checkChrootPath zkHost includes chroot
   [junit4]   2> 654098 T2345 oascc.ConnectionManager.waitForConnected Waiting for client to connect to ZooKeeper
   [junit4]   2> 654100 T2383 oascc.ConnectionManager.process Watcher org.apache.solr.common.cloud.ConnectionManager@103ae098 name:ZooKeeperConnection Watcher:127.0.0.1:41572 got event WatchedEvent state:SyncConnected type:None path:null path:null type:None
   [junit4]   2> 654100 T2345 oascc.ConnectionManager.waitForConnected Client is connected to ZooKeeper
   [junit4]   2> 654101 T2345 oascsi.HttpClientUtil.createClient Creating new http client, config:maxConnections=500&maxConnectionsPerHost=16&socketTimeout=120000&connTimeout=15000
   [junit4]   2> 654104 T2345 oascc.ConnectionManager.waitForConnected Waiting for client to connect to ZooKeeper
   [junit4]   2> 654105 T2385 oascc.ConnectionManager.process Watcher org.apache.solr.common.cloud.ConnectionManager@4baf0aac name:ZooKeeperConnection Watcher:127.0.0.1:41572/solr got event WatchedEvent state:SyncConnected type:None path:null path:null type:None
   [junit4]   2> 654105 T2345 oascc.ConnectionManager.waitForConnected Client is connected to ZooKeeper
   [junit4]   2> 654111 T2345 oascc.ZkStateReader.createClusterStateWatchersAndUpdate Updating cluster state from ZooKeeper... 
   [junit4]   2> 655114 T2345 oasc.ZkController.createEphemeralLiveNode Register node as live in ZooKeeper:/live_nodes/127.0.0.1:37480_vtmq%2Fck
   [junit4]   2> 655116 T2345 oascc.SolrZkClient.makePath makePath: /live_nodes/127.0.0.1:37480_vtmq%2Fck
   [junit4]   2> 655121 T2367 oascc.ZkStateReader$3.process Updating live nodes... (2)
   [junit4]   2> 655121 T2372 oascc.ZkStateReader$3.process Updating live nodes... (2)
   [junit4]   2> 655121 T2385 oascc.ZkStateReader$3.process Updating live nodes... (2)
   [junit4]   2> 655128 T2345 oasc.CorePropertiesLocator.discover Looking for core definitions underneath /mnt/ssd/jenkins/workspace/Lucene-Solr-trunk-Linux/solr/build/solr-core/test/J1/./org.apache.solr.cloud.CollectionsAPIDistributedZkTest-jetty1-1375381836169
   [junit4]   2> 655159 T2345 oasc.CorePropertiesLocator.discoverUnder Found core conf in /mnt/ssd/jenkins/workspace/Lucene-Solr-trunk-Linux/solr/build/solr-core/test/J1/./org.apache.solr.cloud.CollectionsAPIDistributedZkTest-jetty1-1375381836169/conf/
   [junit4]   2> 655159 T2345 oasc.CorePropertiesLocator.discover Found 1 core definitions
   [junit4]   2> 655159 T2345 oass.SolrDispatchFilter.init user.dir=/mnt/ssd/jenkins/workspace/Lucene-Solr-trunk-Linux/solr/build/solr-core/test/J1
   [junit4]   2> 655160 T2345 oass.SolrDispatchFilter.init SolrDispatchFilter.init() done
   [junit4]   2> 655160 T2345 oascsi.HttpClientUtil.createClient Creating new http client, config:maxConnections=128&maxConnectionsPerHost=32&followRedirects=false
   [junit4]   2> 655219 T2345 oejs.Server.doStart jetty-8.1.10.v20130312
   [junit4]   2> 655221 T2345 oejs.AbstractConnector.doStart Started SelectChannelConnector@127.0.0.1:55347
   [junit4]   2> 655221 T2345 oass.SolrDispatchFilter.init SolrDispatchFilter.init()
   [junit4]   2> 655221 T2345 oasc.SolrResourceLoader.locateSolrHome JNDI not configured for solr (NoInitialContextEx)
   [junit4]   2> 655222 T2345 oasc.SolrResourceLoader.locateSolrHome using system property solr.solr.home: /mnt/ssd/jenkins/workspace/Lucene-Solr-trunk-Linux/solr/build/solr-core/test/J1/./org.apache.solr.cloud.CollectionsAPIDistributedZkTest-jetty2-1375381837338
   [junit4]   2> 655222 T2345 oasc.SolrResourceLoader.<init> new SolrResourceLoader for directory: '/mnt/ssd/jenkins/workspace/Lucene-Solr-trunk-Linux/solr/build/solr-core/test/J1/./org.apache.solr.cloud.CollectionsAPIDistributedZkTest-jetty2-1375381837338/'
   [junit4]   2> 655231 T2345 oasc.ConfigSolr.fromFile Loading container configuration from /mnt/ssd/jenkins/workspace/Lucene-Solr-trunk-Linux/solr/build/solr-core/test/J1/./org.apache.solr.cloud.CollectionsAPIDistributedZkTest-jetty2-1375381837338/solr.xml
   [junit4]   2> 655260 T2345 oasc.ConfigSolrXml.<init> Config-defined core root directory: 
   [junit4]   2> 655260 T2345 oasc.CoreContainer.<init> New CoreContainer 1365473169
   [junit4]   2> 655260 T2345 oasc.CoreContainer.load Loading cores into CoreContainer [instanceDir=/mnt/ssd/jenkins/workspace/Lucene-Solr-trunk-Linux/solr/build/solr-core/test/J1/./org.apache.solr.cloud.CollectionsAPIDistributedZkTest-jetty2-1375381837338/]
   [junit4]   2> 655261 T2345 oashc.HttpShardHandlerFactory.getParameter Setting socketTimeout to: 120000
   [junit4]   2> 655261 T2345 oashc.HttpShardHandlerFactory.getParameter Setting urlScheme to: http://
   [junit4]   2> 655262 T2345 oashc.HttpShardHandlerFactory.getParameter Setting connTimeout to: 15000
   [junit4]   2> 655262 T2345 oashc.HttpShardHandlerFactory.getParameter Setting maxConnectionsPerHost to: 20
   [junit4]   2> 655262 T2345 oashc.HttpShardHandlerFactory.getParameter Setting corePoolSize to: 0
   [junit4]   2> 655262 T2345 oashc.HttpShardHandlerFactory.getParameter Setting maximumPoolSize to: 2147483647
   [junit4]   2> 655263 T2345 oashc.HttpShardHandlerFactory.getParameter Setting maxThreadIdleTime to: 5
   [junit4]   2> 655263 T2345 oashc.HttpShardHandlerFactory.getParameter Setting sizeOfQueue to: -1
   [junit4]   2> 655263 T2345 oashc.HttpShardHandlerFactory.getParameter Setting fairnessPolicy to: false
   [junit4]   2> 655263 T2345 oascsi.HttpClientUtil.createClient Creating new http client, config:maxConnectionsPerHost=20&maxConnections=10000&socketTimeout=120000&connTimeout=15000&retry=false
   [junit4]   2> 655266 T2345 oasc.ZkContainer.initZooKeeper Zookeeper client=127.0.0.1:41572/solr
   [junit4]   2> 655266 T2345 oasc.ZkController.checkChrootPath zkHost includes chroot
   [junit4]   2> 655267 T2345 oascc.ConnectionManager.waitForConnected Waiting for client to connect to ZooKeeper
   [junit4]   2> 655268 T2397 oascc.ConnectionManager.process Watcher org.apache.solr.common.cloud.ConnectionManager@67cc29b2 name:ZooKeeperConnection Watcher:127.0.0.1:41572 got event WatchedEvent state:SyncConnected type:None path:null path:null type:None
   [junit4]   2> 655268 T2345 oascc.ConnectionManager.waitForConnected Client is connected to ZooKeeper
   [junit4]   2> 655270 T2345 oascsi.HttpClientUtil.createClient Creating new http client, config:maxConnections=500&maxConnectionsPerHost=16&socketTimeout=120000&connTimeout=15000
   [junit4]   2> 655272 T2345 oascc.ConnectionManager.waitForConnected Waiting for client to connect to ZooKeeper
   [junit4]   2> 655273 T2399 oascc.ConnectionManager.process Watcher org.apache.solr.common.cloud.ConnectionManager@5c5326d3 name:ZooKeeperConnection Watcher:127.0.0.1:41572/solr got event WatchedEvent state:SyncConnected type:None path:null path:null type:None
   [junit4]   2> 655274 T2345 oascc.ConnectionManager.waitForConnected Client is connected to ZooKeeper
   [junit4]   2> 655277 T2345 oascc.ZkStateReader.createClusterStateWatchersAndUpdate Updating cluster state from ZooKeeper... 
   [junit4]   2> 656279 T2345 oasc.ZkController.createEphemeralLiveNode Register node as live in ZooKeeper:/live_nodes/127.0.0.1:55347_vtmq%2Fck
   [junit4]   2> 656281 T2345 oascc.SolrZkClient.makePath makePath: /live_nodes/127.0.0.1:55347_vtmq%2Fck
   [junit4]   2> 656286 T2372 oascc.ZkStateReader$3.process Updating live nodes... (3)
   [junit4]   2> 656286 T2385 oascc.ZkStateReader$3.process Updating live nodes... (3)
   [junit4]   2> 656286 T2367 oascc.ZkStateReader$3.process Updating live nodes... (3)
   [junit4]   2> 656286 T2399 oascc.ZkStateReader$3.process Updating live nodes... (3)
   [junit4]   2> 656294 T2345 oasc.CorePropertiesLocator.discover Looking for core definitions underneath /mnt/ssd/jenkins/workspace/Lucene-Solr-trunk-Linux/solr/build/solr-core/test/J1/./org.apache.solr.cloud.CollectionsAPIDistributedZkTest-jetty2-1375381837338
   [junit4]   2> 656321 T2345 oasc.CorePropertiesLocator.discoverUnder Found core conf in /mnt/ssd/jenkins/workspace/Lucene-Solr-trunk-Linux/solr/build/solr-core/test/J1/./org.apache.solr.cloud.CollectionsAPIDistributedZkTest-jetty2-1375381837338/conf/
   [junit4]   2> 656322 T2345 oasc.CorePropertiesLocator.discover Found 1 core definitions
   [junit4]   2> 656322 T2345 oass.SolrDispatchFilter.init user.dir=/mnt/ssd/jenkins/workspace/Lucene-Solr-trunk-Linux/solr/build/solr-core/test/J1
   [junit4]   2> 656322 T2345 oass.SolrDispatchFilter.init SolrDispatchFilter.init() done
   [junit4]   2> 656323 T2345 oascsi.HttpClientUtil.createClient Creating new http client, config:maxConnections=128&maxConnectionsPerHost=32&followRedirects=false
   [junit4]   2> 656381 T2345 oejs.Server.doStart jetty-8.1.10.v20130312
   [junit4]   2> 656383 T2345 oejs.AbstractConnector.doStart Started SelectChannelConnector@127.0.0.1:52320
   [junit4]   2> 656383 T2345 oass.SolrDispatchFilter.init SolrDispatchFilter.init()
   [junit4]   2> 656383 T2345 oasc.SolrResourceLoader.locateSolrHome JNDI not configured for solr (NoInitialContextEx)
   [junit4]   2> 656384 T2345 oasc.SolrResourceLoader.locateSolrHome using system property solr.solr.home: /mnt/ssd/jenkins/workspace/Lucene-Solr-trunk-Linux/solr/build/solr-core/test/J1/./org.apache.solr.cloud.CollectionsAPIDistributedZkTest-jetty3-1375381838501
   [junit4]   2> 656384 T2345 oasc.SolrResourceLoader.<init> new SolrResourceLoader for directory: '/mnt/ssd/jenkins/workspace/Lucene-Solr-trunk-Linux/solr/build/solr-core/test/J1/./org.apache.solr.cloud.CollectionsAPIDistributedZkTest-jetty3-1375381838501/'
   [junit4]   2> 656398 T2345 oasc.ConfigSolr.fromFile Loading container configuration from /mnt/ssd/jenkins/workspace/Lucene-Solr-trunk-Linux/solr/build/solr-core/test/J1/./org.apache.solr.cloud.CollectionsAPIDistributedZkTest-jetty3-1375381838501/solr.xml
   [junit4]   2> 656439 T2345 oasc.ConfigSolrXml.<init> Config-defined core root directory: 
   [junit4]   2> 656439 T2345 oasc.CoreContainer.<init> New CoreContainer 839270091
   [junit4]   2> 656439 T2345 oasc.CoreContainer.load Loading cores into CoreContainer [instanceDir=/mnt/ssd/jenkins/workspace/Lucene-Solr-trunk-Linux/solr/build/solr-core/test/J1/./org.apache.solr.cloud.CollectionsAPIDistributedZkTest-jetty3-1375381838501/]
   [junit4]   2> 656440 T2345 oashc.HttpShardHandlerFactory.getParameter Setting socketTimeout to: 120000
   [junit4]   2> 656440 T2345 oashc.HttpShardHandlerFactory.getParameter Setting urlScheme to: http://
   [junit4]   2> 656440 T2345 oashc.HttpShardHandlerFactory.getParameter Setting connTimeout to: 15000
   [junit4]   2> 656441 T2345 oashc.HttpShardHandlerFactory.getParameter Setting maxConnectionsPerHost to: 20
   [junit4]   2> 656441 T2345 oashc.HttpShardHandlerFactory.getParameter Setting corePoolSize to: 0
   [junit4]   2> 656441 T2345 oashc.HttpShardHandlerFactory.getParameter Setting maximumPoolSize to: 2147483647
   [junit4]   2> 656441 T2345 oashc.HttpShardHandlerFactory.getParameter Setting maxThreadIdleTime to: 5
   [junit4]   2> 656442 T2345 oashc.HttpShardHandlerFactory.getParameter Setting sizeOfQueue to: -1
   [junit4]   2> 656442 T2345 oashc.HttpShardHandlerFactory.getParameter Setting fairnessPolicy to: false
   [junit4]   2> 656442 T2345 oascsi.HttpClientUtil.createClient Creating new http client, config:maxConnectionsPerHost=20&maxConnections=10000&socketTimeout=120000&connTimeout=15000&retry=false
   [junit4]   2> 656445 T2345 oasc.ZkContainer.initZooKeeper Zookeeper client=127.0.0.1:41572/solr
   [junit4]   2> 656445 T2345 oasc.ZkController.checkChrootPath zkHost includes chroot
   [junit4]   2> 656446 T2345 oascc.ConnectionManager.waitForConnected Waiting for client to connect to ZooKeeper
   [junit4]   2> 656448 T2411 oascc.ConnectionManager.process Watcher org.apache.solr.common.cloud.ConnectionManager@426515a6 name:ZooKeeperConnection Watcher:127.0.0.1:41572 got event WatchedEvent state:SyncConnected type:None path:null path:null type:None
   [junit4]   2> 656448 T2345 oascc.ConnectionManager.waitForConnected Client is connected to ZooKeeper
   [junit4]   2> 656450 T2345 oascsi.HttpClientUtil.createClient Creating new http client, config:maxConnections=500&maxConnectionsPerHost=16&socketTimeout=120000&connTimeout=15000
   [junit4]   2> 656453 T2345 oascc.ConnectionManager.waitForConnected Waiting for client to connect to ZooKeeper
   [junit4]   2> 656454 T2413 oascc.ConnectionManager.process Watcher org.apache.solr.common.cloud.ConnectionManager@38924c34 name:ZooKeeperConnection Watcher:127.0.0.1:41572/solr got event WatchedEvent state:SyncConnected type:None path:null path:null type:None
   [junit4]   2> 656455 T2345 oascc.ConnectionManager.waitForConnected Client is connected to ZooKeeper
   [junit4]   2> 656458 T2345 oascc.ZkStateReader.createClusterStateWatchersAndUpdate Updating cluster state from ZooKeeper... 
   [junit4]   2> 657461 T2345 oasc.ZkController.createEphemeralLiveNode Register node as live in ZooKeeper:/live_nodes/127.0.0.1:52320_vtmq%2Fck
   [junit4]   2> 657463 T2345 oascc.SolrZkClient.makePath makePath: /live_nodes/127.0.0.1:52320_vtmq%2Fck
   [junit4]   2> 657468 T2367 oascc.ZkStateReader$3.process Updating live nodes... (4)
   [junit4]   2> 657468 T2399 oascc.ZkStateReader$3.process Updating live nodes... (4)
   [junit4]   2> 657468 T2372 oascc.ZkStateReader$3.process Updating live nodes... (4)
   [junit4]   2> 657468 T2413 oascc.ZkStateReader$3.process Updating live nodes... (4)
   [junit4]   2> 657468 T2385 oascc.ZkStateReader$3.process Updating live nodes... (4)
   [junit4]   2> 657476 T2345 oasc.CorePropertiesLocator.discover Looking for core definitions underneath /mnt/ssd/jenkins/workspace/Lucene-Solr-trunk-Linux/solr/build/solr-core/test/J1/./org.apache.solr.cloud.CollectionsAPIDistributedZkTest-jetty3-1375381838501
   [junit4]   2> 657502 T2345 oasc.CorePropertiesLocator.discoverUnder Found core conf in /mnt/ssd/jenkins/workspace/Lucene-Solr-trunk-Linux/solr/build/solr-core/test/J1/./org.apache.solr.cloud.CollectionsAPIDistributedZkTest-jetty3-1375381838501/conf/
   [junit4]   2> 657502 T2345 oasc.CorePropertiesLocator.discover Found 1 core definitions
   [junit4]   2> 657503 T2345 oass.SolrDispatchFilter.init user.dir=/mnt/ssd/jenkins/workspace/Lucene-Solr-trunk-Linux/solr/build/solr-core/test/J1
   [junit4]   2> 657503 T2345 oass.SolrDispatchFilter.init SolrDispatchFilter.init() done
   [junit4]   2> 657504 T2345 oascsi.HttpClientUtil.createClient Creating new http client, config:maxConnections=128&maxConnectionsPerHost=32&followRedirects=false
   [junit4]   2> 657562 T2345 oejs.Server.doStart jetty-8.1.10.v20130312
   [junit4]   2> 657564 T2345 oejs.AbstractConnector.doStart Started SelectChannelConnector@127.0.0.1:58481
   [junit4]   2> 657565 T2345 oass.SolrDispatchFilter.init SolrDispatchFilter.init()
   [junit4]   2> 657565 T2345 oasc.SolrResourceLoader.locateSolrHome JNDI not configured for solr (NoInitialContextEx)
   [junit4]   2> 657565 T2345 oasc.SolrResourceLoader.locateSolrHome using system property solr.solr.home: /mnt/ssd/jenkins/workspace/Lucene-Solr-trunk-Linux/solr/build/solr-core/test/J1/./org.apache.solr.cloud.CollectionsAPIDistributedZkTest-jetty4-1375381839682
   [junit4]   2> 657565 T2345 oasc.SolrResourceLoader.<init> new SolrResourceLoader for directory: '/mnt/ssd/jenkins/workspace/Lucene-Solr-trunk-Linux/solr/build/solr-core/test/J1/./org.apache.solr.cloud.CollectionsAPIDistributedZkTest-jetty4-1375381839682/'
   [junit4]   2> 657574 T2345 oasc.ConfigSolr.fromFile Loading container configuration from /mnt/ssd/jenkins/workspace/Lucene-Solr-trunk-Linux/solr/build/solr-core/test/J1/./org.apache.solr.cloud.CollectionsAPIDistributedZkTest-jetty4-1375381839682/solr.xml
   [junit4]   2> 657602 T2345 oasc.ConfigSolrXml.<init> Config-defined core root directory: 
   [junit4]   2> 657602 T2345 oasc.CoreContainer.<init> New CoreContainer 1131909566
   [junit4]   2> 657602 T2345 oasc.CoreContainer.load Loading cores into CoreContainer [instanceDir=/mnt/ssd/jenkins/workspace/Lucene-Solr-trunk-Linux/solr/build/solr-core/test/J1/./org.apache.solr.cloud.CollectionsAPIDistributedZkTest-jetty4-1375381839682/]
   [junit4]   2> 657603 T2345 oashc.HttpShardHandlerFactory.getParameter Setting socketTimeout to: 120000
   [junit4]   2> 657603 T2345 oashc.HttpShardHandlerFactory.getParameter Setting urlScheme to: http://
   [junit4]   2> 657604 T2345 oashc.HttpShardHandlerFactory.getParameter Setting connTimeout to: 15000
   [junit4]   2> 657604 T2345 oashc.HttpShardHandlerFactory.getParameter Setting maxConnectionsPerHost to: 20
   [junit4]   2> 657604 T2345 oashc.HttpShardHandlerFactory.getParameter Setting corePoolSize to: 0
   [junit4]   2> 657604 T2345 oashc.HttpShardHandlerFactory.getParameter Setting maximumPoolSize to: 2147483647
   [junit4]   2> 657605 T2345 oashc.HttpShardHandlerFactory.getParameter Setting maxThreadIdleTime to: 5
   [junit4]   2> 657605 T2345 oashc.HttpShardHandlerFactory.getParameter Setting sizeOfQueue to: -1
   [junit4]   2> 657605 T2345 oashc.HttpShardHandlerFactory.getParameter Setting fairnessPolicy to: false
   [junit4]   2> 657605 T2345 oascsi.HttpClientUtil.createClient Creating new http client, config:maxConnectionsPerHost=20&maxConnections=10000&socketTimeout=120000&connTimeout=15000&retry=false
   [junit4]   2> 657608 T2345 oasc.ZkContainer.initZooKeeper Zookeeper client=127.0.0.1:41572/solr
   [junit4]   2> 657608 T2345 oasc.ZkController.checkChrootPath zkHost includes chroot
   [junit4]   2> 657609 T2345 oascc.ConnectionManager.waitForConnected Waiting for client to connect to ZooKeeper
   [junit4]   2> 657610 T2425 oascc.ConnectionManager.process Watcher org.apache.solr.common.cloud.ConnectionManager@2812af6a name:ZooKeeperConnection Watcher:127.0.0.1:41572 got event WatchedEvent state:SyncConnected type:None path:null path:null type:None
   [junit4]   2> 657610 T2345 oascc.ConnectionManager.waitForConnected Client is connected to ZooKeeper
   [junit4]   2> 657612 T2345 oascsi.HttpClientUtil.createClient Creating new http client, config:maxConnections=500&maxConnectionsPerHost=16&socketTimeout=120000&connTimeout=15000
   [junit4]   2> 657614 T2345 oascc.ConnectionManager.waitForConnected Waiting for client to connect to ZooKeeper
   [junit4]   2> 657615 T2427 oascc.ConnectionManager.process Watcher org.apache.solr.common.cloud.ConnectionManager@4e7ee150 name:ZooKeeperConnection Watcher:127.0.0.1:41572/solr got event WatchedEvent state:SyncConnected type:None path:null path:null type:None
   [junit4]   2> 657615 T2345 oascc.ConnectionManager.waitForConnected Client is connected to ZooKeeper
   [junit4]   2> 657618 T2345 oascc.ZkStateReader.createClusterStateWatchersAndUpdate Updating cluster state from ZooKeeper... 
   [junit4]   2> 658620 T2345 oasc.ZkController.createEphemeralLiveNode Register node as live in ZooKeeper:/live_nodes/127.0.0.1:58481_vtmq%2Fck
   [junit4]   2> 658622 T2345 oascc.SolrZkClient.makePath makePath: /live_nodes/127.0.0.1:58481_vtmq%2Fck
   [junit4]   2> 658627 T2367 oascc.ZkStateReader$3.process Updating live nodes... (5)
   [junit4]   2> 658627 T2385 oascc.ZkStateReader$3.process Updating live nodes... (5)
   [junit4]   2> 658627 T2413 oascc.ZkStateReader$3.process Updating live nodes... (5)
   [junit4]   2> 658627 T2372 oascc.ZkStateReader$3.process Updating live nodes... (5)
   [junit4]   2> 658627 T2427 oascc.ZkStateReader$3.process Updating live nodes... (5)
   [junit4]   2> 658627 T2399 oascc.ZkStateReader$3.process Updating live nodes... (5)
   [junit4]   2> 658634 T2345 oasc.CorePropertiesLocator.discover Looking for core definitions underneath /mnt/ssd/jenkins/workspace/Lucene-Solr-trunk-Linux/solr/build/solr-core/test/J1/./org.apache.solr.cloud.CollectionsAPIDistributedZkTest-jetty4-1375381839682
   [junit4]   2> 658672 T2345 oasc.CorePropertiesLocator.discoverUnder Found core conf in /mnt/ssd/jenkins/workspace/Lucene-Solr-trunk-Linux/solr/build/solr-core/test/J1/./org.apache.solr.cloud.CollectionsAPIDistributedZkTest-jetty4-1375381839682/conf/
   [junit4]   2> 658673 T2345 oasc.CorePropertiesLocator.discover Found 1 core definitions
   [junit4]   2> 658673 T2345 oass.SolrDispatchFilter.init user.dir=/mnt/ssd/jenkins/workspace/Lucene-Solr-trunk-Linux/solr/build/solr-core/test/J1
   [junit4]   2> 658673 T2345 oass.SolrDispatchFilter.init SolrDispatchFilter.init() done
   [junit4]   2> 658674 T2345 oascsi.HttpClientUtil.createClient Creating new http client, config:maxConnections=128&maxConnectionsPerHost=32&followRedirects=false
   [junit4]   2> 658676 T2345 oascsi.HttpClientUtil.createClient Creating new http client, config:maxConnections=128&maxConnectionsPerHost=32&followRedirects=false
   [junit4]   2> 658679 T2380 oasha.CollectionsHandler.handleCreateAction Creating Collection : numShards=2&name=nodes_used_collection&replicationFactor=2&action=CREATE&wt=javabin&version=2
   [junit4]   2> 658681 T2367 oasc.DistributedQueue$LatchChildWatcher.process Watcher fired on path: /overseer/collection-queue-work state: SyncConnected type NodeChildrenChanged
   [junit4]   2> 658682 T2369 oasc.OverseerCollectionProcessor.run Overseer Collection Processor: Get the message id:/overseer/collection-queue-work/qn-0000000000 message:{
   [junit4]   2> 	  "operation":"createcollection",
   [junit4]   2> 	  "numShards":"2",
   [junit4]   2> 	  "name":"nodes_used_collection",
   [junit4]   2> 	  "replicationFactor":"2"}
   [junit4]   2> 658682 T2369 oasc.OverseerCollectionProcessor.processMessage WARN OverseerCollectionProcessor.processMessage : createcollection , {
   [junit4]   2> 	  "operation":"createcollection",
   [junit4]   2> 	  "numShards":"2",
   [junit4]   2> 	  "name":"nodes_used_collection",
   [junit4]   2> 	  "replicationFactor":"2"}
   [junit4]   2> 659970 T2368 oascc.ZkStateReader.updateClusterState Updating cloud state from ZooKeeper... 
   [junit4]   2> 659971 T2368 oasc.Overseer$ClusterStateUpdater.buildCollection building a new collection: nodes_used_collection
   [junit4]   2> 659972 T2368 oasc.Overseer$ClusterStateUpdater.createCollection Create collection nodes_used_collection with shards [shard1, shard2]
   [junit4]   2> 659976 T2427 oascc.ZkStateReader$2.process A cluster state change: WatchedEvent state:SyncConnected type:NodeDataChanged path:/clusterstate.json, has occurred - updating... (live nodes size: 5)
   [junit4]   2> 659977 T2367 oascc.ZkStateReader$2.process A cluster state change: WatchedEvent state:SyncConnected type:NodeDataChanged path:/clusterstate.json, has occurred - updating... (live nodes size: 5)
   [junit4]   2> 659977 T2385 oascc.ZkStateReader$2.process A cluster state change: WatchedEvent state:SyncConnected type:NodeDataChanged path:/clusterstate.json, has occurred - updating... (live nodes size: 5)
   [junit4]   2> 659977 T2372 oascc.ZkStateReader$2.process A cluster state change: WatchedEvent state:SyncConnected type:NodeDataChanged path:/clusterstate.json, has occurred - updating... (live nodes size: 5)
   [junit4]   2> 659976 T2413 oascc.ZkStateReader$2.process A cluster state change: WatchedEvent state:SyncConnected type:NodeDataChanged path:/clusterstate.json, has occurred - updating... (live nodes size: 5)
   [junit4]   2> 659977 T2399 oascc.ZkStateReader$2.process A cluster state change: WatchedEvent state:SyncConnected type:NodeDataChanged path:/clusterstate.json, has occurred - updating... (live nodes size: 5)
   [junit4]   2> 659986 T2369 oasc.OverseerCollectionProcessor.createCollection going to create cores replicas shardNames [shard1, shard2] , repFactor : 2
   [junit4]   2> 659986 T2369 oasc.OverseerCollectionProcessor.createCollection Creating shard nodes_used_collection_shard1_replica1 as part of slice shard1 of collection nodes_used_collection on 127.0.0.1:37480_vtmq%2Fck
   [junit4]   2> 659987 T2369 oasc.OverseerCollectionProcessor.createCollection Creating shard nodes_used_collection_shard1_replica2 as part of slice shard1 of collection nodes_used_collection on 127.0.0.1:52320_vtmq%2Fck
   [junit4]   2> 659988 T2369 oasc.OverseerCollectionProcessor.createCollection Creating shard nodes_used_collection_shard2_replica1 as part of slice shard2 of collection nodes_used_collection on 127.0.0.1:55347_vtmq%2Fck
   [junit4]   2> 659989 T2369 oasc.OverseerCollectionProcessor.createCollection Creating shard nodes_used_collection_shard2_replica2 as part of slice shard2 of collection nodes_used_collection on 127.0.0.1:58481_vtmq%2Fck
   [junit4]   2> 659992 T2381 oasc.ZkController.publish publishing core=nodes_used_collection_shard1_replica1 state=down
   [junit4]   2> 659992 T2408 oasc.ZkController.publish publishing core=nodes_used_collection_shard1_replica2 state=down
   [junit4]   2> 659993 T2395 oasc.ZkController.publish publishing core=nodes_used_collection_shard2_replica1 state=down
   [junit4]   2> 659994 T2381 oasc.ZkController.waitForCoreNodeName look for our core node name
   [junit4]   2> 659995 T2408 oasc.ZkController.waitForCoreNodeName look for our core node name
   [junit4]   2> 659995 T2423 oasc.ZkController.publish publishing core=nodes_used_collection_shard2_replica2 state=down
   [junit4]   2> 659995 T2395 oasc.ZkController.waitForCoreNodeName look for our core node name
   [junit4]   2> 659997 T2423 oasc.ZkController.waitForCoreNodeName look for our core node name
   [junit4]   2> 661483 T2368 oascc.ZkStateReader.updateClusterState Updating cloud state from ZooKeeper... 
   [junit4]   2> 661485 T2368 oasc.Overseer$ClusterStateUpdater.updateState WARN Could not find collection node for nodes_used_collection, skipping publish state
   [junit4]   2> 661485 T2368 oasc.Overseer$ClusterStateUpdater.updateState Update state numShards=2 message={
   [junit4]   2> 	  "operation":"state",
   [junit4]   2> 	  "core_node_name":"core_node1",
   [junit4]   2> 	  "numShards":"2",
   [junit4]   2> 	  "shard":"shard1",
   [junit4]   2> 	  "roles":null,
   [junit4]   2> 	  "state":"down",
   [junit4]   2> 	  "shard_state":"active",
   [junit4]   2> 	  "core":"nodes_used_collection_shard1_replica1",
   [junit4]   2> 	  "collection":"nodes_used_collection",
   [junit4]   2> 	  "shard_range":null,
   [junit4]   2> 	  "node_name":"127.0.0.1:37480_vtmq%2Fck",
   [junit4]   2> 	  "base_url":"http://127.0.0.1:37480/vtmq/ck"}
   [junit4]   2> 661491 T2368 oasc.Overseer$ClusterStateUpdater.updateState WARN Could not find collection node for nodes_used_collection, skipping publish state
   [junit4]   2> 661491 T2368 oasc.Overseer$ClusterStateUpdater.updateState Update state numShards=2 message={
   [junit4]   2> 	  "operation":"state",
   [junit4]   2> 	  "core_node_name":"core_node2",
   [junit4]   2> 	  "numShards":"2",
   [junit4]   2> 	  "shard":"shard1",
   [junit4]   2> 	  "roles":null,
   [junit4]   2> 	  "state":"down",
   [junit4]   2> 	  "shard_state":"active",
   [junit4]   2> 	  "core":"nodes_used_collection_shard1_replica2",
   [junit4]   2> 	  "collection":"nodes_used_collection",
   [junit4]   2> 	  "shard_range":null,
   [junit4]   2> 	  "node_name":"127.0.0.1:52320_vtmq%2Fck",
   [junit4]   2> 	  "base_url":"http://127.0.0.1:52320/vtmq/ck"}
   [junit4]   2> 661495 T2368 oasc.Overseer$ClusterStateUpdater.updateState WARN Could not find collection node for nodes_used_collection, skipping publish state
   [junit4]   2> 661496 T2368 oasc.Overseer$ClusterStateUpdater.updateState Update state numShards=2 message={
   [junit4]   2> 	  "operation":"state",
   [junit4]   2> 	  "core_node_name":"core_node3",
   [junit4]   2> 	  "numShards":"2",
   [junit4]   2> 	  "shard":"shard2",
   [junit4]   2> 	  "roles":null,
   [junit4]   2> 	  "state":"down",
   [junit4]   2> 	  "shard_state":"active",
   [junit4]   2> 	  "core":"nodes_used_collection_shard2_replica1",
   [junit4]   2> 	  "collection":"nodes_used_collection",
   [junit4]   2> 	  "shard_range":null,
   [junit4]   2> 	  "node_name":"127.0.0.1:55347_vtmq%2Fck",
   [junit4]   2> 	  "base_url":"http://127.0.0.1:55347/vtmq/ck"}
   [junit4]   2> 661501 T2368 oasc.Overseer$ClusterStateUpdater.updateState WARN Could not find collection node for nodes_used_collection, skipping publish state
   [junit4]   2> 661501 T2368 oasc.Overseer$ClusterStateUpdater.updateState Update state numShards=2 message={
   [junit4]   2> 	  "operation":"state",
   [junit4]   2> 	  "core_node_name":"core_node4",
   [junit4]   2> 	  "numShards":"2",
   [junit4]   2> 	  "shard":"shard2",
   [junit4]   2> 	  "roles":null,
   [junit4]   2> 	  "state":"down",
   [junit4]   2> 	  "shard_state":"active",
   [junit4]   2> 	  "core":"nodes_used_collection_shard2_replica2",
   [junit4]   2> 	  "collection":"nodes_used_collection",
   [junit4]   2> 	  "shard_range":null,
   [junit4]   2> 	  "node_name":"127.0.0.1:58481_vtmq%2Fck",
   [junit4]   2> 	  "base_url":"http://127.0.0.1:58481/vtmq/ck"}
   [junit4]   2> 661506 T2413 oascc.ZkStateReader$2.process A cluster state change: WatchedEvent state:SyncConnected type:NodeDataChanged path:/clusterstate.json, has occurred - updating... (live nodes size: 5)
   [junit4]   2> 661506 T2367 oascc.ZkStateReader$2.process A cluster state change: WatchedEvent state:SyncConnected type:NodeDataChanged path:/clusterstate.json, has occurred - updating... (live nodes size: 5)
   [junit4]   2> 661506 T2372 oascc.ZkStateReader$2.process A cluster state change: WatchedEvent state:SyncConnected type:NodeDataChanged path:/clusterstate.json, has occurred - updating... (live nodes size: 5)
   [junit4]   2> 661506 T2385 oascc.ZkStateReader$2.process A cluster state change: WatchedEvent state:SyncConnected type:NodeDataChanged path:/clusterstate.json, has occurred - updating... (live nodes size: 5)
   [junit4]   2> 661506 T2399 oascc.ZkStateReader$2.process A cluster state change: WatchedEvent state:SyncConnected type:NodeDataChanged path:/clusterstate.json, has occurred - updating... (live nodes size: 5)
   [junit4]   2> 661506 T2427 oascc.ZkStateReader$2.process A cluster state change: WatchedEvent state:SyncConnected type:NodeDataChanged path:/clusterstate.json, has occurred - updating... (live nodes size: 5)
   [junit4]   2> 661995 T2381 oasc.ZkController.waitForShardId waiting to find shard id in clusterstate for nodes_used_collection_shard1_replica1
   [junit4]   2> 661996 T2408 oasc.ZkController.waitForShardId waiting to find shard id in clusterstate for nodes_used_collection_shard1_replica2
   [junit4]   2> 661996 T2381 oasc.CorePropertiesLocator.writePropertiesFile ERROR Couldn't persist core properties to /mnt/ssd/jenkins/workspace/Lucene-Solr-trunk-Linux/solr/build/solr-core/test/J1/./org.apache.solr.cloud.CollectionsAPIDistributedZkTest-jetty1-1375381836169/nodes_used_collection_shard1_replica1/core.properties: java.io.FileNotFoundException: /mnt/ssd/jenkins/workspace/Lucene-Solr-trunk-Linux/solr/build/solr-core/test/J1/./org.apache.solr.cloud.CollectionsAPIDistributedZkTest-jetty1-1375381836169/nodes_used_collection_shard1_replica1/core.properties (No such file or directory)
   [junit4]   2> 661997 T2408 oasc.CorePropertiesLocator.writePropertiesFile ERROR Couldn't persist core properties to /mnt/ssd/jenkins/workspace/Lucene-Solr-trunk-Linux/solr/build/solr-core/test/J1/./org.apache.solr.cloud.CollectionsAPIDistributedZkTest-jetty3-1375381838501/nodes_used_collection_shard1_replica2/core.properties: java.io.FileNotFoundException: /mnt/ssd/jenkins/workspace/Lucene-Solr-trunk-Linux/solr/build/solr-core/test/J1/./org.apache.solr.cloud.CollectionsAPIDistributedZkTest-jetty3-1375381838501/nodes_used_collection_shard1_replica2/core.properties (No such file or directory)
   [junit4]   2> 661996 T2395 oasc.ZkController.waitForShardId waiting to find shard id in clusterstate for nodes_used_collection_shard2_replica1
   [junit4]   2> 661997 T2408 oasc.CoreContainer.create Creating SolrCore 'nodes_used_collection_shard1_replica2' using instanceDir: /mnt/ssd/jenkins/workspace/Lucene-Solr-trunk-Linux/solr/build/solr-core/test/J1/./org.apache.solr.cloud.CollectionsAPIDistributedZkTest-jetty3-1375381838501/nodes_used_collection_shard1_replica2
   [junit4]   2> 661998 T2395 oasc.CorePropertiesLocator.writePropertiesFile ERROR Couldn't persist core properties to /mnt/ssd/jenkins/workspace/Lucene-Solr-trunk-Linux/solr/build/solr-core/test/J1/./org.apache.solr.cloud.CollectionsAPIDistributedZkTest-jetty2-1375381837338/nodes_used_collection_shard2_replica1/core.properties: java.io.FileNotFoundException: /mnt/ssd/jenkins/workspace/Lucene-Solr-trunk-Linux/solr/build/solr-core/test/J1/./org.apache.solr.cloud.CollectionsAPIDistributedZkTest-jetty2-1375381837338/nodes_used_collection_shard2_replica1/core.properties (No such file or directory)
   [junit4]   2> 661999 T2395 oasc.CoreContainer.create Creating SolrCore 'nodes_used_collection_shard2_replica1' using instanceDir: /mnt/ssd/jenkins/workspace/Lucene-Solr-trunk-Linux/solr/build/solr-core/test/J1/./org.apache.solr.cloud.CollectionsAPIDistributedZkTest-jetty2-1375381837338/nodes_used_collection_shard2_replica1
   [junit4]   2> 661999 T2395 oasc.ZkController.createCollectionZkNode Check for collection zkNode:nodes_used_collection
   [junit4]   2> 661997 T2381 oasc.CoreContainer.create Creating SolrCore 'nodes_used_collection_shard1_replica1' using instanceDir: /mnt/ssd/jenkins/workspace/Lucene-Solr-trunk-Linux/solr/build/solr-core/test/J1/./org.apache.solr.cloud.CollectionsAPIDistributedZkTest-jetty1-1375381836169/nodes_used_collection_shard1_replica1
   [junit4]   2> 662000 T2381 oasc.ZkController.createCollectionZkNode Check for collection zkNode:nodes_used_collection
   [junit4]   2> 662001 T2395 oasc.ZkController.createCollectionZkNode Creating collection in ZooKeeper:nodes_used_collection
   [junit4]   2> 661998 T2408 oasc.ZkController.createCollectionZkNode Check for collection zkNode:nodes_used_collection
   [junit4]   2> 661998 T2423 oasc.ZkController.waitForShardId waiting to find shard id in clusterstate for nodes_used_collection_shard2_replica2
   [junit4]   2> 662001 T2381 oasc.ZkController.createCollectionZkNode Creating collection in ZooKeeper:nodes_used_collection
   [junit4]   2> 662001 T2395 oasc.ZkController.getConfName Looking for collection configName
   [junit4]   2> 662002 T2381 oasc.ZkController.getConfName Looking for collection configName
   [junit4]   2> 662002 T2423 oasc.CorePropertiesLocator.writePropertiesFile ERROR Couldn't persist core properties to /mnt/ssd/jenkins/workspace/Lucene-Solr-trunk-Linux/solr/build/solr-core/test/J1/./org.apache.solr.cloud.CollectionsAPIDistributedZkTest-jetty4-1375381839682/nodes_used_collection_shard2_replica2/core.properties: java.io.FileNotFoundException: /mnt/ssd/jenkins/workspace/Lucene-Solr-trunk-Linux/solr/build/solr-core/test/J1/./org.apache.solr.cloud.CollectionsAPIDistributedZkTest-jetty4-1375381839682/nodes_used_collection_shard2_replica2/core.properties (No such file or directory)
   [junit4]   2> 662002 T2408 oasc.ZkController.createCollectionZkNode Creating collection in ZooKeeper:nodes_used_collection
   [junit4]   2> 662004 T2423 oasc.CoreContainer.create Creating SolrCore 'nodes_used_collection_shard2_replica2' using instanceDir: /mnt/ssd/jenkins/workspace/Lucene-Solr-trunk-Linux/solr/build/solr-core/test/J1/./org.apache.solr.cloud.CollectionsAPIDistributedZkTest-jetty4-1375381839682/nodes_used_collection_shard2_replica2
   [junit4]   2> 662004 T2395 oasc.ZkController.getConfName Only one config set found in zk - using it:conf1
   [junit4]   2> 662004 T2381 oasc.ZkController.getConfName Only one config set found in zk - using it:conf1
   [junit4]   2> 662004 T2408 oasc.ZkController.getConfName Looking for collection configName
   [junit4]   2> 662005 T2381 oascc.SolrZkClient.makePath makePath: /collections/nodes_used_collection
   [junit4]   2> 662005 T2395 oascc.SolrZkClient.makePath makePath: /collections/nodes_used_collection
   [junit4]   2> 662005 T2423 oasc.ZkController.createCollectionZkNode Check for collection zkNode:nodes_used_collection
   [junit4]   2> 662007 T2408 oasc.ZkController.getConfName Only one config set found in zk - using it:conf1
   [junit4]   2> 662008 T2408 oascc.SolrZkClient.makePath makePath: /collections/nodes_used_collection
   [junit4]   2> 662008 T2423 oasc.ZkController.createCollectionZkNode Creating collection in ZooKeeper:nodes_used_collection
   [junit4]   2> 662009 T2423 oasc.ZkController.getConfName Looking for collection configName
   [junit4]   2> 662009 T2395 oasc.ZkController.readConfigName Load collection config from:/collections/nodes_used_collection
   [junit4]   2> 662009 T2381 oasc.ZkController.readConfigName Load collection config from:/collections/nodes_used_collection
   [junit4]   2> 662011 T2423 oascc.SolrZkClient.makePath makePath: /collections/nodes_used_collection
   [junit4]   2> 662011 T2408 oasc.ZkController.readConfigName Load collection config from:/collections/nodes_used_collection
   [junit4]   2> 662011 T2395 oasc.SolrResourceLoader.<init> new SolrResourceLoader for directory: '/mnt/ssd/jenkins/workspace/Lucene-Solr-trunk-Linux/solr/build/solr-core/test/J1/./org.apache.solr.cloud.CollectionsAPIDistributedZkTest-jetty2-1375381837338/nodes_used_collection_shard2_replica1/'
   [junit4]   2> 662011 T2381 oasc.SolrResourceLoader.<init> new SolrResourceLoader for directory: '/mnt/ssd/jenkins/workspace/Lucene-Solr-trunk-Linux/solr/build/solr-core/test/J1/./org.apache.solr.cloud.CollectionsAPIDistributedZkTest-jetty1-1375381836169/nodes_used_collection_shard1_replica1/'
   [junit4]   2> 662013 T2408 oasc.SolrResourceLoader.<init> new SolrResourceLoader for directory: '/mnt/ssd/jenkins/workspace/Lucene-Solr-trunk-Linux/solr/build/solr-core/test/J1/./org.apache.solr.cloud.CollectionsAPIDistributedZkTest-jetty3-1375381838501/nodes_used_collection_shard1_replica2/'
   [junit4]   2> 662013 T2423 oasc.ZkController.readConfigName Load collection config from:/collections/nodes_used_collection
   [junit4]   2> 662015 T2423 oasc.SolrResourceLoader.<init> new SolrResourceLoader for directory: '/mnt/ssd/jenkins/workspace/Lucene-Solr-trunk-Linux/solr/build/solr-core/test/J1/./org.apache.solr.cloud.CollectionsAPIDistributedZkTest-jetty4-1375381839682/nodes_used_collection_shard2_replica2/'
   [junit4]   2> 662059 T2395 oasc.SolrConfig.<init> Using Lucene MatchVersion: LUCENE_50
   [junit4]   2> 662061 T2381 oasc.SolrConfig.<init> Using Lucene MatchVersion: LUCENE_50
   [junit4]   2> 662065 T2423 oasc.SolrConfig.<init> Using Lucene MatchVersion: LUCENE_50
   [junit4]   2> 662070 T2408 oasc.SolrConfig.<init> Using Lucene MatchVersion: LUCENE_50
   [junit4]   2> 662101 T2381 oasc.SolrConfig.<init> Loaded SolrConfig: solrconfig.xml
   [junit4]   2> 662103 T2381 oass.IndexSchema.readSchema Reading Solr Schema from schema.xml
   [junit4]   2> 662104 T2423 oasc.SolrConfig.<init> Loaded SolrConfig: solrconfig.xml
   [junit4]   2> 662105 T2423 oass.IndexSchema.readSchema Reading Solr Schema from schema.xml
   [junit4]   2> 662108 T2395 oasc.SolrConfig.<init> Loaded SolrConfig: solrconfig.xml
   [junit4]   2> 662109 T2395 oass.IndexSchema.readSchema Reading Solr Schema from schema.xml
   [junit4]   2> 662110 T2381 oass.IndexSchema.readSchema [nodes_used_collection_shard1_replica1] Schema name=test
   [junit4]   2> 662111 T2423 oass.IndexSchema.readSchema [nodes_used_collection_shard2_replica2] Schema name=test
   [junit4]   2> 662119 T2395 oass.IndexSchema.readSchema [nodes_used_collection_shard2_replica1] Schema name=test
   [junit4]   2> 662122 T2408 oasc.SolrConfig.<init> Loaded SolrConfig: solrconfig.xml
   [junit4]   2> 662124 T2408 oass.IndexSchema.readSchema Reading Solr Schema from schema.xml
   [junit4]   2> 662131 T2408 oass.IndexSchema.readSchema [nodes_used_collection_shard1_replica2] Schema name=test
   [junit4]   2> 662456 T2423 oass.OpenExchangeRatesOrgProvider.init Initialized with rates=open-exchange-rates.json, refreshInterval=1440.
   [junit4]   2> 662461 T2423 oass.IndexSchema.readSchema default search field in schema is text
   [junit4]   2> 662464 T2423 oass.IndexSchema.readSchema unique key field: id
   [junit4]   2> 662474 T2423 oass.FileExchangeRateProvider.reload Reloading exchange rates from file currency.xml
   [junit4]   2> 662477 T2423 oass.FileExchangeRateProvider.reload Reloading exchange rates from file currency.xml
   [junit4]   2> 662479 T2381 oass.OpenExchangeRatesOrgProvider.init Initialized with rates=open-exchange-rates.json, refreshInterval=1440.
   [junit4]   2> 662480 T2395 oass.OpenExchangeRatesOrgProvider.init Initialized with rates=open-exchange-rates.json, refreshInterval=1440.
   [junit4]   2> 662480 T2423 oass.OpenExchangeRatesOrgProvider.reload Reloading exchange rates from open-exchange-rates.json
   [junit4]   2> 662481 T2423 oass.OpenExchangeRatesOrgProvider$OpenExchangeRates.<init> WARN Unknown key IMPORTANT NOTE
   [junit4]   2> 662481 T2423 oass.OpenExchangeRatesOrgProvider$OpenExchangeRates.<init> WARN Expected key, got STRING
   [junit4]   2> 662482 T2423 oass.OpenExchangeRatesOrgProvider.reload Reloading exchange rates from open-exchange-rates.json
   [junit4]   2> 662482 T2423 oass.OpenExchangeRatesOrgProvider$OpenExchangeRates.<init> WARN Unknown key IMPORTANT NOTE
   [junit4]   2> 662483 T2423 oass.OpenExchangeRatesOrgProvider$OpenExchangeRates.<init> WARN Expected key, got STRING
   [junit4]   2> 662483 T2381 oass.IndexSchema.readSchema default search field in schema is text
   [junit4]   2> 662483 T2423 oasc.SolrCore.initDirectoryFactory org.apache.solr.core.MockDirectoryFactory
   [junit4]   2> 662483 T2423 oasc.SolrCore.<init> [nodes_used_collection_shard2_replica2] Opening new SolrCore at /mnt/ssd/jenkins/workspace/Lucene-Solr-trunk-Linux/solr/build/solr-core/test/J1/./org.apache.solr.cloud.CollectionsAPIDistributedZkTest-jetty4-1375381839682/nodes_used_collection_shard2_replica2/, dataDir=/mnt/ssd/jenkins/workspace/Lucene-Solr-trunk-Linux/solr/build/solr-core/test/J1/./org.apache.solr.cloud.CollectionsAPIDistributedZkTest-jetty4-1375381839682//nodes_used_collection_shard2_replica2/data/
   [junit4]   2> 662484 T2423 oasc.JmxMonitoredMap.<init> JMX monitoring is enabled. Adding Solr mbeans to JMX Server: com.sun.jmx.mbeanserver.JmxMBeanServer@546632b
   [junit4]   2> 662484 T2395 oass.IndexSchema.readSchema default search field in schema is text
   [junit4]   2> 662484 T2423 oasc.CachingDirectoryFactory.get return new directory for /mnt/ssd/jenkins/workspace/Lucene-Solr-trunk-Linux/solr/build/solr-core/test/J1/./org.apache.solr.cloud.CollectionsAPIDistributedZkTest-jetty4-1375381839682//nodes_used_collection_shard2_replica2/data
   [junit4]   2> 662485 T2423 oasc.SolrCore.getNewIndexDir New index directory detected: old=null new=/mnt/ssd/jenkins/workspace/Lucene-Solr-trunk-Linux/solr/build/solr-core/test/J1/./org.apache.solr.cloud.CollectionsAPIDistributedZkTest-jetty4-1375381839682//nodes_used_collection_shard2_replica2/data/index/
   [junit4]   2> 662485 T2423 oasc.SolrCore.initIndex WARN [nodes_used_collection_shard2_replica2] Solr index directory '/mnt/ssd/jenkins/workspace/Lucene-Solr-trunk-Linux/solr/build/solr-core/test/J1/./org.apache.solr.cloud.CollectionsAPIDistributedZkTest-jetty4-1375381839682/nodes_used_collection_shard2_replica2/data/index' doesn't exist. Creating new index...
   [junit4]   2> 662485 T2381 oass.IndexSchema.readSchema unique key field: id
   [junit4]   2> 662485 T2423 oasc.CachingDirectoryFactory.get return new directory for /mnt/ssd/jenkins/workspace/Lucene-Solr-trunk-Linux/solr/build/solr-core/test/J1/./org.apache.solr.cloud.CollectionsAPIDistributedZkTest-jetty4-1375381839682//nodes_used_collection_shard2_replica2/data/index
   [junit4]   2> 662486 T2395 oass.IndexSchema.readSchema unique key field: id
   [junit4]   2> 662487 T2423 oasc.SolrDeletionPolicy.onCommit SolrDeletionPolicy.onCommit: commits: num=1
   [junit4]   2> 		commit{dir=MockDirWrapper(org.apache.lucene.store.RAMDirectory@72333ca5 lockFactory=org.apache.lucene.store.NativeFSLockFactory@4a6a90d0),segFN=segments_1,generation=1}
   [junit4]   2> 662487 T2423 oasc.SolrDeletionPolicy.updateCommits newest commit generation = 1
   [junit4]   2> 662488 T2408 oass.OpenExchangeRatesOrgProvider.init Initialized with rates=open-exchange-rates.json, refreshInterval=1440.
   [junit4]   2> 662490 T2423 oasup.UpdateRequestProcessorChain.init inserting DistributedUpdateProcessorFactory into updateRequestProcessorChain "dedupe"
   [junit4]   2> 662491 T2423 oasup.UpdateRequestProcessorChain.init inserting DistributedUpdateProcessorFactory into updateRequestProcessorChain "stored_sig"
   [junit4]   2> 662491 T2423 oasup.UpdateRequestProcessorChain.init inserting DistributedUpdateProcessorFactory into updateRequestProcessorChain "distrib-dup-test-chain-implicit"
   [junit4]   2> 662492 T2423 oasc.RequestHandlers.initHandlersFromConfig created standard: solr.StandardRequestHandler
   [junit4]   2> 662492 T2423 oasc.RequestHandlers.initHandlersFromConfig created /get: solr.RealTimeGetHandler
   [junit4]   2> 662492 T2423 oasc.RequestHandlers.initHandlersFromConfig adding lazy requestHandler: solr.ReplicationHandler
   [junit4]   2> 662493 T2423 oasc.RequestHandlers.initHandlersFromConfig created /replication: solr.ReplicationHandler
   [junit4]   2> 662493 T2423 oasc.RequestHandlers.initHandlersFromConfig created /update: solr.UpdateRequestHandler
   [junit4]   2> 662493 T2423 oasc.RequestHandlers.initHandlersFromConfig created /admin/: org.apache.solr.handler.admin.AdminHandlers
   [junit4]   2> 662494 T2408 oass.IndexSchema.readSchema default search field in schema is text
   [junit4]   2> 662496 T2423 oashl.XMLLoader.init xsltCacheLifetimeSeconds=60
   [junit4]   2> 662497 T2381 oass.FileExchangeRateProvider.reload Reloading exchange rates from file currency.xml
   [junit4]   2> 662497 T2408 oass.IndexSchema.readSchema unique key field: id
   [junit4]   2> 662498 T2423 oass.SolrIndexSearcher.<init> Opening Searcher@78cb478 main
   [junit4]   2> 662498 T2395 oass.FileExchangeRateProvider.reload Reloading exchange rates from file currency.xml
   [junit4]   2> 662498 T2423 oasu.CommitTracker.<init> Hard AutoCommit: disabled
   [junit4]   2> 662499 T2423 oasu.CommitTracker.<init> Soft AutoCommit: disabled
   [junit4]   2> 662502 T2381 oass.FileExchangeRateProvider.reload Reloading exchange rates from file currency.xml
   [junit4]   2> 662502 T2433 oasc.SolrCore.registerSearcher [nodes_used_collection_shard2_replica2] Registered new searcher Searcher@78cb478 main{StandardDirectoryReader(segments_1:1)}
   [junit4]   2> 662502 T2395 oass.FileExchangeRateProvider.reload Reloading exchange rates from file currency.xml
   [junit4]   2> 662504 T2423 oasc.CoreContainer.registerCore registering core: nodes_used_collection_shard2_replica2
   [junit4]   2> 662504 T2423 oasc.ZkController.register Register replica - core:nodes_used_collection_shard2_replica2 address:http://127.0.0.1:58481/vtmq/ck collection:nodes_used_collection shard:shard2
   [junit4]   2> 662505 T2423 oascsi.HttpClientUtil.createClient Creating new http client, config:maxConnections=10000&maxConnectionsPerHost=20&connTimeout=15000&socketTimeout=30000&retry=false
   [junit4]   2> 662505 T2395 oass.OpenExchangeRatesOrgProvider.reload Reloading exchange rates from open-exchange-rates.json
   [junit4]   2> 662505 T2381 oass.OpenExchangeRatesOrgProvider.reload Reloading exchange rates from open-exchange-rates.json
   [junit4]   2> 662506 T2395 oass.OpenExchangeRatesOrgProvider$OpenExchangeRates.<init> WARN Unknown key IMPORTANT NOTE
   [junit4]   2> 662506 T2395 oass.OpenExchangeRatesOrgProvider$OpenExchangeRates.<init> WARN Expected key, got STRING
   [junit4]   2> 662506 T2381 oass.OpenExchangeRatesOrgProvider$OpenExchangeRates.<init> WARN Unknown key IMPORTANT NOTE
   [junit4]   2> 662507 T2381 oass.OpenExchangeRatesOrgProvider$OpenExchangeRates.<init> WARN Expected key, got STRING
   [junit4]   2> 662507 T2395 oass.OpenExchangeRatesOrgProvider.reload Reloading exchange rates from open-exchange-rates.json
   [junit4]   2> 662507 T2381 oass.OpenExchangeRatesOrgProvider.reload Reloading exchange rates from open-exchange-rates.json
   [junit4]   2> 662507 T2408 oass.FileExchangeRateProvider.reload Reloading exchange rates from file currency.xml
   [junit4]   2> 662508 T2395 oass.OpenExchangeRatesOrgProvider$OpenExchangeRates.<init> WARN Unknown key IMPORTANT NOTE
   [junit4]   2> 662508 T2395 oass.OpenExchangeRatesOrgProvider$OpenExchangeRates.<init> WARN Expected key, got STRING
   [junit4]   2> 662508 T2423 oascc.SolrZkClient.makePath makePath: /collections/nodes_used_collection/leader_elect/shard2/election
   [junit4]   2> 662508 T2395 oasc.SolrCore.initDirectoryFactory org.apache.solr.core.MockDirectoryFactory
   [junit4]   2> 662508 T2381 oass.OpenExchangeRatesOrgProvider$OpenExchangeRates.<init> WARN Unknown key IMPORTANT NOTE
   [junit4]   2> 662509 T2381 oass.OpenExchangeRatesOrgProvider$OpenExchangeRates.<init> WARN Expected key, got STRING
   [junit4]   2> 662509 T2395 oasc.SolrCore.<init> [nodes_used_collection_shard2_replica1] Opening new SolrCore at /mnt/ssd/jenkins/workspace/Lucene-Solr-trunk-Linux/solr/build/solr-core/test/J1/./org.apache.solr.cloud.CollectionsAPIDistributedZkTest-jetty2-1375381837338/nodes_used_collection_shard2_replica1/, dataDir=/mnt/ssd/jenkins/workspace/Lucene-Solr-trunk-Linux/solr/build/solr-core/test/J1/./org.apache.solr.cloud.CollectionsAPIDistributedZkTest-jetty2-1375381837338//nodes_used_collection_shard2_replica1/data/
   [junit4]   2> 662509 T2381 oasc.SolrCore.initDirectoryFactory org.apache.solr.core.MockDirectoryFactory
   [junit4]   2> 662509 T2395 oasc.JmxMonitoredMap.<init> JMX monitoring is enabled. Adding Solr mbeans to JMX Server: com.sun.jmx.mbeanserver.JmxMBeanServer@546632b
   [junit4]   2> 662510 T2381 oasc.SolrCore.<init> [nodes_used_collection_shard1_replica1] Opening new SolrCore at /mnt/ssd/jenkins/workspace/Lucene-Solr-trunk-Linux/solr/build/solr-core/test/J1/./org.apache.solr.cloud.CollectionsAPIDistributedZkTest-jetty1-1375381836169/nodes_used_collection_shard1_replica1/, dataDir=/mnt/ssd/jenkins/workspace/Lucene-Solr-trunk-Linux/solr/build/solr-core/test/J1/./org.apache.solr.cloud.CollectionsAPIDistributedZkTest-jetty1-1375381836169//nodes_used_collection_shard1_replica1/data/
   [junit4]   2> 662510 T2381 oasc.JmxMonitoredMap.<init> JMX monitoring is enabled. Adding Solr mbeans to JMX Server: com.sun.jmx.mbeanserver.JmxMBeanServer@546632b
   [junit4]   2> 662510 T2395 oasc.CachingDirectoryFactory.get return new directory for /mnt/ssd/jenkins/workspace/Lucene-Solr-trunk-Linux/solr/build/solr-core/test/J1/./org.apache.solr.cloud.CollectionsAPIDistributedZkTest-jetty2-1375381837338//nodes_used_collection_shard2_replica1/data
   [junit4]   2> 662511 T2395 oasc.SolrCore.getNewIndexDir New index directory detected: old=null new=/mnt/ssd/jenkins/workspace/Lucene-Solr-trunk-Linux/solr/build/solr-core/test/J1/./org.apache.solr.cloud.CollectionsAPIDistributedZkTest-jetty2-1375381837338//nodes_used_collection_shard2_replica1/data/index/
   [junit4]   2> 662511 T2408 oass.FileExchangeRateProvider.reload Reloading exchange rates from file currency.xml
   [junit4]   2> 662511 T2381 oasc.CachingDirectoryFactory.get return new directory for /mnt/ssd/jenkins/workspace/Lucene-Solr-trunk-Linux/solr/build/solr-core/test/J1/./org.apache.solr.cloud.CollectionsAPIDistributedZkTest-jetty1-1375381836169//nodes_used_collection_shard1_replica1/data
   [junit4]   2> 662511 T2395 oasc.SolrCore.initIndex WARN [nodes_used_collection_shard2_replica1] Solr index directory '/mnt/ssd/jenkins/workspace/Lucene-Solr-trunk-Linux/solr/build/solr-core/test/J1/./org.apache.solr.cloud.CollectionsAPIDistributedZkTest-jetty2-1375381837338/nodes_used_collection_shard2_replica1/data/index' doesn't exist. Creating new index...
   [junit4]   2> 662511 T2381 oasc.SolrCore.getNewIndexDir New index directory detected: old=null new=/mnt/ssd/jenkins/workspace/Lucene-Solr-trunk-Linux/solr/build/solr-core/test/J1/./org.apache.solr.cloud.CollectionsAPIDistributedZkTest-jetty1-1375381836169//nodes_used_collection_shard1_replica1/data/index/
   [junit4]   2> 662512 T2381 oasc.SolrCore.initIndex WARN [nodes_used_collection_shard1_replica1] Solr index directory '/mnt/ssd/jenkins/workspace/Lucene-Solr-trunk-Linux/solr/build/solr-core/test/J1/./org.apache.solr.cloud.CollectionsAPIDistributedZkTest-jetty1-1375381836169/nodes_used_collection_shard1_replica1/data/index' doesn't exist. Creating new index...
   [junit4]   2> 662512 T2395 oasc.CachingDirectoryFactory.get return new directory for /mnt/ssd/jenkins/workspace/Lucene-Solr-trunk-Linux/solr/build/solr-core/test/J1/./org.apache.solr.cloud.CollectionsAPIDistributedZkTest-jetty2-1375381837338//nodes_used_collection_shard2_replica1/data/index
   [junit4]   2> 662512 T2381 oasc.CachingDirectoryFactory.get return new directory for /mnt/ssd/jenkins/workspace/Lucene-Solr-trunk-Linux/solr/build/solr-core/test/J1/./org.apache.solr.cloud.CollectionsAPIDistributedZkTest-jetty1-1375381836169//nodes_used_collection_shard1_replica1/data/index
   [junit4]   2> 662513 T2423 oasc.ShardLeaderElectionContext.runLeaderProcess Running the leader process for shard shard2
   [junit4]   2> 662514 T2381 oasc.SolrDeletionPolicy.onCommit SolrDeletionPolicy.onCommit: commits: num=1
   [junit4]   2> 		commit{dir=MockDirWrapper(org.apache.lucene.store.RAMDirectory@37244969 lockFactory=org.apache.lucene.store.NativeFSLockFactory@22ce1d67),segFN=segments_1,generation=1}
   [junit4]   2> 662514 T2381 oasc.SolrDeletionPolicy.updateCommits newest commit generation = 1
   [junit4]   2> 662514 T2408 oass.OpenExchangeRatesOrgProvider.reload Reloading exchange rates from open-exchange-rates.json
   [junit4]   2> 662514 T2395 oasc.SolrDeletionPolicy.onCommit SolrDeletionPolicy.onCommit: commits: num=1
   [junit4]   2> 		commit{dir=MockDirWrapper(org.apache.lucene.store.RAMDirectory@3c545a85 lockFactory=org.apache.lucene.store.NativeFSLockFactory@12faecb2),segFN=segments_1,generation=1}
   [junit4]   2> 662514 T2395 oasc.SolrDeletionPolicy.updateCommits newest commit generation = 1
   [junit4]   2> 662515 T2408 oass.OpenExchangeRatesOrgProvider$OpenExchangeRates.<init> WARN Unknown key IMPORTANT NOTE
   [junit4]   2> 662515 T2408 oass.OpenExchangeRatesOrgProvider$OpenExchangeRates.<init> WARN Expected key, got STRING
   [junit4]   2> 662515 T2423 oasc.ShardLeaderElectionContext.waitForReplicasToComeUp Waiting until we see more replicas up for shard shard2: total=2 found=1 timeoutin=180000
   [junit4]   2> 662515 T2408 oass.OpenExchangeRatesOrgProvider.reload Reloading exchange rates from open-exchange-rates.json
   [junit4]   2> 662516 T2408 oass.OpenExchangeRatesOrgProvider$OpenExchangeRates.<init> WARN Unknown key IMPORTANT NOTE
   [junit4]   2> 662517 T2381 oasup.UpdateRequestProcessorChain.init inserting DistributedUpdateProcessorFactory into updateRequestProcessorChain "dedupe"
   [junit4]   2> 662517 T2408 oass.OpenExchangeRatesOrgProvider$OpenExchangeRates.<init> WARN Expected key, got STRING
   [junit4]   2> 662517 T2381 oasup.UpdateRequestProcessorChain.init inserting DistributedUpdateProcessorFactory into updateRequestProcessorChain "stored_sig"
   [junit4]   2> 662517 T2408 oasc.SolrCore.initDirectoryFactory org.apache.solr.core.MockDirectoryFactory
   [junit4]   2> 662518 T2381 oasup.UpdateRequestProcessorChain.init inserting DistributedUpdateProcessorFactory into updateRequestProcessorChain "distrib-dup-test-chain-implicit"
   [junit4]   2> 662518 T2408 oasc.SolrCore.<init> [nodes_used_collection_shard1_replica2] Opening new SolrCore at /mnt/ssd/jenkins/workspace/Lucene-Solr-trunk-Linux/solr/build/solr-core/test/J1/./org.apache.solr.cloud.CollectionsAPIDistributedZkTest-jetty3-1375381838501/nodes_used_collection_shard1_replica2/, dataDir=/mnt/ssd/jenkins/workspace/Lucene-Solr-trunk-Linux/solr/build/solr-core/test/J1/./org.apache.solr.cloud.CollectionsAPIDistributedZkTest-jetty3-1375381838501//nodes_used_collection_shard1_replica2/data/
   [junit4]   2> 662518 T2381 oasc.RequestHandlers.initHandlersFromConfig created standard: solr.StandardRequestHandler
   [junit4]   2> 662518 T2408 oasc.JmxMonitoredMap.<init> JMX monitoring is enabled. Adding Solr mbeans to JMX Server: com.sun.jmx.mbeanserver.JmxMBeanServer@546632b
   [junit4]   2> 662518 T2395 oasup.UpdateRequestProcessorChain.init inserting DistributedUpdateProcessorFactory into updateRequestProcessorChain "dedupe"
   [junit4]   2> 662519 T2381 oasc.RequestHandlers.initHandlersFromConfig created /get: solr.RealTimeGetHandler
   [junit4]   2> 662519 T2381 oasc.RequestHandlers.initHandlersFromConfig adding lazy requestHandler: solr.ReplicationHandler
   [junit4]   2> 662519 T2395 oasup.UpdateRequestProcessorChain.init inserting DistributedUpdateProcessorFactory into updateRequestProcessorChain "stored_sig"
   [junit4]   2> 662519 T2381 oasc.RequestHandlers.initHandlersFromConfig created /replication: solr.ReplicationHandler
   [junit4]   2> 662519 T2408 oasc.CachingDirectoryFactory.get return new directory for /mnt/ssd/jenkins/workspace/Lucene-Solr-trunk-Linux/solr/build/solr-core/test/J1/./org.apache.solr.cloud.CollectionsAPIDistributedZkTest-jetty3-1375381838501//nodes_used_collection_shard1_replica2/data
   [junit4]   2> 662520 T2381 oasc.RequestHandlers.initHandlersFromConfig created /update: solr.UpdateRequestHandler
   [junit4]   2> 662520 T2408 oasc.SolrCore.getNewIndexDir New index directory detected: old=null new=/mnt/ssd/jenkins/workspace/Lucene-Solr-trunk-Linux/solr/build/solr-core/test/J1/./org.apache.solr.cloud.CollectionsAPIDistributedZkTest-jetty3-1375381838501//nodes_used_collection_shard1_replica2/data/index/
   [junit4]   2> 662520 T2395 oasup.UpdateRequestProcessorChain.init inserting DistributedUpdateProcessorFactory into updateRequestProcessorChain "distrib-dup-test-chain-implicit"
   [junit4]   2> 662520 T2408 oasc.SolrCore.initIndex WARN [nodes_used_collection_shard1_replica2] Solr index directory '/mnt/ssd/jenkins/workspace/Lucene-Solr-trunk-Linux/solr/build/solr-core/test/J1/./org.apache.solr.cloud.CollectionsAPIDistributedZkTest-jetty3-1375381838501/nodes_used_collection_shard1_replica2/data/index' doesn't exist. Creating new index...
   [junit4]   2> 662520 T2381 oasc.RequestHandlers.initHandlersFromConfig created /admin/: org.apache.solr.handler.admin.AdminHandlers
   [junit4]   2> 662521 T2408 oasc.CachingDirectoryFactory.get return new directory for /mnt/ssd/jenkins/workspace/Lucene-Solr-trunk-Linux/solr/build/solr-core/test/J1/./org.apache.solr.cloud.CollectionsAPIDistributedZkTest-jetty3-1375381838501//nodes_used_collection_shard1_replica2/data/index
   [junit4]   2> 662521 T2395 oasc.RequestHandlers.initHandlersFromConfig created standard: solr.StandardRequestHandler
   [junit4]   2> 662522 T2395 oasc.RequestHandlers.initHandlersFromConfig created /get: solr.RealTimeGetHandler
   [junit4]   2> 662522 T2395 oasc.RequestHandlers.initHandlersFromConfig adding lazy requestHandler: solr.ReplicationHandler
   [junit4]   2> 662522 T2395 oasc.RequestHandlers.initHandlersFromConfig created /replication: solr.ReplicationHandler
   [junit4]   2> 662523 T2408 oasc.SolrDeletionPolicy.onCommit SolrDeletionPolicy.onCommit: commits: num=1
   [junit4]   2> 		commit{dir=MockDirWrapper(org.apache.lucene.store.RAMDirectory@16cfb252 lockFactory=org.apache.lucene.store.NativeFSLockFactory@2bb7c0fe),segFN=segments_1,generation=1}
   [junit4]   2> 662523 T2395 oasc.RequestHandlers.initHandlersFromConfig created /update: solr.UpdateRequestHandler
   [junit4]   2> 662523 T2381 oashl.XMLLoader.init xsltCacheLifetimeSeconds=60
   [junit4]   2> 662523 T2395 oasc.RequestHandlers.initHandlersFromConfig created /admin/: org.apache.solr.handler.admin.AdminHandlers
   [junit4]   2> 662523 T2408 oasc.SolrDeletionPolicy.updateCommits newest commit generation = 1
   [junit4]   2> 662526 T2381 oass.SolrIndexSearcher.<init> Opening Searcher@6eb928c5 main
   [junit4]   2> 662526 T2395 oashl.XMLLoader.init xsltCacheLifetimeSeconds=60
   [junit4]   2> 662526 T2381 oasu.CommitTracker.<init> Hard AutoCommit: disabled
   [junit4]   2> 662527 T2381 oasu.CommitTracker.<init> Soft AutoCommit: disabled
   [junit4]   2> 662528 T2408 oasup.UpdateRequestProcessorChain.init inserting DistributedUpdateProcessorFactory into updateRequestProcessorChain "dedupe"
   [junit4]   2> 662528 T2408 oasup.UpdateRequestProcessorChain.init inserting DistributedUpdateProcessorFactory into updateRequestProcessorChain "stored_sig"
   [junit4]   2> 662529 T2395 oass.SolrIndexSearcher.<init> Opening Searcher@4fb2fe12 main
   [junit4]   2> 662529 T2408 oasup.UpdateRequestProcessorChain.init inserting DistributedUpdateProcessorFactory into updateRequestProcessorChain "distrib-dup-test-chain-implicit"
   [junit4]   2> 662530 T2395 oasu.CommitTracker.<init> Hard AutoCommit: disabled
   [junit4]   2> 662530 T2408 oasc.RequestHandlers.initHandlersFromConfig created standard: solr.StandardRequestHandler
   [junit4]   2> 662530 T2434 oasc.SolrCore.registerSearcher [nodes_used_collection_shard1_replica1] Registered new searcher Searcher@6eb928c5 main{StandardDirectoryReader(segments_1:1)}
   [junit4]   2> 662530 T2395 oasu.CommitTracker.<init> Soft AutoCommit: disabled
   [junit4]   2> 662530 T2381 oasc.CoreContainer.registerCore registering core: nodes_used_collection_shard1_replica1
   [junit4]   2> 662530 T2408 oasc.RequestHandlers.initHandlersFromConfig created /get: solr.RealTimeGetHandler
   [junit4]   2> 662531 T2381 oasc.ZkController.register Register replica - core:nodes_used_collection_shard1_replica1 address:http://127.0.0.1:37480/vtmq/ck collection:nodes_used_collection shard:shard1
   [junit4]   2> 662531 T2408 oasc.RequestHandlers.initHandlersFromConfig adding lazy requestHandler: solr.ReplicationHandler
   [junit4]   2> 662531 T2381 oascsi.HttpClientUtil.createClient Creating new http client, config:maxConnections=10000&maxConnectionsPerHost=20&connTimeout=15000&socketTimeout=30000&retry=false
   [junit4]   2> 662532 T2408 oasc.RequestHandlers.initHandlersFromConfig created /replication: solr.ReplicationHandler
   [junit4]   2> 662532 T2408 oasc.RequestHandlers.initHandlersFromConfig created /update: solr.UpdateRequestHandler
   [junit4]   2> 662533 T2408 oasc.RequestHandlers.initHandlersFromConfig created /admin/: org.apache.solr.handler.admin.AdminHandlers
   [junit4]   2> 662534 T2435 oasc.SolrCore.registerSearcher [nodes_used_collection_shard2_replica1] Registered new searcher Searcher@4fb2fe12 main{StandardDirectoryReader(segments_1:1)}
   [junit4]   2> 662535 T2381 oascc.SolrZkClient.makePath makePath: /collections/nodes_used_collection/leader_elect/shard1/election
   [junit4]   2> 662535 T2395 oasc.CoreContainer.registerCore registering core: nodes_used_collection_shard2_replica1
   [junit4]   2> 662535 T2408 oashl.XMLLoader.init xsltCacheLifetimeSeconds=60
   [junit4]   2> 662535 T2395 oasc.ZkController.register Register replica - core:nodes_used_collection_shard2_replica1 address:http://127.0.0.1:55347/vtmq/ck collection:nodes_used_collection shard:shard2
   [junit4]   2> 662536 T2395 oascsi.HttpClientUtil.createClient Creating new http client, config:maxConnections=10000&maxConnectionsPerHost=20&connTimeout=15000&socketTimeout=30000&retry=false
   [junit4]   2> 662538 T2408 oass.SolrIndexSearcher.<init> Opening Searcher@193c17fb main
   [junit4]   2> 662539 T2408 oasu.CommitTracker.<init> Hard AutoCommit: disabled
   [junit4]   2> 662539 T2381 oasc.ShardLeaderElectionContext.runLeaderProcess Running the leader process for shard shard1
   [junit4]   2> 662539 T2408 oasu.CommitTracker.<init> Soft AutoCommi

[...truncated too long message...]

oasc.ShardLeaderElectionContext.runLeaderProcess Running the leader process for shard shard1
   [junit4]   2> 944439 T2985 oasc.ShardLeaderElectionContext.shouldIBeLeader Checking if I should try and be the leader.
   [junit4]   2> 944440 T2985 oasc.ShardLeaderElectionContext.shouldIBeLeader My last published State was Active, it's okay to be the leader.
   [junit4]   2> 944440 T2985 oasc.ShardLeaderElectionContext.runLeaderProcess I may be the new leader - try and sync
   [junit4]   2> 944440 T2985 oasc.ShardLeaderElectionContext.runLeaderProcess I am the new leader: http://127.0.0.1:8983/solr/collection1/ shard1
   [junit4]   2> 944440 T2985 oascc.SolrZkClient.makePath makePath: /collections/collection1/leaders/shard1
   [junit4]   2> 944444 T2985 oascc.SolrZkClient.makePath makePath: /overseer_elect/leader
   [junit4]   2> 944445 T2985 oasc.Overseer.start Overseer (id=90137040140894214-127.0.0.1:8983_solr-n_0000000001) starting
   [junit4]   2> 944448 T2992 oasc.OverseerCollectionProcessor.run Process current queue of collection creations
   [junit4]   2> 944448 T2991 oasc.Overseer$ClusterStateUpdater.run Starting to work on the main queue
   [junit4]   2> 944449 T2991 oascc.ZkStateReader.updateClusterState Updating cloud state from ZooKeeper... 
   [junit4]   2> 944450 T2991 oasc.Overseer$ClusterStateUpdater.updateState Update state numShards=null message={
   [junit4]   2> 	  "operation":"state",
   [junit4]   2> 	  "core_node_name":"core_node1",
   [junit4]   2> 	  "numShards":null,
   [junit4]   2> 	  "shard":"shard1",
   [junit4]   2> 	  "roles":null,
   [junit4]   2> 	  "state":"down",
   [junit4]   2> 	  "shard_state":"active",
   [junit4]   2> 	  "core":"collection1",
   [junit4]   2> 	  "collection":"collection1",
   [junit4]   2> 	  "shard_range":null,
   [junit4]   2> 	  "node_name":"127.0.0.1:8983_solr",
   [junit4]   2> 	  "base_url":"http://127.0.0.1:8983/solr"}
   [junit4]   2> 944455 T2985 oascc.ZkStateReader$2.process A cluster state change: WatchedEvent state:SyncConnected type:NodeDataChanged path:/clusterstate.json, has occurred - updating... (live nodes size: 1)
   [junit4]   2> 945438 T2961 oasc.ZkController.publish publishing core=collection1 state=down
   [junit4]   2> 945438 T2961 oasc.ZkController.publish numShards not found on descriptor - reading it from system property
   [junit4]   2> 945440 T2961 oasc.SolrCore.close [collection1]  CLOSING SolrCore org.apache.solr.core.SolrCore@461d6e8d
   [junit4]   2> 945449 T2961 oasu.DirectUpdateHandler2.close closing DirectUpdateHandler2{commits=0,autocommits=0,soft autocommits=0,optimizes=0,rollbacks=0,expungeDeletes=0,docsPending=0,adds=0,deletesById=0,deletesByQuery=0,errors=0,cumulative_adds=0,cumulative_deletesById=0,cumulative_deletesByQuery=0,cumulative_errors=0}
   [junit4]   2> 945449 T2961 oasu.SolrCoreState.decrefSolrCoreState Closing SolrCoreState
   [junit4]   2> 945449 T2961 oasu.DefaultSolrCoreState.closeIndexWriter SolrCoreState ref count has reached 0 - closing IndexWriter
   [junit4]   2> 945449 T2961 oasu.DefaultSolrCoreState.closeIndexWriter closing IndexWriter with IndexWriterCloser
   [junit4]   2> 945450 T2961 oasc.SolrCore.closeSearcher [collection1] Closing main searcher on request.
   [junit4]   2> 945450 T2961 oasc.CachingDirectoryFactory.close Closing MockDirectoryFactory - 2 directories currently being tracked
   [junit4]   2> 945451 T2961 oasc.CachingDirectoryFactory.closeCacheValue looking to close /mnt/ssd/jenkins/workspace/Lucene-Solr-trunk-Linux/solr/build/solr-core/test/J0/./solrtest-SliceStateUpdateTest-1375382082225/data2/index [CachedDir<<refCount=0;path=/mnt/ssd/jenkins/workspace/Lucene-Solr-trunk-Linux/solr/build/solr-core/test/J0/./solrtest-SliceStateUpdateTest-1375382082225/data2/index;done=false>>]
   [junit4]   2> 945451 T2961 oasc.CachingDirectoryFactory.close Closing directory: /mnt/ssd/jenkins/workspace/Lucene-Solr-trunk-Linux/solr/build/solr-core/test/J0/./solrtest-SliceStateUpdateTest-1375382082225/data2/index
   [junit4]   2> 945451 T2961 oasc.CachingDirectoryFactory.closeCacheValue looking to close /mnt/ssd/jenkins/workspace/Lucene-Solr-trunk-Linux/solr/build/solr-core/test/J0/./solrtest-SliceStateUpdateTest-1375382082225/data2 [CachedDir<<refCount=0;path=/mnt/ssd/jenkins/workspace/Lucene-Solr-trunk-Linux/solr/build/solr-core/test/J0/./solrtest-SliceStateUpdateTest-1375382082225/data2;done=false>>]
   [junit4]   2> 945451 T2961 oasc.CachingDirectoryFactory.close Closing directory: /mnt/ssd/jenkins/workspace/Lucene-Solr-trunk-Linux/solr/build/solr-core/test/J0/./solrtest-SliceStateUpdateTest-1375382082225/data2
   [junit4]   2> 945452 T2991 oasc.Overseer$ClusterStateUpdater.amILeader According to ZK I (id=90137040140894214-127.0.0.1:8983_solr-n_0000000001) am no longer a leader.
   [junit4]   2> 945454 T2961 oasc.ZkTestServer.send4LetterWord connecting to 127.0.0.1:36904 36904
   [junit4]   2> 945455 T2961 oas.SolrTestCaseJ4.tearDown ###Ending testSliceStateUpdate
   [junit4]   1> client port:0.0.0.0/0.0.0.0:0
   [junit4]   2> NOTE: reproduce with: ant test  -Dtestcase=SliceStateUpdateTest -Dtests.method=testSliceStateUpdate -Dtests.seed=DF8A5C3F83955E82 -Dtests.multiplier=3 -Dtests.slow=true -Dtests.locale=en_SG -Dtests.timezone=Indian/Comoro -Dtests.file.encoding=UTF-8
   [junit4] FAILURE 45.4s J0 | SliceStateUpdateTest.testSliceStateUpdate <<<
   [junit4]    > Throwable #1: org.junit.ComparisonFailure: expected:<[in]active> but was:<[]active>
   [junit4]    > 	at __randomizedtesting.SeedInfo.seed([DF8A5C3F83955E82:FE8D173DD408406]:0)
   [junit4]    > 	at org.apache.solr.cloud.SliceStateUpdateTest.testSliceStateUpdate(SliceStateUpdateTest.java:183)
   [junit4]    > 	at java.lang.Thread.run(Thread.java:724)
   [junit4]   2> 945474 T2961 oas.SolrTestCaseJ4.deleteCore ###deleteCore
   [junit4]   2> 45447 T2960 ccr.ThreadLeakControl.checkThreadLeaks WARNING Will linger awaiting termination of 3 leaked thread(s).
   [junit4]   2> 946753 T2985 oascc.ZkStateReader$3.process WARN ZooKeeper watch triggered, but Solr cannot talk to ZK
   [junit4]   2> 946753 T2985 oascc.ZkStateReader$2.process A cluster state change: WatchedEvent state:SyncConnected type:NodeChildrenChanged path:/live_nodes, has occurred - updating... (live nodes size: 1)
   [junit4]   2> 946753 T2985 oascc.ZkStateReader$2.process WARN ZooKeeper watch triggered, but Solr cannot talk to ZK
   [junit4]   2> NOTE: test params are: codec=Lucene42: {}, docValues:{}, sim=RandomSimilarityProvider(queryNorm=false,coord=crazy): {}, locale=en_SG, timezone=Indian/Comoro
   [junit4]   2> NOTE: Linux 3.2.0-51-generic amd64/Oracle Corporation 1.7.0_25 (64-bit)/cpus=8,threads=1,free=137774720,total=373686272
   [junit4]   2> NOTE: All tests run in this JVM: [TestSolrDeletionPolicy1, ShardRoutingTest, TestPropInjectDefaults, SchemaVersionSpecificBehaviorTest, JsonLoaderTest, PreAnalyzedFieldTest, TestSchemaNameResource, TestDocSet, CoreAdminHandlerTest, TermVectorComponentTest, TestFieldTypeCollectionResource, TestQuerySenderListener, DateFieldTest, DocumentBuilderTest, HdfsChaosMonkeySafeLeaderTest, TestRealTimeGet, ScriptEngineTest, TestDefaultSearchFieldResource, TestSurroundQueryParser, StatelessScriptUpdateProcessorFactoryTest, UpdateRequestProcessorFactoryTest, PreAnalyzedUpdateProcessorTest, SliceStateTest, TestSolrDeletionPolicy2, TestFastLRUCache, TestDynamicFieldCollectionResource, BlockDirectoryTest, IndexSchemaTest, TestFieldTypeResource, BinaryUpdateRequestHandlerTest, TestSchemaVersionResource, DistributedQueryElevationComponentTest, TestFaceting, SystemInfoHandlerTest, PrimUtilsTest, SpellingQueryConverterTest, LukeRequestHandlerTest, TestSearchPerf, TestBadConfig, TestFastWriter, CachingDirectoryFactoryTest, AddSchemaFieldsUpdateProcessorFactoryTest, ReturnFieldsTest, LoggingHandlerTest, SOLR749Test, DirectUpdateHandlerOptimizeTest, ZkCLITest, TestStressRecovery, TestPluginEnable, TestSolrXmlPersistence, FieldMutatingUpdateProcessorTest, TermsComponentTest, SimpleFacetsTest, AlternateDirectoryTest, TestWriterPerf, TestJoin, TestLRUCache, TestFunctionQuery, AnalysisAfterCoreReloadTest, SolrInfoMBeanTest, WordBreakSolrSpellCheckerTest, OverseerTest, DirectSolrConnectionTest, ZkControllerTest, SolrIndexSplitterTest, TestSolrXml, RecoveryZkTest, MBeansHandlerTest, TestReversedWildcardFilterFactory, SuggesterTest, RAMDirectoryFactoryTest, TestExtendedDismaxParser, BasicDistributedZkTest, FastVectorHighlighterTest, CoreMergeIndexesAdminHandlerTest, SolrTestCaseJ4Test, SyncSliceTest, LeaderElectionIntegrationTest, FullSolrCloudDistribCmdsTest, ClusterStateUpdateTest, LeaderElectionTest, ShardRoutingCustomTest, SliceStateUpdateTest]
   [junit4] Completed on J0 in 46.97s, 1 test, 1 failure <<< FAILURES!

[...truncated 453 lines...]
BUILD FAILED
/mnt/ssd/jenkins/workspace/Lucene-Solr-trunk-Linux/build.xml:389: The following error occurred while executing this line:
/mnt/ssd/jenkins/workspace/Lucene-Solr-trunk-Linux/build.xml:369: The following error occurred while executing this line:
/mnt/ssd/jenkins/workspace/Lucene-Solr-trunk-Linux/build.xml:39: The following error occurred while executing this line:
/mnt/ssd/jenkins/workspace/Lucene-Solr-trunk-Linux/solr/build.xml:181: The following error occurred while executing this line:
/mnt/ssd/jenkins/workspace/Lucene-Solr-trunk-Linux/solr/common-build.xml:449: The following error occurred while executing this line:
/mnt/ssd/jenkins/workspace/Lucene-Solr-trunk-Linux/lucene/common-build.xml:1230: The following error occurred while executing this line:
/mnt/ssd/jenkins/workspace/Lucene-Solr-trunk-Linux/lucene/common-build.xml:873: There were test failures: 320 suites, 1345 tests, 1 error, 1 failure, 34 ignored (6 assumptions)

Total time: 39 minutes 15 seconds
Build step 'Invoke Ant' marked build as failure
Description set: Java: 64bit/jdk1.7.0_25 -XX:-UseCompressedOops -XX:+UseParallelGC
Archiving artifacts
Recording test results
Email was triggered for: Failure
Sending email for trigger: Failure



Mime
View raw message