lucene-dev mailing list archives

Site index · List index
Message view « Date » · « Thread »
Top « Date » · « Thread »
From Policeman Jenkins Server <jenk...@thetaphi.de>
Subject [JENKINS] Lucene-Solr-4.x-Linux (64bit/jdk1.6.0_45) - Build # 6773 - Still Failing!
Date Fri, 02 Aug 2013 23:22:23 GMT
Build: http://jenkins.thetaphi.de/job/Lucene-Solr-4.x-Linux/6773/
Java: 64bit/jdk1.6.0_45 -XX:-UseCompressedOops -XX:+UseSerialGC

2 tests failed.
REGRESSION:  org.apache.solr.handler.TestReplicationHandler.doTestStressReplication

Error Message:
timed out waiting for collection1 startAt time to exceed: Fri Aug 02 20:15:21 ART 2013

Stack Trace:
java.lang.AssertionError: timed out waiting for collection1 startAt time to exceed: Fri Aug 02 20:15:21 ART 2013
	at __randomizedtesting.SeedInfo.seed([46E57D34E8E5471C:9D4E7DF2EDCD2EAF]:0)
	at org.junit.Assert.fail(Assert.java:93)
	at org.apache.solr.handler.TestReplicationHandler.watchCoreStartAt(TestReplicationHandler.java:1507)
	at org.apache.solr.handler.TestReplicationHandler.doTestStressReplication(TestReplicationHandler.java:811)
	at sun.reflect.NativeMethodAccessorImpl.invoke0(Native Method)
	at sun.reflect.NativeMethodAccessorImpl.invoke(NativeMethodAccessorImpl.java:39)
	at sun.reflect.DelegatingMethodAccessorImpl.invoke(DelegatingMethodAccessorImpl.java:25)
	at java.lang.reflect.Method.invoke(Method.java:597)
	at com.carrotsearch.randomizedtesting.RandomizedRunner.invoke(RandomizedRunner.java:1559)
	at com.carrotsearch.randomizedtesting.RandomizedRunner.access$600(RandomizedRunner.java:79)
	at com.carrotsearch.randomizedtesting.RandomizedRunner$6.evaluate(RandomizedRunner.java:737)
	at com.carrotsearch.randomizedtesting.RandomizedRunner$7.evaluate(RandomizedRunner.java:773)
	at com.carrotsearch.randomizedtesting.RandomizedRunner$8.evaluate(RandomizedRunner.java:787)
	at com.carrotsearch.randomizedtesting.rules.SystemPropertiesRestoreRule$1.evaluate(SystemPropertiesRestoreRule.java:53)
	at org.apache.lucene.util.TestRuleSetupTeardownChained$1.evaluate(TestRuleSetupTeardownChained.java:50)
	at org.apache.lucene.util.TestRuleFieldCacheSanity$1.evaluate(TestRuleFieldCacheSanity.java:51)
	at org.apache.lucene.util.AbstractBeforeAfterRule$1.evaluate(AbstractBeforeAfterRule.java:46)
	at com.carrotsearch.randomizedtesting.rules.SystemPropertiesInvariantRule$1.evaluate(SystemPropertiesInvariantRule.java:55)
	at org.apache.lucene.util.TestRuleThreadAndTestName$1.evaluate(TestRuleThreadAndTestName.java:49)
	at org.apache.lucene.util.TestRuleIgnoreAfterMaxFailures$1.evaluate(TestRuleIgnoreAfterMaxFailures.java:70)
	at org.apache.lucene.util.TestRuleMarkFailure$1.evaluate(TestRuleMarkFailure.java:48)
	at com.carrotsearch.randomizedtesting.rules.StatementAdapter.evaluate(StatementAdapter.java:36)
	at com.carrotsearch.randomizedtesting.ThreadLeakControl$StatementRunner.run(ThreadLeakControl.java:358)
	at com.carrotsearch.randomizedtesting.ThreadLeakControl.forkTimeoutingTask(ThreadLeakControl.java:782)
	at com.carrotsearch.randomizedtesting.ThreadLeakControl$3.evaluate(ThreadLeakControl.java:442)
	at com.carrotsearch.randomizedtesting.RandomizedRunner.runSingleTest(RandomizedRunner.java:746)
	at com.carrotsearch.randomizedtesting.RandomizedRunner$3.evaluate(RandomizedRunner.java:648)
	at com.carrotsearch.randomizedtesting.RandomizedRunner$4.evaluate(RandomizedRunner.java:682)
	at com.carrotsearch.randomizedtesting.RandomizedRunner$5.evaluate(RandomizedRunner.java:693)
	at com.carrotsearch.randomizedtesting.rules.StatementAdapter.evaluate(StatementAdapter.java:36)
	at com.carrotsearch.randomizedtesting.rules.SystemPropertiesRestoreRule$1.evaluate(SystemPropertiesRestoreRule.java:53)
	at org.apache.lucene.util.AbstractBeforeAfterRule$1.evaluate(AbstractBeforeAfterRule.java:46)
	at org.apache.lucene.util.TestRuleStoreClassName$1.evaluate(TestRuleStoreClassName.java:42)
	at com.carrotsearch.randomizedtesting.rules.SystemPropertiesInvariantRule$1.evaluate(SystemPropertiesInvariantRule.java:55)
	at com.carrotsearch.randomizedtesting.rules.NoShadowingOrOverridesOnMethodsRule$1.evaluate(NoShadowingOrOverridesOnMethodsRule.java:39)
	at com.carrotsearch.randomizedtesting.rules.NoShadowingOrOverridesOnMethodsRule$1.evaluate(NoShadowingOrOverridesOnMethodsRule.java:39)
	at com.carrotsearch.randomizedtesting.rules.StatementAdapter.evaluate(StatementAdapter.java:36)
	at org.apache.lucene.util.TestRuleAssertionsRequired$1.evaluate(TestRuleAssertionsRequired.java:43)
	at org.apache.lucene.util.TestRuleMarkFailure$1.evaluate(TestRuleMarkFailure.java:48)
	at org.apache.lucene.util.TestRuleIgnoreAfterMaxFailures$1.evaluate(TestRuleIgnoreAfterMaxFailures.java:70)
	at org.apache.lucene.util.TestRuleIgnoreTestSuites$1.evaluate(TestRuleIgnoreTestSuites.java:55)
	at com.carrotsearch.randomizedtesting.rules.StatementAdapter.evaluate(StatementAdapter.java:36)
	at com.carrotsearch.randomizedtesting.ThreadLeakControl$StatementRunner.run(ThreadLeakControl.java:358)
	at java.lang.Thread.run(Thread.java:662)


FAILED:  org.apache.solr.cloud.CollectionsAPIDistributedZkTest.testDistribSearch

Error Message:
Server refused connection at: http://127.0.0.1:42482/cy/wa

Stack Trace:
org.apache.solr.client.solrj.SolrServerException: Server refused connection at: http://127.0.0.1:42482/cy/wa
	at __randomizedtesting.SeedInfo.seed([46E57D34E8E5471C:C703F32C9FBA2720]:0)
	at org.apache.solr.client.solrj.impl.HttpSolrServer.request(HttpSolrServer.java:428)
	at org.apache.solr.client.solrj.impl.HttpSolrServer.request(HttpSolrServer.java:180)
	at org.apache.solr.cloud.CollectionsAPIDistributedZkTest.testCustomCollectionsAPI(CollectionsAPIDistributedZkTest.java:764)
	at org.apache.solr.cloud.CollectionsAPIDistributedZkTest.doTest(CollectionsAPIDistributedZkTest.java:159)
	at org.apache.solr.BaseDistributedSearchTestCase.testDistribSearch(BaseDistributedSearchTestCase.java:835)
	at sun.reflect.NativeMethodAccessorImpl.invoke0(Native Method)
	at sun.reflect.NativeMethodAccessorImpl.invoke(NativeMethodAccessorImpl.java:39)
	at sun.reflect.DelegatingMethodAccessorImpl.invoke(DelegatingMethodAccessorImpl.java:25)
	at java.lang.reflect.Method.invoke(Method.java:597)
	at com.carrotsearch.randomizedtesting.RandomizedRunner.invoke(RandomizedRunner.java:1559)
	at com.carrotsearch.randomizedtesting.RandomizedRunner.access$600(RandomizedRunner.java:79)
	at com.carrotsearch.randomizedtesting.RandomizedRunner$6.evaluate(RandomizedRunner.java:737)
	at com.carrotsearch.randomizedtesting.RandomizedRunner$7.evaluate(RandomizedRunner.java:773)
	at com.carrotsearch.randomizedtesting.RandomizedRunner$8.evaluate(RandomizedRunner.java:787)
	at com.carrotsearch.randomizedtesting.rules.SystemPropertiesRestoreRule$1.evaluate(SystemPropertiesRestoreRule.java:53)
	at org.apache.lucene.util.TestRuleSetupTeardownChained$1.evaluate(TestRuleSetupTeardownChained.java:50)
	at org.apache.lucene.util.TestRuleFieldCacheSanity$1.evaluate(TestRuleFieldCacheSanity.java:51)
	at org.apache.lucene.util.AbstractBeforeAfterRule$1.evaluate(AbstractBeforeAfterRule.java:46)
	at com.carrotsearch.randomizedtesting.rules.SystemPropertiesInvariantRule$1.evaluate(SystemPropertiesInvariantRule.java:55)
	at org.apache.lucene.util.TestRuleThreadAndTestName$1.evaluate(TestRuleThreadAndTestName.java:49)
	at org.apache.lucene.util.TestRuleIgnoreAfterMaxFailures$1.evaluate(TestRuleIgnoreAfterMaxFailures.java:70)
	at org.apache.lucene.util.TestRuleMarkFailure$1.evaluate(TestRuleMarkFailure.java:48)
	at com.carrotsearch.randomizedtesting.rules.StatementAdapter.evaluate(StatementAdapter.java:36)
	at com.carrotsearch.randomizedtesting.ThreadLeakControl$StatementRunner.run(ThreadLeakControl.java:358)
	at com.carrotsearch.randomizedtesting.ThreadLeakControl.forkTimeoutingTask(ThreadLeakControl.java:782)
	at com.carrotsearch.randomizedtesting.ThreadLeakControl$3.evaluate(ThreadLeakControl.java:442)
	at com.carrotsearch.randomizedtesting.RandomizedRunner.runSingleTest(RandomizedRunner.java:746)
	at com.carrotsearch.randomizedtesting.RandomizedRunner$3.evaluate(RandomizedRunner.java:648)
	at com.carrotsearch.randomizedtesting.RandomizedRunner$4.evaluate(RandomizedRunner.java:682)
	at com.carrotsearch.randomizedtesting.RandomizedRunner$5.evaluate(RandomizedRunner.java:693)
	at com.carrotsearch.randomizedtesting.rules.StatementAdapter.evaluate(StatementAdapter.java:36)
	at com.carrotsearch.randomizedtesting.rules.SystemPropertiesRestoreRule$1.evaluate(SystemPropertiesRestoreRule.java:53)
	at org.apache.lucene.util.AbstractBeforeAfterRule$1.evaluate(AbstractBeforeAfterRule.java:46)
	at org.apache.lucene.util.TestRuleStoreClassName$1.evaluate(TestRuleStoreClassName.java:42)
	at com.carrotsearch.randomizedtesting.rules.SystemPropertiesInvariantRule$1.evaluate(SystemPropertiesInvariantRule.java:55)
	at com.carrotsearch.randomizedtesting.rules.NoShadowingOrOverridesOnMethodsRule$1.evaluate(NoShadowingOrOverridesOnMethodsRule.java:39)
	at com.carrotsearch.randomizedtesting.rules.NoShadowingOrOverridesOnMethodsRule$1.evaluate(NoShadowingOrOverridesOnMethodsRule.java:39)
	at com.carrotsearch.randomizedtesting.rules.StatementAdapter.evaluate(StatementAdapter.java:36)
	at org.apache.lucene.util.TestRuleAssertionsRequired$1.evaluate(TestRuleAssertionsRequired.java:43)
	at org.apache.lucene.util.TestRuleMarkFailure$1.evaluate(TestRuleMarkFailure.java:48)
	at org.apache.lucene.util.TestRuleIgnoreAfterMaxFailures$1.evaluate(TestRuleIgnoreAfterMaxFailures.java:70)
	at org.apache.lucene.util.TestRuleIgnoreTestSuites$1.evaluate(TestRuleIgnoreTestSuites.java:55)
	at com.carrotsearch.randomizedtesting.rules.StatementAdapter.evaluate(StatementAdapter.java:36)
	at com.carrotsearch.randomizedtesting.ThreadLeakControl$StatementRunner.run(ThreadLeakControl.java:358)
	at java.lang.Thread.run(Thread.java:662)
Caused by: org.apache.http.conn.HttpHostConnectException: Connection to http://127.0.0.1:42482 refused
	at org.apache.http.impl.conn.DefaultClientConnectionOperator.openConnection(DefaultClientConnectionOperator.java:190)
	at org.apache.http.impl.conn.ManagedClientConnectionImpl.open(ManagedClientConnectionImpl.java:294)
	at org.apache.http.impl.client.DefaultRequestDirector.tryConnect(DefaultRequestDirector.java:645)
	at org.apache.http.impl.client.DefaultRequestDirector.execute(DefaultRequestDirector.java:480)
	at org.apache.http.impl.client.AbstractHttpClient.execute(AbstractHttpClient.java:906)
	at org.apache.http.impl.client.AbstractHttpClient.execute(AbstractHttpClient.java:805)
	at org.apache.http.impl.client.AbstractHttpClient.execute(AbstractHttpClient.java:784)
	at org.apache.solr.client.solrj.impl.HttpSolrServer.request(HttpSolrServer.java:365)
	... 44 more
Caused by: java.net.ConnectException: Connection refused
	at java.net.PlainSocketImpl.socketConnect(Native Method)
	at java.net.PlainSocketImpl.doConnect(PlainSocketImpl.java:351)
	at java.net.PlainSocketImpl.connectToAddress(PlainSocketImpl.java:213)
	at java.net.PlainSocketImpl.connect(PlainSocketImpl.java:200)
	at java.net.SocksSocketImpl.connect(SocksSocketImpl.java:366)
	at java.net.Socket.connect(Socket.java:529)
	at org.apache.http.conn.scheme.PlainSocketFactory.connectSocket(PlainSocketFactory.java:127)
	at org.apache.http.impl.conn.DefaultClientConnectionOperator.openConnection(DefaultClientConnectionOperator.java:180)
	... 51 more




Build Log:
[...truncated 9231 lines...]
   [junit4] Suite: org.apache.solr.cloud.CollectionsAPIDistributedZkTest
   [junit4]   2> 694541 T2528 oas.BaseDistributedSearchTestCase.initHostContext Setting hostContext system property: /cy/wa
   [junit4]   2> 694545 T2528 oas.SolrTestCaseJ4.setUp ###Starting testDistribSearch
   [junit4]   2> Creating dataDir: /mnt/ssd/jenkins/workspace/Lucene-Solr-4.x-Linux/solr/build/solr-core/test/J1/./solrtest-CollectionsAPIDistributedZkTest-1375485015066
   [junit4]   2> 694545 T2528 oasc.ZkTestServer.run STARTING ZK TEST SERVER
   [junit4]   2> 694546 T2529 oasc.ZkTestServer$ZKServerMain.runFromConfig Starting server
   [junit4]   2> 694646 T2528 oasc.ZkTestServer.run start zk server on port:55629
   [junit4]   2> 694647 T2528 oascc.ConnectionManager.waitForConnected Waiting for client to connect to ZooKeeper
   [junit4]   2> 694697 T2535 oascc.ConnectionManager.process Watcher org.apache.solr.common.cloud.ConnectionManager@23cd9ff1 name:ZooKeeperConnection Watcher:127.0.0.1:55629 got event WatchedEvent state:SyncConnected type:None path:null path:null type:None
   [junit4]   2> 694697 T2528 oascc.ConnectionManager.waitForConnected Client is connected to ZooKeeper
   [junit4]   2> 694698 T2528 oascc.SolrZkClient.makePath makePath: /solr
   [junit4]   2> 694703 T2528 oascc.ConnectionManager.waitForConnected Waiting for client to connect to ZooKeeper
   [junit4]   2> 694704 T2537 oascc.ConnectionManager.process Watcher org.apache.solr.common.cloud.ConnectionManager@f858887 name:ZooKeeperConnection Watcher:127.0.0.1:55629/solr got event WatchedEvent state:SyncConnected type:None path:null path:null type:None
   [junit4]   2> 694704 T2528 oascc.ConnectionManager.waitForConnected Client is connected to ZooKeeper
   [junit4]   2> 694704 T2528 oascc.SolrZkClient.makePath makePath: /collections/collection1
   [junit4]   2> 694708 T2528 oascc.SolrZkClient.makePath makePath: /collections/collection1/shards
   [junit4]   2> 694712 T2528 oascc.SolrZkClient.makePath makePath: /collections/control_collection
   [junit4]   2> 694715 T2528 oascc.SolrZkClient.makePath makePath: /collections/control_collection/shards
   [junit4]   2> 694718 T2528 oasc.AbstractZkTestCase.putConfig put /mnt/ssd/jenkins/workspace/Lucene-Solr-4.x-Linux/solr/build/solr-core/test-files/solr/collection1/conf/solrconfig-tlog.xml to /configs/conf1/solrconfig.xml
   [junit4]   2> 694719 T2528 oascc.SolrZkClient.makePath makePath: /configs/conf1/solrconfig.xml
   [junit4]   2> 694724 T2528 oasc.AbstractZkTestCase.putConfig put /mnt/ssd/jenkins/workspace/Lucene-Solr-4.x-Linux/solr/build/solr-core/test-files/solr/collection1/conf/schema.xml to /configs/conf1/schema.xml
   [junit4]   2> 694724 T2528 oascc.SolrZkClient.makePath makePath: /configs/conf1/schema.xml
   [junit4]   2> 694728 T2528 oasc.AbstractZkTestCase.putConfig put /mnt/ssd/jenkins/workspace/Lucene-Solr-4.x-Linux/solr/build/solr-core/test-files/solr/collection1/conf/stopwords.txt to /configs/conf1/stopwords.txt
   [junit4]   2> 694729 T2528 oascc.SolrZkClient.makePath makePath: /configs/conf1/stopwords.txt
   [junit4]   2> 694732 T2528 oasc.AbstractZkTestCase.putConfig put /mnt/ssd/jenkins/workspace/Lucene-Solr-4.x-Linux/solr/build/solr-core/test-files/solr/collection1/conf/protwords.txt to /configs/conf1/protwords.txt
   [junit4]   2> 694732 T2528 oascc.SolrZkClient.makePath makePath: /configs/conf1/protwords.txt
   [junit4]   2> 694738 T2528 oasc.AbstractZkTestCase.putConfig put /mnt/ssd/jenkins/workspace/Lucene-Solr-4.x-Linux/solr/build/solr-core/test-files/solr/collection1/conf/currency.xml to /configs/conf1/currency.xml
   [junit4]   2> 694738 T2528 oascc.SolrZkClient.makePath makePath: /configs/conf1/currency.xml
   [junit4]   2> 694741 T2528 oasc.AbstractZkTestCase.putConfig put /mnt/ssd/jenkins/workspace/Lucene-Solr-4.x-Linux/solr/build/solr-core/test-files/solr/collection1/conf/open-exchange-rates.json to /configs/conf1/open-exchange-rates.json
   [junit4]   2> 694742 T2528 oascc.SolrZkClient.makePath makePath: /configs/conf1/open-exchange-rates.json
   [junit4]   2> 694745 T2528 oasc.AbstractZkTestCase.putConfig put /mnt/ssd/jenkins/workspace/Lucene-Solr-4.x-Linux/solr/build/solr-core/test-files/solr/collection1/conf/mapping-ISOLatin1Accent.txt to /configs/conf1/mapping-ISOLatin1Accent.txt
   [junit4]   2> 694746 T2528 oascc.SolrZkClient.makePath makePath: /configs/conf1/mapping-ISOLatin1Accent.txt
   [junit4]   2> 694749 T2528 oasc.AbstractZkTestCase.putConfig put /mnt/ssd/jenkins/workspace/Lucene-Solr-4.x-Linux/solr/build/solr-core/test-files/solr/collection1/conf/old_synonyms.txt to /configs/conf1/old_synonyms.txt
   [junit4]   2> 694749 T2528 oascc.SolrZkClient.makePath makePath: /configs/conf1/old_synonyms.txt
   [junit4]   2> 694753 T2528 oasc.AbstractZkTestCase.putConfig put /mnt/ssd/jenkins/workspace/Lucene-Solr-4.x-Linux/solr/build/solr-core/test-files/solr/collection1/conf/synonyms.txt to /configs/conf1/synonyms.txt
   [junit4]   2> 694753 T2528 oascc.SolrZkClient.makePath makePath: /configs/conf1/synonyms.txt
   [junit4]   2> 694827 T2528 oejs.Server.doStart jetty-8.1.10.v20130312
   [junit4]   2> 694830 T2528 oejs.AbstractConnector.doStart Started SelectChannelConnector@127.0.0.1:43300
   [junit4]   2> 694831 T2528 oass.SolrDispatchFilter.init SolrDispatchFilter.init()
   [junit4]   2> 694831 T2528 oasc.SolrResourceLoader.locateSolrHome JNDI not configured for solr (NoInitialContextEx)
   [junit4]   2> 694831 T2528 oasc.SolrResourceLoader.locateSolrHome using system property solr.solr.home: /mnt/ssd/jenkins/workspace/Lucene-Solr-4.x-Linux/solr/build/solr-core/test/J1/./org.apache.solr.cloud.CollectionsAPIDistributedZkTest-controljetty-1375485015279
   [junit4]   2> 694832 T2528 oasc.SolrResourceLoader.<init> new SolrResourceLoader for directory: '/mnt/ssd/jenkins/workspace/Lucene-Solr-4.x-Linux/solr/build/solr-core/test/J1/./org.apache.solr.cloud.CollectionsAPIDistributedZkTest-controljetty-1375485015279/'
   [junit4]   2> 694842 T2528 oasc.ConfigSolr.fromFile Loading container configuration from /mnt/ssd/jenkins/workspace/Lucene-Solr-4.x-Linux/solr/build/solr-core/test/J1/./org.apache.solr.cloud.CollectionsAPIDistributedZkTest-controljetty-1375485015279/solr.xml
   [junit4]   2> 694886 T2528 oasc.ConfigSolrXml.<init> Config-defined core root directory: 
   [junit4]   2> 694886 T2528 oasc.CoreContainer.<init> New CoreContainer 613319670
   [junit4]   2> 694886 T2528 oasc.CoreContainer.load Loading cores into CoreContainer [instanceDir=/mnt/ssd/jenkins/workspace/Lucene-Solr-4.x-Linux/solr/build/solr-core/test/J1/./org.apache.solr.cloud.CollectionsAPIDistributedZkTest-controljetty-1375485015279/]
   [junit4]   2> 694887 T2528 oashc.HttpShardHandlerFactory.getParameter Setting socketTimeout to: 120000
   [junit4]   2> 694888 T2528 oashc.HttpShardHandlerFactory.getParameter Setting urlScheme to: http://
   [junit4]   2> 694888 T2528 oashc.HttpShardHandlerFactory.getParameter Setting connTimeout to: 15000
   [junit4]   2> 694889 T2528 oashc.HttpShardHandlerFactory.getParameter Setting maxConnectionsPerHost to: 20
   [junit4]   2> 694889 T2528 oashc.HttpShardHandlerFactory.getParameter Setting corePoolSize to: 0
   [junit4]   2> 694889 T2528 oashc.HttpShardHandlerFactory.getParameter Setting maximumPoolSize to: 2147483647
   [junit4]   2> 694890 T2528 oashc.HttpShardHandlerFactory.getParameter Setting maxThreadIdleTime to: 5
   [junit4]   2> 694890 T2528 oashc.HttpShardHandlerFactory.getParameter Setting sizeOfQueue to: -1
   [junit4]   2> 694890 T2528 oashc.HttpShardHandlerFactory.getParameter Setting fairnessPolicy to: false
   [junit4]   2> 694890 T2528 oascsi.HttpClientUtil.createClient Creating new http client, config:maxConnectionsPerHost=20&maxConnections=10000&socketTimeout=120000&connTimeout=15000&retry=false
   [junit4]   2> 694893 T2528 oasc.ZkContainer.initZooKeeper Zookeeper client=127.0.0.1:55629/solr
   [junit4]   2> 694894 T2528 oasc.ZkController.checkChrootPath zkHost includes chroot
   [junit4]   2> 694894 T2528 oascc.ConnectionManager.waitForConnected Waiting for client to connect to ZooKeeper
   [junit4]   2> 694897 T2548 oascc.ConnectionManager.process Watcher org.apache.solr.common.cloud.ConnectionManager@8799e3a name:ZooKeeperConnection Watcher:127.0.0.1:55629 got event WatchedEvent state:SyncConnected type:None path:null path:null type:None
   [junit4]   2> 694897 T2528 oascc.ConnectionManager.waitForConnected Client is connected to ZooKeeper
   [junit4]   2> 694899 T2528 oascsi.HttpClientUtil.createClient Creating new http client, config:maxConnections=500&maxConnectionsPerHost=16&socketTimeout=120000&connTimeout=15000
   [junit4]   2> 694902 T2528 oascc.ConnectionManager.waitForConnected Waiting for client to connect to ZooKeeper
   [junit4]   2> 694903 T2550 oascc.ConnectionManager.process Watcher org.apache.solr.common.cloud.ConnectionManager@6df610a7 name:ZooKeeperConnection Watcher:127.0.0.1:55629/solr got event WatchedEvent state:SyncConnected type:None path:null path:null type:None
   [junit4]   2> 694903 T2528 oascc.ConnectionManager.waitForConnected Client is connected to ZooKeeper
   [junit4]   2> 694905 T2528 oascc.SolrZkClient.makePath makePath: /overseer/queue
   [junit4]   2> 694910 T2528 oascc.SolrZkClient.makePath makePath: /overseer/collection-queue-work
   [junit4]   2> 694914 T2528 oascc.SolrZkClient.makePath makePath: /live_nodes
   [junit4]   2> 694916 T2528 oasc.ZkController.createEphemeralLiveNode Register node as live in ZooKeeper:/live_nodes/127.0.0.1:43300_cy%2Fwa
   [junit4]   2> 694917 T2528 oascc.SolrZkClient.makePath makePath: /live_nodes/127.0.0.1:43300_cy%2Fwa
   [junit4]   2> 694923 T2528 oascc.SolrZkClient.makePath makePath: /overseer_elect/election
   [junit4]   2> 694929 T2528 oascc.SolrZkClient.makePath makePath: /overseer_elect/leader
   [junit4]   2> 694932 T2528 oasc.Overseer.start Overseer (id=90143785947561987-127.0.0.1:43300_cy%2Fwa-n_0000000000) starting
   [junit4]   2> 694936 T2528 oascc.SolrZkClient.makePath makePath: /overseer/queue-work
   [junit4]   2> 694941 T2552 oasc.OverseerCollectionProcessor.run Process current queue of collection creations
   [junit4]   2> 694942 T2528 oascc.SolrZkClient.makePath makePath: /clusterstate.json
   [junit4]   2> 694945 T2528 oascc.SolrZkClient.makePath makePath: /aliases.json
   [junit4]   2> 694948 T2528 oascc.ZkStateReader.createClusterStateWatchersAndUpdate Updating cluster state from ZooKeeper... 
   [junit4]   2> 694952 T2551 oasc.Overseer$ClusterStateUpdater.run Starting to work on the main queue
   [junit4]   2> 694954 T2528 oasc.CorePropertiesLocator.discover Looking for core definitions underneath /mnt/ssd/jenkins/workspace/Lucene-Solr-4.x-Linux/solr/build/solr-core/test/J1/./org.apache.solr.cloud.CollectionsAPIDistributedZkTest-controljetty-1375485015279
   [junit4]   2> 694987 T2528 oasc.CorePropertiesLocator.discoverUnder Found core conf in /mnt/ssd/jenkins/workspace/Lucene-Solr-4.x-Linux/solr/build/solr-core/test/J1/./org.apache.solr.cloud.CollectionsAPIDistributedZkTest-controljetty-1375485015279/conf/
   [junit4]   2> 694988 T2528 oasc.CorePropertiesLocator.discover Found 1 core definitions
   [junit4]   2> 694988 T2528 oass.SolrDispatchFilter.init user.dir=/mnt/ssd/jenkins/workspace/Lucene-Solr-4.x-Linux/solr/build/solr-core/test/J1
   [junit4]   2> 694988 T2528 oass.SolrDispatchFilter.init SolrDispatchFilter.init() done
   [junit4]   2> 694989 T2528 oascsi.HttpClientUtil.createClient Creating new http client, config:maxConnections=128&maxConnectionsPerHost=32&followRedirects=false
   [junit4]   2> 694991 T2528 oascsi.HttpClientUtil.createClient Creating new http client, config:
   [junit4]   2> 694992 T2528 oascc.ConnectionManager.waitForConnected Waiting for client to connect to ZooKeeper
   [junit4]   2> 694993 T2555 oascc.ConnectionManager.process Watcher org.apache.solr.common.cloud.ConnectionManager@16574516 name:ZooKeeperConnection Watcher:127.0.0.1:55629/solr got event WatchedEvent state:SyncConnected type:None path:null path:null type:None
   [junit4]   2> 694994 T2528 oascc.ConnectionManager.waitForConnected Client is connected to ZooKeeper
   [junit4]   2> 694995 T2528 oascc.ZkStateReader.createClusterStateWatchersAndUpdate Updating cluster state from ZooKeeper... 
   [junit4]   2> 694998 T2528 oasc.ChaosMonkey.monkeyLog monkey: init - expire sessions:true cause connection loss:true
   [junit4]   2> 695062 T2528 oejs.Server.doStart jetty-8.1.10.v20130312
   [junit4]   2> 695063 T2528 oejs.AbstractConnector.doStart Started SelectChannelConnector@127.0.0.1:42482
   [junit4]   2> 695064 T2528 oass.SolrDispatchFilter.init SolrDispatchFilter.init()
   [junit4]   2> 695064 T2528 oasc.SolrResourceLoader.locateSolrHome JNDI not configured for solr (NoInitialContextEx)
   [junit4]   2> 695065 T2528 oasc.SolrResourceLoader.locateSolrHome using system property solr.solr.home: /mnt/ssd/jenkins/workspace/Lucene-Solr-4.x-Linux/solr/build/solr-core/test/J1/./org.apache.solr.cloud.CollectionsAPIDistributedZkTest-jetty1-1375485015520
   [junit4]   2> 695065 T2528 oasc.SolrResourceLoader.<init> new SolrResourceLoader for directory: '/mnt/ssd/jenkins/workspace/Lucene-Solr-4.x-Linux/solr/build/solr-core/test/J1/./org.apache.solr.cloud.CollectionsAPIDistributedZkTest-jetty1-1375485015520/'
   [junit4]   2> 695081 T2528 oasc.ConfigSolr.fromFile Loading container configuration from /mnt/ssd/jenkins/workspace/Lucene-Solr-4.x-Linux/solr/build/solr-core/test/J1/./org.apache.solr.cloud.CollectionsAPIDistributedZkTest-jetty1-1375485015520/solr.xml
   [junit4]   2> 695113 T2528 oasc.ConfigSolrXml.<init> Config-defined core root directory: 
   [junit4]   2> 695114 T2528 oasc.CoreContainer.<init> New CoreContainer 669756915
   [junit4]   2> 695114 T2528 oasc.CoreContainer.load Loading cores into CoreContainer [instanceDir=/mnt/ssd/jenkins/workspace/Lucene-Solr-4.x-Linux/solr/build/solr-core/test/J1/./org.apache.solr.cloud.CollectionsAPIDistributedZkTest-jetty1-1375485015520/]
   [junit4]   2> 695115 T2528 oashc.HttpShardHandlerFactory.getParameter Setting socketTimeout to: 120000
   [junit4]   2> 695115 T2528 oashc.HttpShardHandlerFactory.getParameter Setting urlScheme to: http://
   [junit4]   2> 695115 T2528 oashc.HttpShardHandlerFactory.getParameter Setting connTimeout to: 15000
   [junit4]   2> 695116 T2528 oashc.HttpShardHandlerFactory.getParameter Setting maxConnectionsPerHost to: 20
   [junit4]   2> 695116 T2528 oashc.HttpShardHandlerFactory.getParameter Setting corePoolSize to: 0
   [junit4]   2> 695116 T2528 oashc.HttpShardHandlerFactory.getParameter Setting maximumPoolSize to: 2147483647
   [junit4]   2> 695117 T2528 oashc.HttpShardHandlerFactory.getParameter Setting maxThreadIdleTime to: 5
   [junit4]   2> 695117 T2528 oashc.HttpShardHandlerFactory.getParameter Setting sizeOfQueue to: -1
   [junit4]   2> 695117 T2528 oashc.HttpShardHandlerFactory.getParameter Setting fairnessPolicy to: false
   [junit4]   2> 695118 T2528 oascsi.HttpClientUtil.createClient Creating new http client, config:maxConnectionsPerHost=20&maxConnections=10000&socketTimeout=120000&connTimeout=15000&retry=false
   [junit4]   2> 695120 T2528 oasc.ZkContainer.initZooKeeper Zookeeper client=127.0.0.1:55629/solr
   [junit4]   2> 695121 T2528 oasc.ZkController.checkChrootPath zkHost includes chroot
   [junit4]   2> 695121 T2528 oascc.ConnectionManager.waitForConnected Waiting for client to connect to ZooKeeper
   [junit4]   2> 695123 T2566 oascc.ConnectionManager.process Watcher org.apache.solr.common.cloud.ConnectionManager@61e940fe name:ZooKeeperConnection Watcher:127.0.0.1:55629 got event WatchedEvent state:SyncConnected type:None path:null path:null type:None
   [junit4]   2> 695123 T2528 oascc.ConnectionManager.waitForConnected Client is connected to ZooKeeper
   [junit4]   2> 695126 T2528 oascsi.HttpClientUtil.createClient Creating new http client, config:maxConnections=500&maxConnectionsPerHost=16&socketTimeout=120000&connTimeout=15000
   [junit4]   2> 695128 T2528 oascc.ConnectionManager.waitForConnected Waiting for client to connect to ZooKeeper
   [junit4]   2> 695129 T2568 oascc.ConnectionManager.process Watcher org.apache.solr.common.cloud.ConnectionManager@579169f6 name:ZooKeeperConnection Watcher:127.0.0.1:55629/solr got event WatchedEvent state:SyncConnected type:None path:null path:null type:None
   [junit4]   2> 695129 T2528 oascc.ConnectionManager.waitForConnected Client is connected to ZooKeeper
   [junit4]   2> 695135 T2528 oascc.ZkStateReader.createClusterStateWatchersAndUpdate Updating cluster state from ZooKeeper... 
   [junit4]   2> 696139 T2528 oasc.ZkController.createEphemeralLiveNode Register node as live in ZooKeeper:/live_nodes/127.0.0.1:42482_cy%2Fwa
   [junit4]   2> 696141 T2528 oascc.SolrZkClient.makePath makePath: /live_nodes/127.0.0.1:42482_cy%2Fwa
   [junit4]   2> 696146 T2550 oascc.ZkStateReader$3.process Updating live nodes... (2)
   [junit4]   2> 696147 T2555 oascc.ZkStateReader$3.process Updating live nodes... (2)
   [junit4]   2> 696147 T2568 oascc.ZkStateReader$3.process Updating live nodes... (2)
   [junit4]   2> 696155 T2528 oasc.CorePropertiesLocator.discover Looking for core definitions underneath /mnt/ssd/jenkins/workspace/Lucene-Solr-4.x-Linux/solr/build/solr-core/test/J1/./org.apache.solr.cloud.CollectionsAPIDistributedZkTest-jetty1-1375485015520
   [junit4]   2> 696179 T2528 oasc.CorePropertiesLocator.discoverUnder Found core conf in /mnt/ssd/jenkins/workspace/Lucene-Solr-4.x-Linux/solr/build/solr-core/test/J1/./org.apache.solr.cloud.CollectionsAPIDistributedZkTest-jetty1-1375485015520/conf/
   [junit4]   2> 696179 T2528 oasc.CorePropertiesLocator.discover Found 1 core definitions
   [junit4]   2> 696180 T2528 oass.SolrDispatchFilter.init user.dir=/mnt/ssd/jenkins/workspace/Lucene-Solr-4.x-Linux/solr/build/solr-core/test/J1
   [junit4]   2> 696180 T2528 oass.SolrDispatchFilter.init SolrDispatchFilter.init() done
   [junit4]   2> 696181 T2528 oascsi.HttpClientUtil.createClient Creating new http client, config:maxConnections=128&maxConnectionsPerHost=32&followRedirects=false
   [junit4]   2> 696251 T2528 oejs.Server.doStart jetty-8.1.10.v20130312
   [junit4]   2> 696253 T2528 oejs.AbstractConnector.doStart Started SelectChannelConnector@127.0.0.1:58557
   [junit4]   2> 696254 T2528 oass.SolrDispatchFilter.init SolrDispatchFilter.init()
   [junit4]   2> 696254 T2528 oasc.SolrResourceLoader.locateSolrHome JNDI not configured for solr (NoInitialContextEx)
   [junit4]   2> 696254 T2528 oasc.SolrResourceLoader.locateSolrHome using system property solr.solr.home: /mnt/ssd/jenkins/workspace/Lucene-Solr-4.x-Linux/solr/build/solr-core/test/J1/./org.apache.solr.cloud.CollectionsAPIDistributedZkTest-jetty2-1375485016704
   [junit4]   2> 696255 T2528 oasc.SolrResourceLoader.<init> new SolrResourceLoader for directory: '/mnt/ssd/jenkins/workspace/Lucene-Solr-4.x-Linux/solr/build/solr-core/test/J1/./org.apache.solr.cloud.CollectionsAPIDistributedZkTest-jetty2-1375485016704/'
   [junit4]   2> 696265 T2528 oasc.ConfigSolr.fromFile Loading container configuration from /mnt/ssd/jenkins/workspace/Lucene-Solr-4.x-Linux/solr/build/solr-core/test/J1/./org.apache.solr.cloud.CollectionsAPIDistributedZkTest-jetty2-1375485016704/solr.xml
   [junit4]   2> 696296 T2528 oasc.ConfigSolrXml.<init> Config-defined core root directory: 
   [junit4]   2> 696296 T2528 oasc.CoreContainer.<init> New CoreContainer 434698780
   [junit4]   2> 696297 T2528 oasc.CoreContainer.load Loading cores into CoreContainer [instanceDir=/mnt/ssd/jenkins/workspace/Lucene-Solr-4.x-Linux/solr/build/solr-core/test/J1/./org.apache.solr.cloud.CollectionsAPIDistributedZkTest-jetty2-1375485016704/]
   [junit4]   2> 696298 T2528 oashc.HttpShardHandlerFactory.getParameter Setting socketTimeout to: 120000
   [junit4]   2> 696298 T2528 oashc.HttpShardHandlerFactory.getParameter Setting urlScheme to: http://
   [junit4]   2> 696298 T2528 oashc.HttpShardHandlerFactory.getParameter Setting connTimeout to: 15000
   [junit4]   2> 696299 T2528 oashc.HttpShardHandlerFactory.getParameter Setting maxConnectionsPerHost to: 20
   [junit4]   2> 696299 T2528 oashc.HttpShardHandlerFactory.getParameter Setting corePoolSize to: 0
   [junit4]   2> 696299 T2528 oashc.HttpShardHandlerFactory.getParameter Setting maximumPoolSize to: 2147483647
   [junit4]   2> 696300 T2528 oashc.HttpShardHandlerFactory.getParameter Setting maxThreadIdleTime to: 5
   [junit4]   2> 696300 T2528 oashc.HttpShardHandlerFactory.getParameter Setting sizeOfQueue to: -1
   [junit4]   2> 696300 T2528 oashc.HttpShardHandlerFactory.getParameter Setting fairnessPolicy to: false
   [junit4]   2> 696301 T2528 oascsi.HttpClientUtil.createClient Creating new http client, config:maxConnectionsPerHost=20&maxConnections=10000&socketTimeout=120000&connTimeout=15000&retry=false
   [junit4]   2> 696303 T2528 oasc.ZkContainer.initZooKeeper Zookeeper client=127.0.0.1:55629/solr
   [junit4]   2> 696304 T2528 oasc.ZkController.checkChrootPath zkHost includes chroot
   [junit4]   2> 696305 T2528 oascc.ConnectionManager.waitForConnected Waiting for client to connect to ZooKeeper
   [junit4]   2> 696306 T2580 oascc.ConnectionManager.process Watcher org.apache.solr.common.cloud.ConnectionManager@e7c518e name:ZooKeeperConnection Watcher:127.0.0.1:55629 got event WatchedEvent state:SyncConnected type:None path:null path:null type:None
   [junit4]   2> 696307 T2528 oascc.ConnectionManager.waitForConnected Client is connected to ZooKeeper
   [junit4]   2> 696309 T2528 oascsi.HttpClientUtil.createClient Creating new http client, config:maxConnections=500&maxConnectionsPerHost=16&socketTimeout=120000&connTimeout=15000
   [junit4]   2> 696313 T2528 oascc.ConnectionManager.waitForConnected Waiting for client to connect to ZooKeeper
   [junit4]   2> 696314 T2582 oascc.ConnectionManager.process Watcher org.apache.solr.common.cloud.ConnectionManager@16b28576 name:ZooKeeperConnection Watcher:127.0.0.1:55629/solr got event WatchedEvent state:SyncConnected type:None path:null path:null type:None
   [junit4]   2> 696314 T2528 oascc.ConnectionManager.waitForConnected Client is connected to ZooKeeper
   [junit4]   2> 696320 T2528 oascc.ZkStateReader.createClusterStateWatchersAndUpdate Updating cluster state from ZooKeeper... 
   [junit4]   2> 697325 T2528 oasc.ZkController.createEphemeralLiveNode Register node as live in ZooKeeper:/live_nodes/127.0.0.1:58557_cy%2Fwa
   [junit4]   2> 697328 T2528 oascc.SolrZkClient.makePath makePath: /live_nodes/127.0.0.1:58557_cy%2Fwa
   [junit4]   2> 697336 T2550 oascc.ZkStateReader$3.process Updating live nodes... (3)
   [junit4]   2> 697336 T2568 oascc.ZkStateReader$3.process Updating live nodes... (3)
   [junit4]   2> 697338 T2555 oascc.ZkStateReader$3.process Updating live nodes... (3)
   [junit4]   2> 697338 T2582 oascc.ZkStateReader$3.process Updating live nodes... (3)
   [junit4]   2> 697348 T2528 oasc.CorePropertiesLocator.discover Looking for core definitions underneath /mnt/ssd/jenkins/workspace/Lucene-Solr-4.x-Linux/solr/build/solr-core/test/J1/./org.apache.solr.cloud.CollectionsAPIDistributedZkTest-jetty2-1375485016704
   [junit4]   2> 697378 T2528 oasc.CorePropertiesLocator.discoverUnder Found core conf in /mnt/ssd/jenkins/workspace/Lucene-Solr-4.x-Linux/solr/build/solr-core/test/J1/./org.apache.solr.cloud.CollectionsAPIDistributedZkTest-jetty2-1375485016704/conf/
   [junit4]   2> 697379 T2528 oasc.CorePropertiesLocator.discover Found 1 core definitions
   [junit4]   2> 697379 T2528 oass.SolrDispatchFilter.init user.dir=/mnt/ssd/jenkins/workspace/Lucene-Solr-4.x-Linux/solr/build/solr-core/test/J1
   [junit4]   2> 697379 T2528 oass.SolrDispatchFilter.init SolrDispatchFilter.init() done
   [junit4]   2> 697380 T2528 oascsi.HttpClientUtil.createClient Creating new http client, config:maxConnections=128&maxConnectionsPerHost=32&followRedirects=false
   [junit4]   2> 697457 T2528 oejs.Server.doStart jetty-8.1.10.v20130312
   [junit4]   2> 697459 T2528 oejs.AbstractConnector.doStart Started SelectChannelConnector@127.0.0.1:44392
   [junit4]   2> 697459 T2528 oass.SolrDispatchFilter.init SolrDispatchFilter.init()
   [junit4]   2> 697459 T2528 oasc.SolrResourceLoader.locateSolrHome JNDI not configured for solr (NoInitialContextEx)
   [junit4]   2> 697460 T2528 oasc.SolrResourceLoader.locateSolrHome using system property solr.solr.home: /mnt/ssd/jenkins/workspace/Lucene-Solr-4.x-Linux/solr/build/solr-core/test/J1/./org.apache.solr.cloud.CollectionsAPIDistributedZkTest-jetty3-1375485017903
   [junit4]   2> 697460 T2528 oasc.SolrResourceLoader.<init> new SolrResourceLoader for directory: '/mnt/ssd/jenkins/workspace/Lucene-Solr-4.x-Linux/solr/build/solr-core/test/J1/./org.apache.solr.cloud.CollectionsAPIDistributedZkTest-jetty3-1375485017903/'
   [junit4]   2> 697470 T2528 oasc.ConfigSolr.fromFile Loading container configuration from /mnt/ssd/jenkins/workspace/Lucene-Solr-4.x-Linux/solr/build/solr-core/test/J1/./org.apache.solr.cloud.CollectionsAPIDistributedZkTest-jetty3-1375485017903/solr.xml
   [junit4]   2> 697500 T2528 oasc.ConfigSolrXml.<init> Config-defined core root directory: 
   [junit4]   2> 697501 T2528 oasc.CoreContainer.<init> New CoreContainer 1376546892
   [junit4]   2> 697501 T2528 oasc.CoreContainer.load Loading cores into CoreContainer [instanceDir=/mnt/ssd/jenkins/workspace/Lucene-Solr-4.x-Linux/solr/build/solr-core/test/J1/./org.apache.solr.cloud.CollectionsAPIDistributedZkTest-jetty3-1375485017903/]
   [junit4]   2> 697502 T2528 oashc.HttpShardHandlerFactory.getParameter Setting socketTimeout to: 120000
   [junit4]   2> 697502 T2528 oashc.HttpShardHandlerFactory.getParameter Setting urlScheme to: http://
   [junit4]   2> 697503 T2528 oashc.HttpShardHandlerFactory.getParameter Setting connTimeout to: 15000
   [junit4]   2> 697503 T2528 oashc.HttpShardHandlerFactory.getParameter Setting maxConnectionsPerHost to: 20
   [junit4]   2> 697503 T2528 oashc.HttpShardHandlerFactory.getParameter Setting corePoolSize to: 0
   [junit4]   2> 697503 T2528 oashc.HttpShardHandlerFactory.getParameter Setting maximumPoolSize to: 2147483647
   [junit4]   2> 697504 T2528 oashc.HttpShardHandlerFactory.getParameter Setting maxThreadIdleTime to: 5
   [junit4]   2> 697504 T2528 oashc.HttpShardHandlerFactory.getParameter Setting sizeOfQueue to: -1
   [junit4]   2> 697504 T2528 oashc.HttpShardHandlerFactory.getParameter Setting fairnessPolicy to: false
   [junit4]   2> 697505 T2528 oascsi.HttpClientUtil.createClient Creating new http client, config:maxConnectionsPerHost=20&maxConnections=10000&socketTimeout=120000&connTimeout=15000&retry=false
   [junit4]   2> 697507 T2528 oasc.ZkContainer.initZooKeeper Zookeeper client=127.0.0.1:55629/solr
   [junit4]   2> 697508 T2528 oasc.ZkController.checkChrootPath zkHost includes chroot
   [junit4]   2> 697508 T2528 oascc.ConnectionManager.waitForConnected Waiting for client to connect to ZooKeeper
   [junit4]   2> 697510 T2594 oascc.ConnectionManager.process Watcher org.apache.solr.common.cloud.ConnectionManager@2ea0b7a9 name:ZooKeeperConnection Watcher:127.0.0.1:55629 got event WatchedEvent state:SyncConnected type:None path:null path:null type:None
   [junit4]   2> 697510 T2528 oascc.ConnectionManager.waitForConnected Client is connected to ZooKeeper
   [junit4]   2> 697512 T2528 oascsi.HttpClientUtil.createClient Creating new http client, config:maxConnections=500&maxConnectionsPerHost=16&socketTimeout=120000&connTimeout=15000
   [junit4]   2> 697515 T2528 oascc.ConnectionManager.waitForConnected Waiting for client to connect to ZooKeeper
   [junit4]   2> 697516 T2596 oascc.ConnectionManager.process Watcher org.apache.solr.common.cloud.ConnectionManager@467cb77c name:ZooKeeperConnection Watcher:127.0.0.1:55629/solr got event WatchedEvent state:SyncConnected type:None path:null path:null type:None
   [junit4]   2> 697516 T2528 oascc.ConnectionManager.waitForConnected Client is connected to ZooKeeper
   [junit4]   2> 697521 T2528 oascc.ZkStateReader.createClusterStateWatchersAndUpdate Updating cluster state from ZooKeeper... 
   [junit4]   2> 698526 T2528 oasc.ZkController.createEphemeralLiveNode Register node as live in ZooKeeper:/live_nodes/127.0.0.1:44392_cy%2Fwa
   [junit4]   2> 698528 T2528 oascc.SolrZkClient.makePath makePath: /live_nodes/127.0.0.1:44392_cy%2Fwa
   [junit4]   2> 698534 T2555 oascc.ZkStateReader$3.process Updating live nodes... (4)
   [junit4]   2> 698534 T2568 oascc.ZkStateReader$3.process Updating live nodes... (4)
   [junit4]   2> 698534 T2596 oascc.ZkStateReader$3.process Updating live nodes... (4)
   [junit4]   2> 698536 T2582 oascc.ZkStateReader$3.process Updating live nodes... (4)
   [junit4]   2> 698536 T2550 oascc.ZkStateReader$3.process Updating live nodes... (4)
   [junit4]   2> 698549 T2528 oasc.CorePropertiesLocator.discover Looking for core definitions underneath /mnt/ssd/jenkins/workspace/Lucene-Solr-4.x-Linux/solr/build/solr-core/test/J1/./org.apache.solr.cloud.CollectionsAPIDistributedZkTest-jetty3-1375485017903
   [junit4]   2> 698573 T2528 oasc.CorePropertiesLocator.discoverUnder Found core conf in /mnt/ssd/jenkins/workspace/Lucene-Solr-4.x-Linux/solr/build/solr-core/test/J1/./org.apache.solr.cloud.CollectionsAPIDistributedZkTest-jetty3-1375485017903/conf/
   [junit4]   2> 698573 T2528 oasc.CorePropertiesLocator.discover Found 1 core definitions
   [junit4]   2> 698574 T2528 oass.SolrDispatchFilter.init user.dir=/mnt/ssd/jenkins/workspace/Lucene-Solr-4.x-Linux/solr/build/solr-core/test/J1
   [junit4]   2> 698574 T2528 oass.SolrDispatchFilter.init SolrDispatchFilter.init() done
   [junit4]   2> 698575 T2528 oascsi.HttpClientUtil.createClient Creating new http client, config:maxConnections=128&maxConnectionsPerHost=32&followRedirects=false
   [junit4]   2> 698637 T2528 oejs.Server.doStart jetty-8.1.10.v20130312
   [junit4]   2> 698639 T2528 oejs.AbstractConnector.doStart Started SelectChannelConnector@127.0.0.1:57087
   [junit4]   2> 698639 T2528 oass.SolrDispatchFilter.init SolrDispatchFilter.init()
   [junit4]   2> 698640 T2528 oasc.SolrResourceLoader.locateSolrHome JNDI not configured for solr (NoInitialContextEx)
   [junit4]   2> 698640 T2528 oasc.SolrResourceLoader.locateSolrHome using system property solr.solr.home: /mnt/ssd/jenkins/workspace/Lucene-Solr-4.x-Linux/solr/build/solr-core/test/J1/./org.apache.solr.cloud.CollectionsAPIDistributedZkTest-jetty4-1375485019098
   [junit4]   2> 698640 T2528 oasc.SolrResourceLoader.<init> new SolrResourceLoader for directory: '/mnt/ssd/jenkins/workspace/Lucene-Solr-4.x-Linux/solr/build/solr-core/test/J1/./org.apache.solr.cloud.CollectionsAPIDistributedZkTest-jetty4-1375485019098/'
   [junit4]   2> 698650 T2528 oasc.ConfigSolr.fromFile Loading container configuration from /mnt/ssd/jenkins/workspace/Lucene-Solr-4.x-Linux/solr/build/solr-core/test/J1/./org.apache.solr.cloud.CollectionsAPIDistributedZkTest-jetty4-1375485019098/solr.xml
   [junit4]   2> 698681 T2528 oasc.ConfigSolrXml.<init> Config-defined core root directory: 
   [junit4]   2> 698682 T2528 oasc.CoreContainer.<init> New CoreContainer 569623218
   [junit4]   2> 698682 T2528 oasc.CoreContainer.load Loading cores into CoreContainer [instanceDir=/mnt/ssd/jenkins/workspace/Lucene-Solr-4.x-Linux/solr/build/solr-core/test/J1/./org.apache.solr.cloud.CollectionsAPIDistributedZkTest-jetty4-1375485019098/]
   [junit4]   2> 698683 T2528 oashc.HttpShardHandlerFactory.getParameter Setting socketTimeout to: 120000
   [junit4]   2> 698683 T2528 oashc.HttpShardHandlerFactory.getParameter Setting urlScheme to: http://
   [junit4]   2> 698684 T2528 oashc.HttpShardHandlerFactory.getParameter Setting connTimeout to: 15000
   [junit4]   2> 698684 T2528 oashc.HttpShardHandlerFactory.getParameter Setting maxConnectionsPerHost to: 20
   [junit4]   2> 698684 T2528 oashc.HttpShardHandlerFactory.getParameter Setting corePoolSize to: 0
   [junit4]   2> 698685 T2528 oashc.HttpShardHandlerFactory.getParameter Setting maximumPoolSize to: 2147483647
   [junit4]   2> 698685 T2528 oashc.HttpShardHandlerFactory.getParameter Setting maxThreadIdleTime to: 5
   [junit4]   2> 698685 T2528 oashc.HttpShardHandlerFactory.getParameter Setting sizeOfQueue to: -1
   [junit4]   2> 698686 T2528 oashc.HttpShardHandlerFactory.getParameter Setting fairnessPolicy to: false
   [junit4]   2> 698686 T2528 oascsi.HttpClientUtil.createClient Creating new http client, config:maxConnectionsPerHost=20&maxConnections=10000&socketTimeout=120000&connTimeout=15000&retry=false
   [junit4]   2> 698695 T2528 oasc.ZkContainer.initZooKeeper Zookeeper client=127.0.0.1:55629/solr
   [junit4]   2> 698695 T2528 oasc.ZkController.checkChrootPath zkHost includes chroot
   [junit4]   2> 698696 T2528 oascc.ConnectionManager.waitForConnected Waiting for client to connect to ZooKeeper
   [junit4]   2> 698697 T2608 oascc.ConnectionManager.process Watcher org.apache.solr.common.cloud.ConnectionManager@15d9e914 name:ZooKeeperConnection Watcher:127.0.0.1:55629 got event WatchedEvent state:SyncConnected type:None path:null path:null type:None
   [junit4]   2> 698698 T2528 oascc.ConnectionManager.waitForConnected Client is connected to ZooKeeper
   [junit4]   2> 698700 T2528 oascsi.HttpClientUtil.createClient Creating new http client, config:maxConnections=500&maxConnectionsPerHost=16&socketTimeout=120000&connTimeout=15000
   [junit4]   2> 698702 T2528 oascc.ConnectionManager.waitForConnected Waiting for client to connect to ZooKeeper
   [junit4]   2> 698703 T2610 oascc.ConnectionManager.process Watcher org.apache.solr.common.cloud.ConnectionManager@6d04a538 name:ZooKeeperConnection Watcher:127.0.0.1:55629/solr got event WatchedEvent state:SyncConnected type:None path:null path:null type:None
   [junit4]   2> 698704 T2528 oascc.ConnectionManager.waitForConnected Client is connected to ZooKeeper
   [junit4]   2> 698710 T2528 oascc.ZkStateReader.createClusterStateWatchersAndUpdate Updating cluster state from ZooKeeper... 
   [junit4]   2> 699716 T2528 oasc.ZkController.createEphemeralLiveNode Register node as live in ZooKeeper:/live_nodes/127.0.0.1:57087_cy%2Fwa
   [junit4]   2> 699718 T2528 oascc.SolrZkClient.makePath makePath: /live_nodes/127.0.0.1:57087_cy%2Fwa
   [junit4]   2> 699723 T2582 oascc.ZkStateReader$3.process Updating live nodes... (5)
   [junit4]   2> 699724 T2596 oascc.ZkStateReader$3.process Updating live nodes... (5)
   [junit4]   2> 699724 T2550 oascc.ZkStateReader$3.process Updating live nodes... (5)
   [junit4]   2> 699724 T2610 oascc.ZkStateReader$3.process Updating live nodes... (5)
   [junit4]   2> 699725 T2555 oascc.ZkStateReader$3.process Updating live nodes... (5)
   [junit4]   2> 699726 T2568 oascc.ZkStateReader$3.process Updating live nodes... (5)
   [junit4]   2> 699731 T2528 oasc.CorePropertiesLocator.discover Looking for core definitions underneath /mnt/ssd/jenkins/workspace/Lucene-Solr-4.x-Linux/solr/build/solr-core/test/J1/./org.apache.solr.cloud.CollectionsAPIDistributedZkTest-jetty4-1375485019098
   [junit4]   2> 699754 T2528 oasc.CorePropertiesLocator.discoverUnder Found core conf in /mnt/ssd/jenkins/workspace/Lucene-Solr-4.x-Linux/solr/build/solr-core/test/J1/./org.apache.solr.cloud.CollectionsAPIDistributedZkTest-jetty4-1375485019098/conf/
   [junit4]   2> 699755 T2528 oasc.CorePropertiesLocator.discover Found 1 core definitions
   [junit4]   2> 699756 T2528 oass.SolrDispatchFilter.init user.dir=/mnt/ssd/jenkins/workspace/Lucene-Solr-4.x-Linux/solr/build/solr-core/test/J1
   [junit4]   2> 699756 T2528 oass.SolrDispatchFilter.init SolrDispatchFilter.init() done
   [junit4]   2> 699756 T2528 oascsi.HttpClientUtil.createClient Creating new http client, config:maxConnections=128&maxConnectionsPerHost=32&followRedirects=false
   [junit4]   2> 699759 T2528 oascsi.HttpClientUtil.createClient Creating new http client, config:maxConnections=128&maxConnectionsPerHost=32&followRedirects=false
   [junit4]   2> 699762 T2564 oasha.CollectionsHandler.handleCreateAction Creating Collection : numShards=2&name=nodes_used_collection&replicationFactor=2&action=CREATE&wt=javabin&version=2
   [junit4]   2> 699764 T2550 oasc.DistributedQueue$LatchChildWatcher.process Watcher fired on path: /overseer/collection-queue-work state: SyncConnected type NodeChildrenChanged
   [junit4]   2> 699767 T2552 oasc.OverseerCollectionProcessor.run Overseer Collection Processor: Get the message id:/overseer/collection-queue-work/qn-0000000000 message:{
   [junit4]   2> 	  "operation":"createcollection",
   [junit4]   2> 	  "numShards":"2",
   [junit4]   2> 	  "name":"nodes_used_collection",
   [junit4]   2> 	  "replicationFactor":"2"}
   [junit4]   2> 699767 T2552 oasc.OverseerCollectionProcessor.processMessage WARN OverseerCollectionProcessor.processMessage : createcollection , {
   [junit4]   2> 	  "operation":"createcollection",
   [junit4]   2> 	  "numShards":"2",
   [junit4]   2> 	  "name":"nodes_used_collection",
   [junit4]   2> 	  "replicationFactor":"2"}
   [junit4]   2> 700967 T2551 oascc.ZkStateReader.updateClusterState Updating cloud state from ZooKeeper... 
   [junit4]   2> 700968 T2551 oasc.Overseer$ClusterStateUpdater.buildCollection building a new collection: nodes_used_collection
   [junit4]   2> 700968 T2551 oasc.Overseer$ClusterStateUpdater.createCollection Create collection nodes_used_collection with shards [shard1, shard2]
   [junit4]   2> 700973 T2610 oascc.ZkStateReader$2.process A cluster state change: WatchedEvent state:SyncConnected type:NodeDataChanged path:/clusterstate.json, has occurred - updating... (live nodes size: 5)
   [junit4]   2> 700973 T2555 oascc.ZkStateReader$2.process A cluster state change: WatchedEvent state:SyncConnected type:NodeDataChanged path:/clusterstate.json, has occurred - updating... (live nodes size: 5)
   [junit4]   2> 700973 T2596 oascc.ZkStateReader$2.process A cluster state change: WatchedEvent state:SyncConnected type:NodeDataChanged path:/clusterstate.json, has occurred - updating... (live nodes size: 5)
   [junit4]   2> 700974 T2550 oascc.ZkStateReader$2.process A cluster state change: WatchedEvent state:SyncConnected type:NodeDataChanged path:/clusterstate.json, has occurred - updating... (live nodes size: 5)
   [junit4]   2> 700974 T2568 oascc.ZkStateReader$2.process A cluster state change: WatchedEvent state:SyncConnected type:NodeDataChanged path:/clusterstate.json, has occurred - updating... (live nodes size: 5)
   [junit4]   2> 700974 T2582 oascc.ZkStateReader$2.process A cluster state change: WatchedEvent state:SyncConnected type:NodeDataChanged path:/clusterstate.json, has occurred - updating... (live nodes size: 5)
   [junit4]   2> 701072 T2552 oasc.OverseerCollectionProcessor.createCollection going to create cores replicas shardNames [shard1, shard2] , repFactor : 2
   [junit4]   2> 701073 T2552 oasc.OverseerCollectionProcessor.createCollection Creating shard nodes_used_collection_shard1_replica1 as part of slice shard1 of collection nodes_used_collection on 127.0.0.1:58557_cy%2Fwa
   [junit4]   2> 701073 T2552 oasc.OverseerCollectionProcessor.createCollection Creating shard nodes_used_collection_shard1_replica2 as part of slice shard1 of collection nodes_used_collection on 127.0.0.1:57087_cy%2Fwa
   [junit4]   2> 701074 T2552 oasc.OverseerCollectionProcessor.createCollection Creating shard nodes_used_collection_shard2_replica1 as part of slice shard2 of collection nodes_used_collection on 127.0.0.1:44392_cy%2Fwa
   [junit4]   2> 701077 T2552 oasc.OverseerCollectionProcessor.createCollection Creating shard nodes_used_collection_shard2_replica2 as part of slice shard2 of collection nodes_used_collection on 127.0.0.1:43300_cy%2Fwa
   [junit4]   2> 701079 T2577 oasc.ZkController.publish publishing core=nodes_used_collection_shard1_replica1 state=down
   [junit4]   2> 701079 T2605 oasc.ZkController.publish publishing core=nodes_used_collection_shard1_replica2 state=down
   [junit4]   2> 701079 T2592 oasc.ZkController.publish publishing core=nodes_used_collection_shard2_replica1 state=down
   [junit4]   2> 701079 T2544 oasc.ZkController.publish publishing core=nodes_used_collection_shard2_replica2 state=down
   [junit4]   2> 701081 T2605 oasc.ZkController.waitForCoreNodeName look for our core node name
   [junit4]   2> 701081 T2577 oasc.ZkController.waitForCoreNodeName look for our core node name
   [junit4]   2> 701082 T2592 oasc.ZkController.waitForCoreNodeName look for our core node name
   [junit4]   2> 701082 T2544 oasc.ZkController.waitForCoreNodeName look for our core node name
   [junit4]   2> 702485 T2551 oascc.ZkStateReader.updateClusterState Updating cloud state from ZooKeeper... 
   [junit4]   2> 702487 T2551 oasc.Overseer$ClusterStateUpdater.updateState WARN Could not find collection node for nodes_used_collection, skipping publish state
   [junit4]   2> 702487 T2551 oasc.Overseer$ClusterStateUpdater.updateState Update state numShards=2 message={
   [junit4]   2> 	  "operation":"state",
   [junit4]   2> 	  "core_node_name":"core_node1",
   [junit4]   2> 	  "numShards":"2",
   [junit4]   2> 	  "shard":"shard1",
   [junit4]   2> 	  "roles":null,
   [junit4]   2> 	  "state":"down",
   [junit4]   2> 	  "shard_state":"active",
   [junit4]   2> 	  "core":"nodes_used_collection_shard1_replica1",
   [junit4]   2> 	  "collection":"nodes_used_collection",
   [junit4]   2> 	  "shard_range":null,
   [junit4]   2> 	  "node_name":"127.0.0.1:58557_cy%2Fwa",
   [junit4]   2> 	  "base_url":"http://127.0.0.1:58557/cy/wa"}
   [junit4]   2> 702494 T2551 oasc.Overseer$ClusterStateUpdater.updateState WARN Could not find collection node for nodes_used_collection, skipping publish state
   [junit4]   2> 702494 T2551 oasc.Overseer$ClusterStateUpdater.updateState Update state numShards=2 message={
   [junit4]   2> 	  "operation":"state",
   [junit4]   2> 	  "core_node_name":"core_node2",
   [junit4]   2> 	  "numShards":"2",
   [junit4]   2> 	  "shard":"shard1",
   [junit4]   2> 	  "roles":null,
   [junit4]   2> 	  "state":"down",
   [junit4]   2> 	  "shard_state":"active",
   [junit4]   2> 	  "core":"nodes_used_collection_shard1_replica2",
   [junit4]   2> 	  "collection":"nodes_used_collection",
   [junit4]   2> 	  "shard_range":null,
   [junit4]   2> 	  "node_name":"127.0.0.1:57087_cy%2Fwa",
   [junit4]   2> 	  "base_url":"http://127.0.0.1:57087/cy/wa"}
   [junit4]   2> 702500 T2551 oasc.Overseer$ClusterStateUpdater.updateState WARN Could not find collection node for nodes_used_collection, skipping publish state
   [junit4]   2> 702500 T2551 oasc.Overseer$ClusterStateUpdater.updateState Update state numShards=2 message={
   [junit4]   2> 	  "operation":"state",
   [junit4]   2> 	  "core_node_name":"core_node3",
   [junit4]   2> 	  "numShards":"2",
   [junit4]   2> 	  "shard":"shard2",
   [junit4]   2> 	  "roles":null,
   [junit4]   2> 	  "state":"down",
   [junit4]   2> 	  "shard_state":"active",
   [junit4]   2> 	  "core":"nodes_used_collection_shard2_replica1",
   [junit4]   2> 	  "collection":"nodes_used_collection",
   [junit4]   2> 	  "shard_range":null,
   [junit4]   2> 	  "node_name":"127.0.0.1:44392_cy%2Fwa",
   [junit4]   2> 	  "base_url":"http://127.0.0.1:44392/cy/wa"}
   [junit4]   2> 702506 T2551 oasc.Overseer$ClusterStateUpdater.updateState WARN Could not find collection node for nodes_used_collection, skipping publish state
   [junit4]   2> 702506 T2551 oasc.Overseer$ClusterStateUpdater.updateState Update state numShards=2 message={
   [junit4]   2> 	  "operation":"state",
   [junit4]   2> 	  "core_node_name":"core_node4",
   [junit4]   2> 	  "numShards":"2",
   [junit4]   2> 	  "shard":"shard2",
   [junit4]   2> 	  "roles":null,
   [junit4]   2> 	  "state":"down",
   [junit4]   2> 	  "shard_state":"active",
   [junit4]   2> 	  "core":"nodes_used_collection_shard2_replica2",
   [junit4]   2> 	  "collection":"nodes_used_collection",
   [junit4]   2> 	  "shard_range":null,
   [junit4]   2> 	  "node_name":"127.0.0.1:43300_cy%2Fwa",
   [junit4]   2> 	  "base_url":"http://127.0.0.1:43300/cy/wa"}
   [junit4]   2> 702511 T2610 oascc.ZkStateReader$2.process A cluster state change: WatchedEvent state:SyncConnected type:NodeDataChanged path:/clusterstate.json, has occurred - updating... (live nodes size: 5)
   [junit4]   2> 702512 T2568 oascc.ZkStateReader$2.process A cluster state change: WatchedEvent state:SyncConnected type:NodeDataChanged path:/clusterstate.json, has occurred - updating... (live nodes size: 5)
   [junit4]   2> 702512 T2555 oascc.ZkStateReader$2.process A cluster state change: WatchedEvent state:SyncConnected type:NodeDataChanged path:/clusterstate.json, has occurred - updating... (live nodes size: 5)
   [junit4]   2> 702511 T2596 oascc.ZkStateReader$2.process A cluster state change: WatchedEvent state:SyncConnected type:NodeDataChanged path:/clusterstate.json, has occurred - updating... (live nodes size: 5)
   [junit4]   2> 702511 T2550 oascc.ZkStateReader$2.process A cluster state change: WatchedEvent state:SyncConnected type:NodeDataChanged path:/clusterstate.json, has occurred - updating... (live nodes size: 5)
   [junit4]   2> 702512 T2582 oascc.ZkStateReader$2.process A cluster state change: WatchedEvent state:SyncConnected type:NodeDataChanged path:/clusterstate.json, has occurred - updating... (live nodes size: 5)
   [junit4]   2> 703081 T2605 oasc.ZkController.waitForShardId waiting to find shard id in clusterstate for nodes_used_collection_shard1_replica2
   [junit4]   2> 703082 T2592 oasc.ZkController.waitForShardId waiting to find shard id in clusterstate for nodes_used_collection_shard2_replica1
   [junit4]   2> 703082 T2577 oasc.ZkController.waitForShardId waiting to find shard id in clusterstate for nodes_used_collection_shard1_replica1
   [junit4]   2> 703083 T2592 oasc.CorePropertiesLocator.writePropertiesFile ERROR Couldn't persist core properties to /mnt/ssd/jenkins/workspace/Lucene-Solr-4.x-Linux/solr/build/solr-core/test/J1/./org.apache.solr.cloud.CollectionsAPIDistributedZkTest-jetty3-1375485017903/nodes_used_collection_shard2_replica1/core.properties: java.io.FileNotFoundException: /mnt/ssd/jenkins/workspace/Lucene-Solr-4.x-Linux/solr/build/solr-core/test/J1/./org.apache.solr.cloud.CollectionsAPIDistributedZkTest-jetty3-1375485017903/nodes_used_collection_shard2_replica1/core.properties (No such file or directory)
   [junit4]   2> 703083 T2544 oasc.ZkController.waitForShardId waiting to find shard id in clusterstate for nodes_used_collection_shard2_replica2
   [junit4]   2> 703082 T2605 oasc.CorePropertiesLocator.writePropertiesFile ERROR Couldn't persist core properties to /mnt/ssd/jenkins/workspace/Lucene-Solr-4.x-Linux/solr/build/solr-core/test/J1/./org.apache.solr.cloud.CollectionsAPIDistributedZkTest-jetty4-1375485019098/nodes_used_collection_shard1_replica2/core.properties: java.io.FileNotFoundException: /mnt/ssd/jenkins/workspace/Lucene-Solr-4.x-Linux/solr/build/solr-core/test/J1/./org.apache.solr.cloud.CollectionsAPIDistributedZkTest-jetty4-1375485019098/nodes_used_collection_shard1_replica2/core.properties (No such file or directory)
   [junit4]   2> 703084 T2544 oasc.CorePropertiesLocator.writePropertiesFile ERROR Couldn't persist core properties to /mnt/ssd/jenkins/workspace/Lucene-Solr-4.x-Linux/solr/build/solr-core/test/J1/./org.apache.solr.cloud.CollectionsAPIDistributedZkTest-controljetty-1375485015279/nodes_used_collection_shard2_replica2/core.properties: java.io.FileNotFoundException: /mnt/ssd/jenkins/workspace/Lucene-Solr-4.x-Linux/solr/build/solr-core/test/J1/./org.apache.solr.cloud.CollectionsAPIDistributedZkTest-controljetty-1375485015279/nodes_used_collection_shard2_replica2/core.properties (No such file or directory)
   [junit4]   2> 703083 T2592 oasc.CoreContainer.create Creating SolrCore 'nodes_used_collection_shard2_replica1' using instanceDir: /mnt/ssd/jenkins/workspace/Lucene-Solr-4.x-Linux/solr/build/solr-core/test/J1/./org.apache.solr.cloud.CollectionsAPIDistributedZkTest-jetty3-1375485017903/nodes_used_collection_shard2_replica1
   [junit4]   2> 703084 T2592 oasc.ZkController.createCollectionZkNode Check for collection zkNode:nodes_used_collection
   [junit4]   2> 703083 T2577 oasc.CorePropertiesLocator.writePropertiesFile ERROR Couldn't persist core properties to /mnt/ssd/jenkins/workspace/Lucene-Solr-4.x-Linux/solr/build/solr-core/test/J1/./org.apache.solr.cloud.CollectionsAPIDistributedZkTest-jetty2-1375485016704/nodes_used_collection_shard1_replica1/core.properties: java.io.FileNotFoundException: /mnt/ssd/jenkins/workspace/Lucene-Solr-4.x-Linux/solr/build/solr-core/test/J1/./org.apache.solr.cloud.CollectionsAPIDistributedZkTest-jetty2-1375485016704/nodes_used_collection_shard1_replica1/core.properties (No such file or directory)
   [junit4]   2> 703084 T2544 oasc.CoreContainer.create Creating SolrCore 'nodes_used_collection_shard2_replica2' using instanceDir: /mnt/ssd/jenkins/workspace/Lucene-Solr-4.x-Linux/solr/build/solr-core/test/J1/./org.apache.solr.cloud.CollectionsAPIDistributedZkTest-controljetty-1375485015279/nodes_used_collection_shard2_replica2
   [junit4]   2> 703085 T2544 oasc.ZkController.createCollectionZkNode Check for collection zkNode:nodes_used_collection
   [junit4]   2> 703084 T2605 oasc.CoreContainer.create Creating SolrCore 'nodes_used_collection_shard1_replica2' using instanceDir: /mnt/ssd/jenkins/workspace/Lucene-Solr-4.x-Linux/solr/build/solr-core/test/J1/./org.apache.solr.cloud.CollectionsAPIDistributedZkTest-jetty4-1375485019098/nodes_used_collection_shard1_replica2
   [junit4]   2> 703086 T2592 oasc.ZkController.createCollectionZkNode Creating collection in ZooKeeper:nodes_used_collection
   [junit4]   2> 703085 T2577 oasc.CoreContainer.create Creating SolrCore 'nodes_used_collection_shard1_replica1' using instanceDir: /mnt/ssd/jenkins/workspace/Lucene-Solr-4.x-Linux/solr/build/solr-core/test/J1/./org.apache.solr.cloud.CollectionsAPIDistributedZkTest-jetty2-1375485016704/nodes_used_collection_shard1_replica1
   [junit4]   2> 703086 T2544 oasc.ZkController.createCollectionZkNode Creating collection in ZooKeeper:nodes_used_collection
   [junit4]   2> 703086 T2592 oasc.ZkController.getConfName Looking for collection configName
   [junit4]   2> 703086 T2605 oasc.ZkController.createCollectionZkNode Check for collection zkNode:nodes_used_collection
   [junit4]   2> 703087 T2544 oasc.ZkController.getConfName Looking for collection configName
   [junit4]   2> 703087 T2577 oasc.ZkController.createCollectionZkNode Check for collection zkNode:nodes_used_collection
   [junit4]   2> 703089 T2605 oasc.ZkController.createCollectionZkNode Creating collection in ZooKeeper:nodes_used_collection
   [junit4]   2> 703089 T2605 oasc.ZkController.getConfName Looking for collection configName
   [junit4]   2> 703090 T2577 oasc.ZkController.createCollectionZkNode Creating collection in ZooKeeper:nodes_used_collection
   [junit4]   2> 703091 T2577 oasc.ZkController.getConfName Looking for collection configName
   [junit4]   2> 703091 T2544 oasc.ZkController.getConfName Only one config set found in zk - using it:conf1
   [junit4]   2> 703091 T2544 oascc.SolrZkClient.makePath makePath: /collections/nodes_used_collection
   [junit4]   2> 703091 T2592 oasc.ZkController.getConfName Only one config set found in zk - using it:conf1
   [junit4]   2> 703092 T2592 oascc.SolrZkClient.makePath makePath: /collections/nodes_used_collection
   [junit4]   2> 703092 T2605 oasc.ZkController.getConfName Only one config set found in zk - using it:conf1
   [junit4]   2> 703093 T2605 oascc.SolrZkClient.makePath makePath: /collections/nodes_used_collection
   [junit4]   2> 703096 T2577 oasc.ZkController.getConfName Only one config set found in zk - using it:conf1
   [junit4]   2> 703096 T2577 oascc.SolrZkClient.makePath makePath: /collections/nodes_used_collection
   [junit4]   2> 703097 T2605 oasc.ZkController.readConfigName Load collection config from:/collections/nodes_used_collection
   [junit4]   2> 703098 T2592 oasc.ZkController.readConfigName Load collection config from:/collections/nodes_used_collection
   [junit4]   2> 703100 T2544 oasc.ZkController.readConfigName Load collection config from:/collections/nodes_used_collection
   [junit4]   2> 703101 T2605 oasc.SolrResourceLoader.<init> new SolrResourceLoader for directory: '/mnt/ssd/jenkins/workspace/Lucene-Solr-4.x-Linux/solr/build/solr-core/test/J1/./org.apache.solr.cloud.CollectionsAPIDistributedZkTest-jetty4-1375485019098/nodes_used_collection_shard1_replica2/'
   [junit4]   2> 703101 T2592 oasc.SolrResourceLoader.<init> new SolrResourceLoader for directory: '/mnt/ssd/jenkins/workspace/Lucene-Solr-4.x-Linux/solr/build/solr-core/test/J1/./org.apache.solr.cloud.CollectionsAPIDistributedZkTest-jetty3-1375485017903/nodes_used_collection_shard2_replica1/'
   [junit4]   2> 703103 T2577 oasc.ZkController.readConfigName Load collection config from:/collections/nodes_used_collection
   [junit4]   2> 703103 T2544 oasc.SolrResourceLoader.<init> new SolrResourceLoader for directory: '/mnt/ssd/jenkins/workspace/Lucene-Solr-4.x-Linux/solr/build/solr-core/test/J1/./org.apache.solr.cloud.CollectionsAPIDistributedZkTest-controljetty-1375485015279/nodes_used_collection_shard2_replica2/'
   [junit4]   2> 703105 T2577 oasc.SolrResourceLoader.<init> new SolrResourceLoader for directory: '/mnt/ssd/jenkins/workspace/Lucene-Solr-4.x-Linux/solr/build/solr-core/test/J1/./org.apache.solr.cloud.CollectionsAPIDistributedZkTest-jetty2-1375485016704/nodes_used_collection_shard1_replica1/'
   [junit4]   2> 703160 T2544 oasc.SolrConfig.<init> Using Lucene MatchVersion: LUCENE_45
   [junit4]   2> 703174 T2577 oasc.SolrConfig.<init> Using Lucene MatchVersion: LUCENE_45
   [junit4]   2> 703177 T2605 oasc.SolrConfig.<init> Using Lucene MatchVersion: LUCENE_45
   [junit4]   2> 703182 T2592 oasc.SolrConfig.<init> Using Lucene MatchVersion: LUCENE_45
   [junit4]   2> 703242 T2544 oasc.SolrConfig.<init> Loaded SolrConfig: solrconfig.xml
   [junit4]   2> 703245 T2544 oass.IndexSchema.readSchema Reading Solr Schema from schema.xml
   [junit4]   2> 703246 T2605 oasc.SolrConfig.<init> Loaded SolrConfig: solrconfig.xml
   [junit4]   2> 703249 T2605 oass.IndexSchema.readSchema Reading Solr Schema from schema.xml
   [junit4]   2> 703272 T2577 oasc.SolrConfig.<init> Loaded SolrConfig: solrconfig.xml
   [junit4]   2> 703272 T2592 oasc.SolrConfig.<init> Loaded SolrConfig: solrconfig.xml
   [junit4]   2> 703275 T2577 oass.IndexSchema.readSchema Reading Solr Schema from schema.xml
   [junit4]   2> 703277 T2605 oass.IndexSchema.readSchema [nodes_used_collection_shard1_replica2] Schema name=test
   [junit4]   2> 703276 T2592 oass.IndexSchema.readSchema Reading Solr Schema from schema.xml
   [junit4]   2> 703281 T2544 oass.IndexSchema.readSchema [nodes_used_collection_shard2_replica2] Schema name=test
   [junit4]   2> 703291 T2577 oass.IndexSchema.readSchema [nodes_used_collection_shard1_replica1] Schema name=test
   [junit4]   2> 703294 T2592 oass.IndexSchema.readSchema [nodes_used_collection_shard2_replica1] Schema name=test
   [junit4]   2> 703821 T2605 oass.ByteField.init WARN ByteField is deprecated and will be removed in 5.0. You should use TrieIntField instead.
   [junit4]   2> 703821 T2605 oass.ShortField.init WARN ShortField is deprecated and will be removed in 5.0. You should use TrieIntField instead.
   [junit4]   2> 703822 T2605 oass.OpenExchangeRatesOrgProvider.init Initialized with rates=open-exchange-rates.json, refreshInterval=1440.
   [junit4]   2> 703830 T2605 oass.IndexSchema.readSchema default search field in schema is text
   [junit4]   2> 703834 T2605 oass.IndexSchema.readSchema unique key field: id
   [junit4]   2> 703866 T2605 oass.FileExchangeRateProvider.reload Reloading exchange rates from file currency.xml
   [junit4]   2> 703872 T2605 oass.FileExchangeRateProvider.reload Reloading exchange rates from file currency.xml
   [junit4]   2> 703883 T2605 oass.OpenExchangeRatesOrgProvider.reload Reloading exchange rates from open-exchange-rates.json
   [junit4]   2> 703886 T2605 oass.OpenExchangeRatesOrgProvider$OpenExchangeRates.<init> WARN Unknown key IMPORTANT NOTE
   [junit4]   2> 703887 T2605 oass.OpenExchangeRatesOrgProvider$OpenExchangeRates.<init> WARN Expected key, got STRING
   [junit4]   2> 703887 T2605 oass.OpenExchangeRatesOrgProvider.reload Reloading exchange rates from open-exchange-rates.json
   [junit4]   2> 703889 T2605 oass.OpenExchangeRatesOrgProvider$OpenExchangeRates.<init> WARN Unknown key IMPORTANT NOTE
   [junit4]   2> 703890 T2605 oass.OpenExchangeRatesOrgProvider$OpenExchangeRates.<init> WARN Expected key, got STRING
   [junit4]   2> 703890 T2605 oasc.SolrCore.initDirectoryFactory org.apache.solr.core.MockDirectoryFactory
   [junit4]   2> 703891 T2605 oasc.SolrCore.<init> [nodes_used_collection_shard1_replica2] Opening new SolrCore at /mnt/ssd/jenkins/workspace/Lucene-Solr-4.x-Linux/solr/build/solr-core/test/J1/./org.apache.solr.cloud.CollectionsAPIDistributedZkTest-jetty4-1375485019098/nodes_used_collection_shard1_replica2/, dataDir=/mnt/ssd/jenkins/workspace/Lucene-Solr-4.x-Linux/solr/build/solr-core/test/J1/./org.apache.solr.cloud.CollectionsAPIDistributedZkTest-jetty4-1375485019098//nodes_used_collection_shard1_replica2/data/
   [junit4]   2> 703891 T2605 oasc.JmxMonitoredMap.<init> JMX monitoring is enabled. Adding Solr mbeans to JMX Server: com.sun.jmx.mbeanserver.JmxMBeanServer@7ec78e02
   [junit4]   2> 703893 T2605 oasc.CachingDirectoryFactory.get return new directory for /mnt/ssd/jenkins/workspace/Lucene-Solr-4.x-Linux/solr/build/solr-core/test/J1/./org.apache.solr.cloud.CollectionsAPIDistributedZkTest-jetty4-1375485019098//nodes_used_collection_shard1_replica2/data
   [junit4]   2> 703893 T2605 oasc.SolrCore.getNewIndexDir New index directory detected: old=null new=/mnt/ssd/jenkins/workspace/Lucene-Solr-4.x-Linux/solr/build/solr-core/test/J1/./org.apache.solr.cloud.CollectionsAPIDistributedZkTest-jetty4-1375485019098//nodes_used_collection_shard1_replica2/data/index/
   [junit4]   2> 703894 T2605 oasc.SolrCore.initIndex WARN [nodes_used_collection_shard1_replica2] Solr index directory '/mnt/ssd/jenkins/workspace/Lucene-Solr-4.x-Linux/solr/build/solr-core/test/J1/./org.apache.solr.cloud.CollectionsAPIDistributedZkTest-jetty4-1375485019098/nodes_used_collection_shard1_replica2/data/index' doesn't exist. Creating new index...
   [junit4]   2> 703894 T2592 oass.ByteField.init WARN ByteField is deprecated and will be removed in 5.0. You should use TrieIntField instead.
   [junit4]   2> 703894 T2605 oasc.CachingDirectoryFactory.get return new directory for /mnt/ssd/jenkins/workspace/Lucene-Solr-4.x-Linux/solr/build/solr-core/test/J1/./org.apache.solr.cloud.CollectionsAPIDistributedZkTest-jetty4-1375485019098//nodes_used_collection_shard1_replica2/data/index
   [junit4]   2> 703894 T2592 oass.ShortField.init WARN ShortField is deprecated and will be removed in 5.0. You should use TrieIntField instead.
   [junit4]   2> 703895 T2592 oass.OpenExchangeRatesOrgProvider.init Initialized with rates=open-exchange-rates.json, refreshInterval=1440.
   [junit4]   2> 703897 T2605 oasc.SolrDeletionPolicy.onCommit SolrDeletionPolicy.onCommit: commits: num=1
   [junit4]   2> 		commit{dir=MockDirWrapper(org.apache.lucene.store.RAMDirectory@5809c898 lockFactory=org.apache.lucene.store.NativeFSLockFactory@5a3ed429),segFN=segments_1,generation=1}
   [junit4]   2> 703897 T2605 oasc.SolrDeletionPolicy.updateCommits newest commit generation = 1
   [junit4]   2> 703901 T2592 oass.IndexSchema.readSchema default search field in schema is text
   [junit4]   2> 703902 T2605 oasup.UpdateRequestProcessorChain.init inserting DistributedUpdateProcessorFactory into updateRequestProcessorChain "dedupe"
   [junit4]   2> 703903 T2605 oasup.UpdateRequestProcessorChain.init inserting DistributedUpdateProcessorFactory into updateRequestProcessorChain "stored_sig"
   [junit4]   2> 703904 T2605 oasup.UpdateRequestProcessorChain.init inserting DistributedUpdateProcessorFactory into updateRequestProcessorChain "distrib-dup-test-chain-implicit"
   [junit4]   2> 703904 T2592 oass.IndexSchema.readSchema unique key field: id
   [junit4]   2> 703904 T2605 oasc.RequestHandlers.initHandlersFromConfig created standard: solr.StandardRequestHandler
   [junit4]   2> 703905 T2605 oasc.RequestHandlers.initHandlersFromConfig created /get: solr.RealTimeGetHandler
   [junit4]   2> 703911 T2605 oasc.RequestHandlers.initHandlersFromConfig adding lazy requestHandler: solr.ReplicationHandler
   [junit4]   2> 703912 T2605 oasc.RequestHandlers.initHandlersFromConfig created /replication: solr.ReplicationHandler
   [junit4]   2> 703913 T2605 oasc.RequestHandlers.initHandlersFromConfig created /update: solr.UpdateRequestHandler
   [junit4]   2> 703913 T2605 oasc.RequestHandlers.initHandlersFromConfig created /admin/: org.apache.solr.handler.admin.AdminHandlers
   [junit4]   2> 703916 T2605 oashl.XMLLoader.init xsltCacheLifetimeSeconds=60
   [junit4]   2> 703919 T2605 oass.SolrIndexSearcher.<init> Opening Searcher@379ba3b3 main
   [junit4]   2> 703921 T2605 oasu.CommitTracker.<init> Hard AutoCommit: disabled
   [junit4]   2> 703921 T2605 oasu.CommitTracker.<init> Soft AutoCommit: disabled
   [junit4]   2> 703926 T2616 oasc.SolrCore.registerSearcher [nodes_used_collection_shard1_replica2] Registered new searcher Searcher@379ba3b3 main{StandardDirectoryReader(segments_1:1)}
   [junit4]   2> 703928 T2605 oasc.CoreContainer.registerCore registering core: nodes_used_collection_shard1_replica2
   [junit4]   2> 703929 T2605 oasc.ZkController.register Register replica - core:nodes_used_collection_shard1_replica2 address:http://127.0.0.1:57087/cy/wa collection:nodes_used_collection shard:shard1
   [junit4]   2> 703929 T2605 oascsi.HttpClientUtil.createClient Creating new http client, config:maxConnections=10000&maxConnectionsPerHost=20&connTimeout=15000&socketTimeout=30000&retry=false
   [junit4]   2> 703933 T2605 oascc.SolrZkClient.makePath makePath: /collections/nodes_used_collection/leader_elect/shard1/election
   [junit4]   2> 703936 T2592 oass.FileExchangeRateProvider.reload Reloading exchange rates from file currency.xml
   [junit4]   2> 703943 T2592 oass.FileExchangeRateProvider.reload Reloading exchange rates from file currency.xml
   [junit4]   2> 703945 T2544 oass.ByteField.init WARN ByteField is deprecated and will be removed in 5.0. You should use TrieIntField instead.
   [junit4]   2> 703946 T2544 oass.ShortField.init WARN ShortField is deprecated and will be removed in 5.0. You should use TrieIntField instead.
   [junit4]   2> 703947 T2544 oass.OpenExchangeRatesOrgProvider.init Initialized with rates=open-exchange-rates.json, refreshInterval=1440.
   [junit4]   2> 703957 T2605 oasc.ShardLeaderElectionContext.runLeaderProcess Running the leader process for shard shard1
   [junit4]   2> 703958 T2592 oass.OpenExchangeRatesOrgProvider.reload Reloading exchange rates from open-exchange-rates.json
   [junit4]   2> 703961 T2592 oass.OpenExchangeRatesOrgProvider$OpenExchangeRates.<init> WARN Unknown key IMPORTANT NOTE
   [junit4]   2> 703962 T2592 oass.OpenExchangeRatesOrgProvider$OpenExchangeRates.<init> WARN Expected key, got STRING
   [junit4]   2> 703962 T2544 oass.IndexSchema.readSchema default search field in schema is text
   [junit4]   2> 703962 T2592 oass.OpenExchangeRatesOrgProvider.reload Reloading exchange rates from open-exchange-rates.json
   [junit4]   2> 703964 T2605 oasc.ShardLeaderElectionContext.waitForReplicasToComeUp Waiting until we see more replicas up for shard shard1: total=2 found=1 timeoutin=179999
   [junit4]   2> 703965 T2544 oass.IndexSchema.readSchema unique key field: id
   [junit4]   2> 703965 T2592 oass.OpenExchangeRatesOrgProvider$OpenExchangeRates.<init> WARN Unknown key IMPORTANT NOTE
   [junit4]   2> 703966 T2592 oass.OpenExchangeRatesOrgProvider$OpenExchangeRates.<init> WARN Expected key, got STRING
   [junit4]   2> 703967 T2592 oasc.SolrCore.initDirectoryFactory org.apache.solr.core.MockDirectoryFactory
   [junit4]   2> 703967 T2592 oasc.SolrCore.<init> [nodes_used_collection_shard2_replica1] Opening new SolrCore at /mnt/ssd/jenkins/workspace/Lucene-Solr-4.x-Linux/solr/build/solr-core/test/J1/./org.apache.solr.cloud.CollectionsAPIDistributedZkTest-jetty3-1375485017903/nodes_used_collection_shard2_replica1/, dataDir=/mnt/ssd/jenkins/workspace/Lucene-Solr-4.x-Linux/solr/build/solr-core/test/J1/./org.apache.solr.cloud.CollectionsAPIDistributedZkTest-jetty3-1375485017903//nodes_used_collection_shard2_replica1/data/
   [junit4]   2> 703967 T2592 oasc.JmxMonitoredMap.<init> JMX monitoring is enabled. Adding Solr mbeans to JMX Server: com.sun.jmx.mbeanserver.JmxMBeanServer@7ec78e02
   [junit4]   2> 703969 T2592 oasc.CachingDirectoryFactory.get return new directory for /mnt/ssd/jenkins/workspace/Lucene-Solr-4.x-Linux/solr/build/solr-core/test/J1/./org.apache.solr.cloud.CollectionsAPIDistributedZkTest-jetty3-1375485017903//nodes_used_collection_shard2_replica1/data
   [junit4]   2> 703970 T2592 oasc.SolrCore.getNewIndexDir New index directory detected: old=null new=/mnt/ssd/jenkins/workspace/Lucene-Solr-4.x-Linux/solr/build/solr-core/test/J1/./org.apache.solr.cloud.CollectionsAPIDistributedZkTest-jetty3-1375485017903//nodes_used_collection_shard2_replica1/data/index/
   [junit4]   2> 703970 T2592 oasc.SolrCore.initIndex WARN [nodes_used_collection_shard2_replica1] Solr index directory '/mnt/ssd/jenkins/workspace/Lucene-Solr-4.x-Linux/solr/build/solr-core/test/J1/./org.apache.solr.cloud.CollectionsAPIDistributedZkTest-jetty3-1375485017903/nodes_used_collection_shard2_replica1/data/index' doesn't exist. Creating new index...
   [junit4]   2> 703971 T2592 oasc.CachingDirectoryFactory.get return new directory for /mnt/ssd/jenkins/workspace/Lucene-Solr-4.x-Linux/solr/build/solr-core/test/J1/./org.apache.solr.cloud.CollectionsAPIDistributedZkTest-jetty3-1375485017903//nodes_used_collection_shard2_replica1/data/index
   [junit4]   2> 703972 T2577 oass.ByteField.init WARN ByteField is deprecated and will be removed in 5.0. You should use TrieIntField instead.
   [junit4]   2> 703973 T2577 oass.ShortField.init WARN ShortField is deprecated and will be removed in 5.0. You should use TrieIntField instead.
   [junit4]   2> 703974 T2577 oass.OpenExchangeRatesOrgProvider.init Initialized with rates=open-exchange-rates.json, refreshInterval=1440.
   [junit4]   2> 703974 T2592 oasc.SolrDeletionPolicy.onCommit SolrDeletionPolicy.onCommit: commits: num=1
   [junit4]   2> 		commit{dir=MockDirWrapper(org.apache.lucene.store.RAMDirectory@69217a9c lockFactory=org.apache.lucene.store.NativeFSLockFactory@10b5b606),segFN=segments_1,generation=1}
   [junit4]   2> 703974 T2592 oasc.SolrDeletionPolicy.updateCommits newest commit generation = 1
   [junit4]   2> 703979 T2592 oasup.UpdateRequestProcessorChain.init inserting DistributedUpdateProcessorFactory into updateRequestProcessorChain "dedupe"
   [junit4]   2> 703980 T2592 oasup.UpdateRequestProcessorChain.init inserting DistributedUpdateProcessorFactory into updateRequestProcessorChain "stored_sig"
   [junit4]   2> 703981 T2592 oasup.UpdateRequestProcessorChain.init inserting DistributedUpdateProcessorFactory into updateRequestProcessorChain "distrib-dup-test-chain-implicit"
   [junit4]   2> 703982 T2592 oasc.RequestHandlers.initHandlersFromConfig created standard: solr.StandardRequestHandler
   [junit4]   2> 703983 T2577 oass.IndexSchema.readSchema default search field in schema is text
   [junit4]   2> 703983 T2592 oasc.RequestHandlers.initHandlersFromConfig created /get: solr.RealTimeGetHandler
   [junit4]   2> 703984 T2592 oasc.RequestHandlers.initHandlersFromConfig adding lazy requestHandler: solr.ReplicationHandler
   [junit4]   2> 703984 T2592 oasc.RequestHandlers.initHandlersFromConfig created /replication: solr.ReplicationHandler
   [junit4]   2> 703985 T2592 oasc.RequestHandlers.initHandlersFromConfig created /update: solr.UpdateRequestHandler
   [junit4]   2> 703986 T2592 oasc.RequestHandlers.initHandlersFromConfig created /admin/: org.apache.solr.handler.admin.AdminHandlers
   [junit4]   2> 703987 T2577 oass.IndexSchema.readSchema unique key field: id
   [junit4]   2> 703987 T2544 oass.FileExchangeRateProvider.reload Reloading exchange rates from file currency.xml
   [junit4]   2> 703989 T2592 oashl.XMLLoader.init xsltCacheLifetimeSeconds=60
   [junit4]   2> 703991 T2592 oass.SolrIndexSearcher.<init> Opening Searcher@a28ad2e main
   [junit4]   2> 703992 T2592 oasu.CommitTracker.<init> Hard AutoCommit: disabled
   [junit4]   2> 703993 T2592 oasu.CommitTracker.<init> Soft AutoCommit: disabled
   [junit4]   2> 703993 T2544 oass.FileExchangeRateProvider.reload Reloading exchange rates from file currency.xml
   [junit4]   2> 703996 T2617 oasc.SolrCore.registerSearcher [nodes_used_collection_shard2_replica1] Registered new searcher Searcher@a28ad2e main{StandardDirectoryReader(segments_1:1)}
   [junit4]   2> 703997 T2592 oasc.CoreContainer.registerCore registering core: nodes_used_collection_shard2_replica1
   [junit4]   2> 703998 T2592 oasc.ZkController.register Register replica - core:nodes_used_collection_shard2_replica1 address:http://127.0.0.1:44392/cy/wa collection:nodes_used_collection shard:shard2
   [junit4]   2> 703998 T2544 oass.OpenExchangeRatesOrgProvider.reload Reloading exchange rates from open-exchange-rates.json
   [junit4]   2> 703998 T2592 oascsi.HttpClientUtil.createClient Creating new http client, config:maxConnections=10000&maxConnectionsPerHost=20&connTimeout=15000&socketTimeout=30000&retry=false
   [junit4]   2> 704001 T2544 oass.OpenExchangeRatesOrgProvider$OpenExchangeRates.<init> WARN Unknown key IMPORTANT NOTE
   [junit4]   2> 704001 T2544 oass.OpenExchangeRatesOrgProvider$OpenExchangeRates.<init> WARN Expected key, got STRING
   [junit4]   2> 704001 T2544 oass.OpenExchangeRatesOrgProvider.reload Reloading exchange rates from open-exchange-rates.json
   [junit4]   2> 704003 T2592 oascc.SolrZkClient.makePath makePath: /collections/nodes_used_collection/leader_elect/shard2/election
   [junit4]   2> 704006 T2544 oass.OpenExchangeRatesOrgProvider$OpenExchangeRates.<init> WARN Unknown key IMPORTANT NOTE
   [junit4]   2> 704006 T2544 oass.OpenExchangeRatesOrgProvider$OpenExchangeRates.<init> WARN Expected key, got STRING
   [junit4]   2> 704007 T2544 oasc.SolrCore.initDirectoryFactory org.apache.solr.core.MockDirectoryFactory
   [junit4]   2> 704007 T2544 oasc.SolrCore.<init> [nodes_used_collection_shard2_replica2] Opening new SolrCore at /mnt/ssd/jenkins/workspace/Lucene-Solr-4.x-Linux/solr/build/solr-core/test/J1/./org.apache.solr.cloud.CollectionsAPIDistributedZkTest-controljetty-1375485015279/nodes_used_collection_shard2_replica2/, dataDir=/mnt/ssd/jenkins/workspace/Lucene-Solr-4.x-Linux/solr/build/solr-core/test/J1/./org.apache.solr.cloud.CollectionsAPIDistributedZkTest-controljetty-1375485015279//nodes_used_collection_shard2_replica2/data/
   [junit4]   2> 704007 T2544 oasc.JmxMonitoredMap.<init> JMX monitoring is enabled. Adding Solr mbeans to JMX Server: com.sun.jmx.mbeanserver.JmxMBeanServer@7ec78e02
   [junit4]   2> 704008 T2544 oasc.CachingDirectoryFactory.get return new directory for /mnt/ssd/jenkins/workspace/Lucene-Solr-4.x-Linux/solr/build/solr-core/test/J1/./org.apache.solr.cloud.CollectionsAPIDistributedZkTest-controljetty-1375485015279//nodes_used_collection_shard2_replica2/data
   [junit4]   2> 704009 T2544 oasc.SolrCore.getNewIndexDir New index directory detected: old=null new=/mnt/ssd/jenkins/workspace/Lucene-Solr-4.x-Linux/solr/build/solr-core/test/J1/./org.apache.solr.cloud.CollectionsAPIDistributedZkTest-controljetty-1375485015279//nodes_used_collection_shard2_replica2/data/index/
   [junit4]   2> 704009 T2544 oasc.SolrCore.initIndex WARN [nodes_used_collection_shard2_replica2] Solr index directory '/mnt/ssd/jenkins/workspace/Lucene-Solr-4.x-Linux/solr/build/solr-core/test/J1/./org.apache.solr.cloud.CollectionsAPIDistributedZkTest-controljetty-1375485015279/nodes_used_collection_shard2_replica2/data/index' doesn't exist. Creating new index...
   [junit4]   2> 704009 T2544 oasc.CachingDirectoryFactory.get return new directory for /mnt/ssd/jenkins/workspace/Lucene-Solr-4.x-Linux/solr/build/solr-core/test/J1/./org.apache.solr.cloud.CollectionsAPIDistributedZkTest-controljetty-1375485015279//nodes_used_collection_shard2_replica2/data/index
   [junit4]   2> 704011 T2544 oasc.SolrDeletionPolicy.onCommit SolrDeletionPolicy.onCommit: commits: num=1
   [junit4]   2> 		commit{dir=MockDirWrapper(org.apache.lucene.store.RAMDirectory@5008387c lockFactory=org.apache.lucene.store.NativeFSLockFactory@7a08334c),segFN=segments_1,generation=1}
   [junit4]   2> 704011 T2544 oasc.SolrDeletionPolicy.updateCommits newest commit generation = 1
   [junit4]   2> 704014 T2577 oass.FileExchangeRateProvider.reload Reloading exchange rates from file currency.xml
   [junit4]   2> 704015 T2544 oasup.UpdateRequestProcessorChain.init inserting DistributedUpdateProcessorFactory into updateRequestProcessorChain "dedupe"
   [junit4]   2> 704015 T2544 oasup.UpdateRequestProcessorChain.init inserting DistributedUpdateProcessorFactory into updateRequestProcessorChain "stored_sig"
   [junit4]   2> 704016 T2544 oasup.UpdateRequestProcessorChain.init inserting DistributedUpdateProcessorFactory into updateRequestProcessorChain "distrib-dup-test-chain-implicit"
   [junit4]   2> 704016 T2544 oasc.RequestHandlers.initHandlersFromConfig created standard: solr.StandardRequestHandler
   [junit4]   2> 704017 T2544 oasc.RequestHandlers.initHandlersFromConfig created /get: solr.RealTimeGetHandler
   [junit4]   2> 704017 T2544 oasc.RequestHandlers.initHandlersFromConfig adding lazy requestHandler: solr.ReplicationHandler
   [junit4]   2> 704018 T2544 oasc.RequestHandlers.initHandlersFromConfig created /replication: solr.ReplicationHandler
   [junit4]   2> 704018 T2544 oasc.RequestHandlers.initHandlersFromConfig created /update: solr.UpdateRequestHandler
   [junit4]   2> 704019 T2544 oasc.RequestHandlers.initHandlersFromConfig created /admin/: org.apache.solr.handler.admin.AdminHandlers
   [junit4]   2> 704019 T2592 oasc.ShardLeaderElectionContext.runLeaderProcess Running the leader process for shard shard2
   [junit4]   2> 704020 T2577 oass.FileExchangeRateProvider.reload Reloading exchange rates from file currency.xml
   [junit4]   2> 704020 T2544 oashl.XMLLoader.init xsltCacheLifetimeSeconds=60
   [junit4]   2> 704023 T2544 oass.SolrIndexSearcher.<init> Opening Searcher@190f51a main
   [junit4]   2> 704024 T2544 oasu.CommitTracker.<init> Hard AutoCommit: disabled
   [junit4]   2> 704024 T2544 oasu.CommitTracker.<init> Soft AutoCommit: disabled
   [junit4]   2> 704025 T2592 oasc.ShardLeaderElectionContext.waitForReplicasToComeUp Waiting until we see more replicas up for shard shard2: total=2 found=1 timeoutin=179999
   [junit4]   2> 704026 T2577 oass.OpenExchangeRatesOrgProvider.reload Reloading exchange rates from open-exchange-rates.json
   [junit4]   2> 704027 T2618 oasc.SolrCore.registerSearcher [nodes_used_collection_shard2_replica2] Registered new searcher Searcher@190f51a main{StandardDirectoryReader(segments_1:1)}
   [junit4]   2> 704028 T2577 oass.OpenExchangeRatesOrgProvider$OpenExchangeRates.<init> WARN Unknown key IMPORTANT NOTE
   [junit4]   2> 704028 T2577 oass.OpenExchangeRatesOrgProvider$OpenExchangeRates.<init> WARN Expected key, got STRING
   [junit4]   2> 704028 T2544 oasc.CoreContainer.registerCore registering core: nodes_used_collection_shard2_replica2
   [junit4]   2> 704029 T2577 oass.OpenExchangeRatesOrgProvider.reload Reloading exchange rates from open-exchange-rates.json
   [junit4]   2> 704029 T2544 oasc.ZkController.register Register replica - core:nodes_used_collection_shard2_replica2 address:http://127.0.0.1:43300/cy/wa collection:nodes_used_collection shard:shard2
   [junit4]   2> 704030 T2544 oascsi.HttpClientUtil.createClient Creating new http client, config:maxConnections=10000&maxConnectionsPerHost=20&connTimeout=15000&socketTimeout=30000&retry=false
   [junit4]   2> 704031 T2551 oascc.ZkStateReader.updateClusterState Updating cloud state from ZooKeeper... 
   [junit4]   2> 704031 T2577 oass.OpenExchangeRatesOrgProvider$OpenExchangeRates.<init> WARN Unknown key IMPORTANT NOTE
   [junit4]   2> 704032 T2577 oass.OpenExchangeRatesOrgProvider$OpenExchangeRates.<init> WARN Expected key, got STRING
   [junit4]   2> 704032 T2577 oasc.SolrCore.initDirectoryFactory org.apache.solr.core.MockDirectoryFactory
   [junit4]   2> 704033 T2577 oasc.SolrCore.<init> [nodes_used_collection_shard1_replica1] Opening new SolrCore at /mnt/ssd/jenkins/workspace/Lucene-Solr-4.x-Linux/solr/build/solr-core/test/J1/./org.apache.solr.cloud.CollectionsAPIDistributedZkTest-jetty2-1375485016704/nodes_used_collection_shard1_replica1/, dataDir=/mnt/ssd/jenkins/workspace/Lucene-Solr-4.x-Linux/solr/build/solr-core/test/J1/./org.apache.solr.cloud.CollectionsAPIDistributedZkTest-jetty2-1375485016704//nodes_used_collection_shard1_replica1/data/
   [junit4]   2> 704033 T2577 oasc.JmxMonitoredMap.<init> JMX monitoring is enabled. Adding Solr mbeans to JMX Server: com.sun.jmx.mbeanserver.JmxMBeanServer@7ec78e02
   [junit4]   2> 704034 T2577 oasc.CachingDirectoryFactory.get return new directory for /mnt/ssd/jenkins/workspace/Lucene-Solr-4.x-Linux/solr/build/solr-core/test/J1/./org.apache.solr.cloud.CollectionsAPIDistributedZkTest-jetty2-1375485016704//nodes_used_collection_shard1_replica1/data
   [junit4]   2> 704043 T2577 oasc.SolrCore.getNewIndexDir New index directory detected: old=null new=/mnt/ssd/jenkins/workspace/Lucene-Solr-4.x-Linux/solr/build/solr-core/test/J1/./org.apache.solr.cloud.CollectionsAPIDistributedZkTest-jetty2-1375485016704//nodes_used_collection_shard1_replica1/data/index/
   [junit4]   2> 704043 T2577 oasc.SolrCore.initIndex WARN [nodes_used_collection_shard1_replica1] Solr index directory '/mnt/ssd/jenkins/workspace/Lucene-Solr-4.x-Linux/solr/build/solr-core/test/J1/./org.apache.solr.cloud.CollectionsAPIDistributedZkTest-jetty2-1375485016704/nodes_used_collection_shard1_replica1/data/index' doesn't exist. Creating new index...
   [junit4]   2> 704044 T2577 oasc.CachingDirectoryFactory.get return new directory for /mnt/ssd/jenkins/workspace/Lucene-Solr-4.x-Linux/solr/build/solr-core/test/J1/./org.apache.solr.cloud.CollectionsAPIDistributedZkTest-jetty2-1375485016704//nodes_used_collection_shard1_replica1/data/index
   [junit4]   2> 704046 T2577 oasc.SolrDeletionPolicy.onCommit SolrDeletionPolicy.onCommit: commits: num=1
   [junit4]   2> 		commit{dir=MockDirWrapper(org.apache.lucene.store.RAMDirectory@2882f357 lockFactory=org.apache.lucene.store.NativeFSLockFactory@44c112d),segFN=segments_1,generation=1}
   [junit4]   2> 704046 T2577 oasc.SolrDeletionPolicy.updateCommits newest commit generation = 1
   [junit4]   2> 704050 T2577 oasup.UpdateRequestProcessorChain.init inserting DistributedUpdateProcessorFactory into updateRequestProcessorChain "dedupe"
   [junit4]   2> 704050 T257

[...truncated too long message...]

junit4]   2> 1044565 T3230 oasc.CachingDirectoryFactory.closeCacheValue looking to close /mnt/ssd/jenkins/workspace/Lucene-Solr-4.x-Linux/solr/build/solr-core/test/J0/./org.apache.solr.handler.TestReplicationHandler$SolrInstance-1375485364542/repeater/collection1/data [CachedDir<<refCount=0;path=/mnt/ssd/jenkins/workspace/Lucene-Solr-4.x-Linux/solr/build/solr-core/test/J0/./org.apache.solr.handler.TestReplicationHandler$SolrInstance-1375485364542/repeater/collection1/data;done=false>>]
   [junit4]   2> 1044566 T3230 oasc.CachingDirectoryFactory.close Closing directory: /mnt/ssd/jenkins/workspace/Lucene-Solr-4.x-Linux/solr/build/solr-core/test/J0/./org.apache.solr.handler.TestReplicationHandler$SolrInstance-1375485364542/repeater/collection1/data
   [junit4]   2> 1044566 T3230 oejsh.ContextHandler.doStop stopped o.e.j.s.ServletContextHandler{/solr,null}
   [junit4]   2> 1044618 T3230 oas.SolrTestCaseJ4.tearDown ###Ending doTestRepeater
   [junit4]   2> 1044639 T3230 oasc.CoreContainer.shutdown Shutting down CoreContainer instance=170967737
   [junit4]   2> 1044639 T3230 oasc.SolrCore.close [collection1]  CLOSING SolrCore org.apache.solr.core.SolrCore@253428ab
   [junit4]   2> 1044640 T3230 oasu.DirectUpdateHandler2.close closing DirectUpdateHandler2{commits=2,autocommits=0,soft autocommits=0,optimizes=0,rollbacks=0,expungeDeletes=0,docsPending=0,adds=0,deletesById=0,deletesByQuery=0,errors=0,cumulative_adds=6,cumulative_deletesById=0,cumulative_deletesByQuery=0,cumulative_errors=0}
   [junit4]   2> 1044641 T3230 oasu.SolrCoreState.decrefSolrCoreState Closing SolrCoreState
   [junit4]   2> 1044641 T3230 oasu.DefaultSolrCoreState.closeIndexWriter SolrCoreState ref count has reached 0 - closing IndexWriter
   [junit4]   2> 1044641 T3230 oasu.DefaultSolrCoreState.closeIndexWriter closing IndexWriter with IndexWriterCloser
   [junit4]   2> 1044642 T3230 oasc.SolrCore.closeSearcher [collection1] Closing main searcher on request.
   [junit4]   2> 1044643 T3230 oasc.CachingDirectoryFactory.close Closing MockDirectoryFactory - 2 directories currently being tracked
   [junit4]   2> 1044643 T3230 oasc.CachingDirectoryFactory.closeCacheValue looking to close /mnt/ssd/jenkins/workspace/Lucene-Solr-4.x-Linux/solr/build/solr-core/test/J0/./org.apache.solr.handler.TestReplicationHandler$SolrInstance-1375485364022/master/collection1/data [CachedDir<<refCount=0;path=/mnt/ssd/jenkins/workspace/Lucene-Solr-4.x-Linux/solr/build/solr-core/test/J0/./org.apache.solr.handler.TestReplicationHandler$SolrInstance-1375485364022/master/collection1/data;done=false>>]
   [junit4]   2> 1044643 T3230 oasc.CachingDirectoryFactory.close Closing directory: /mnt/ssd/jenkins/workspace/Lucene-Solr-4.x-Linux/solr/build/solr-core/test/J0/./org.apache.solr.handler.TestReplicationHandler$SolrInstance-1375485364022/master/collection1/data
   [junit4]   2> 1044644 T3230 oasc.CachingDirectoryFactory.closeCacheValue looking to close /mnt/ssd/jenkins/workspace/Lucene-Solr-4.x-Linux/solr/build/solr-core/test/J0/./org.apache.solr.handler.TestReplicationHandler$SolrInstance-1375485364022/master/collection1/data/index [CachedDir<<refCount=0;path=/mnt/ssd/jenkins/workspace/Lucene-Solr-4.x-Linux/solr/build/solr-core/test/J0/./org.apache.solr.handler.TestReplicationHandler$SolrInstance-1375485364022/master/collection1/data/index;done=false>>]
   [junit4]   2> 1044644 T3230 oasc.CachingDirectoryFactory.close Closing directory: /mnt/ssd/jenkins/workspace/Lucene-Solr-4.x-Linux/solr/build/solr-core/test/J0/./org.apache.solr.handler.TestReplicationHandler$SolrInstance-1375485364022/master/collection1/data/index
   [junit4]   2> 1044644 T3230 oejsh.ContextHandler.doStop stopped o.e.j.s.ServletContextHandler{/solr,null}
   [junit4]   2> 1044717 T3230 oasc.CoreContainer.shutdown Shutting down CoreContainer instance=319961884
   [junit4]   2> 1044717 T3230 oasc.SolrCore.close [collection1]  CLOSING SolrCore org.apache.solr.core.SolrCore@9431b98
   [junit4]   2> 1044718 T3230 oasu.DirectUpdateHandler2.close closing DirectUpdateHandler2{commits=0,autocommits=0,soft autocommits=0,optimizes=0,rollbacks=0,expungeDeletes=0,docsPending=0,adds=0,deletesById=0,deletesByQuery=0,errors=0,cumulative_adds=0,cumulative_deletesById=0,cumulative_deletesByQuery=0,cumulative_errors=0}
   [junit4]   2> 1044718 T3230 oasu.SolrCoreState.decrefSolrCoreState Closing SolrCoreState
   [junit4]   2> 1044719 T3230 oasu.DefaultSolrCoreState.closeIndexWriter SolrCoreState ref count has reached 0 - closing IndexWriter
   [junit4]   2> 1044719 T3230 oasu.DefaultSolrCoreState.closeIndexWriter closing IndexWriter with IndexWriterCloser
   [junit4]   2> 1044720 T3230 oasc.SolrCore.closeSearcher [collection1] Closing main searcher on request.
   [junit4]   2> 1044720 T3230 oasc.CachingDirectoryFactory.close Closing MockDirectoryFactory - 2 directories currently being tracked
   [junit4]   2> 1044721 T3230 oasc.CachingDirectoryFactory.closeCacheValue looking to close /mnt/ssd/jenkins/workspace/Lucene-Solr-4.x-Linux/solr/build/solr-core/test/J0/./org.apache.solr.handler.TestReplicationHandler$SolrInstance-1375485364182/slave/collection1/data/index [CachedDir<<refCount=0;path=/mnt/ssd/jenkins/workspace/Lucene-Solr-4.x-Linux/solr/build/solr-core/test/J0/./org.apache.solr.handler.TestReplicationHandler$SolrInstance-1375485364182/slave/collection1/data/index;done=false>>]
   [junit4]   2> 1044721 T3230 oasc.CachingDirectoryFactory.close Closing directory: /mnt/ssd/jenkins/workspace/Lucene-Solr-4.x-Linux/solr/build/solr-core/test/J0/./org.apache.solr.handler.TestReplicationHandler$SolrInstance-1375485364182/slave/collection1/data/index
   [junit4]   2> 1044721 T3230 oasc.CachingDirectoryFactory.closeCacheValue looking to close /mnt/ssd/jenkins/workspace/Lucene-Solr-4.x-Linux/solr/build/solr-core/test/J0/./org.apache.solr.handler.TestReplicationHandler$SolrInstance-1375485364182/slave/collection1/data [CachedDir<<refCount=0;path=/mnt/ssd/jenkins/workspace/Lucene-Solr-4.x-Linux/solr/build/solr-core/test/J0/./org.apache.solr.handler.TestReplicationHandler$SolrInstance-1375485364182/slave/collection1/data;done=false>>]
   [junit4]   2> 1044722 T3230 oasc.CachingDirectoryFactory.close Closing directory: /mnt/ssd/jenkins/workspace/Lucene-Solr-4.x-Linux/solr/build/solr-core/test/J0/./org.apache.solr.handler.TestReplicationHandler$SolrInstance-1375485364182/slave/collection1/data
   [junit4]   2> 1044722 T3230 oejsh.ContextHandler.doStop stopped o.e.j.s.ServletContextHandler{/solr,null}
   [junit4]   2> 1044777 T3230 oas.SolrTestCaseJ4.deleteCore ###deleteCore
   [junit4]   2> NOTE: test params are: codec=Lucene40, sim=DefaultSimilarity, locale=tr_TR, timezone=America/Argentina/Tucuman
   [junit4]   2> NOTE: Linux 3.2.0-51-generic amd64/Sun Microsystems Inc. 1.6.0_45 (64-bit)/cpus=8,threads=1,free=85895968,total=192897024
   [junit4]   2> NOTE: All tests run in this JVM: [PreAnalyzedFieldTest, DocValuesTest, HdfsUnloadDistributedZkTest, BasicFunctionalityTest, CachingDirectoryFactoryTest, TestSchemaNameResource, SOLR749Test, BadComponentTest, MBeansHandlerTest, SolrInfoMBeanTest, TestSolrXmlPersistence, BinaryUpdateRequestHandlerTest, SimpleFacetsTest, TestRandomDVFaceting, TestSolrQueryParser, UpdateRequestProcessorFactoryTest, TestQueryUtils, QueryParsingTest, TestSearchPerf, SynonymTokenizerTest, IndexSchemaTest, TestRealTimeGet, TermVectorComponentTest, PrimitiveFieldTypeTest, SoftAutoCommitTest, DistributedTermsComponentTest, ZkControllerTest, UnloadDistributedZkTest, TestPseudoReturnFields, PolyFieldTest, OverseerTest, TestDefaultSearchFieldResource, CircularListTest, DistributedQueryElevationComponentTest, TestRemoteStreaming, TestDynamicFieldCollectionResource, SyncSliceTest, AlternateDirectoryTest, TestSolrQueryParserResource, TestFieldTypeResource, TestLMDirichletSimilarityFactory, TestSolrXml, DistributedSpellCheckComponentTest, TestDocumentBuilder, FastVectorHighlighterTest, TestBadConfig, PeerSyncTest, TestGroupingSearch, ScriptEngineTest, TestReversedWildcardFilterFactory, TestSweetSpotSimilarityFactory, CSVRequestHandlerTest, ResponseLogComponentTest, TestFastLRUCache, LeaderElectionTest, ShowFileRequestHandlerTest, TestIBSimilarityFactory, ShardRoutingTest, RegexBoostProcessorTest, DirectSolrConnectionTest, ZkCLITest, FieldMutatingUpdateProcessorTest, UUIDFieldTest, StressHdfsTest, ReturnFieldsTest, TestStressVersions, RecoveryZkTest, TestPhraseSuggestions, TestFuzzyAnalyzedSuggestions, DirectUpdateHandlerOptimizeTest, TestPropInjectDefaults, HdfsChaosMonkeySafeLeaderTest, DateFieldTest, TestCoreContainer, TestExtendedDismaxParser, SuggesterTest, AliasIntegrationTest, BasicDistributedZkTest, TestReplicationHandler]
   [junit4] Completed on J0 in 63.68s, 14 tests, 1 failure <<< FAILURES!

[...truncated 472 lines...]
BUILD FAILED
/mnt/ssd/jenkins/workspace/Lucene-Solr-4.x-Linux/build.xml:395: The following error occurred while executing this line:
/mnt/ssd/jenkins/workspace/Lucene-Solr-4.x-Linux/build.xml:375: The following error occurred while executing this line:
/mnt/ssd/jenkins/workspace/Lucene-Solr-4.x-Linux/build.xml:39: The following error occurred while executing this line:
/mnt/ssd/jenkins/workspace/Lucene-Solr-4.x-Linux/solr/build.xml:181: The following error occurred while executing this line:
/mnt/ssd/jenkins/workspace/Lucene-Solr-4.x-Linux/solr/common-build.xml:449: The following error occurred while executing this line:
/mnt/ssd/jenkins/workspace/Lucene-Solr-4.x-Linux/lucene/common-build.xml:1233: The following error occurred while executing this line:
/mnt/ssd/jenkins/workspace/Lucene-Solr-4.x-Linux/lucene/common-build.xml:876: There were test failures: 321 suites, 1352 tests, 1 error, 1 failure, 34 ignored (6 assumptions)

Total time: 41 minutes 16 seconds
Build step 'Invoke Ant' marked build as failure
Description set: Java: 64bit/jdk1.6.0_45 -XX:-UseCompressedOops -XX:+UseSerialGC
Archiving artifacts
Recording test results
Email was triggered for: Failure
Sending email for trigger: Failure



Mime
View raw message