lucene-dev mailing list archives

Site index · List index
Message view « Date » · « Thread »
Top « Date » · « Thread »
From Apache Jenkins Server <jenk...@builds.apache.org>
Subject [JENKINS] Lucene-Solr-Tests-4.x-Java7 - Build # 1476 - Still Failing
Date Sat, 03 Aug 2013 14:25:17 GMT
Build: https://builds.apache.org/job/Lucene-Solr-Tests-4.x-Java7/1476/

1 tests failed.
FAILED:  org.apache.solr.cloud.CollectionsAPIDistributedZkTest.testDistribSearch

Error Message:
IOException occured when talking to server at: http://127.0.0.1:11505

Stack Trace:
org.apache.solr.client.solrj.SolrServerException: IOException occured when talking to server at: http://127.0.0.1:11505
	at __randomizedtesting.SeedInfo.seed([C707DA29C275A80C:46E15431B52AC830]:0)
	at org.apache.solr.client.solrj.impl.HttpSolrServer.request(HttpSolrServer.java:435)
	at org.apache.solr.client.solrj.impl.HttpSolrServer.request(HttpSolrServer.java:180)
	at org.apache.solr.cloud.AbstractFullDistribZkTestBase.createCollection(AbstractFullDistribZkTestBase.java:1535)
	at org.apache.solr.cloud.CollectionsAPIDistributedZkTest.testCustomCollectionsAPI(CollectionsAPIDistributedZkTest.java:677)
	at org.apache.solr.cloud.CollectionsAPIDistributedZkTest.doTest(CollectionsAPIDistributedZkTest.java:159)
	at org.apache.solr.BaseDistributedSearchTestCase.testDistribSearch(BaseDistributedSearchTestCase.java:835)
	at sun.reflect.NativeMethodAccessorImpl.invoke0(Native Method)
	at sun.reflect.NativeMethodAccessorImpl.invoke(NativeMethodAccessorImpl.java:57)
	at sun.reflect.DelegatingMethodAccessorImpl.invoke(DelegatingMethodAccessorImpl.java:43)
	at java.lang.reflect.Method.invoke(Method.java:606)
	at com.carrotsearch.randomizedtesting.RandomizedRunner.invoke(RandomizedRunner.java:1559)
	at com.carrotsearch.randomizedtesting.RandomizedRunner.access$600(RandomizedRunner.java:79)
	at com.carrotsearch.randomizedtesting.RandomizedRunner$6.evaluate(RandomizedRunner.java:737)
	at com.carrotsearch.randomizedtesting.RandomizedRunner$7.evaluate(RandomizedRunner.java:773)
	at com.carrotsearch.randomizedtesting.RandomizedRunner$8.evaluate(RandomizedRunner.java:787)
	at com.carrotsearch.randomizedtesting.rules.SystemPropertiesRestoreRule$1.evaluate(SystemPropertiesRestoreRule.java:53)
	at org.apache.lucene.util.TestRuleSetupTeardownChained$1.evaluate(TestRuleSetupTeardownChained.java:50)
	at org.apache.lucene.util.TestRuleFieldCacheSanity$1.evaluate(TestRuleFieldCacheSanity.java:51)
	at org.apache.lucene.util.AbstractBeforeAfterRule$1.evaluate(AbstractBeforeAfterRule.java:46)
	at com.carrotsearch.randomizedtesting.rules.SystemPropertiesInvariantRule$1.evaluate(SystemPropertiesInvariantRule.java:55)
	at org.apache.lucene.util.TestRuleThreadAndTestName$1.evaluate(TestRuleThreadAndTestName.java:49)
	at org.apache.lucene.util.TestRuleIgnoreAfterMaxFailures$1.evaluate(TestRuleIgnoreAfterMaxFailures.java:70)
	at org.apache.lucene.util.TestRuleMarkFailure$1.evaluate(TestRuleMarkFailure.java:48)
	at com.carrotsearch.randomizedtesting.rules.StatementAdapter.evaluate(StatementAdapter.java:36)
	at com.carrotsearch.randomizedtesting.ThreadLeakControl$StatementRunner.run(ThreadLeakControl.java:358)
	at com.carrotsearch.randomizedtesting.ThreadLeakControl.forkTimeoutingTask(ThreadLeakControl.java:782)
	at com.carrotsearch.randomizedtesting.ThreadLeakControl$3.evaluate(ThreadLeakControl.java:442)
	at com.carrotsearch.randomizedtesting.RandomizedRunner.runSingleTest(RandomizedRunner.java:746)
	at com.carrotsearch.randomizedtesting.RandomizedRunner$3.evaluate(RandomizedRunner.java:648)
	at com.carrotsearch.randomizedtesting.RandomizedRunner$4.evaluate(RandomizedRunner.java:682)
	at com.carrotsearch.randomizedtesting.RandomizedRunner$5.evaluate(RandomizedRunner.java:693)
	at com.carrotsearch.randomizedtesting.rules.StatementAdapter.evaluate(StatementAdapter.java:36)
	at com.carrotsearch.randomizedtesting.rules.SystemPropertiesRestoreRule$1.evaluate(SystemPropertiesRestoreRule.java:53)
	at org.apache.lucene.util.AbstractBeforeAfterRule$1.evaluate(AbstractBeforeAfterRule.java:46)
	at org.apache.lucene.util.TestRuleStoreClassName$1.evaluate(TestRuleStoreClassName.java:42)
	at com.carrotsearch.randomizedtesting.rules.SystemPropertiesInvariantRule$1.evaluate(SystemPropertiesInvariantRule.java:55)
	at com.carrotsearch.randomizedtesting.rules.NoShadowingOrOverridesOnMethodsRule$1.evaluate(NoShadowingOrOverridesOnMethodsRule.java:39)
	at com.carrotsearch.randomizedtesting.rules.NoShadowingOrOverridesOnMethodsRule$1.evaluate(NoShadowingOrOverridesOnMethodsRule.java:39)
	at com.carrotsearch.randomizedtesting.rules.StatementAdapter.evaluate(StatementAdapter.java:36)
	at org.apache.lucene.util.TestRuleAssertionsRequired$1.evaluate(TestRuleAssertionsRequired.java:43)
	at org.apache.lucene.util.TestRuleMarkFailure$1.evaluate(TestRuleMarkFailure.java:48)
	at org.apache.lucene.util.TestRuleIgnoreAfterMaxFailures$1.evaluate(TestRuleIgnoreAfterMaxFailures.java:70)
	at org.apache.lucene.util.TestRuleIgnoreTestSuites$1.evaluate(TestRuleIgnoreTestSuites.java:55)
	at com.carrotsearch.randomizedtesting.rules.StatementAdapter.evaluate(StatementAdapter.java:36)
	at com.carrotsearch.randomizedtesting.ThreadLeakControl$StatementRunner.run(ThreadLeakControl.java:358)
	at java.lang.Thread.run(Thread.java:724)
Caused by: org.apache.http.conn.ConnectTimeoutException: Connect to 127.0.0.1:11505 timed out
	at org.apache.http.conn.scheme.PlainSocketFactory.connectSocket(PlainSocketFactory.java:129)
	at org.apache.http.impl.conn.DefaultClientConnectionOperator.openConnection(DefaultClientConnectionOperator.java:180)
	at org.apache.http.impl.conn.ManagedClientConnectionImpl.open(ManagedClientConnectionImpl.java:294)
	at org.apache.http.impl.client.DefaultRequestDirector.tryConnect(DefaultRequestDirector.java:645)
	at org.apache.http.impl.client.DefaultRequestDirector.execute(DefaultRequestDirector.java:480)
	at org.apache.http.impl.client.AbstractHttpClient.execute(AbstractHttpClient.java:906)
	at org.apache.http.impl.client.AbstractHttpClient.execute(AbstractHttpClient.java:805)
	at org.apache.http.impl.client.AbstractHttpClient.execute(AbstractHttpClient.java:784)
	at org.apache.solr.client.solrj.impl.HttpSolrServer.request(HttpSolrServer.java:365)
	... 45 more




Build Log:
[...truncated 9793 lines...]
   [junit4] Suite: org.apache.solr.cloud.CollectionsAPIDistributedZkTest
   [junit4]   2> 1221737 T2357 oas.BaseDistributedSearchTestCase.initHostContext Setting hostContext system property: /
   [junit4]   2> 1221743 T2357 oas.SolrTestCaseJ4.setUp ###Starting testDistribSearch
   [junit4]   2> Creating dataDir: /usr/home/hudson/hudson-slave/workspace/Lucene-Solr-Tests-4.x-Java7/solr/build/solr-core/test/J0/./solrtest-CollectionsAPIDistributedZkTest-1375539176583
   [junit4]   2> 1221745 T2357 oasc.ZkTestServer.run STARTING ZK TEST SERVER
   [junit4]   2> 1221745 T2358 oasc.ZkTestServer$ZKServerMain.runFromConfig Starting server
   [junit4]   2> 1221846 T2357 oasc.ZkTestServer.run start zk server on port:17478
   [junit4]   2> 1221847 T2357 oascc.ConnectionManager.waitForConnected Waiting for client to connect to ZooKeeper
   [junit4]   2> 1221932 T2364 oascc.ConnectionManager.process Watcher org.apache.solr.common.cloud.ConnectionManager@19756e13 name:ZooKeeperConnection Watcher:127.0.0.1:17478 got event WatchedEvent state:SyncConnected type:None path:null path:null type:None
   [junit4]   2> 1221932 T2357 oascc.ConnectionManager.waitForConnected Client is connected to ZooKeeper
   [junit4]   2> 1221933 T2357 oascc.SolrZkClient.makePath makePath: /solr
   [junit4]   2> 1221970 T2357 oascc.ConnectionManager.waitForConnected Waiting for client to connect to ZooKeeper
   [junit4]   2> 1221997 T2366 oascc.ConnectionManager.process Watcher org.apache.solr.common.cloud.ConnectionManager@2bbac007 name:ZooKeeperConnection Watcher:127.0.0.1:17478/solr got event WatchedEvent state:SyncConnected type:None path:null path:null type:None
   [junit4]   2> 1221998 T2357 oascc.ConnectionManager.waitForConnected Client is connected to ZooKeeper
   [junit4]   2> 1221998 T2357 oascc.SolrZkClient.makePath makePath: /collections/collection1
   [junit4]   2> 1222050 T2357 oascc.SolrZkClient.makePath makePath: /collections/collection1/shards
   [junit4]   2> 1222053 T2357 oascc.SolrZkClient.makePath makePath: /collections/control_collection
   [junit4]   2> 1222056 T2357 oascc.SolrZkClient.makePath makePath: /collections/control_collection/shards
   [junit4]   2> 1222088 T2357 oasc.AbstractZkTestCase.putConfig put /usr/home/hudson/hudson-slave/workspace/Lucene-Solr-Tests-4.x-Java7/solr/build/solr-core/test-files/solr/collection1/conf/solrconfig-tlog.xml to /configs/conf1/solrconfig.xml
   [junit4]   2> 1222089 T2357 oascc.SolrZkClient.makePath makePath: /configs/conf1/solrconfig.xml
   [junit4]   2> 1222100 T2357 oasc.AbstractZkTestCase.putConfig put /usr/home/hudson/hudson-slave/workspace/Lucene-Solr-Tests-4.x-Java7/solr/build/solr-core/test-files/solr/collection1/conf/schema.xml to /configs/conf1/schema.xml
   [junit4]   2> 1222101 T2357 oascc.SolrZkClient.makePath makePath: /configs/conf1/schema.xml
   [junit4]   2> 1222207 T2357 oasc.AbstractZkTestCase.putConfig put /usr/home/hudson/hudson-slave/workspace/Lucene-Solr-Tests-4.x-Java7/solr/build/solr-core/test-files/solr/collection1/conf/stopwords.txt to /configs/conf1/stopwords.txt
   [junit4]   2> 1222208 T2357 oascc.SolrZkClient.makePath makePath: /configs/conf1/stopwords.txt
   [junit4]   2> 1222211 T2357 oasc.AbstractZkTestCase.putConfig put /usr/home/hudson/hudson-slave/workspace/Lucene-Solr-Tests-4.x-Java7/solr/build/solr-core/test-files/solr/collection1/conf/protwords.txt to /configs/conf1/protwords.txt
   [junit4]   2> 1222212 T2357 oascc.SolrZkClient.makePath makePath: /configs/conf1/protwords.txt
   [junit4]   2> 1222224 T2357 oasc.AbstractZkTestCase.putConfig put /usr/home/hudson/hudson-slave/workspace/Lucene-Solr-Tests-4.x-Java7/solr/build/solr-core/test-files/solr/collection1/conf/currency.xml to /configs/conf1/currency.xml
   [junit4]   2> 1222225 T2357 oascc.SolrZkClient.makePath makePath: /configs/conf1/currency.xml
   [junit4]   2> 1222228 T2357 oasc.AbstractZkTestCase.putConfig put /usr/home/hudson/hudson-slave/workspace/Lucene-Solr-Tests-4.x-Java7/solr/build/solr-core/test-files/solr/collection1/conf/open-exchange-rates.json to /configs/conf1/open-exchange-rates.json
   [junit4]   2> 1222229 T2357 oascc.SolrZkClient.makePath makePath: /configs/conf1/open-exchange-rates.json
   [junit4]   2> 1222232 T2357 oasc.AbstractZkTestCase.putConfig put /usr/home/hudson/hudson-slave/workspace/Lucene-Solr-Tests-4.x-Java7/solr/build/solr-core/test-files/solr/collection1/conf/mapping-ISOLatin1Accent.txt to /configs/conf1/mapping-ISOLatin1Accent.txt
   [junit4]   2> 1222233 T2357 oascc.SolrZkClient.makePath makePath: /configs/conf1/mapping-ISOLatin1Accent.txt
   [junit4]   2> 1222238 T2357 oasc.AbstractZkTestCase.putConfig put /usr/home/hudson/hudson-slave/workspace/Lucene-Solr-Tests-4.x-Java7/solr/build/solr-core/test-files/solr/collection1/conf/old_synonyms.txt to /configs/conf1/old_synonyms.txt
   [junit4]   2> 1222239 T2357 oascc.SolrZkClient.makePath makePath: /configs/conf1/old_synonyms.txt
   [junit4]   2> 1222242 T2357 oasc.AbstractZkTestCase.putConfig put /usr/home/hudson/hudson-slave/workspace/Lucene-Solr-Tests-4.x-Java7/solr/build/solr-core/test-files/solr/collection1/conf/synonyms.txt to /configs/conf1/synonyms.txt
   [junit4]   2> 1222243 T2357 oascc.SolrZkClient.makePath makePath: /configs/conf1/synonyms.txt
   [junit4]   2> 1222559 T2357 oejs.Server.doStart jetty-8.1.10.v20130312
   [junit4]   2> 1222562 T2357 oejs.AbstractConnector.doStart Started SocketConnector@127.0.0.1:22902
   [junit4]   2> 1222563 T2357 oass.SolrDispatchFilter.init SolrDispatchFilter.init()
   [junit4]   2> 1222564 T2357 oasc.SolrResourceLoader.locateSolrHome JNDI not configured for solr (NoInitialContextEx)
   [junit4]   2> 1222564 T2357 oasc.SolrResourceLoader.locateSolrHome using system property solr.solr.home: /usr/home/hudson/hudson-slave/workspace/Lucene-Solr-Tests-4.x-Java7/solr/build/solr-core/test/J0/./org.apache.solr.cloud.CollectionsAPIDistributedZkTest-controljetty-1375539177092
   [junit4]   2> 1222564 T2357 oasc.SolrResourceLoader.<init> new SolrResourceLoader for directory: '/usr/home/hudson/hudson-slave/workspace/Lucene-Solr-Tests-4.x-Java7/solr/build/solr-core/test/J0/./org.apache.solr.cloud.CollectionsAPIDistributedZkTest-controljetty-1375539177092/'
   [junit4]   2> 1222608 T2357 oasc.ConfigSolr.fromFile Loading container configuration from /usr/home/hudson/hudson-slave/workspace/Lucene-Solr-Tests-4.x-Java7/solr/build/solr-core/test/J0/./org.apache.solr.cloud.CollectionsAPIDistributedZkTest-controljetty-1375539177092/solr.xml
   [junit4]   2> 1222710 T2357 oasc.ConfigSolrXml.<init> Config-defined core root directory: 
   [junit4]   2> 1222711 T2357 oasc.CoreContainer.<init> New CoreContainer 638257660
   [junit4]   2> 1222711 T2357 oasc.CoreContainer.load Loading cores into CoreContainer [instanceDir=/usr/home/hudson/hudson-slave/workspace/Lucene-Solr-Tests-4.x-Java7/solr/build/solr-core/test/J0/./org.apache.solr.cloud.CollectionsAPIDistributedZkTest-controljetty-1375539177092/]
   [junit4]   2> 1222713 T2357 oashc.HttpShardHandlerFactory.getParameter Setting socketTimeout to: 120000
   [junit4]   2> 1222714 T2357 oashc.HttpShardHandlerFactory.getParameter Setting urlScheme to: http://
   [junit4]   2> 1222714 T2357 oashc.HttpShardHandlerFactory.getParameter Setting connTimeout to: 15000
   [junit4]   2> 1222715 T2357 oashc.HttpShardHandlerFactory.getParameter Setting maxConnectionsPerHost to: 20
   [junit4]   2> 1222715 T2357 oashc.HttpShardHandlerFactory.getParameter Setting corePoolSize to: 0
   [junit4]   2> 1222716 T2357 oashc.HttpShardHandlerFactory.getParameter Setting maximumPoolSize to: 2147483647
   [junit4]   2> 1222716 T2357 oashc.HttpShardHandlerFactory.getParameter Setting maxThreadIdleTime to: 5
   [junit4]   2> 1222717 T2357 oashc.HttpShardHandlerFactory.getParameter Setting sizeOfQueue to: -1
   [junit4]   2> 1222717 T2357 oashc.HttpShardHandlerFactory.getParameter Setting fairnessPolicy to: false
   [junit4]   2> 1222718 T2357 oascsi.HttpClientUtil.createClient Creating new http client, config:maxConnectionsPerHost=20&maxConnections=10000&socketTimeout=120000&connTimeout=15000&retry=false
   [junit4]   2> 1222736 T2357 oasc.ZkContainer.initZooKeeper Zookeeper client=127.0.0.1:17478/solr
   [junit4]   2> 1222737 T2357 oasc.ZkController.checkChrootPath zkHost includes chroot
   [junit4]   2> 1222738 T2357 oascc.ConnectionManager.waitForConnected Waiting for client to connect to ZooKeeper
   [junit4]   2> 1222741 T2377 oascc.ConnectionManager.process Watcher org.apache.solr.common.cloud.ConnectionManager@69f3a540 name:ZooKeeperConnection Watcher:127.0.0.1:17478 got event WatchedEvent state:SyncConnected type:None path:null path:null type:None
   [junit4]   2> 1222741 T2357 oascc.ConnectionManager.waitForConnected Client is connected to ZooKeeper
   [junit4]   2> 1222760 T2357 oascsi.HttpClientUtil.createClient Creating new http client, config:maxConnections=500&maxConnectionsPerHost=16&socketTimeout=120000&connTimeout=15000
   [junit4]   2> 1222773 T2357 oascc.ConnectionManager.waitForConnected Waiting for client to connect to ZooKeeper
   [junit4]   2> 1222775 T2379 oascc.ConnectionManager.process Watcher org.apache.solr.common.cloud.ConnectionManager@7327ae39 name:ZooKeeperConnection Watcher:127.0.0.1:17478/solr got event WatchedEvent state:SyncConnected type:None path:null path:null type:None
   [junit4]   2> 1222775 T2357 oascc.ConnectionManager.waitForConnected Client is connected to ZooKeeper
   [junit4]   2> 1222778 T2357 oascc.SolrZkClient.makePath makePath: /overseer/queue
   [junit4]   2> 1222786 T2357 oascc.SolrZkClient.makePath makePath: /overseer/collection-queue-work
   [junit4]   2> 1222790 T2357 oascc.SolrZkClient.makePath makePath: /live_nodes
   [junit4]   2> 1222797 T2357 oasc.ZkController.createEphemeralLiveNode Register node as live in ZooKeeper:/live_nodes/127.0.0.1:22902_
   [junit4]   2> 1222798 T2357 oascc.SolrZkClient.makePath makePath: /live_nodes/127.0.0.1:22902_
   [junit4]   2> 1222806 T2357 oascc.SolrZkClient.makePath makePath: /overseer_elect/election
   [junit4]   2> 1222820 T2357 oascc.SolrZkClient.makePath makePath: /overseer_elect/leader
   [junit4]   2> 1222823 T2357 oasc.Overseer.start Overseer (id=90147335477067779-127.0.0.1:22902_-n_0000000000) starting
   [junit4]   2> 1222836 T2357 oascc.SolrZkClient.makePath makePath: /overseer/queue-work
   [junit4]   2> 1222845 T2381 oasc.OverseerCollectionProcessor.run Process current queue of collection creations
   [junit4]   2> 1222846 T2357 oascc.SolrZkClient.makePath makePath: /clusterstate.json
   [junit4]   2> 1222848 T2357 oascc.SolrZkClient.makePath makePath: /aliases.json
   [junit4]   2> 1222856 T2357 oascc.ZkStateReader.createClusterStateWatchersAndUpdate Updating cluster state from ZooKeeper... 
   [junit4]   2> 1222858 T2380 oasc.Overseer$ClusterStateUpdater.run Starting to work on the main queue
   [junit4]   2> 1222862 T2357 oasc.CorePropertiesLocator.discover Looking for core definitions underneath /usr/home/hudson/hudson-slave/workspace/Lucene-Solr-Tests-4.x-Java7/solr/build/solr-core/test/J0/./org.apache.solr.cloud.CollectionsAPIDistributedZkTest-controljetty-1375539177092
   [junit4]   2> 1222866 T2357 oasc.CorePropertiesLocator.discoverUnder Found core conf in /usr/home/hudson/hudson-slave/workspace/Lucene-Solr-Tests-4.x-Java7/solr/build/solr-core/test/J0/./org.apache.solr.cloud.CollectionsAPIDistributedZkTest-controljetty-1375539177092/conf/
   [junit4]   2> 1223063 T2357 oasc.CorePropertiesLocator.discover Found 1 core definitions
   [junit4]   2> 1223064 T2357 oass.SolrDispatchFilter.init user.dir=/usr/home/hudson/hudson-slave/workspace/Lucene-Solr-Tests-4.x-Java7/solr/build/solr-core/test/J0
   [junit4]   2> 1223065 T2357 oass.SolrDispatchFilter.init SolrDispatchFilter.init() done
   [junit4]   2> 1223065 T2357 oascsi.HttpClientUtil.createClient Creating new http client, config:maxConnections=128&maxConnectionsPerHost=32&followRedirects=false
   [junit4]   2> 1223083 T2357 oascsi.HttpClientUtil.createClient Creating new http client, config:
   [junit4]   2> 1223085 T2357 oascc.ConnectionManager.waitForConnected Waiting for client to connect to ZooKeeper
   [junit4]   2> 1223087 T2384 oascc.ConnectionManager.process Watcher org.apache.solr.common.cloud.ConnectionManager@2fd4a34c name:ZooKeeperConnection Watcher:127.0.0.1:17478/solr got event WatchedEvent state:SyncConnected type:None path:null path:null type:None
   [junit4]   2> 1223087 T2357 oascc.ConnectionManager.waitForConnected Client is connected to ZooKeeper
   [junit4]   2> 1223089 T2357 oascc.ZkStateReader.createClusterStateWatchersAndUpdate Updating cluster state from ZooKeeper... 
   [junit4]   2> 1223091 T2357 oasc.ChaosMonkey.monkeyLog monkey: init - expire sessions:true cause connection loss:true
   [junit4]   2> 1223376 T2357 oejs.Server.doStart jetty-8.1.10.v20130312
   [junit4]   2> 1223379 T2357 oejs.AbstractConnector.doStart Started SocketConnector@127.0.0.1:11505
   [junit4]   2> 1223380 T2357 oass.SolrDispatchFilter.init SolrDispatchFilter.init()
   [junit4]   2> 1223380 T2357 oasc.SolrResourceLoader.locateSolrHome JNDI not configured for solr (NoInitialContextEx)
   [junit4]   2> 1223381 T2357 oasc.SolrResourceLoader.locateSolrHome using system property solr.solr.home: /usr/home/hudson/hudson-slave/workspace/Lucene-Solr-Tests-4.x-Java7/solr/build/solr-core/test/J0/./org.apache.solr.cloud.CollectionsAPIDistributedZkTest-jetty1-1375539177931
   [junit4]   2> 1223381 T2357 oasc.SolrResourceLoader.<init> new SolrResourceLoader for directory: '/usr/home/hudson/hudson-slave/workspace/Lucene-Solr-Tests-4.x-Java7/solr/build/solr-core/test/J0/./org.apache.solr.cloud.CollectionsAPIDistributedZkTest-jetty1-1375539177931/'
   [junit4]   2> 1223428 T2357 oasc.ConfigSolr.fromFile Loading container configuration from /usr/home/hudson/hudson-slave/workspace/Lucene-Solr-Tests-4.x-Java7/solr/build/solr-core/test/J0/./org.apache.solr.cloud.CollectionsAPIDistributedZkTest-jetty1-1375539177931/solr.xml
   [junit4]   2> 1223518 T2357 oasc.ConfigSolrXml.<init> Config-defined core root directory: 
   [junit4]   2> 1223519 T2357 oasc.CoreContainer.<init> New CoreContainer 263958195
   [junit4]   2> 1223519 T2357 oasc.CoreContainer.load Loading cores into CoreContainer [instanceDir=/usr/home/hudson/hudson-slave/workspace/Lucene-Solr-Tests-4.x-Java7/solr/build/solr-core/test/J0/./org.apache.solr.cloud.CollectionsAPIDistributedZkTest-jetty1-1375539177931/]
   [junit4]   2> 1223520 T2357 oashc.HttpShardHandlerFactory.getParameter Setting socketTimeout to: 120000
   [junit4]   2> 1223520 T2357 oashc.HttpShardHandlerFactory.getParameter Setting urlScheme to: http://
   [junit4]   2> 1223521 T2357 oashc.HttpShardHandlerFactory.getParameter Setting connTimeout to: 15000
   [junit4]   2> 1223521 T2357 oashc.HttpShardHandlerFactory.getParameter Setting maxConnectionsPerHost to: 20
   [junit4]   2> 1223521 T2357 oashc.HttpShardHandlerFactory.getParameter Setting corePoolSize to: 0
   [junit4]   2> 1223522 T2357 oashc.HttpShardHandlerFactory.getParameter Setting maximumPoolSize to: 2147483647
   [junit4]   2> 1223522 T2357 oashc.HttpShardHandlerFactory.getParameter Setting maxThreadIdleTime to: 5
   [junit4]   2> 1223522 T2357 oashc.HttpShardHandlerFactory.getParameter Setting sizeOfQueue to: -1
   [junit4]   2> 1223522 T2357 oashc.HttpShardHandlerFactory.getParameter Setting fairnessPolicy to: false
   [junit4]   2> 1223523 T2357 oascsi.HttpClientUtil.createClient Creating new http client, config:maxConnectionsPerHost=20&maxConnections=10000&socketTimeout=120000&connTimeout=15000&retry=false
   [junit4]   2> 1223535 T2357 oasc.ZkContainer.initZooKeeper Zookeeper client=127.0.0.1:17478/solr
   [junit4]   2> 1223535 T2357 oasc.ZkController.checkChrootPath zkHost includes chroot
   [junit4]   2> 1223536 T2357 oascc.ConnectionManager.waitForConnected Waiting for client to connect to ZooKeeper
   [junit4]   2> 1223538 T2395 oascc.ConnectionManager.process Watcher org.apache.solr.common.cloud.ConnectionManager@7d4fb053 name:ZooKeeperConnection Watcher:127.0.0.1:17478 got event WatchedEvent state:SyncConnected type:None path:null path:null type:None
   [junit4]   2> 1223538 T2357 oascc.ConnectionManager.waitForConnected Client is connected to ZooKeeper
   [junit4]   2> 1223540 T2357 oascsi.HttpClientUtil.createClient Creating new http client, config:maxConnections=500&maxConnectionsPerHost=16&socketTimeout=120000&connTimeout=15000
   [junit4]   2> 1223549 T2357 oascc.ConnectionManager.waitForConnected Waiting for client to connect to ZooKeeper
   [junit4]   2> 1223550 T2397 oascc.ConnectionManager.process Watcher org.apache.solr.common.cloud.ConnectionManager@76425f77 name:ZooKeeperConnection Watcher:127.0.0.1:17478/solr got event WatchedEvent state:SyncConnected type:None path:null path:null type:None
   [junit4]   2> 1223551 T2357 oascc.ConnectionManager.waitForConnected Client is connected to ZooKeeper
   [junit4]   2> 1223562 T2357 oascc.ZkStateReader.createClusterStateWatchersAndUpdate Updating cluster state from ZooKeeper... 
   [junit4]   2> 1224565 T2357 oasc.ZkController.createEphemeralLiveNode Register node as live in ZooKeeper:/live_nodes/127.0.0.1:11505_
   [junit4]   2> 1224578 T2357 oascc.SolrZkClient.makePath makePath: /live_nodes/127.0.0.1:11505_
   [junit4]   2> 1224582 T2379 oascc.ZkStateReader$3.process Updating live nodes... (2)
   [junit4]   2> 1224582 T2384 oascc.ZkStateReader$3.process Updating live nodes... (2)
   [junit4]   2> 1224582 T2397 oascc.ZkStateReader$3.process Updating live nodes... (2)
   [junit4]   2> 1224621 T2357 oasc.CorePropertiesLocator.discover Looking for core definitions underneath /usr/home/hudson/hudson-slave/workspace/Lucene-Solr-Tests-4.x-Java7/solr/build/solr-core/test/J0/./org.apache.solr.cloud.CollectionsAPIDistributedZkTest-jetty1-1375539177931
   [junit4]   2> 1224801 T2357 oasc.CorePropertiesLocator.discoverUnder Found core conf in /usr/home/hudson/hudson-slave/workspace/Lucene-Solr-Tests-4.x-Java7/solr/build/solr-core/test/J0/./org.apache.solr.cloud.CollectionsAPIDistributedZkTest-jetty1-1375539177931/conf/
   [junit4]   2> 1224809 T2357 oasc.CorePropertiesLocator.discover Found 1 core definitions
   [junit4]   2> 1224809 T2357 oass.SolrDispatchFilter.init user.dir=/usr/home/hudson/hudson-slave/workspace/Lucene-Solr-Tests-4.x-Java7/solr/build/solr-core/test/J0
   [junit4]   2> 1224810 T2357 oass.SolrDispatchFilter.init SolrDispatchFilter.init() done
   [junit4]   2> 1224810 T2357 oascsi.HttpClientUtil.createClient Creating new http client, config:maxConnections=128&maxConnectionsPerHost=32&followRedirects=false
   [junit4]   2> 1225117 T2357 oejs.Server.doStart jetty-8.1.10.v20130312
   [junit4]   2> 1225120 T2357 oejs.AbstractConnector.doStart Started SocketConnector@127.0.0.1:20077
   [junit4]   2> 1225121 T2357 oass.SolrDispatchFilter.init SolrDispatchFilter.init()
   [junit4]   2> 1225121 T2357 oasc.SolrResourceLoader.locateSolrHome JNDI not configured for solr (NoInitialContextEx)
   [junit4]   2> 1225122 T2357 oasc.SolrResourceLoader.locateSolrHome using system property solr.solr.home: /usr/home/hudson/hudson-slave/workspace/Lucene-Solr-Tests-4.x-Java7/solr/build/solr-core/test/J0/./org.apache.solr.cloud.CollectionsAPIDistributedZkTest-jetty2-1375539179666
   [junit4]   2> 1225122 T2357 oasc.SolrResourceLoader.<init> new SolrResourceLoader for directory: '/usr/home/hudson/hudson-slave/workspace/Lucene-Solr-Tests-4.x-Java7/solr/build/solr-core/test/J0/./org.apache.solr.cloud.CollectionsAPIDistributedZkTest-jetty2-1375539179666/'
   [junit4]   2> 1225165 T2357 oasc.ConfigSolr.fromFile Loading container configuration from /usr/home/hudson/hudson-slave/workspace/Lucene-Solr-Tests-4.x-Java7/solr/build/solr-core/test/J0/./org.apache.solr.cloud.CollectionsAPIDistributedZkTest-jetty2-1375539179666/solr.xml
   [junit4]   2> 1225261 T2357 oasc.ConfigSolrXml.<init> Config-defined core root directory: 
   [junit4]   2> 1225261 T2357 oasc.CoreContainer.<init> New CoreContainer 1170638041
   [junit4]   2> 1225262 T2357 oasc.CoreContainer.load Loading cores into CoreContainer [instanceDir=/usr/home/hudson/hudson-slave/workspace/Lucene-Solr-Tests-4.x-Java7/solr/build/solr-core/test/J0/./org.apache.solr.cloud.CollectionsAPIDistributedZkTest-jetty2-1375539179666/]
   [junit4]   2> 1225264 T2357 oashc.HttpShardHandlerFactory.getParameter Setting socketTimeout to: 120000
   [junit4]   2> 1225264 T2357 oashc.HttpShardHandlerFactory.getParameter Setting urlScheme to: http://
   [junit4]   2> 1225265 T2357 oashc.HttpShardHandlerFactory.getParameter Setting connTimeout to: 15000
   [junit4]   2> 1225265 T2357 oashc.HttpShardHandlerFactory.getParameter Setting maxConnectionsPerHost to: 20
   [junit4]   2> 1225266 T2357 oashc.HttpShardHandlerFactory.getParameter Setting corePoolSize to: 0
   [junit4]   2> 1225266 T2357 oashc.HttpShardHandlerFactory.getParameter Setting maximumPoolSize to: 2147483647
   [junit4]   2> 1225267 T2357 oashc.HttpShardHandlerFactory.getParameter Setting maxThreadIdleTime to: 5
   [junit4]   2> 1225267 T2357 oashc.HttpShardHandlerFactory.getParameter Setting sizeOfQueue to: -1
   [junit4]   2> 1225267 T2357 oashc.HttpShardHandlerFactory.getParameter Setting fairnessPolicy to: false
   [junit4]   2> 1225268 T2357 oascsi.HttpClientUtil.createClient Creating new http client, config:maxConnectionsPerHost=20&maxConnections=10000&socketTimeout=120000&connTimeout=15000&retry=false
   [junit4]   2> 1225285 T2357 oasc.ZkContainer.initZooKeeper Zookeeper client=127.0.0.1:17478/solr
   [junit4]   2> 1225286 T2357 oasc.ZkController.checkChrootPath zkHost includes chroot
   [junit4]   2> 1225287 T2357 oascc.ConnectionManager.waitForConnected Waiting for client to connect to ZooKeeper
   [junit4]   2> 1225315 T2409 oascc.ConnectionManager.process Watcher org.apache.solr.common.cloud.ConnectionManager@12606b9f name:ZooKeeperConnection Watcher:127.0.0.1:17478 got event WatchedEvent state:SyncConnected type:None path:null path:null type:None
   [junit4]   2> 1225316 T2357 oascc.ConnectionManager.waitForConnected Client is connected to ZooKeeper
   [junit4]   2> 1225318 T2357 oascsi.HttpClientUtil.createClient Creating new http client, config:maxConnections=500&maxConnectionsPerHost=16&socketTimeout=120000&connTimeout=15000
   [junit4]   2> 1225331 T2357 oascc.ConnectionManager.waitForConnected Waiting for client to connect to ZooKeeper
   [junit4]   2> 1225333 T2411 oascc.ConnectionManager.process Watcher org.apache.solr.common.cloud.ConnectionManager@52543ecb name:ZooKeeperConnection Watcher:127.0.0.1:17478/solr got event WatchedEvent state:SyncConnected type:None path:null path:null type:None
   [junit4]   2> 1225334 T2357 oascc.ConnectionManager.waitForConnected Client is connected to ZooKeeper
   [junit4]   2> 1225346 T2357 oascc.ZkStateReader.createClusterStateWatchersAndUpdate Updating cluster state from ZooKeeper... 
   [junit4]   2> 1226349 T2357 oasc.ZkController.createEphemeralLiveNode Register node as live in ZooKeeper:/live_nodes/127.0.0.1:20077_
   [junit4]   2> 1226354 T2357 oascc.SolrZkClient.makePath makePath: /live_nodes/127.0.0.1:20077_
   [junit4]   2> 1226358 T2397 oascc.ZkStateReader$3.process Updating live nodes... (3)
   [junit4]   2> 1226358 T2384 oascc.ZkStateReader$3.process Updating live nodes... (3)
   [junit4]   2> 1226358 T2379 oascc.ZkStateReader$3.process Updating live nodes... (3)
   [junit4]   2> 1226358 T2411 oascc.ZkStateReader$3.process Updating live nodes... (3)
   [junit4]   2> 1226372 T2357 oasc.CorePropertiesLocator.discover Looking for core definitions underneath /usr/home/hudson/hudson-slave/workspace/Lucene-Solr-Tests-4.x-Java7/solr/build/solr-core/test/J0/./org.apache.solr.cloud.CollectionsAPIDistributedZkTest-jetty2-1375539179666
   [junit4]   2> 1226556 T2357 oasc.CorePropertiesLocator.discoverUnder Found core conf in /usr/home/hudson/hudson-slave/workspace/Lucene-Solr-Tests-4.x-Java7/solr/build/solr-core/test/J0/./org.apache.solr.cloud.CollectionsAPIDistributedZkTest-jetty2-1375539179666/conf/
   [junit4]   2> 1226560 T2357 oasc.CorePropertiesLocator.discover Found 1 core definitions
   [junit4]   2> 1226560 T2357 oass.SolrDispatchFilter.init user.dir=/usr/home/hudson/hudson-slave/workspace/Lucene-Solr-Tests-4.x-Java7/solr/build/solr-core/test/J0
   [junit4]   2> 1226561 T2357 oass.SolrDispatchFilter.init SolrDispatchFilter.init() done
   [junit4]   2> 1226561 T2357 oascsi.HttpClientUtil.createClient Creating new http client, config:maxConnections=128&maxConnectionsPerHost=32&followRedirects=false
   [junit4]   2> 1226890 T2357 oejs.Server.doStart jetty-8.1.10.v20130312
   [junit4]   2> 1226893 T2357 oejs.AbstractConnector.doStart Started SocketConnector@127.0.0.1:26387
   [junit4]   2> 1226894 T2357 oass.SolrDispatchFilter.init SolrDispatchFilter.init()
   [junit4]   2> 1226895 T2357 oasc.SolrResourceLoader.locateSolrHome JNDI not configured for solr (NoInitialContextEx)
   [junit4]   2> 1226895 T2357 oasc.SolrResourceLoader.locateSolrHome using system property solr.solr.home: /usr/home/hudson/hudson-slave/workspace/Lucene-Solr-Tests-4.x-Java7/solr/build/solr-core/test/J0/./org.apache.solr.cloud.CollectionsAPIDistributedZkTest-jetty3-1375539181424
   [junit4]   2> 1226896 T2357 oasc.SolrResourceLoader.<init> new SolrResourceLoader for directory: '/usr/home/hudson/hudson-slave/workspace/Lucene-Solr-Tests-4.x-Java7/solr/build/solr-core/test/J0/./org.apache.solr.cloud.CollectionsAPIDistributedZkTest-jetty3-1375539181424/'
   [junit4]   2> 1226939 T2357 oasc.ConfigSolr.fromFile Loading container configuration from /usr/home/hudson/hudson-slave/workspace/Lucene-Solr-Tests-4.x-Java7/solr/build/solr-core/test/J0/./org.apache.solr.cloud.CollectionsAPIDistributedZkTest-jetty3-1375539181424/solr.xml
   [junit4]   2> 1227040 T2357 oasc.ConfigSolrXml.<init> Config-defined core root directory: 
   [junit4]   2> 1227041 T2357 oasc.CoreContainer.<init> New CoreContainer 1678898002
   [junit4]   2> 1227041 T2357 oasc.CoreContainer.load Loading cores into CoreContainer [instanceDir=/usr/home/hudson/hudson-slave/workspace/Lucene-Solr-Tests-4.x-Java7/solr/build/solr-core/test/J0/./org.apache.solr.cloud.CollectionsAPIDistributedZkTest-jetty3-1375539181424/]
   [junit4]   2> 1227043 T2357 oashc.HttpShardHandlerFactory.getParameter Setting socketTimeout to: 120000
   [junit4]   2> 1227043 T2357 oashc.HttpShardHandlerFactory.getParameter Setting urlScheme to: http://
   [junit4]   2> 1227044 T2357 oashc.HttpShardHandlerFactory.getParameter Setting connTimeout to: 15000
   [junit4]   2> 1227044 T2357 oashc.HttpShardHandlerFactory.getParameter Setting maxConnectionsPerHost to: 20
   [junit4]   2> 1227045 T2357 oashc.HttpShardHandlerFactory.getParameter Setting corePoolSize to: 0
   [junit4]   2> 1227045 T2357 oashc.HttpShardHandlerFactory.getParameter Setting maximumPoolSize to: 2147483647
   [junit4]   2> 1227046 T2357 oashc.HttpShardHandlerFactory.getParameter Setting maxThreadIdleTime to: 5
   [junit4]   2> 1227046 T2357 oashc.HttpShardHandlerFactory.getParameter Setting sizeOfQueue to: -1
   [junit4]   2> 1227047 T2357 oashc.HttpShardHandlerFactory.getParameter Setting fairnessPolicy to: false
   [junit4]   2> 1227047 T2357 oascsi.HttpClientUtil.createClient Creating new http client, config:maxConnectionsPerHost=20&maxConnections=10000&socketTimeout=120000&connTimeout=15000&retry=false
   [junit4]   2> 1227065 T2357 oasc.ZkContainer.initZooKeeper Zookeeper client=127.0.0.1:17478/solr
   [junit4]   2> 1227066 T2357 oasc.ZkController.checkChrootPath zkHost includes chroot
   [junit4]   2> 1227067 T2357 oascc.ConnectionManager.waitForConnected Waiting for client to connect to ZooKeeper
   [junit4]   2> 1227073 T2423 oascc.ConnectionManager.process Watcher org.apache.solr.common.cloud.ConnectionManager@5ded67cb name:ZooKeeperConnection Watcher:127.0.0.1:17478 got event WatchedEvent state:SyncConnected type:None path:null path:null type:None
   [junit4]   2> 1227073 T2357 oascc.ConnectionManager.waitForConnected Client is connected to ZooKeeper
   [junit4]   2> 1227079 T2357 oascsi.HttpClientUtil.createClient Creating new http client, config:maxConnections=500&maxConnectionsPerHost=16&socketTimeout=120000&connTimeout=15000
   [junit4]   2> 1227121 T2357 oascc.ConnectionManager.waitForConnected Waiting for client to connect to ZooKeeper
   [junit4]   2> 1227124 T2425 oascc.ConnectionManager.process Watcher org.apache.solr.common.cloud.ConnectionManager@2ad3d6b6 name:ZooKeeperConnection Watcher:127.0.0.1:17478/solr got event WatchedEvent state:SyncConnected type:None path:null path:null type:None
   [junit4]   2> 1227124 T2357 oascc.ConnectionManager.waitForConnected Client is connected to ZooKeeper
   [junit4]   2> 1227142 T2357 oascc.ZkStateReader.createClusterStateWatchersAndUpdate Updating cluster state from ZooKeeper... 
   [junit4]   2> 1228146 T2357 oasc.ZkController.createEphemeralLiveNode Register node as live in ZooKeeper:/live_nodes/127.0.0.1:26387_
   [junit4]   2> 1228175 T2357 oascc.SolrZkClient.makePath makePath: /live_nodes/127.0.0.1:26387_
   [junit4]   2> 1228179 T2384 oascc.ZkStateReader$3.process Updating live nodes... (4)
   [junit4]   2> 1228179 T2411 oascc.ZkStateReader$3.process Updating live nodes... (4)
   [junit4]   2> 1228179 T2379 oascc.ZkStateReader$3.process Updating live nodes... (4)
   [junit4]   2> 1228179 T2397 oascc.ZkStateReader$3.process Updating live nodes... (4)
   [junit4]   2> 1228179 T2425 oascc.ZkStateReader$3.process Updating live nodes... (4)
   [junit4]   2> 1228186 T2357 oasc.CorePropertiesLocator.discover Looking for core definitions underneath /usr/home/hudson/hudson-slave/workspace/Lucene-Solr-Tests-4.x-Java7/solr/build/solr-core/test/J0/./org.apache.solr.cloud.CollectionsAPIDistributedZkTest-jetty3-1375539181424
   [junit4]   2> 1228383 T2357 oasc.CorePropertiesLocator.discoverUnder Found core conf in /usr/home/hudson/hudson-slave/workspace/Lucene-Solr-Tests-4.x-Java7/solr/build/solr-core/test/J0/./org.apache.solr.cloud.CollectionsAPIDistributedZkTest-jetty3-1375539181424/conf/
   [junit4]   2> 1228385 T2357 oasc.CorePropertiesLocator.discover Found 1 core definitions
   [junit4]   2> 1228386 T2357 oass.SolrDispatchFilter.init user.dir=/usr/home/hudson/hudson-slave/workspace/Lucene-Solr-Tests-4.x-Java7/solr/build/solr-core/test/J0
   [junit4]   2> 1228386 T2357 oass.SolrDispatchFilter.init SolrDispatchFilter.init() done
   [junit4]   2> 1228387 T2357 oascsi.HttpClientUtil.createClient Creating new http client, config:maxConnections=128&maxConnectionsPerHost=32&followRedirects=false
   [junit4]   2> 1228696 T2357 oejs.Server.doStart jetty-8.1.10.v20130312
   [junit4]   2> 1228700 T2357 oejs.AbstractConnector.doStart Started SocketConnector@127.0.0.1:41067
   [junit4]   2> 1228701 T2357 oass.SolrDispatchFilter.init SolrDispatchFilter.init()
   [junit4]   2> 1228701 T2357 oasc.SolrResourceLoader.locateSolrHome JNDI not configured for solr (NoInitialContextEx)
   [junit4]   2> 1228702 T2357 oasc.SolrResourceLoader.locateSolrHome using system property solr.solr.home: /usr/home/hudson/hudson-slave/workspace/Lucene-Solr-Tests-4.x-Java7/solr/build/solr-core/test/J0/./org.apache.solr.cloud.CollectionsAPIDistributedZkTest-jetty4-1375539183241
   [junit4]   2> 1228702 T2357 oasc.SolrResourceLoader.<init> new SolrResourceLoader for directory: '/usr/home/hudson/hudson-slave/workspace/Lucene-Solr-Tests-4.x-Java7/solr/build/solr-core/test/J0/./org.apache.solr.cloud.CollectionsAPIDistributedZkTest-jetty4-1375539183241/'
   [junit4]   2> 1228745 T2357 oasc.ConfigSolr.fromFile Loading container configuration from /usr/home/hudson/hudson-slave/workspace/Lucene-Solr-Tests-4.x-Java7/solr/build/solr-core/test/J0/./org.apache.solr.cloud.CollectionsAPIDistributedZkTest-jetty4-1375539183241/solr.xml
   [junit4]   2> 1228846 T2357 oasc.ConfigSolrXml.<init> Config-defined core root directory: 
   [junit4]   2> 1228847 T2357 oasc.CoreContainer.<init> New CoreContainer 1786446481
   [junit4]   2> 1228847 T2357 oasc.CoreContainer.load Loading cores into CoreContainer [instanceDir=/usr/home/hudson/hudson-slave/workspace/Lucene-Solr-Tests-4.x-Java7/solr/build/solr-core/test/J0/./org.apache.solr.cloud.CollectionsAPIDistributedZkTest-jetty4-1375539183241/]
   [junit4]   2> 1228849 T2357 oashc.HttpShardHandlerFactory.getParameter Setting socketTimeout to: 120000
   [junit4]   2> 1228850 T2357 oashc.HttpShardHandlerFactory.getParameter Setting urlScheme to: http://
   [junit4]   2> 1228850 T2357 oashc.HttpShardHandlerFactory.getParameter Setting connTimeout to: 15000
   [junit4]   2> 1228851 T2357 oashc.HttpShardHandlerFactory.getParameter Setting maxConnectionsPerHost to: 20
   [junit4]   2> 1228851 T2357 oashc.HttpShardHandlerFactory.getParameter Setting corePoolSize to: 0
   [junit4]   2> 1228851 T2357 oashc.HttpShardHandlerFactory.getParameter Setting maximumPoolSize to: 2147483647
   [junit4]   2> 1228852 T2357 oashc.HttpShardHandlerFactory.getParameter Setting maxThreadIdleTime to: 5
   [junit4]   2> 1228852 T2357 oashc.HttpShardHandlerFactory.getParameter Setting sizeOfQueue to: -1
   [junit4]   2> 1228853 T2357 oashc.HttpShardHandlerFactory.getParameter Setting fairnessPolicy to: false
   [junit4]   2> 1228853 T2357 oascsi.HttpClientUtil.createClient Creating new http client, config:maxConnectionsPerHost=20&maxConnections=10000&socketTimeout=120000&connTimeout=15000&retry=false
   [junit4]   2> 1228870 T2357 oasc.ZkContainer.initZooKeeper Zookeeper client=127.0.0.1:17478/solr
   [junit4]   2> 1228870 T2357 oasc.ZkController.checkChrootPath zkHost includes chroot
   [junit4]   2> 1228871 T2357 oascc.ConnectionManager.waitForConnected Waiting for client to connect to ZooKeeper
   [junit4]   2> 1228874 T2437 oascc.ConnectionManager.process Watcher org.apache.solr.common.cloud.ConnectionManager@6e1aa67d name:ZooKeeperConnection Watcher:127.0.0.1:17478 got event WatchedEvent state:SyncConnected type:None path:null path:null type:None
   [junit4]   2> 1228874 T2357 oascc.ConnectionManager.waitForConnected Client is connected to ZooKeeper
   [junit4]   2> 1228877 T2357 oascsi.HttpClientUtil.createClient Creating new http client, config:maxConnections=500&maxConnectionsPerHost=16&socketTimeout=120000&connTimeout=15000
   [junit4]   2> 1228888 T2357 oascc.ConnectionManager.waitForConnected Waiting for client to connect to ZooKeeper
   [junit4]   2> 1228890 T2439 oascc.ConnectionManager.process Watcher org.apache.solr.common.cloud.ConnectionManager@2f2ef78d name:ZooKeeperConnection Watcher:127.0.0.1:17478/solr got event WatchedEvent state:SyncConnected type:None path:null path:null type:None
   [junit4]   2> 1228890 T2357 oascc.ConnectionManager.waitForConnected Client is connected to ZooKeeper
   [junit4]   2> 1228902 T2357 oascc.ZkStateReader.createClusterStateWatchersAndUpdate Updating cluster state from ZooKeeper... 
   [junit4]   2> 1229905 T2357 oasc.ZkController.createEphemeralLiveNode Register node as live in ZooKeeper:/live_nodes/127.0.0.1:41067_
   [junit4]   2> 1229911 T2357 oascc.SolrZkClient.makePath makePath: /live_nodes/127.0.0.1:41067_
   [junit4]   2> 1229916 T2384 oascc.ZkStateReader$3.process Updating live nodes... (5)
   [junit4]   2> 1229916 T2397 oascc.ZkStateReader$3.process Updating live nodes... (5)
   [junit4]   2> 1229916 T2439 oascc.ZkStateReader$3.process Updating live nodes... (5)
   [junit4]   2> 1229916 T2425 oascc.ZkStateReader$3.process Updating live nodes... (5)
   [junit4]   2> 1229916 T2379 oascc.ZkStateReader$3.process Updating live nodes... (5)
   [junit4]   2> 1229916 T2411 oascc.ZkStateReader$3.process Updating live nodes... (5)
   [junit4]   2> 1229931 T2357 oasc.CorePropertiesLocator.discover Looking for core definitions underneath /usr/home/hudson/hudson-slave/workspace/Lucene-Solr-Tests-4.x-Java7/solr/build/solr-core/test/J0/./org.apache.solr.cloud.CollectionsAPIDistributedZkTest-jetty4-1375539183241
   [junit4]   2> 1230136 T2357 oasc.CorePropertiesLocator.discoverUnder Found core conf in /usr/home/hudson/hudson-slave/workspace/Lucene-Solr-Tests-4.x-Java7/solr/build/solr-core/test/J0/./org.apache.solr.cloud.CollectionsAPIDistributedZkTest-jetty4-1375539183241/conf/
   [junit4]   2> 1230139 T2357 oasc.CorePropertiesLocator.discover Found 1 core definitions
   [junit4]   2> 1230140 T2357 oass.SolrDispatchFilter.init user.dir=/usr/home/hudson/hudson-slave/workspace/Lucene-Solr-Tests-4.x-Java7/solr/build/solr-core/test/J0
   [junit4]   2> 1230140 T2357 oass.SolrDispatchFilter.init SolrDispatchFilter.init() done
   [junit4]   2> 1230141 T2357 oascsi.HttpClientUtil.createClient Creating new http client, config:maxConnections=128&maxConnectionsPerHost=32&followRedirects=false
   [junit4]   2> 1230158 T2357 oascsi.HttpClientUtil.createClient Creating new http client, config:maxConnections=128&maxConnectionsPerHost=32&followRedirects=false
   [junit4]   2> 1230170 T2387 oasha.CollectionsHandler.handleCreateAction Creating Collection : numShards=2&name=nodes_used_collection&replicationFactor=2&action=CREATE&wt=javabin&version=2
   [junit4]   2> 1230172 T2379 oasc.DistributedQueue$LatchChildWatcher.process Watcher fired on path: /overseer/collection-queue-work state: SyncConnected type NodeChildrenChanged
   [junit4]   2> 1230173 T2381 oasc.OverseerCollectionProcessor.run Overseer Collection Processor: Get the message id:/overseer/collection-queue-work/qn-0000000000 message:{
   [junit4]   2> 	  "operation":"createcollection",
   [junit4]   2> 	  "numShards":"2",
   [junit4]   2> 	  "name":"nodes_used_collection",
   [junit4]   2> 	  "replicationFactor":"2"}
   [junit4]   2> 1230174 T2381 oasc.OverseerCollectionProcessor.processMessage WARN OverseerCollectionProcessor.processMessage : createcollection , {
   [junit4]   2> 	  "operation":"createcollection",
   [junit4]   2> 	  "numShards":"2",
   [junit4]   2> 	  "name":"nodes_used_collection",
   [junit4]   2> 	  "replicationFactor":"2"}
   [junit4]   2> 1230369 T2380 oascc.ZkStateReader.updateClusterState Updating cloud state from ZooKeeper... 
   [junit4]   2> 1230370 T2380 oasc.Overseer$ClusterStateUpdater.buildCollection building a new collection: nodes_used_collection
   [junit4]   2> 1230370 T2380 oasc.Overseer$ClusterStateUpdater.createCollection Create collection nodes_used_collection with shards [shard1, shard2]
   [junit4]   2> 1230385 T2439 oascc.ZkStateReader$2.process A cluster state change: WatchedEvent state:SyncConnected type:NodeDataChanged path:/clusterstate.json, has occurred - updating... (live nodes size: 5)
   [junit4]   2> 1230385 T2379 oascc.ZkStateReader$2.process A cluster state change: WatchedEvent state:SyncConnected type:NodeDataChanged path:/clusterstate.json, has occurred - updating... (live nodes size: 5)
   [junit4]   2> 1230385 T2384 oascc.ZkStateReader$2.process A cluster state change: WatchedEvent state:SyncConnected type:NodeDataChanged path:/clusterstate.json, has occurred - updating... (live nodes size: 5)
   [junit4]   2> 1230385 T2425 oascc.ZkStateReader$2.process A cluster state change: WatchedEvent state:SyncConnected type:NodeDataChanged path:/clusterstate.json, has occurred - updating... (live nodes size: 5)
   [junit4]   2> 1230385 T2411 oascc.ZkStateReader$2.process A cluster state change: WatchedEvent state:SyncConnected type:NodeDataChanged path:/clusterstate.json, has occurred - updating... (live nodes size: 5)
   [junit4]   2> 1230385 T2397 oascc.ZkStateReader$2.process A cluster state change: WatchedEvent state:SyncConnected type:NodeDataChanged path:/clusterstate.json, has occurred - updating... (live nodes size: 5)
   [junit4]   2> 1230489 T2381 oasc.OverseerCollectionProcessor.createCollection going to create cores replicas shardNames [shard1, shard2] , repFactor : 2
   [junit4]   2> 1230489 T2381 oasc.OverseerCollectionProcessor.createCollection Creating shard nodes_used_collection_shard1_replica1 as part of slice shard1 of collection nodes_used_collection on 127.0.0.1:22902_
   [junit4]   2> 1230489 T2381 oasc.OverseerCollectionProcessor.createCollection Creating shard nodes_used_collection_shard1_replica2 as part of slice shard1 of collection nodes_used_collection on 127.0.0.1:26387_
   [junit4]   2> 1230490 T2381 oasc.OverseerCollectionProcessor.createCollection Creating shard nodes_used_collection_shard2_replica1 as part of slice shard2 of collection nodes_used_collection on 127.0.0.1:11505_
   [junit4]   2> 1230491 T2381 oasc.OverseerCollectionProcessor.createCollection Creating shard nodes_used_collection_shard2_replica2 as part of slice shard2 of collection nodes_used_collection on 127.0.0.1:41067_
   [junit4]   2> 1230494 T2415 oasc.ZkController.publish publishing core=nodes_used_collection_shard1_replica2 state=down
   [junit4]   2> 1230494 T2369 oasc.ZkController.publish publishing core=nodes_used_collection_shard1_replica1 state=down
   [junit4]   2> 1230495 T2429 oasc.ZkController.publish publishing core=nodes_used_collection_shard2_replica2 state=down
   [junit4]   2> 1230495 T2388 oasc.ZkController.publish publishing core=nodes_used_collection_shard2_replica1 state=down
   [junit4]   2> 1230496 T2415 oasc.ZkController.waitForCoreNodeName look for our core node name
   [junit4]   2> 1230497 T2369 oasc.ZkController.waitForCoreNodeName look for our core node name
   [junit4]   2> 1230508 T2429 oasc.ZkController.waitForCoreNodeName look for our core node name
   [junit4]   2> 1230508 T2388 oasc.ZkController.waitForCoreNodeName look for our core node name
   [junit4]   2> 1231889 T2380 oascc.ZkStateReader.updateClusterState Updating cloud state from ZooKeeper... 
   [junit4]   2> 1231891 T2380 oasc.Overseer$ClusterStateUpdater.updateState WARN Could not find collection node for nodes_used_collection, skipping publish state
   [junit4]   2> 1231891 T2380 oasc.Overseer$ClusterStateUpdater.updateState Update state numShards=2 message={
   [junit4]   2> 	  "operation":"state",
   [junit4]   2> 	  "core_node_name":"core_node1",
   [junit4]   2> 	  "numShards":"2",
   [junit4]   2> 	  "shard":"shard1",
   [junit4]   2> 	  "roles":null,
   [junit4]   2> 	  "state":"down",
   [junit4]   2> 	  "shard_state":"active",
   [junit4]   2> 	  "core":"nodes_used_collection_shard1_replica2",
   [junit4]   2> 	  "collection":"nodes_used_collection",
   [junit4]   2> 	  "shard_range":null,
   [junit4]   2> 	  "node_name":"127.0.0.1:26387_",
   [junit4]   2> 	  "base_url":"http://127.0.0.1:26387"}
   [junit4]   2> 1231938 T2380 oasc.Overseer$ClusterStateUpdater.updateState WARN Could not find collection node for nodes_used_collection, skipping publish state
   [junit4]   2> 1231938 T2380 oasc.Overseer$ClusterStateUpdater.updateState Update state numShards=2 message={
   [junit4]   2> 	  "operation":"state",
   [junit4]   2> 	  "core_node_name":"core_node2",
   [junit4]   2> 	  "numShards":"2",
   [junit4]   2> 	  "shard":"shard1",
   [junit4]   2> 	  "roles":null,
   [junit4]   2> 	  "state":"down",
   [junit4]   2> 	  "shard_state":"active",
   [junit4]   2> 	  "core":"nodes_used_collection_shard1_replica1",
   [junit4]   2> 	  "collection":"nodes_used_collection",
   [junit4]   2> 	  "shard_range":null,
   [junit4]   2> 	  "node_name":"127.0.0.1:22902_",
   [junit4]   2> 	  "base_url":"http://127.0.0.1:22902"}
   [junit4]   2> 1231974 T2380 oasc.Overseer$ClusterStateUpdater.updateState WARN Could not find collection node for nodes_used_collection, skipping publish state
   [junit4]   2> 1231974 T2380 oasc.Overseer$ClusterStateUpdater.updateState Update state numShards=2 message={
   [junit4]   2> 	  "operation":"state",
   [junit4]   2> 	  "core_node_name":"core_node3",
   [junit4]   2> 	  "numShards":"2",
   [junit4]   2> 	  "shard":"shard2",
   [junit4]   2> 	  "roles":null,
   [junit4]   2> 	  "state":"down",
   [junit4]   2> 	  "shard_state":"active",
   [junit4]   2> 	  "core":"nodes_used_collection_shard2_replica2",
   [junit4]   2> 	  "collection":"nodes_used_collection",
   [junit4]   2> 	  "shard_range":null,
   [junit4]   2> 	  "node_name":"127.0.0.1:41067_",
   [junit4]   2> 	  "base_url":"http://127.0.0.1:41067"}
   [junit4]   2> 1231985 T2380 oasc.Overseer$ClusterStateUpdater.updateState WARN Could not find collection node for nodes_used_collection, skipping publish state
   [junit4]   2> 1231985 T2380 oasc.Overseer$ClusterStateUpdater.updateState Update state numShards=2 message={
   [junit4]   2> 	  "operation":"state",
   [junit4]   2> 	  "core_node_name":"core_node4",
   [junit4]   2> 	  "numShards":"2",
   [junit4]   2> 	  "shard":"shard2",
   [junit4]   2> 	  "roles":null,
   [junit4]   2> 	  "state":"down",
   [junit4]   2> 	  "shard_state":"active",
   [junit4]   2> 	  "core":"nodes_used_collection_shard2_replica1",
   [junit4]   2> 	  "collection":"nodes_used_collection",
   [junit4]   2> 	  "shard_range":null,
   [junit4]   2> 	  "node_name":"127.0.0.1:11505_",
   [junit4]   2> 	  "base_url":"http://127.0.0.1:11505"}
   [junit4]   2> 1231996 T2384 oascc.ZkStateReader$2.process A cluster state change: WatchedEvent state:SyncConnected type:NodeDataChanged path:/clusterstate.json, has occurred - updating... (live nodes size: 5)
   [junit4]   2> 1231996 T2397 oascc.ZkStateReader$2.process A cluster state change: WatchedEvent state:SyncConnected type:NodeDataChanged path:/clusterstate.json, has occurred - updating... (live nodes size: 5)
   [junit4]   2> 1231996 T2425 oascc.ZkStateReader$2.process A cluster state change: WatchedEvent state:SyncConnected type:NodeDataChanged path:/clusterstate.json, has occurred - updating... (live nodes size: 5)
   [junit4]   2> 1231996 T2379 oascc.ZkStateReader$2.process A cluster state change: WatchedEvent state:SyncConnected type:NodeDataChanged path:/clusterstate.json, has occurred - updating... (live nodes size: 5)
   [junit4]   2> 1231996 T2411 oascc.ZkStateReader$2.process A cluster state change: WatchedEvent state:SyncConnected type:NodeDataChanged path:/clusterstate.json, has occurred - updating... (live nodes size: 5)
   [junit4]   2> 1231996 T2439 oascc.ZkStateReader$2.process A cluster state change: WatchedEvent state:SyncConnected type:NodeDataChanged path:/clusterstate.json, has occurred - updating... (live nodes size: 5)
   [junit4]   2> 1232498 T2415 oasc.ZkController.waitForShardId waiting to find shard id in clusterstate for nodes_used_collection_shard1_replica2
   [junit4]   2> 1232499 T2369 oasc.ZkController.waitForShardId waiting to find shard id in clusterstate for nodes_used_collection_shard1_replica1
   [junit4]   2> 1232499 T2415 oasc.CorePropertiesLocator.writePropertiesFile ERROR Couldn't persist core properties to /usr/home/hudson/hudson-slave/workspace/Lucene-Solr-Tests-4.x-Java7/solr/build/solr-core/test/J0/./org.apache.solr.cloud.CollectionsAPIDistributedZkTest-jetty3-1375539181424/nodes_used_collection_shard1_replica2/core.properties: java.io.FileNotFoundException: /usr/home/hudson/hudson-slave/workspace/Lucene-Solr-Tests-4.x-Java7/solr/build/solr-core/test/J0/./org.apache.solr.cloud.CollectionsAPIDistributedZkTest-jetty3-1375539181424/nodes_used_collection_shard1_replica2/core.properties (No such file or directory)
   [junit4]   2> 1232500 T2415 oasc.CoreContainer.create Creating SolrCore 'nodes_used_collection_shard1_replica2' using instanceDir: /usr/home/hudson/hudson-slave/workspace/Lucene-Solr-Tests-4.x-Java7/solr/build/solr-core/test/J0/./org.apache.solr.cloud.CollectionsAPIDistributedZkTest-jetty3-1375539181424/nodes_used_collection_shard1_replica2
   [junit4]   2> 1232500 T2415 oasc.ZkController.createCollectionZkNode Check for collection zkNode:nodes_used_collection
   [junit4]   2> 1232500 T2369 oasc.CorePropertiesLocator.writePropertiesFile ERROR Couldn't persist core properties to /usr/home/hudson/hudson-slave/workspace/Lucene-Solr-Tests-4.x-Java7/solr/build/solr-core/test/J0/./org.apache.solr.cloud.CollectionsAPIDistributedZkTest-controljetty-1375539177092/nodes_used_collection_shard1_replica1/core.properties: java.io.FileNotFoundException: /usr/home/hudson/hudson-slave/workspace/Lucene-Solr-Tests-4.x-Java7/solr/build/solr-core/test/J0/./org.apache.solr.cloud.CollectionsAPIDistributedZkTest-controljetty-1375539177092/nodes_used_collection_shard1_replica1/core.properties (No such file or directory)
   [junit4]   2> 1232501 T2369 oasc.CoreContainer.create Creating SolrCore 'nodes_used_collection_shard1_replica1' using instanceDir: /usr/home/hudson/hudson-slave/workspace/Lucene-Solr-Tests-4.x-Java7/solr/build/solr-core/test/J0/./org.apache.solr.cloud.CollectionsAPIDistributedZkTest-controljetty-1375539177092/nodes_used_collection_shard1_replica1
   [junit4]   2> 1232501 T2415 oasc.ZkController.createCollectionZkNode Creating collection in ZooKeeper:nodes_used_collection
   [junit4]   2> 1232501 T2369 oasc.ZkController.createCollectionZkNode Check for collection zkNode:nodes_used_collection
   [junit4]   2> 1232502 T2415 oasc.ZkController.getConfName Looking for collection configName
   [junit4]   2> 1232502 T2369 oasc.ZkController.createCollectionZkNode Creating collection in ZooKeeper:nodes_used_collection
   [junit4]   2> 1232503 T2369 oasc.ZkController.getConfName Looking for collection configName
   [junit4]   2> 1232503 T2415 oasc.ZkController.getConfName Only one config set found in zk - using it:conf1
   [junit4]   2> 1232503 T2415 oascc.SolrZkClient.makePath makePath: /collections/nodes_used_collection
   [junit4]   2> 1232504 T2369 oasc.ZkController.getConfName Only one config set found in zk - using it:conf1
   [junit4]   2> 1232504 T2369 oascc.SolrZkClient.makePath makePath: /collections/nodes_used_collection
   [junit4]   2> 1232508 T2415 oasc.ZkController.readConfigName Load collection config from:/collections/nodes_used_collection
   [junit4]   2> 1232509 T2369 oasc.ZkController.readConfigName Load collection config from:/collections/nodes_used_collection
   [junit4]   2> 1232509 T2415 oasc.SolrResourceLoader.<init> new SolrResourceLoader for directory: '/usr/home/hudson/hudson-slave/workspace/Lucene-Solr-Tests-4.x-Java7/solr/build/solr-core/test/J0/./org.apache.solr.cloud.CollectionsAPIDistributedZkTest-jetty3-1375539181424/nodes_used_collection_shard1_replica2/'
   [junit4]   2> 1232510 T2429 oasc.ZkController.waitForShardId waiting to find shard id in clusterstate for nodes_used_collection_shard2_replica2
   [junit4]   2> 1232510 T2369 oasc.SolrResourceLoader.<init> new SolrResourceLoader for directory: '/usr/home/hudson/hudson-slave/workspace/Lucene-Solr-Tests-4.x-Java7/solr/build/solr-core/test/J0/./org.apache.solr.cloud.CollectionsAPIDistributedZkTest-controljetty-1375539177092/nodes_used_collection_shard1_replica1/'
   [junit4]   2> 1232510 T2388 oasc.ZkController.waitForShardId waiting to find shard id in clusterstate for nodes_used_collection_shard2_replica1
   [junit4]   2> 1232511 T2429 oasc.CorePropertiesLocator.writePropertiesFile ERROR Couldn't persist core properties to /usr/home/hudson/hudson-slave/workspace/Lucene-Solr-Tests-4.x-Java7/solr/build/solr-core/test/J0/./org.apache.solr.cloud.CollectionsAPIDistributedZkTest-jetty4-1375539183241/nodes_used_collection_shard2_replica2/core.properties: java.io.FileNotFoundException: /usr/home/hudson/hudson-slave/workspace/Lucene-Solr-Tests-4.x-Java7/solr/build/solr-core/test/J0/./org.apache.solr.cloud.CollectionsAPIDistributedZkTest-jetty4-1375539183241/nodes_used_collection_shard2_replica2/core.properties (No such file or directory)
   [junit4]   2> 1232511 T2429 oasc.CoreContainer.create Creating SolrCore 'nodes_used_collection_shard2_replica2' using instanceDir: /usr/home/hudson/hudson-slave/workspace/Lucene-Solr-Tests-4.x-Java7/solr/build/solr-core/test/J0/./org.apache.solr.cloud.CollectionsAPIDistributedZkTest-jetty4-1375539183241/nodes_used_collection_shard2_replica2
   [junit4]   2> 1232511 T2429 oasc.ZkController.createCollectionZkNode Check for collection zkNode:nodes_used_collection
   [junit4]   2> 1232512 T2388 oasc.CorePropertiesLocator.writePropertiesFile ERROR Couldn't persist core properties to /usr/home/hudson/hudson-slave/workspace/Lucene-Solr-Tests-4.x-Java7/solr/build/solr-core/test/J0/./org.apache.solr.cloud.CollectionsAPIDistributedZkTest-jetty1-1375539177931/nodes_used_collection_shard2_replica1/core.properties: java.io.FileNotFoundException: /usr/home/hudson/hudson-slave/workspace/Lucene-Solr-Tests-4.x-Java7/solr/build/solr-core/test/J0/./org.apache.solr.cloud.CollectionsAPIDistributedZkTest-jetty1-1375539177931/nodes_used_collection_shard2_replica1/core.properties (No such file or directory)
   [junit4]   2> 1232512 T2388 oasc.CoreContainer.create Creating SolrCore 'nodes_used_collection_shard2_replica1' using instanceDir: /usr/home/hudson/hudson-slave/workspace/Lucene-Solr-Tests-4.x-Java7/solr/build/solr-core/test/J0/./org.apache.solr.cloud.CollectionsAPIDistributedZkTest-jetty1-1375539177931/nodes_used_collection_shard2_replica1
   [junit4]   2> 1232512 T2429 oasc.ZkController.createCollectionZkNode Collection zkNode exists
   [junit4]   2> 1232513 T2429 oasc.ZkController.readConfigName Load collection config from:/collections/nodes_used_collection
   [junit4]   2> 1232512 T2388 oasc.ZkController.createCollectionZkNode Check for collection zkNode:nodes_used_collection
   [junit4]   2> 1232514 T2388 oasc.ZkController.createCollectionZkNode Collection zkNode exists
   [junit4]   2> 1232514 T2429 oasc.SolrResourceLoader.<init> new SolrResourceLoader for directory: '/usr/home/hudson/hudson-slave/workspace/Lucene-Solr-Tests-4.x-Java7/solr/build/solr-core/test/J0/./org.apache.solr.cloud.CollectionsAPIDistributedZkTest-jetty4-1375539183241/nodes_used_collection_shard2_replica2/'
   [junit4]   2> 1232514 T2388 oasc.ZkController.readConfigName Load collection config from:/collections/nodes_used_collection
   [junit4]   2> 1232515 T2388 oasc.SolrResourceLoader.<init> new SolrResourceLoader for directory: '/usr/home/hudson/hudson-slave/workspace/Lucene-Solr-Tests-4.x-Java7/solr/build/solr-core/test/J0/./org.apache.solr.cloud.CollectionsAPIDistributedZkTest-jetty1-1375539177931/nodes_used_collection_shard2_replica1/'
   [junit4]   2> 1232654 T2388 oasc.SolrConfig.<init> Using Lucene MatchVersion: LUCENE_45
   [junit4]   2> 1232654 T2415 oasc.SolrConfig.<init> Using Lucene MatchVersion: LUCENE_45
   [junit4]   2> 1232656 T2369 oasc.SolrConfig.<init> Using Lucene MatchVersion: LUCENE_45
   [junit4]   2> 1232656 T2429 oasc.SolrConfig.<init> Using Lucene MatchVersion: LUCENE_45
   [junit4]   2> 1232754 T2415 oasc.SolrConfig.<init> Loaded SolrConfig: solrconfig.xml
   [junit4]   2> 1232755 T2388 oasc.SolrConfig.<init> Loaded SolrConfig: solrconfig.xml
   [junit4]   2> 1232758 T2369 oasc.SolrConfig.<init> Loaded SolrConfig: solrconfig.xml
   [junit4]   2> 1232759 T2429 oasc.SolrConfig.<init> Loaded SolrConfig: solrconfig.xml
   [junit4]   2> 1232856 T2415 oass.IndexSchema.readSchema Reading Solr Schema from schema.xml
   [junit4]   2> 1232857 T2388 oass.IndexSchema.readSchema Reading Solr Schema from schema.xml
   [junit4]   2> 1232860 T2369 oass.IndexSchema.readSchema Reading Solr Schema from schema.xml
   [junit4]   2> 1232860 T2429 oass.IndexSchema.readSchema Reading Solr Schema from schema.xml
   [junit4]   2> 1232868 T2388 oass.IndexSchema.readSchema [nodes_used_collection_shard2_replica1] Schema name=test
   [junit4]   2> 1232868 T2415 oass.IndexSchema.readSchema [nodes_used_collection_shard1_replica2] Schema name=test
   [junit4]   2> 1232871 T2369 oass.IndexSchema.readSchema [nodes_used_collection_shard1_replica1] Schema name=test
   [junit4]   2> 1232871 T2429 oass.IndexSchema.readSchema [nodes_used_collection_shard2_replica2] Schema name=test
   [junit4]   2> 1233665 T2369 oass.ByteField.init WARN ByteField is deprecated and will be removed in 5.0. You should use TrieIntField instead.
   [junit4]   2> 1233665 T2369 oass.ShortField.init WARN ShortField is deprecated and will be removed in 5.0. You should use TrieIntField instead.
   [junit4]   2> 1233666 T2369 oass.OpenExchangeRatesOrgProvider.init Initialized with rates=open-exchange-rates.json, refreshInterval=1440.
   [junit4]   2> 1233671 T2429 oass.ByteField.init WARN ByteField is deprecated and will be removed in 5.0. You should use TrieIntField instead.
   [junit4]   2> 1233672 T2429 oass.ShortField.init WARN ShortField is deprecated and will be removed in 5.0. You should use TrieIntField instead.
   [junit4]   2> 1233673 T2429 oass.OpenExchangeRatesOrgProvider.init Initialized with rates=open-exchange-rates.json, refreshInterval=1440.
   [junit4]   2> 1233678 T2369 oass.IndexSchema.readSchema default search field in schema is text
   [junit4]   2> 1233681 T2429 oass.IndexSchema.readSchema default search field in schema is text
   [junit4]   2> 1233682 T2369 oass.IndexSchema.readSchema unique key field: id
   [junit4]   2> 1233686 T2429 oass.IndexSchema.readSchema unique key field: id
   [junit4]   2> 1233686 T2415 oass.ByteField.init WARN ByteField is deprecated and will be removed in 5.0. You should use TrieIntField instead.
   [junit4]   2> 1233687 T2415 oass.ShortField.init WARN ShortField is deprecated and will be removed in 5.0. You should use TrieIntField instead.
   [junit4]   2> 1233688 T2415 oass.OpenExchangeRatesOrgProvider.init Initialized with rates=open-exchange-rates.json, refreshInterval=1440.
   [junit4]   2> 1233694 T2388 oass.ByteField.init WARN ByteField is deprecated and will be removed in 5.0. You should use TrieIntField instead.
   [junit4]   2> 1233694 T2388 oass.ShortField.init WARN ShortField is deprecated and will be removed in 5.0. You should use TrieIntField instead.
   [junit4]   2> 1233695 T2415 oass.IndexSchema.readSchema default search field in schema is text
   [junit4]   2> 1233695 T2388 oass.OpenExchangeRatesOrgProvider.init Initialized with rates=open-exchange-rates.json, refreshInterval=1440.
   [junit4]   2> 1233698 T2369 oass.FileExchangeRateProvider.reload Reloading exchange rates from file currency.xml
   [junit4]   2> 1233699 T2415 oass.IndexSchema.readSchema unique key field: id
   [junit4]   2> 1233700 T2429 oass.FileExchangeRateProvider.reload Reloading exchange rates from file currency.xml
   [junit4]   2> 1233702 T2369 oass.FileExchangeRateProvider.reload Reloading exchange rates from file currency.xml
   [junit4]   2> 1233703 T2388 oass.IndexSchema.readSchema default search field in schema is text
   [junit4]   2> 1233706 T2429 oass.FileExchangeRateProvider.reload Reloading exchange rates from file currency.xml
   [junit4]   2> 1233707 T2369 oass.OpenExchangeRatesOrgProvider.reload Reloading exchange rates from open-exchange-rates.json
   [junit4]   2> 1233707 T2388 oass.IndexSchema.readSchema unique key field: id
   [junit4]   2> 1233709 T2369 oass.OpenExchangeRatesOrgProvider$OpenExchangeRates.<init> WARN Unknown key IMPORTANT NOTE
   [junit4]   2> 1233709 T2369 oass.OpenExchangeRatesOrgProvider$OpenExchangeRates.<init> WARN Expected key, got STRING
   [junit4]   2> 1233709 T2369 oass.OpenExchangeRatesOrgProvider.reload Reloading exchange rates from open-exchange-rates.json
   [junit4]   2> 1233710 T2369 oass.OpenExchangeRatesOrgProvider$OpenExchangeRates.<init> WARN Unknown key IMPORTANT NOTE
   [junit4]   2> 1233711 T2369 oass.OpenExchangeRatesOrgProvider$OpenExchangeRates.<init> WARN Expected key, got STRING
   [junit4]   2> 1233711 T2429 oass.OpenExchangeRatesOrgProvider.reload Reloading exchange rates from open-exchange-rates.json
   [junit4]   2> 1233711 T2369 oasc.SolrCore.initDirectoryFactory org.apache.solr.core.MockDirectoryFactory
   [junit4]   2> 1233712 T2369 oasc.SolrCore.<init> [nodes_used_collection_shard1_replica1] Opening new SolrCore at /usr/home/hudson/hudson-slave/workspace/Lucene-Solr-Tests-4.x-Java7/solr/build/solr-core/test/J0/./org.apache.solr.cloud.CollectionsAPIDistributedZkTest-controljetty-1375539177092/nodes_used_collection_shard1_replica1/, dataDir=/usr/home/hudson/hudson-slave/workspace/Lucene-Solr-Tests-4.x-Java7/solr/build/solr-core/test/J0/./org.apache.solr.cloud.CollectionsAPIDistributedZkTest-controljetty-1375539177092//nodes_used_collection_shard1_replica1/data/
   [junit4]   2> 1233712 T2415 oass.FileExchangeRateProvider.reload Reloading exchange rates from file currency.xml
   [junit4]   2> 1233712 T2369 oasc.JmxMonitoredMap.<init> JMX monitoring is enabled. Adding Solr mbeans to JMX Server: com.sun.jmx.mbeanserver.JmxMBeanServer@2d6bcf8a
   [junit4]   2> 1233712 T2429 oass.OpenExchangeRatesOrgProvider$OpenExchangeRates.<init> WARN Unknown key IMPORTANT NOTE
   [junit4]   2> 1233713 T2429 oass.OpenExchangeRatesOrgProvider$OpenExchangeRates.<init> WARN Expected key, got STRING
   [junit4]   2> 1233714 T2429 oass.OpenExchangeRatesOrgProvider.reload Reloading exchange rates from open-exchange-rates.json
   [junit4]   2> 1233714 T2369 oasc.CachingDirectoryFactory.get return new directory for /usr/home/hudson/hudson-slave/workspace/Lucene-Solr-Tests-4.x-Java7/solr/build/solr-core/test/J0/./org.apache.solr.cloud.CollectionsAPIDistributedZkTest-controljetty-1375539177092//nodes_used_collection_shard1_replica1/data
   [junit4]   2> 1233714 T2369 oasc.SolrCore.getNewIndexDir New index directory detected: old=null new=/usr/home/hudson/hudson-slave/workspace/Lucene-Solr-Tests-4.x-Java7/solr/build/solr-core/test/J0/./org.apache.solr.cloud.CollectionsAPIDistributedZkTest-controljetty-1375539177092//nodes_used_collection_shard1_replica1/data/index/
   [junit4]   2> 1233715 T2369 oasc.SolrCore.initIndex WARN [nodes_used_collection_shard1_replica1] Solr index directory '/usr/home/hudson/hudson-slave/workspace/Lucene-Solr-Tests-4.x-Java7/solr/build/solr-core/test/J0/./org.apache.solr.cloud.CollectionsAPIDistributedZkTest-controljetty-1375539177092/nodes_used_collection_shard1_replica1/data/index' doesn't exist. Creating new index...
   [junit4]   2> 1233715 T2429 oass.OpenExchangeRatesOrgProvider$OpenExchangeRates.<init> WARN Unknown key IMPORTANT NOTE
   [junit4]   2> 1233715 T2369 oasc.CachingDirectoryFactory.get return new directory for /usr/home/hudson/hudson-slave/workspace/Lucene-Solr-Tests-4.x-Java7/solr/build/solr-core/test/J0/./org.apache.solr.cloud.CollectionsAPIDistributedZkTest-controljetty-1375539177092//nodes_used_collection_shard1_replica1/data/index
   [junit4]   2> 1233716 T2429 oass.OpenExchangeRatesOrgProvider$OpenExchangeRates.<init> WARN Expected key, got STRING
   [junit4]   2> 1233716 T2429 oasc.SolrCore.initDirectoryFactory org.apache.solr.core.MockDirectoryFactory
   [junit4]   2> 1233717 T2429 oasc.SolrCore.<init> [nodes_used_collection_shard2_replica2] Opening new SolrCore at /usr/home/hudson/hudson-slave/workspace/Lucene-Solr-Tests-4.x-Java7/solr/build/solr-core/test/J0/./org.apache.solr.cloud.CollectionsAPIDistributedZkTest-jetty4-1375539183241/nodes_used_collection_shard2_replica2/, dataDir=/usr/home/hudson/hudson-slave/workspace/Lucene-Solr-Tests-4.x-Java7/solr/build/solr-core/test/J0/./org.apache.solr.cloud.CollectionsAPIDistributedZkTest-jetty4-1375539183241//nodes_used_collection_shard2_replica2/data/
   [junit4]   2> 1233717 T2415 oass.FileExchangeRateProvider.reload Reloading exchange rates from file currency.xml
   [junit4]   2> 1233717 T2429 oasc.JmxMonitoredMap.<init> JMX monitoring is enabled. Adding Solr mbeans to JMX Server: com.sun.jmx.mbeanserver.JmxMBeanServer@2d6bcf8a
   [junit4]   2> 1233719 T2429 oasc.CachingDirectoryFactory.get return new directory for /usr/home/hudson/hudson-slave/workspace/Lucene-Solr-Tests-4.x-Java7/solr/build/solr-core/test/J0/./org.apache.solr.cloud.CollectionsAPIDistributedZkTest-jetty4-1375539183241//nodes_used_collection_shard2_replica2/data
   [junit4]   2> 1233719 T2429 oasc.SolrCore.getNewIndexDir New index directory detected: old=null new=/usr/home/hudson/hudson-slave/workspace/Lucene-Solr-Tests-4.x-Java7/solr/build/solr-core/test/J0/./org.apache.solr.cloud.CollectionsAPIDistributedZkTest-jetty4-1375539183241//nodes_used_collection_shard2_replica2/data/index/
   [junit4]   2> 1233720 T2429 oasc.SolrCore.initIndex WARN [nodes_used_collection_shard2_replica2] Solr index directory '/usr/home/hudson/hudson-slave/workspace/Lucene-Solr-Tests-4.x-Java7/solr/build/solr-core/test/J0/./org.apache.solr.cloud.CollectionsAPIDistributedZkTest-jetty4-1375539183241/nodes_used_collection_shard2_replica2/data/index' doesn't exist. Creating new index...
   [junit4]   2> 1233720 T2429 oasc.CachingDirectoryFactory.get return new directory for /usr/home/hudson/hudson-slave/workspace/Lucene-Solr-Tests-4.x-Java7/solr/build/solr-core/test/J0/./org.apache.solr.cloud.CollectionsAPIDistributedZkTest-jetty4-1375539183241//nodes_used_collection_shard2_replica2/data/index
   [junit4]   2> 1233720 T2369 oasc.SolrDeletionPolicy.onCommit SolrDeletionPolicy.onCommit: commits: num=1
   [junit4]   2> 		commit{dir=BaseDirectoryWrapper(org.apache.lucene.store.RAMDirectory@50fbcea2 lockFactory=org.apache.lucene.store.NativeFSLockFactory@7460fa9),segFN=segments_1,generation=1}
   [junit4]   2> 1233721 T2388 oass.FileExchangeRateProvider.reload Reloading exchange rates from file currency.xml
   [junit4]   2> 1233721 T2369 oasc.SolrDeletionPolicy.updateCommits newest commit generation = 1
   [junit4]   2> 1233722 T2415 oass.OpenExchangeRatesOrgProvider.reload Reloading exchange rates from open-exchange-rates.json
   [junit4]   2> 1233723 T2415 oass.OpenExchangeRatesOrgProvider$OpenExchangeRates.<init> WARN Unknown key IMPORTANT NOTE
   [junit4]   2> 1233723 T2415 oass.OpenExchangeRatesOrgProvider$OpenExchangeRates.<init> WARN Expected key, got STRING
   [junit4]   2> 1233724 T2415 oass.OpenExchangeRatesOrgProvider.reload Reloading exchange rates from open-exchange-rates.json
   [junit4]   2> 1233725 T2415 oass.OpenExchangeRatesOrgProvider$OpenExchangeRates.<init> WARN Unknown key IMPORTANT NOTE
   [junit4]   2> 1233725 T2415 oass.OpenExchangeRatesOrgProvider$OpenExchangeRates.<init> WARN Expected key, got STRING
   [junit4]   2> 1233725 T2415 oasc.SolrCore.initDirectoryFactory org.apache.solr.core.MockDirectoryFactory
   [junit4]   2> 1233726 T2415 oasc.SolrCore.<init> [nodes_used_collection_shard1_replica2] Opening new SolrCore at /usr/home/hudson/hudson-slave/workspace/Lucene-Solr-Tests-4.x-Java7/solr/build/solr-core/test/J0/./org.apache.solr.cloud.CollectionsAPIDistributedZkTest-jetty3-1375539181424/nodes_used_collection_shard1_replica2/, dataDir=/usr/home/hudson/hudson-slave/workspace/Lucene-Solr-Tests-4.x-Java7/solr/build/solr-core/test/J0/./org.apache.solr.cloud.CollectionsAPIDistributedZkTest-jetty3-1375539181424//nodes_used_collection_shard1_replica2/data/
   [junit4]   2> 1233726 T2415 oasc.JmxMonitoredMap.<init> JMX monitoring is enabled. Adding Solr mbeans to JMX Server: com.sun.jmx.mbeanserver.JmxMBeanServer@2d6bcf8a
   [junit4]   2> 1233727 T2369 oasup.UpdateRequestProcessorChain.init inserting DistributedUpdateProcessorFactory into updateRequestProcessorChain "dedupe"
   [junit4]   2> 1233727 T2415 oasc.CachingDirectoryFactory.get return new directory for /usr/home/hudson/hudson-slave/workspace/Lucene-Solr-Tests-4.x-Java7/solr/build/solr-core/test/J0/./org.apache.solr.cloud.CollectionsAPIDistributedZkTest-jetty3-1375539181424//nodes_used_collection_shard1_replica2/data
   [junit4]   2> 1233727 T2429 oasc.SolrDeletionPolicy.onCommit SolrDeletionPolicy.onCommit: commits: num=1
   [junit4]   2> 		commit{dir=BaseDirectoryWrapper(org.apache.lucene.store.RAMDirectory@7b2d911c lockFactory=org.apache.lucene.store.NativeFSLockFactory@1f35bf0d),segFN=segments_1,generation=1}
   [junit4]   2> 1233727 T2369 oasup.UpdateRequestProcessorChain.init inserting DistributedUpdateProcessorFactory into updateRequestProcessorChain "stored_sig"
   [junit4]   2> 1233728 T2429 oasc.SolrDeletionPolicy.updateCommits newest commit generation = 1
   [junit4]   2> 1233727 T2415 oasc.SolrCore.getNewIndexDir New index directory detected: old=null new=/usr/home/hudson/hudson-slave/workspace/Lucene-Solr-Tests-4.x-Java7/solr/build/solr-core/test/J0/./org.apache.solr.cloud.CollectionsAPIDistributedZkTest-jetty3-1375539181424//nodes_used_collection_shard1_replica2/data/index/
   [junit4]   2> 1233729 T2369 oasup.UpdateRequestProcessorChain.init inserting DistributedUpdateProcessorFactory into updateRequestProcessorChain "distrib-dup-test-chain-implicit"
   [junit4]   2> 1233729 T2415 oasc.SolrCore.initIndex WARN [nodes_used_collection_shard1_replica2] Solr index directory '/usr/home/hudson/hudson-slave/workspace/Lucene-Solr-Tests-4.x-Java7/solr/build/solr-core/test/J0/./org.apache.solr.cloud.CollectionsAPIDistributedZkTest-jetty3-1375539181424/nodes_used_collection_shard1_replica2/data/index' doesn't exist. Creating new index...
   [junit4]   2> 1233730 T2369 oasc.RequestHandlers.initHandlersFromConfig created standard: solr.StandardRequestHandler
   [junit4]   2> 1233730 T2415 oasc.CachingDirectoryFactory.get return new directory for /usr/home/hudson/hudson-slave/workspace/Lucene-Solr-Tests-4.x-Java7/solr/build/solr-core/test/J0/./org.apache.solr.cloud.CollectionsAPIDistributedZkTest-jetty3-1375539181424//nodes_used_collection_shard1_replica2/data/index
   [junit4]   2> 1233730 T2369 oasc.RequestHandlers.initHandlersFromConfig created /get: solr.RealTimeGetHandler
   [junit4]   2> 1233731 T2369 oasc.RequestHandlers.initHandlersFromConfig adding lazy requestHandler: solr.ReplicationHandler
   [junit4]   2> 1233731 T2369 oasc.RequestHandlers.initHandlersFromConfig created /replication: solr.ReplicationHandler
   [junit4]   2> 1233732 T2369 oasc.RequestHandlers.initHandlersFromConfig created /update: solr.UpdateRequestHandler
   [junit4]   2> 1233732 T2369 oasc.RequestHandlers.initHandlersFromConfig created /admin/: org.apache.solr.handler.admin.AdminHandlers
   [junit4]   2> 1233734 T2429 oasup.UpdateRequestProcessorChain.init inserting DistributedUpdateProcessorFactory into updateRequestProcessorChain "dedupe"
   [junit4]   2> 1233734 T2429 oasup.UpdateRequestProcessorChain.init inserting DistributedUpdateProcessorFactory into updateRequestProcessorChain "stored_sig"
   [junit4]   2> 1233735 T2415 oasc.SolrDeletionPolicy.onCommit SolrDeletionPolicy.onCommit: commits: num=1
   [junit4]   2> 		commit{dir=BaseDirectoryWrapper(org.apache.lucene.store.RAMDirectory@55aecb52 lockFactory=org.apache.lucene.store.NativeFSLockFactory@6a217c9a),segFN=segments_1,generation=1}
   [junit4]   2> 1233735 T2429 oasup.UpdateRequestProcessorChain.init inserting DistributedUpdateProcessorFactory into updateRequestProcessorChain "distrib-dup-test-chain-implicit"
   [junit4]   2> 1233735 T2415 oasc.SolrDeletionPolicy.updateCommits newest commit generation = 1
   [junit4]   2> 1233736 T2429 oasc.RequestHandlers.initHandlersFromConfig created standard: solr.StandardRequestHandler
   [junit4]   2> 1233737 T2429 oasc.RequestHandlers.initHandlersFromConfig created /get: solr.RealTimeGetHandler
   [junit4]   2> 1233737 T2429 oasc.RequestHandlers.initHandlersFromConfig adding lazy requestHandler: solr.ReplicationHandler
   [junit4]   2> 1233738 T2429 oasc.RequestHandlers.initHandlersFromConfig created /replication: solr.ReplicationHandler
   [junit4]   2> 1233738 T2429 oasc.RequestHandlers.initHandlersFromConfig created /update: solr.UpdateRequestHandler
   [junit4]   2> 1233739 T2429 oasc.RequestHandlers.initHandlersFromConfig created /admin/: org.apache.solr.handler.admin.AdminHandlers
   [junit4]   2> 1233741 T2415 oasup.UpdateRequestProcessorChain.init inserting DistributedUpdateProcessorFactory into updateRequestProcessorChain "dedupe"
   [junit4]   2> 1233741 T2415 oasup.UpdateRequestProcessorChain.init inserting DistributedUpdateProcessorFactory into updateRequestProcessorChain "stored_sig"
   [junit4]   2> 1233742 T2415 oasup.UpdateRequestProcessorChain.init inserting DistributedUpdateProcessorFactory into updateRequestProcessorChain "distrib-dup-test-chain-implicit"
   [junit4]   2> 1233742 T2415 oasc.RequestHandlers.initHandlersFromConfig created standard: solr.StandardRequestHandler
   [junit4]   2> 1233743 T2415 oasc.RequestHandlers.initHandlersFromConfig created /get: solr.RealTimeGetHandler
   [junit4]   2> 1233743 T2415 oasc.RequestHandlers.initHandlersFromConfig adding lazy requestHandler: solr.ReplicationHandler
   [junit4]   2> 1233744 T2415 oasc.RequestHandlers.initHandlersFromConfig created /replication: solr.ReplicationHandler
   [junit4]   2> 1233744 T2415 oasc.RequestHandlers.initHandlersFromConfig created /update: solr.UpdateRequestHandler
   [junit4]   2> 1233745 T2415 oasc.RequestHandlers.initHandlersFromConfig created /admin/: org.apache.solr.handler.admin.AdminHandlers
   [junit4]   2> 1233751 T2388 oass.FileExchangeRateProvider.reload Reloading exchange rates from file currency.xml
   [junit4]   2> 1233756 T2369 oashl.XMLLoader.init xsltCacheLifetimeSeconds=60
   [junit4]   2> 1233756 T2415 oashl.XMLLoader.init xsltCacheLifetimeSeconds=60
   [junit4]   2> 1233757 T2429 oashl.XMLLoader.init xsltCacheLifetimeSeconds=60
   [junit4]   2> 1233759 T2369 oass.SolrIndexSearcher.<init> Opening Searcher@383fd747 main
   [junit4]   2> 1233760 T2415 oass.SolrIndexSearcher.<init> Opening Searcher@579fdf62 main
   [junit4]   2> 1233761 T2369 oasu.CommitTracker.<init> Hard AutoCommit: disabled
   [junit4]   2> 1233762 T2429 oass.SolrIndexSearcher.<init> Opening Searcher@2b2d9fb2 main
   [junit4]   2> 1233762 T2369 oasu.CommitTracker.<init> Soft AutoCommit: disabled
   [junit4]   2> 1233762 T2415 oasu.CommitTracker.<init> Hard AutoCommit: disabled
   [junit4]   2> 1233763 T2415 oasu.CommitTracker.<init> Soft AutoCommit: disabled
   [junit4]   2> 1233764 T2429 oasu.CommitTracker.<init> Hard AutoCommit: disabled
   [junit4]   2> 1233764 T2429 oasu.CommitTracker.<init> Soft AutoCommit: disabled
   [junit4]   2> 1233766 T2445 oasc.SolrCore.registerSearcher [nodes_used_collection_shard1_replica1] Registered new searcher Searcher@383fd747 main{StandardDirectoryReader(segments_1:1)}
   [junit4]   2> 1233766 T2446 oasc.SolrCore.registerSearcher [nodes_used_collection_shard1_replica2] Registered new searcher Searcher@579fdf62 main{StandardDirectoryReader(segments_1:1)}
   [junit4]   2> 1233768 T2447 oasc.SolrCore.registerSearcher [nodes_used_collection_shard2_replica2] Registered new searcher Searcher@2b2d9fb2 main{StandardDirectoryReader(segments_1:1)}
   [junit4]   2> 1233768 T2369 oasc.CoreContainer.registerCore registering core: nodes_used_collection_shard1_replica1
   [junit4]   2> 1233768 T2415 oasc.CoreContainer.registerCore registering core: nodes_used_collection_shard1_replica2
   [junit4]   2> 1233769 T2369 oasc.ZkController.register Register replica - core:nodes_used_collection_shard1_replica1 address:http://127.0.0.1:22902 collection:nodes_used_collection shard:shard1
   [junit4]   2> 1233769 T2415 oasc.ZkController.register Register replica - core:nodes_used_collection_shard1_replica2 address:http://127.0.0.1:26387 collection:nodes_used_collection shard:shard1
   [junit4]   2> 1233769 T2388 oass.OpenExchangeRatesOrgProvider.reload Reloading exchange rates from open-exchange-rates.json
   [junit4]   2> 1233769 T2369 oascsi.HttpClientUtil.createClient Creating new http client, config:maxConnections=10000&maxConnectionsPerHost=20&connTimeout=15000&socketTimeout=30000&retry=false
   [junit4]   2> 1233770 T2429 oasc.CoreContainer.registerCore registering core: nodes_used_collection_shard2_replica2
   [junit4]   2> 1233770 T2415 oascsi.HttpClientUtil.createClient Creating new http client, config:maxConnections=10000&maxConnectionsPerHost=20&connTimeout=15000&socketTimeout=30000&retry=false
   [junit4]   2> 1233771 T2388 oass.OpenExchangeRatesOrgProvider$OpenExchangeRates.<init> WARN Unknown key IMPORTANT NOTE
   [junit4]   2> 1233771 T2388 oass.OpenExchangeRatesOrgProvider$OpenExchangeRates.<init> WARN Expected key, got STRING
   [junit4]   2> 1233770 T2429 oasc.ZkController.register Register replica - core:nodes_used_collection_shard2_replica2 address:http://127.0.0.1:41067 collection:nodes_used_collection shard:shard2
   [junit4]   2> 1233772 T2388 oass.OpenExchangeRatesOrgProvider.reload Reloading exchange rates from open-exchange-rates.json
   [junit4]   2> 1233772 T2429 oascsi.HttpClientUtil.createClient Creating new http client, config:maxConnections=10000&maxConnectionsPerHost=20&connTimeout=15000&socketTimeout=30000&retry=false
   [junit4]   2> 1233773 T2388 oass.OpenExchangeRatesOrgProvider$OpenExchangeRates.<init> WARN Unknown key IMPORTANT NOTE
   [junit4]   2> 1233773 T2388 oass.OpenExchangeRatesOrgProvider$OpenExchangeRates.<init> WARN Expected key, got STRING
   [junit4]   2> 1233774 T2388 oasc.SolrCore.initDirectoryFactory org.apache.solr.core.MockDirectoryFactory
   [junit4]   2> 1233774 T2388 oasc.SolrCore.<init> [nodes_used_collection_shard2_replica1] Opening new SolrCore at /usr/home/hudson/hudson-slave/workspace/Lucene-Solr-Tests-4.x-Java7/solr/build/solr-core/test/J0/./org.apache.solr.cloud.CollectionsAPIDistributedZkTest-jetty1-1375539177931/nodes_used_collection_shard2_replica1/, dataDir=/usr/home/hudson/hudson-slave/workspace/Lucene-Solr-Tests-4.x-Java7/solr/build/solr-core/test/J0/./org.apache.solr.cloud.CollectionsAPIDistributedZkTest-jetty1-1375539177931//nodes_used_collection_shard2_replica1/data/
   [junit4]   2> 1233774 T2388 oasc.JmxMonitoredMap.<init> JMX monitoring is enabled. Adding Solr mbeans to JMX Server: com.sun.jmx.mbeanserver.JmxMBeanServer@2d6bcf8a
   [junit4]   2> 1233776 T2388 oasc.CachingDirectoryFactory.get return new directory for /usr/home/hudson/hudson-slave/workspace/Lucene-Solr-Tests-4.x-Java7/solr/build/solr-core/test/J0/./org.apache.solr.cloud.CollectionsAPIDistributedZkTest-jetty1-1375539177931//nodes_used_collection_shard2_replica1/data
   [junit4]   2> 1233776 T2388 oasc.SolrCore.getNewIndexDir New index directory detected: old=null new=/usr/home/hudson/hudson-slave/workspace/Lucene-Solr-Tests-4.x-Java7/solr/build/solr-core/test/J0/./org.apache.solr.cloud.CollectionsAPIDistributedZkTest-jetty1-1375539177931//nodes_used_collection_shard2_replica1/data/index/
   [junit4]   2> 1233776 T2388 oasc.SolrCore.initIndex WARN [nodes_used_collection_shard2_replica1] Solr index directory '/usr/home/hudson/hudson-slave/workspace/Lucene-Solr-Tests-4.x-Java7/solr/build/solr-core/test/J0/./org.apache.solr.cloud.CollectionsAPIDistributedZkTest-jetty1-1375539177931/nodes_used_collection_shard2_replica1/data/index' doesn't exist. Creating new index...
   [junit4]   2> 1233777 T2388 oasc.CachingDirectoryFactory.get return new directory for /usr/home/hudson/hudson-slave/workspace/Lucene-Solr-Tests-4.x-Java7/solr/build/solr-core/test/J0/./org.apache.solr.cloud.CollectionsAPIDistributedZkTest-jetty1-1375539177931//nodes_used_collection_shard2_replica1/data/index
   [junit4]   2> 1233781 T2388 oasc.SolrDeletionPolicy.onCommit SolrDeletionPolicy.onCommit: commits: num=1
   [junit4]   2> 		commit{dir=BaseDirectoryWrapper(org.apache.lucene.store.RAMDirectory@ec5d565 lockFactory=org.apache.lucene.store.NativeFSLockFactory@676e5172),segFN=segments_1,generation=1}
   [junit4]   2> 1233782 T2388 oasc.SolrDeletionPolicy.updateCommits newest commit generation = 1
   [junit4]   2> 1233787 T2388 oasup.UpdateRequestProcessorChain.init inserting DistributedUpdateProcessorFactory into updateRequestProcessorChain "dedupe"
   [junit4]   2> 1233787 T2388 oasup.UpdateRequestProcessorChain.init inserting DistributedUpdateProcessorFactory into updateRequestProcessorChain "stored_sig"
   [junit4]   2> 1233788 T2388 oasup.UpdateRequestProcessorChain.init inserting DistributedUpdateProcessorFactory into updateRequestProcessorChain "distrib-dup-test-chain-implicit"
   [junit4]   2> 1233789 T2388 oasc.RequestHandlers.initHandlersFromConfig created standard: solr.StandardRequestHandler
   [junit4]   2> 1233789 T2388 oasc.RequestHandlers.initHandlersFromConfig created /get: solr.RealTimeGetHandler
   [junit4]   2> 1233790 T2388 oasc.RequestHandlers.initHandlersFromConfig adding lazy requestHandler: solr.ReplicationHandler
   [junit4]   2> 1233790 T2388 oasc.RequestHandlers.initHandlersFromConfig created /replication: solr.ReplicationHandler
   [junit4]   2> 1233791 T2388 oasc.RequestHandlers.initHandlersFromConfig created /update: solr.UpdateRequestHandler
   [junit4]   2> 1233791 T2388 oasc.RequestHandlers.initHandlersFromConfig created /admin/: org.apache.solr.handler.admin.AdminHandlers
   [junit4]   2> 1233792 T2369 oascc.SolrZkClient.makePath makePath: /collections/nodes_used_collection/leader_elect/shard1/election
   [junit4]   2> 1233792 T2415 oascc.SolrZkClient.makePath makePath: /collections/nodes_used_collection/leader_elect/shard1/election
   [junit4]   2> 1233792 T2429 oascc.SolrZkClient.makePath makePath: /collections/nodes_used_collection/leader_elect/shard2/election
   [junit4]   2> 1233807 T2388 oashl.XMLLoader.init xsltCacheLifetimeSeconds=60
   [junit4]   2> 1233814 T2388 oass.SolrIndexSearcher.<init> Opening Searcher@76a8654a main
   [junit4]   2> 1233815 T2388 oasu.CommitTracker.<init> Hard AutoCommit: disabled
   [junit4]   2> 1233816 T2388 oasu.CommitTracker.<init> Soft AutoCommit: disabled
   [junit4]   2> 1233819 T2448 oasc.SolrCore.registerSearcher [nodes_used_collection_shard2_replica1] Registered new searcher Searcher@76a8654a main{StandardDirectoryReader(segments_1:1)}
   [junit4]   2> 1233821 T2388 oasc.CoreContainer.registerCore registering core: nodes_used_collection_shard2_replica1
   [junit4]   2> 1233821 T2388 oasc.ZkController.register Register replica - core:nodes_used_collection_shard2_replica1 address:http://127.0.0.1:11505 collection:nodes_used_collection shard:shard2
   [junit4]   2> 1233822 T2388 oascsi.HttpClientUtil.createClient Creating new http client, config:maxConnections=10000&maxConnectionsPerHost=20&connTimeout=15000&socketTimeout=30000&retry=false
   [junit4]   2> 1233835 T2415 oasc.ShardLeaderElectionContext.runLeaderProcess Running the leader process for shard shard1
   [junit4]   2> 1233837 T2429 oasc.ShardLeaderElectionContext.runLeaderProcess Running the leader process for shard shard2
   [junit4]   2> 1233853 T2415 oasc.ShardLeaderElectionContext.waitForReplicasToComeUp Enough replicas found to continue.
   [junit4]   2> 1233853 T2429 oasc.ShardLeaderElectionContext.waitForReplicasToComeUp Enough replicas found to continue.
   [junit4]   2> 1233853 T2429 oasc.ShardLeaderElectionContext.runLeaderProcess I may be the new leader - try and sync
   [junit4]   2> 1233853 T2415 oasc.ShardLeaderElectionContext.runLeaderProcess I may be the new leader - try and sync
   [junit4]   2> 1233854 T2429 oasc.SyncStrategy.sync Sync replicas to http://127.0.0.1:41067/nodes_used_collection_shard2_replica2/
   [junit4]   2> 1233854 T2415 oasc.SyncStrategy.sync Sync replicas to http://127.0.0.1:26387/nodes_used_collection_shard1_replica2/
   [junit4]   2> 1233854 T2429 oasu.PeerSync.sync PeerSync: core=nodes_used_collection_shard2_replica2 url=http://127.0.0.1:41067 START replicas=[http://127.0.0.1:11505/nodes_used_collection_shard2_replica1/] nUpdates=100
   [junit4]   2> 1233855 T2415 oasu.PeerSync.sync PeerSync: core=nodes_used_collection_shard1_replica2 url=http://127.0.0.1:26387 START replicas=[http://127.0.0.1:22902/nodes_used_collection_shard1_replica1/] nUpdates=100
   [junit4]   2> 1233855 T2429 oasu.PeerSync.sync PeerSync: core=nodes_used_collection_shard2_replica2 url=http://127.0.0.1:41067 DONE.  We have no versions.  sync failed.
   [junit4]   2> 1233856 T2429 oasc.SyncStrategy.syncReplicas Leader's attempt to sync with shard failed, moving to the next candidate
   [junit4]   2> 1233855 T2415 oasu.PeerSync.sync PeerSync: core=nodes_used_collection_shard1_replica2 url=http://127.0.0.1:26387 DONE.  We have no versions.  sync failed.
   [junit4]   2> 1233858 T2415 oasc.SyncStrategy.syncReplicas Leader's attempt to sync with shard failed, moving to the next candidate
   [junit4]   2> 1233856 T2429 oasc.ShardLeaderElectionContext.runLeaderProcess We failed sync, but we have no versions - we can't sync in that case - we were active before, so become leader anyway
   [junit4]   2> 1233858 T2415 oa

[...truncated too long message...]

solr-core/test/J0/./org.apache.solr.cloud.CollectionsAPIDistributedZkTest-jetty4-1375539183241//new_implicit_coll_1_a_replica3/data/index
   [junit4]   2> 1392461 T3034 oasc.Overseer$ClusterStateUpdater.amILeader According to ZK I (id=90147335477067788-127.0.0.1:41067_-n_0000000004) am no longer a leader.
   [junit4]   2> 1392464 T2357 oejsh.ContextHandler.doStop stopped o.e.j.s.ServletContextHandler{/,null}
   [junit4]   2> 1392521 T2357 oas.SolrTestCaseJ4.tearDown ###Ending testDistribSearch
   [junit4]   2> 1392524 T2357 oasc.ZkTestServer.send4LetterWord connecting to 127.0.0.1:17478 17478
   [junit4]   1> client port:0.0.0.0/0.0.0.0:0
   [junit4]   2> NOTE: reproduce with: ant test  -Dtestcase=CollectionsAPIDistributedZkTest -Dtests.method=testDistribSearch -Dtests.seed=C707DA29C275A80C -Dtests.multiplier=3 -Dtests.slow=true -Dtests.locale=sk -Dtests.timezone=Europe/Brussels -Dtests.file.encoding=US-ASCII
   [junit4] ERROR    171s J0 | CollectionsAPIDistributedZkTest.testDistribSearch <<<
   [junit4]    > Throwable #1: org.apache.solr.client.solrj.SolrServerException: IOException occured when talking to server at: http://127.0.0.1:11505
   [junit4]    > 	at __randomizedtesting.SeedInfo.seed([C707DA29C275A80C:46E15431B52AC830]:0)
   [junit4]    > 	at org.apache.solr.client.solrj.impl.HttpSolrServer.request(HttpSolrServer.java:435)
   [junit4]    > 	at org.apache.solr.client.solrj.impl.HttpSolrServer.request(HttpSolrServer.java:180)
   [junit4]    > 	at org.apache.solr.cloud.AbstractFullDistribZkTestBase.createCollection(AbstractFullDistribZkTestBase.java:1535)
   [junit4]    > 	at org.apache.solr.cloud.CollectionsAPIDistributedZkTest.testCustomCollectionsAPI(CollectionsAPIDistributedZkTest.java:677)
   [junit4]    > 	at org.apache.solr.cloud.CollectionsAPIDistributedZkTest.doTest(CollectionsAPIDistributedZkTest.java:159)
   [junit4]    > 	at org.apache.solr.BaseDistributedSearchTestCase.testDistribSearch(BaseDistributedSearchTestCase.java:835)
   [junit4]    > 	at java.lang.Thread.run(Thread.java:724)
   [junit4]    > Caused by: org.apache.http.conn.ConnectTimeoutException: Connect to 127.0.0.1:11505 timed out
   [junit4]    > 	at org.apache.http.conn.scheme.PlainSocketFactory.connectSocket(PlainSocketFactory.java:129)
   [junit4]    > 	at org.apache.http.impl.conn.DefaultClientConnectionOperator.openConnection(DefaultClientConnectionOperator.java:180)
   [junit4]    > 	at org.apache.http.impl.conn.ManagedClientConnectionImpl.open(ManagedClientConnectionImpl.java:294)
   [junit4]    > 	at org.apache.http.impl.client.DefaultRequestDirector.tryConnect(DefaultRequestDirector.java:645)
   [junit4]    > 	at org.apache.http.impl.client.DefaultRequestDirector.execute(DefaultRequestDirector.java:480)
   [junit4]    > 	at org.apache.http.impl.client.AbstractHttpClient.execute(AbstractHttpClient.java:906)
   [junit4]    > 	at org.apache.http.impl.client.AbstractHttpClient.execute(AbstractHttpClient.java:805)
   [junit4]    > 	at org.apache.http.impl.client.AbstractHttpClient.execute(AbstractHttpClient.java:784)
   [junit4]    > 	at org.apache.solr.client.solrj.impl.HttpSolrServer.request(HttpSolrServer.java:365)
   [junit4]    > 	... 45 more
   [junit4]   2> 1392655 T2357 oas.SolrTestCaseJ4.deleteCore ###deleteCore
   [junit4]   2> 170930 T2356 ccr.ThreadLeakControl.checkThreadLeaks WARNING Will linger awaiting termination of 2 leaked thread(s).
   [junit4]   2> 1393764 T2439 oasc.LeaderElector$1.process WARN  org.apache.zookeeper.KeeperException$SessionExpiredException: KeeperErrorCode = Session expired for /collections/new_implicit_coll_1/leader_elect/b/election
   [junit4]   2> 	at org.apache.zookeeper.KeeperException.create(KeeperException.java:127)
   [junit4]   2> 	at org.apache.zookeeper.KeeperException.create(KeeperException.java:51)
   [junit4]   2> 	at org.apache.zookeeper.ZooKeeper.getChildren(ZooKeeper.java:1468)
   [junit4]   2> 	at org.apache.solr.common.cloud.SolrZkClient$6.execute(SolrZkClient.java:235)
   [junit4]   2> 	at org.apache.solr.common.cloud.SolrZkClient$6.execute(SolrZkClient.java:232)
   [junit4]   2> 	at org.apache.solr.common.cloud.ZkCmdExecutor.retryOperation(ZkCmdExecutor.java:65)
   [junit4]   2> 	at org.apache.solr.common.cloud.SolrZkClient.getChildren(SolrZkClient.java:232)
   [junit4]   2> 	at org.apache.solr.cloud.LeaderElector.checkIfIamLeader(LeaderElector.java:84)
   [junit4]   2> 	at org.apache.solr.cloud.LeaderElector.access$000(LeaderElector.java:55)
   [junit4]   2> 	at org.apache.solr.cloud.LeaderElector$1.process(LeaderElector.java:129)
   [junit4]   2> 	at org.apache.zookeeper.ClientCnxn$EventThread.processEvent(ClientCnxn.java:519)
   [junit4]   2> 	at org.apache.zookeeper.ClientCnxn$EventThread.run(ClientCnxn.java:495)
   [junit4]   2> 
   [junit4]   2> 1393764 T2439 oasc.LeaderElector$1.process WARN  org.apache.zookeeper.KeeperException$SessionExpiredException: KeeperErrorCode = Session expired for /collections/new_implicit_coll_1/leader_elect/c/election
   [junit4]   2> 	at org.apache.zookeeper.KeeperException.create(KeeperException.java:127)
   [junit4]   2> 	at org.apache.zookeeper.KeeperException.create(KeeperException.java:51)
   [junit4]   2> 	at org.apache.zookeeper.ZooKeeper.getChildren(ZooKeeper.java:1468)
   [junit4]   2> 	at org.apache.solr.common.cloud.SolrZkClient$6.execute(SolrZkClient.java:235)
   [junit4]   2> 	at org.apache.solr.common.cloud.SolrZkClient$6.execute(SolrZkClient.java:232)
   [junit4]   2> 	at org.apache.solr.common.cloud.ZkCmdExecutor.retryOperation(ZkCmdExecutor.java:65)
   [junit4]   2> 	at org.apache.solr.common.cloud.SolrZkClient.getChildren(SolrZkClient.java:232)
   [junit4]   2> 	at org.apache.solr.cloud.LeaderElector.checkIfIamLeader(LeaderElector.java:84)
   [junit4]   2> 	at org.apache.solr.cloud.LeaderElector.access$000(LeaderElector.java:55)
   [junit4]   2> 	at org.apache.solr.cloud.LeaderElector$1.process(LeaderElector.java:129)
   [junit4]   2> 	at org.apache.zookeeper.ClientCnxn$EventThread.processEvent(ClientCnxn.java:519)
   [junit4]   2> 	at org.apache.zookeeper.ClientCnxn$EventThread.run(ClientCnxn.java:495)
   [junit4]   2> 
   [junit4]   2> 1393765 T2439 oascc.ZkStateReader$2.process A cluster state change: WatchedEvent state:SyncConnected type:NodeChildrenChanged path:/live_nodes, has occurred - updating... (live nodes size: 1)
   [junit4]   2> 1393765 T2439 oascc.ZkStateReader$2.process WARN ZooKeeper watch triggered, but Solr cannot talk to ZK
   [junit4]   2> 1393765 T2439 oascc.ZkStateReader$3.process WARN ZooKeeper watch triggered, but Solr cannot talk to ZK
   [junit4]   2> NOTE: test params are: codec=Lucene41, sim=RandomSimilarityProvider(queryNorm=true,coord=yes): {}, locale=sk, timezone=Europe/Brussels
   [junit4]   2> NOTE: FreeBSD 9.1-RELEASE-p3 amd64/Oracle Corporation 1.7.0_25 (64-bit)/cpus=16,threads=15,free=356989272,total=536870912
   [junit4]   2> NOTE: All tests run in this JVM: [ZkNodePropsTest, PathHierarchyTokenizerFactoryTest, TestDocSet, SOLR749Test, TestSuggestSpellingConverter, TestSearchPerf, PreAnalyzedFieldTest, TestUpdate, TestQueryUtils, TestSolrIndexConfig, ZkCLITest, TestXIncludeConfig, RegexBoostProcessorTest, AliasIntegrationTest, TestCopyFieldCollectionResource, TermsComponentTest, TestStressRecovery, QueryParsingTest, JsonLoaderTest, TestSort, HdfsChaosMonkeySafeLeaderTest, TestWriterPerf, TestFaceting, PrimUtilsTest, OutputWriterTest, TestQuerySenderNoQuery, UnloadDistributedZkTest, TestQueryTypes, HighlighterTest, TestBadConfig, PrimitiveFieldTypeTest, TestMaxScoreQueryParser, TestCollationField, TestRTGBase, DirectUpdateHandlerOptimizeTest, BlockDirectoryTest, TestFoldingMultitermQuery, TestPluginEnable, TestIndexingPerformance, EchoParamsTest, TestJoin, TestElisionMultitermQuery, SpellingQueryConverterTest, UpdateParamsTest, QueryResultKeyTest, SpellCheckCollatorTest, TestClassNameShortening, BasicFunctionalityTest, TestDFRSimilarityFactory, SolrInfoMBeanTest, TestCoreContainer, AnalysisAfterCoreReloadTest, CurrencyFieldXmlFileTest, SoftAutoCommitTest, TestCoreDiscovery, TestSolrDeletionPolicy2, TestQuerySenderListener, TestArbitraryIndexDir, SuggesterTSTTest, TestFastLRUCache, TimeZoneUtilsTest, NoCacheHeaderTest, SpellCheckComponentTest, SystemInfoHandlerTest, ChaosMonkeySafeLeaderTest, BasicDistributedZkTest, TestSolrXml, PreAnalyzedUpdateProcessorTest, AssignTest, TestMultiCoreConfBootstrap, TestSolrCoreProperties, IndexBasedSpellCheckerTest, OpenExchangeRatesOrgProviderTest, TestStressReorder, TestCloudManagedSchemaAddField, TestSystemIdResolver, SynonymTokenizerTest, ShardRoutingCustomTest, SyncSliceTest, CollectionsAPIDistributedZkTest]
   [junit4] Completed on J0 in 172.22s, 1 test, 1 error <<< FAILURES!

[...truncated 494 lines...]
BUILD FAILED
/usr/home/hudson/hudson-slave/workspace/Lucene-Solr-Tests-4.x-Java7/build.xml:395: The following error occurred while executing this line:
/usr/home/hudson/hudson-slave/workspace/Lucene-Solr-Tests-4.x-Java7/build.xml:375: The following error occurred while executing this line:
/usr/home/hudson/hudson-slave/workspace/Lucene-Solr-Tests-4.x-Java7/build.xml:39: The following error occurred while executing this line:
/usr/home/hudson/hudson-slave/workspace/Lucene-Solr-Tests-4.x-Java7/solr/build.xml:181: The following error occurred while executing this line:
/usr/home/hudson/hudson-slave/workspace/Lucene-Solr-Tests-4.x-Java7/solr/common-build.xml:449: The following error occurred while executing this line:
/usr/home/hudson/hudson-slave/workspace/Lucene-Solr-Tests-4.x-Java7/lucene/common-build.xml:1233: The following error occurred while executing this line:
/usr/home/hudson/hudson-slave/workspace/Lucene-Solr-Tests-4.x-Java7/lucene/common-build.xml:876: There were test failures: 321 suites, 1352 tests, 1 error, 34 ignored (6 assumptions)

Total time: 53 minutes 59 seconds
Build step 'Invoke Ant' marked build as failure
Archiving artifacts
Recording test results
Email was triggered for: Failure
Sending email for trigger: Failure



Mime
View raw message