lucene-dev mailing list archives

Site index · List index
Message view « Date » · « Thread »
Top « Date » · « Thread »
From Policeman Jenkins Server <jenk...@thetaphi.de>
Subject [JENKINS] Lucene-Solr-trunk-Linux (32bit/jdk1.7.0_25) - Build # 6822 - Still Failing!
Date Thu, 01 Aug 2013 03:19:14 GMT
Build: http://jenkins.thetaphi.de/job/Lucene-Solr-trunk-Linux/6822/
Java: 32bit/jdk1.7.0_25 -server -XX:+UseParallelGC

1 tests failed.
FAILED:  org.apache.solr.cloud.CollectionsAPIDistributedZkTest.testDistribSearch

Error Message:
collection already exists: awholynewcollection_1

Stack Trace:
org.apache.solr.client.solrj.impl.HttpSolrServer$RemoteSolrException: collection already exists: awholynewcollection_1
	at __randomizedtesting.SeedInfo.seed([262AF3518A09B569:A7CC7D49FD56D555]:0)
	at org.apache.solr.client.solrj.impl.HttpSolrServer.request(HttpSolrServer.java:424)
	at org.apache.solr.client.solrj.impl.HttpSolrServer.request(HttpSolrServer.java:180)
	at org.apache.solr.client.solrj.impl.LBHttpSolrServer.request(LBHttpSolrServer.java:264)
	at org.apache.solr.client.solrj.impl.CloudSolrServer.request(CloudSolrServer.java:318)
	at org.apache.solr.cloud.AbstractFullDistribZkTestBase.createCollection(AbstractFullDistribZkTestBase.java:1537)
	at org.apache.solr.cloud.AbstractFullDistribZkTestBase.createCollection(AbstractFullDistribZkTestBase.java:1551)
	at org.apache.solr.cloud.CollectionsAPIDistributedZkTest.testCollectionsAPI(CollectionsAPIDistributedZkTest.java:448)
	at org.apache.solr.cloud.CollectionsAPIDistributedZkTest.doTest(CollectionsAPIDistributedZkTest.java:155)
	at org.apache.solr.BaseDistributedSearchTestCase.testDistribSearch(BaseDistributedSearchTestCase.java:835)
	at sun.reflect.NativeMethodAccessorImpl.invoke0(Native Method)
	at sun.reflect.NativeMethodAccessorImpl.invoke(NativeMethodAccessorImpl.java:57)
	at sun.reflect.DelegatingMethodAccessorImpl.invoke(DelegatingMethodAccessorImpl.java:43)
	at java.lang.reflect.Method.invoke(Method.java:606)
	at com.carrotsearch.randomizedtesting.RandomizedRunner.invoke(RandomizedRunner.java:1559)
	at com.carrotsearch.randomizedtesting.RandomizedRunner.access$600(RandomizedRunner.java:79)
	at com.carrotsearch.randomizedtesting.RandomizedRunner$6.evaluate(RandomizedRunner.java:737)
	at com.carrotsearch.randomizedtesting.RandomizedRunner$7.evaluate(RandomizedRunner.java:773)
	at com.carrotsearch.randomizedtesting.RandomizedRunner$8.evaluate(RandomizedRunner.java:787)
	at com.carrotsearch.randomizedtesting.rules.SystemPropertiesRestoreRule$1.evaluate(SystemPropertiesRestoreRule.java:53)
	at org.apache.lucene.util.TestRuleSetupTeardownChained$1.evaluate(TestRuleSetupTeardownChained.java:50)
	at org.apache.lucene.util.TestRuleFieldCacheSanity$1.evaluate(TestRuleFieldCacheSanity.java:51)
	at org.apache.lucene.util.AbstractBeforeAfterRule$1.evaluate(AbstractBeforeAfterRule.java:46)
	at com.carrotsearch.randomizedtesting.rules.SystemPropertiesInvariantRule$1.evaluate(SystemPropertiesInvariantRule.java:55)
	at org.apache.lucene.util.TestRuleThreadAndTestName$1.evaluate(TestRuleThreadAndTestName.java:49)
	at org.apache.lucene.util.TestRuleIgnoreAfterMaxFailures$1.evaluate(TestRuleIgnoreAfterMaxFailures.java:70)
	at org.apache.lucene.util.TestRuleMarkFailure$1.evaluate(TestRuleMarkFailure.java:48)
	at com.carrotsearch.randomizedtesting.rules.StatementAdapter.evaluate(StatementAdapter.java:36)
	at com.carrotsearch.randomizedtesting.ThreadLeakControl$StatementRunner.run(ThreadLeakControl.java:358)
	at com.carrotsearch.randomizedtesting.ThreadLeakControl.forkTimeoutingTask(ThreadLeakControl.java:782)
	at com.carrotsearch.randomizedtesting.ThreadLeakControl$3.evaluate(ThreadLeakControl.java:442)
	at com.carrotsearch.randomizedtesting.RandomizedRunner.runSingleTest(RandomizedRunner.java:746)
	at com.carrotsearch.randomizedtesting.RandomizedRunner$3.evaluate(RandomizedRunner.java:648)
	at com.carrotsearch.randomizedtesting.RandomizedRunner$4.evaluate(RandomizedRunner.java:682)
	at com.carrotsearch.randomizedtesting.RandomizedRunner$5.evaluate(RandomizedRunner.java:693)
	at com.carrotsearch.randomizedtesting.rules.StatementAdapter.evaluate(StatementAdapter.java:36)
	at com.carrotsearch.randomizedtesting.rules.SystemPropertiesRestoreRule$1.evaluate(SystemPropertiesRestoreRule.java:53)
	at org.apache.lucene.util.AbstractBeforeAfterRule$1.evaluate(AbstractBeforeAfterRule.java:46)
	at org.apache.lucene.util.TestRuleStoreClassName$1.evaluate(TestRuleStoreClassName.java:42)
	at com.carrotsearch.randomizedtesting.rules.SystemPropertiesInvariantRule$1.evaluate(SystemPropertiesInvariantRule.java:55)
	at com.carrotsearch.randomizedtesting.rules.NoShadowingOrOverridesOnMethodsRule$1.evaluate(NoShadowingOrOverridesOnMethodsRule.java:39)
	at com.carrotsearch.randomizedtesting.rules.NoShadowingOrOverridesOnMethodsRule$1.evaluate(NoShadowingOrOverridesOnMethodsRule.java:39)
	at com.carrotsearch.randomizedtesting.rules.StatementAdapter.evaluate(StatementAdapter.java:36)
	at org.apache.lucene.util.TestRuleAssertionsRequired$1.evaluate(TestRuleAssertionsRequired.java:43)
	at org.apache.lucene.util.TestRuleMarkFailure$1.evaluate(TestRuleMarkFailure.java:48)
	at org.apache.lucene.util.TestRuleIgnoreAfterMaxFailures$1.evaluate(TestRuleIgnoreAfterMaxFailures.java:70)
	at org.apache.lucene.util.TestRuleIgnoreTestSuites$1.evaluate(TestRuleIgnoreTestSuites.java:55)
	at com.carrotsearch.randomizedtesting.rules.StatementAdapter.evaluate(StatementAdapter.java:36)
	at com.carrotsearch.randomizedtesting.ThreadLeakControl$StatementRunner.run(ThreadLeakControl.java:358)
	at java.lang.Thread.run(Thread.java:724)




Build Log:
[...truncated 9785 lines...]
   [junit4] Suite: org.apache.solr.cloud.CollectionsAPIDistributedZkTest
   [junit4]   2> 1774508 T2644 oas.BaseDistributedSearchTestCase.initHostContext Setting hostContext system property: /g_qa/ct
   [junit4]   2> 1774512 T2644 oas.SolrTestCaseJ4.setUp ###Starting testDistribSearch
   [junit4]   2> Creating dataDir: /mnt/ssd/jenkins/workspace/Lucene-Solr-trunk-Linux/solr/build/solr-core/test/J0/./solrtest-CollectionsAPIDistributedZkTest-1375325831350
   [junit4]   2> 1774513 T2644 oasc.ZkTestServer.run STARTING ZK TEST SERVER
   [junit4]   2> 1774514 T2645 oasc.ZkTestServer$ZKServerMain.runFromConfig Starting server
   [junit4]   2> 1774614 T2644 oasc.ZkTestServer.run start zk server on port:43249
   [junit4]   2> 1774615 T2644 oascc.ConnectionManager.waitForConnected Waiting for client to connect to ZooKeeper
   [junit4]   2> 1774630 T2651 oascc.ConnectionManager.process Watcher org.apache.solr.common.cloud.ConnectionManager@cad6b4 name:ZooKeeperConnection Watcher:127.0.0.1:43249 got event WatchedEvent state:SyncConnected type:None path:null path:null type:None
   [junit4]   2> 1774630 T2644 oascc.ConnectionManager.waitForConnected Client is connected to ZooKeeper
   [junit4]   2> 1774630 T2644 oascc.SolrZkClient.makePath makePath: /solr
   [junit4]   2> 1774633 T2644 oascc.ConnectionManager.waitForConnected Waiting for client to connect to ZooKeeper
   [junit4]   2> 1774634 T2653 oascc.ConnectionManager.process Watcher org.apache.solr.common.cloud.ConnectionManager@15dbeac name:ZooKeeperConnection Watcher:127.0.0.1:43249/solr got event WatchedEvent state:SyncConnected type:None path:null path:null type:None
   [junit4]   2> 1774634 T2644 oascc.ConnectionManager.waitForConnected Client is connected to ZooKeeper
   [junit4]   2> 1774635 T2644 oascc.SolrZkClient.makePath makePath: /collections/collection1
   [junit4]   2> 1774636 T2644 oascc.SolrZkClient.makePath makePath: /collections/collection1/shards
   [junit4]   2> 1774638 T2644 oascc.SolrZkClient.makePath makePath: /collections/control_collection
   [junit4]   2> 1774639 T2644 oascc.SolrZkClient.makePath makePath: /collections/control_collection/shards
   [junit4]   2> 1774641 T2644 oasc.AbstractZkTestCase.putConfig put /mnt/ssd/jenkins/workspace/Lucene-Solr-trunk-Linux/solr/build/solr-core/test-files/solr/collection1/conf/solrconfig-tlog.xml to /configs/conf1/solrconfig.xml
   [junit4]   2> 1774641 T2644 oascc.SolrZkClient.makePath makePath: /configs/conf1/solrconfig.xml
   [junit4]   2> 1774644 T2644 oasc.AbstractZkTestCase.putConfig put /mnt/ssd/jenkins/workspace/Lucene-Solr-trunk-Linux/solr/build/solr-core/test-files/solr/collection1/conf/schema.xml to /configs/conf1/schema.xml
   [junit4]   2> 1774644 T2644 oascc.SolrZkClient.makePath makePath: /configs/conf1/schema.xml
   [junit4]   2> 1774646 T2644 oasc.AbstractZkTestCase.putConfig put /mnt/ssd/jenkins/workspace/Lucene-Solr-trunk-Linux/solr/build/solr-core/test-files/solr/collection1/conf/stopwords.txt to /configs/conf1/stopwords.txt
   [junit4]   2> 1774646 T2644 oascc.SolrZkClient.makePath makePath: /configs/conf1/stopwords.txt
   [junit4]   2> 1774648 T2644 oasc.AbstractZkTestCase.putConfig put /mnt/ssd/jenkins/workspace/Lucene-Solr-trunk-Linux/solr/build/solr-core/test-files/solr/collection1/conf/protwords.txt to /configs/conf1/protwords.txt
   [junit4]   2> 1774649 T2644 oascc.SolrZkClient.makePath makePath: /configs/conf1/protwords.txt
   [junit4]   2> 1774650 T2644 oasc.AbstractZkTestCase.putConfig put /mnt/ssd/jenkins/workspace/Lucene-Solr-trunk-Linux/solr/build/solr-core/test-files/solr/collection1/conf/currency.xml to /configs/conf1/currency.xml
   [junit4]   2> 1774650 T2644 oascc.SolrZkClient.makePath makePath: /configs/conf1/currency.xml
   [junit4]   2> 1774652 T2644 oasc.AbstractZkTestCase.putConfig put /mnt/ssd/jenkins/workspace/Lucene-Solr-trunk-Linux/solr/build/solr-core/test-files/solr/collection1/conf/open-exchange-rates.json to /configs/conf1/open-exchange-rates.json
   [junit4]   2> 1774653 T2644 oascc.SolrZkClient.makePath makePath: /configs/conf1/open-exchange-rates.json
   [junit4]   2> 1774658 T2644 oasc.AbstractZkTestCase.putConfig put /mnt/ssd/jenkins/workspace/Lucene-Solr-trunk-Linux/solr/build/solr-core/test-files/solr/collection1/conf/mapping-ISOLatin1Accent.txt to /configs/conf1/mapping-ISOLatin1Accent.txt
   [junit4]   2> 1774659 T2644 oascc.SolrZkClient.makePath makePath: /configs/conf1/mapping-ISOLatin1Accent.txt
   [junit4]   2> 1774661 T2644 oasc.AbstractZkTestCase.putConfig put /mnt/ssd/jenkins/workspace/Lucene-Solr-trunk-Linux/solr/build/solr-core/test-files/solr/collection1/conf/old_synonyms.txt to /configs/conf1/old_synonyms.txt
   [junit4]   2> 1774661 T2644 oascc.SolrZkClient.makePath makePath: /configs/conf1/old_synonyms.txt
   [junit4]   2> 1774663 T2644 oasc.AbstractZkTestCase.putConfig put /mnt/ssd/jenkins/workspace/Lucene-Solr-trunk-Linux/solr/build/solr-core/test-files/solr/collection1/conf/synonyms.txt to /configs/conf1/synonyms.txt
   [junit4]   2> 1774663 T2644 oascc.SolrZkClient.makePath makePath: /configs/conf1/synonyms.txt
   [junit4]   2> 1774739 T2644 oejs.Server.doStart jetty-8.1.10.v20130312
   [junit4]   2> 1774746 T2644 oejs.AbstractConnector.doStart Started SelectChannelConnector@127.0.0.1:41506
   [junit4]   2> 1774746 T2644 oass.SolrDispatchFilter.init SolrDispatchFilter.init()
   [junit4]   2> 1774747 T2644 oasc.SolrResourceLoader.locateSolrHome JNDI not configured for solr (NoInitialContextEx)
   [junit4]   2> 1774747 T2644 oasc.SolrResourceLoader.locateSolrHome using system property solr.solr.home: /mnt/ssd/jenkins/workspace/Lucene-Solr-trunk-Linux/solr/build/solr-core/test/J0/./org.apache.solr.cloud.CollectionsAPIDistributedZkTest-controljetty-1375325831502
   [junit4]   2> 1774747 T2644 oasc.SolrResourceLoader.<init> new SolrResourceLoader for directory: '/mnt/ssd/jenkins/workspace/Lucene-Solr-trunk-Linux/solr/build/solr-core/test/J0/./org.apache.solr.cloud.CollectionsAPIDistributedZkTest-controljetty-1375325831502/'
   [junit4]   2> 1774758 T2644 oasc.ConfigSolr.fromFile Loading container configuration from /mnt/ssd/jenkins/workspace/Lucene-Solr-trunk-Linux/solr/build/solr-core/test/J0/./org.apache.solr.cloud.CollectionsAPIDistributedZkTest-controljetty-1375325831502/solr.xml
   [junit4]   2> 1774790 T2644 oasc.ConfigSolrXml.<init> Config-defined core root directory: 
   [junit4]   2> 1774791 T2644 oasc.CoreContainer.<init> New CoreContainer 7697742
   [junit4]   2> 1774791 T2644 oasc.CoreContainer.load Loading cores into CoreContainer [instanceDir=/mnt/ssd/jenkins/workspace/Lucene-Solr-trunk-Linux/solr/build/solr-core/test/J0/./org.apache.solr.cloud.CollectionsAPIDistributedZkTest-controljetty-1375325831502/]
   [junit4]   2> 1774792 T2644 oashc.HttpShardHandlerFactory.getParameter Setting socketTimeout to: 120000
   [junit4]   2> 1774792 T2644 oashc.HttpShardHandlerFactory.getParameter Setting urlScheme to: http://
   [junit4]   2> 1774793 T2644 oashc.HttpShardHandlerFactory.getParameter Setting connTimeout to: 15000
   [junit4]   2> 1774793 T2644 oashc.HttpShardHandlerFactory.getParameter Setting maxConnectionsPerHost to: 20
   [junit4]   2> 1774793 T2644 oashc.HttpShardHandlerFactory.getParameter Setting corePoolSize to: 0
   [junit4]   2> 1774794 T2644 oashc.HttpShardHandlerFactory.getParameter Setting maximumPoolSize to: 2147483647
   [junit4]   2> 1774794 T2644 oashc.HttpShardHandlerFactory.getParameter Setting maxThreadIdleTime to: 5
   [junit4]   2> 1774794 T2644 oashc.HttpShardHandlerFactory.getParameter Setting sizeOfQueue to: -1
   [junit4]   2> 1774794 T2644 oashc.HttpShardHandlerFactory.getParameter Setting fairnessPolicy to: false
   [junit4]   2> 1774795 T2644 oascsi.HttpClientUtil.createClient Creating new http client, config:maxConnectionsPerHost=20&maxConnections=10000&socketTimeout=120000&connTimeout=15000&retry=false
   [junit4]   2> 1774797 T2644 oasc.ZkContainer.initZooKeeper Zookeeper client=127.0.0.1:43249/solr
   [junit4]   2> 1774798 T2644 oasc.ZkController.checkChrootPath zkHost includes chroot
   [junit4]   2> 1774798 T2644 oascc.ConnectionManager.waitForConnected Waiting for client to connect to ZooKeeper
   [junit4]   2> 1774801 T2664 oascc.ConnectionManager.process Watcher org.apache.solr.common.cloud.ConnectionManager@99702f name:ZooKeeperConnection Watcher:127.0.0.1:43249 got event WatchedEvent state:SyncConnected type:None path:null path:null type:None
   [junit4]   2> 1774801 T2644 oascc.ConnectionManager.waitForConnected Client is connected to ZooKeeper
   [junit4]   2> 1774802 T2644 oascsi.HttpClientUtil.createClient Creating new http client, config:maxConnections=500&maxConnectionsPerHost=16&socketTimeout=120000&connTimeout=15000
   [junit4]   2> 1774804 T2644 oascc.ConnectionManager.waitForConnected Waiting for client to connect to ZooKeeper
   [junit4]   2> 1774805 T2666 oascc.ConnectionManager.process Watcher org.apache.solr.common.cloud.ConnectionManager@1c4e561 name:ZooKeeperConnection Watcher:127.0.0.1:43249/solr got event WatchedEvent state:SyncConnected type:None path:null path:null type:None
   [junit4]   2> 1774805 T2644 oascc.ConnectionManager.waitForConnected Client is connected to ZooKeeper
   [junit4]   2> 1774806 T2644 oascc.SolrZkClient.makePath makePath: /overseer/queue
   [junit4]   2> 1774807 T2644 oascc.SolrZkClient.makePath makePath: /overseer/collection-queue-work
   [junit4]   2> 1774809 T2644 oascc.SolrZkClient.makePath makePath: /live_nodes
   [junit4]   2> 1774810 T2644 oasc.ZkController.createEphemeralLiveNode Register node as live in ZooKeeper:/live_nodes/127.0.0.1:41506_g_qa%2Fct
   [junit4]   2> 1774810 T2644 oascc.SolrZkClient.makePath makePath: /live_nodes/127.0.0.1:41506_g_qa%2Fct
   [junit4]   2> 1774812 T2644 oascc.SolrZkClient.makePath makePath: /overseer_elect/election
   [junit4]   2> 1774815 T2644 oascc.SolrZkClient.makePath makePath: /overseer_elect/leader
   [junit4]   2> 1774817 T2644 oasc.Overseer.start Overseer (id=90133353683484675-127.0.0.1:41506_g_qa%2Fct-n_0000000000) starting
   [junit4]   2> 1774818 T2644 oascc.SolrZkClient.makePath makePath: /overseer/queue-work
   [junit4]   2> 1774820 T2668 oasc.OverseerCollectionProcessor.run Process current queue of collection creations
   [junit4]   2> 1774821 T2644 oascc.SolrZkClient.makePath makePath: /clusterstate.json
   [junit4]   2> 1774822 T2644 oascc.SolrZkClient.makePath makePath: /aliases.json
   [junit4]   2> 1774823 T2644 oascc.ZkStateReader.createClusterStateWatchersAndUpdate Updating cluster state from ZooKeeper... 
   [junit4]   2> 1774824 T2667 oasc.Overseer$ClusterStateUpdater.run Starting to work on the main queue
   [junit4]   2> 1774826 T2644 oasc.CorePropertiesLocator.discover Looking for core definitions underneath /mnt/ssd/jenkins/workspace/Lucene-Solr-trunk-Linux/solr/build/solr-core/test/J0/./org.apache.solr.cloud.CollectionsAPIDistributedZkTest-controljetty-1375325831502
   [junit4]   2> 1774854 T2644 oasc.CorePropertiesLocator.discoverUnder Found core conf in /mnt/ssd/jenkins/workspace/Lucene-Solr-trunk-Linux/solr/build/solr-core/test/J0/./org.apache.solr.cloud.CollectionsAPIDistributedZkTest-controljetty-1375325831502/conf/
   [junit4]   2> 1774854 T2644 oasc.CorePropertiesLocator.discover Found 1 core definitions
   [junit4]   2> 1774855 T2644 oass.SolrDispatchFilter.init user.dir=/mnt/ssd/jenkins/workspace/Lucene-Solr-trunk-Linux/solr/build/solr-core/test/J0
   [junit4]   2> 1774855 T2644 oass.SolrDispatchFilter.init SolrDispatchFilter.init() done
   [junit4]   2> 1774855 T2644 oascsi.HttpClientUtil.createClient Creating new http client, config:maxConnections=128&maxConnectionsPerHost=32&followRedirects=false
   [junit4]   2> 1774858 T2644 oascsi.HttpClientUtil.createClient Creating new http client, config:
   [junit4]   2> 1774859 T2644 oascc.ConnectionManager.waitForConnected Waiting for client to connect to ZooKeeper
   [junit4]   2> 1774860 T2671 oascc.ConnectionManager.process Watcher org.apache.solr.common.cloud.ConnectionManager@18c398b name:ZooKeeperConnection Watcher:127.0.0.1:43249/solr got event WatchedEvent state:SyncConnected type:None path:null path:null type:None
   [junit4]   2> 1774860 T2644 oascc.ConnectionManager.waitForConnected Client is connected to ZooKeeper
   [junit4]   2> 1774860 T2644 oascc.ZkStateReader.createClusterStateWatchersAndUpdate Updating cluster state from ZooKeeper... 
   [junit4]   2> 1774862 T2644 oasc.ChaosMonkey.monkeyLog monkey: init - expire sessions:true cause connection loss:true
   [junit4]   2> 1774929 T2644 oejs.Server.doStart jetty-8.1.10.v20130312
   [junit4]   2> 1774931 T2644 oejs.AbstractConnector.doStart Started SelectChannelConnector@127.0.0.1:37280
   [junit4]   2> 1774931 T2644 oass.SolrDispatchFilter.init SolrDispatchFilter.init()
   [junit4]   2> 1774931 T2644 oasc.SolrResourceLoader.locateSolrHome JNDI not configured for solr (NoInitialContextEx)
   [junit4]   2> 1774932 T2644 oasc.SolrResourceLoader.locateSolrHome using system property solr.solr.home: /mnt/ssd/jenkins/workspace/Lucene-Solr-trunk-Linux/solr/build/solr-core/test/J0/./org.apache.solr.cloud.CollectionsAPIDistributedZkTest-jetty1-1375325831699
   [junit4]   2> 1774932 T2644 oasc.SolrResourceLoader.<init> new SolrResourceLoader for directory: '/mnt/ssd/jenkins/workspace/Lucene-Solr-trunk-Linux/solr/build/solr-core/test/J0/./org.apache.solr.cloud.CollectionsAPIDistributedZkTest-jetty1-1375325831699/'
   [junit4]   2> 1774941 T2644 oasc.ConfigSolr.fromFile Loading container configuration from /mnt/ssd/jenkins/workspace/Lucene-Solr-trunk-Linux/solr/build/solr-core/test/J0/./org.apache.solr.cloud.CollectionsAPIDistributedZkTest-jetty1-1375325831699/solr.xml
   [junit4]   2> 1774974 T2644 oasc.ConfigSolrXml.<init> Config-defined core root directory: 
   [junit4]   2> 1774974 T2644 oasc.CoreContainer.<init> New CoreContainer 6354692
   [junit4]   2> 1774975 T2644 oasc.CoreContainer.load Loading cores into CoreContainer [instanceDir=/mnt/ssd/jenkins/workspace/Lucene-Solr-trunk-Linux/solr/build/solr-core/test/J0/./org.apache.solr.cloud.CollectionsAPIDistributedZkTest-jetty1-1375325831699/]
   [junit4]   2> 1774976 T2644 oashc.HttpShardHandlerFactory.getParameter Setting socketTimeout to: 120000
   [junit4]   2> 1774976 T2644 oashc.HttpShardHandlerFactory.getParameter Setting urlScheme to: http://
   [junit4]   2> 1774976 T2644 oashc.HttpShardHandlerFactory.getParameter Setting connTimeout to: 15000
   [junit4]   2> 1774977 T2644 oashc.HttpShardHandlerFactory.getParameter Setting maxConnectionsPerHost to: 20
   [junit4]   2> 1774977 T2644 oashc.HttpShardHandlerFactory.getParameter Setting corePoolSize to: 0
   [junit4]   2> 1774977 T2644 oashc.HttpShardHandlerFactory.getParameter Setting maximumPoolSize to: 2147483647
   [junit4]   2> 1774977 T2644 oashc.HttpShardHandlerFactory.getParameter Setting maxThreadIdleTime to: 5
   [junit4]   2> 1774978 T2644 oashc.HttpShardHandlerFactory.getParameter Setting sizeOfQueue to: -1
   [junit4]   2> 1774978 T2644 oashc.HttpShardHandlerFactory.getParameter Setting fairnessPolicy to: false
   [junit4]   2> 1774978 T2644 oascsi.HttpClientUtil.createClient Creating new http client, config:maxConnectionsPerHost=20&maxConnections=10000&socketTimeout=120000&connTimeout=15000&retry=false
   [junit4]   2> 1774981 T2644 oasc.ZkContainer.initZooKeeper Zookeeper client=127.0.0.1:43249/solr
   [junit4]   2> 1774981 T2644 oasc.ZkController.checkChrootPath zkHost includes chroot
   [junit4]   2> 1774982 T2644 oascc.ConnectionManager.waitForConnected Waiting for client to connect to ZooKeeper
   [junit4]   2> 1774983 T2682 oascc.ConnectionManager.process Watcher org.apache.solr.common.cloud.ConnectionManager@4e7c54 name:ZooKeeperConnection Watcher:127.0.0.1:43249 got event WatchedEvent state:SyncConnected type:None path:null path:null type:None
   [junit4]   2> 1774983 T2644 oascc.ConnectionManager.waitForConnected Client is connected to ZooKeeper
   [junit4]   2> 1774984 T2644 oascsi.HttpClientUtil.createClient Creating new http client, config:maxConnections=500&maxConnectionsPerHost=16&socketTimeout=120000&connTimeout=15000
   [junit4]   2> 1774987 T2644 oascc.ConnectionManager.waitForConnected Waiting for client to connect to ZooKeeper
   [junit4]   2> 1774987 T2684 oascc.ConnectionManager.process Watcher org.apache.solr.common.cloud.ConnectionManager@1ba6252 name:ZooKeeperConnection Watcher:127.0.0.1:43249/solr got event WatchedEvent state:SyncConnected type:None path:null path:null type:None
   [junit4]   2> 1774988 T2644 oascc.ConnectionManager.waitForConnected Client is connected to ZooKeeper
   [junit4]   2> 1774990 T2644 oascc.ZkStateReader.createClusterStateWatchersAndUpdate Updating cluster state from ZooKeeper... 
   [junit4]   2> 1775992 T2644 oasc.ZkController.createEphemeralLiveNode Register node as live in ZooKeeper:/live_nodes/127.0.0.1:37280_g_qa%2Fct
   [junit4]   2> 1775993 T2644 oascc.SolrZkClient.makePath makePath: /live_nodes/127.0.0.1:37280_g_qa%2Fct
   [junit4]   2> 1775997 T2666 oascc.ZkStateReader$3.process Updating live nodes... (2)
   [junit4]   2> 1775997 T2684 oascc.ZkStateReader$3.process Updating live nodes... (2)
   [junit4]   2> 1775997 T2671 oascc.ZkStateReader$3.process Updating live nodes... (2)
   [junit4]   2> 1776003 T2644 oasc.CorePropertiesLocator.discover Looking for core definitions underneath /mnt/ssd/jenkins/workspace/Lucene-Solr-trunk-Linux/solr/build/solr-core/test/J0/./org.apache.solr.cloud.CollectionsAPIDistributedZkTest-jetty1-1375325831699
   [junit4]   2> 1776025 T2644 oasc.CorePropertiesLocator.discoverUnder Found core conf in /mnt/ssd/jenkins/workspace/Lucene-Solr-trunk-Linux/solr/build/solr-core/test/J0/./org.apache.solr.cloud.CollectionsAPIDistributedZkTest-jetty1-1375325831699/conf/
   [junit4]   2> 1776026 T2644 oasc.CorePropertiesLocator.discover Found 1 core definitions
   [junit4]   2> 1776026 T2644 oass.SolrDispatchFilter.init user.dir=/mnt/ssd/jenkins/workspace/Lucene-Solr-trunk-Linux/solr/build/solr-core/test/J0
   [junit4]   2> 1776026 T2644 oass.SolrDispatchFilter.init SolrDispatchFilter.init() done
   [junit4]   2> 1776027 T2644 oascsi.HttpClientUtil.createClient Creating new http client, config:maxConnections=128&maxConnectionsPerHost=32&followRedirects=false
   [junit4]   2> 1776088 T2644 oejs.Server.doStart jetty-8.1.10.v20130312
   [junit4]   2> 1776089 T2644 oejs.AbstractConnector.doStart Started SelectChannelConnector@127.0.0.1:40811
   [junit4]   2> 1776090 T2644 oass.SolrDispatchFilter.init SolrDispatchFilter.init()
   [junit4]   2> 1776091 T2644 oasc.SolrResourceLoader.locateSolrHome JNDI not configured for solr (NoInitialContextEx)
   [junit4]   2> 1776091 T2644 oasc.SolrResourceLoader.locateSolrHome using system property solr.solr.home: /mnt/ssd/jenkins/workspace/Lucene-Solr-trunk-Linux/solr/build/solr-core/test/J0/./org.apache.solr.cloud.CollectionsAPIDistributedZkTest-jetty2-1375325832866
   [junit4]   2> 1776091 T2644 oasc.SolrResourceLoader.<init> new SolrResourceLoader for directory: '/mnt/ssd/jenkins/workspace/Lucene-Solr-trunk-Linux/solr/build/solr-core/test/J0/./org.apache.solr.cloud.CollectionsAPIDistributedZkTest-jetty2-1375325832866/'
   [junit4]   2> 1776100 T2644 oasc.ConfigSolr.fromFile Loading container configuration from /mnt/ssd/jenkins/workspace/Lucene-Solr-trunk-Linux/solr/build/solr-core/test/J0/./org.apache.solr.cloud.CollectionsAPIDistributedZkTest-jetty2-1375325832866/solr.xml
   [junit4]   2> 1776127 T2644 oasc.ConfigSolrXml.<init> Config-defined core root directory: 
   [junit4]   2> 1776128 T2644 oasc.CoreContainer.<init> New CoreContainer 17096203
   [junit4]   2> 1776128 T2644 oasc.CoreContainer.load Loading cores into CoreContainer [instanceDir=/mnt/ssd/jenkins/workspace/Lucene-Solr-trunk-Linux/solr/build/solr-core/test/J0/./org.apache.solr.cloud.CollectionsAPIDistributedZkTest-jetty2-1375325832866/]
   [junit4]   2> 1776129 T2644 oashc.HttpShardHandlerFactory.getParameter Setting socketTimeout to: 120000
   [junit4]   2> 1776129 T2644 oashc.HttpShardHandlerFactory.getParameter Setting urlScheme to: http://
   [junit4]   2> 1776129 T2644 oashc.HttpShardHandlerFactory.getParameter Setting connTimeout to: 15000
   [junit4]   2> 1776130 T2644 oashc.HttpShardHandlerFactory.getParameter Setting maxConnectionsPerHost to: 20
   [junit4]   2> 1776130 T2644 oashc.HttpShardHandlerFactory.getParameter Setting corePoolSize to: 0
   [junit4]   2> 1776130 T2644 oashc.HttpShardHandlerFactory.getParameter Setting maximumPoolSize to: 2147483647
   [junit4]   2> 1776130 T2644 oashc.HttpShardHandlerFactory.getParameter Setting maxThreadIdleTime to: 5
   [junit4]   2> 1776131 T2644 oashc.HttpShardHandlerFactory.getParameter Setting sizeOfQueue to: -1
   [junit4]   2> 1776131 T2644 oashc.HttpShardHandlerFactory.getParameter Setting fairnessPolicy to: false
   [junit4]   2> 1776131 T2644 oascsi.HttpClientUtil.createClient Creating new http client, config:maxConnectionsPerHost=20&maxConnections=10000&socketTimeout=120000&connTimeout=15000&retry=false
   [junit4]   2> 1776134 T2644 oasc.ZkContainer.initZooKeeper Zookeeper client=127.0.0.1:43249/solr
   [junit4]   2> 1776134 T2644 oasc.ZkController.checkChrootPath zkHost includes chroot
   [junit4]   2> 1776135 T2644 oascc.ConnectionManager.waitForConnected Waiting for client to connect to ZooKeeper
   [junit4]   2> 1776136 T2696 oascc.ConnectionManager.process Watcher org.apache.solr.common.cloud.ConnectionManager@11fa367 name:ZooKeeperConnection Watcher:127.0.0.1:43249 got event WatchedEvent state:SyncConnected type:None path:null path:null type:None
   [junit4]   2> 1776136 T2644 oascc.ConnectionManager.waitForConnected Client is connected to ZooKeeper
   [junit4]   2> 1776137 T2644 oascsi.HttpClientUtil.createClient Creating new http client, config:maxConnections=500&maxConnectionsPerHost=16&socketTimeout=120000&connTimeout=15000
   [junit4]   2> 1776140 T2644 oascc.ConnectionManager.waitForConnected Waiting for client to connect to ZooKeeper
   [junit4]   2> 1776141 T2698 oascc.ConnectionManager.process Watcher org.apache.solr.common.cloud.ConnectionManager@7aa7a name:ZooKeeperConnection Watcher:127.0.0.1:43249/solr got event WatchedEvent state:SyncConnected type:None path:null path:null type:None
   [junit4]   2> 1776141 T2644 oascc.ConnectionManager.waitForConnected Client is connected to ZooKeeper
   [junit4]   2> 1776143 T2644 oascc.ZkStateReader.createClusterStateWatchersAndUpdate Updating cluster state from ZooKeeper... 
   [junit4]   2> 1777146 T2644 oasc.ZkController.createEphemeralLiveNode Register node as live in ZooKeeper:/live_nodes/127.0.0.1:40811_g_qa%2Fct
   [junit4]   2> 1777147 T2644 oascc.SolrZkClient.makePath makePath: /live_nodes/127.0.0.1:40811_g_qa%2Fct
   [junit4]   2> 1777149 T2684 oascc.ZkStateReader$3.process Updating live nodes... (3)
   [junit4]   2> 1777149 T2698 oascc.ZkStateReader$3.process Updating live nodes... (3)
   [junit4]   2> 1777150 T2666 oascc.ZkStateReader$3.process Updating live nodes... (3)
   [junit4]   2> 1777151 T2671 oascc.ZkStateReader$3.process Updating live nodes... (3)
   [junit4]   2> 1777155 T2644 oasc.CorePropertiesLocator.discover Looking for core definitions underneath /mnt/ssd/jenkins/workspace/Lucene-Solr-trunk-Linux/solr/build/solr-core/test/J0/./org.apache.solr.cloud.CollectionsAPIDistributedZkTest-jetty2-1375325832866
   [junit4]   2> 1777198 T2644 oasc.CorePropertiesLocator.discoverUnder Found core conf in /mnt/ssd/jenkins/workspace/Lucene-Solr-trunk-Linux/solr/build/solr-core/test/J0/./org.apache.solr.cloud.CollectionsAPIDistributedZkTest-jetty2-1375325832866/conf/
   [junit4]   2> 1777199 T2644 oasc.CorePropertiesLocator.discover Found 1 core definitions
   [junit4]   2> 1777199 T2644 oass.SolrDispatchFilter.init user.dir=/mnt/ssd/jenkins/workspace/Lucene-Solr-trunk-Linux/solr/build/solr-core/test/J0
   [junit4]   2> 1777200 T2644 oass.SolrDispatchFilter.init SolrDispatchFilter.init() done
   [junit4]   2> 1777200 T2644 oascsi.HttpClientUtil.createClient Creating new http client, config:maxConnections=128&maxConnectionsPerHost=32&followRedirects=false
   [junit4]   2> 1777300 T2644 oejs.Server.doStart jetty-8.1.10.v20130312
   [junit4]   2> 1777309 T2644 oejs.AbstractConnector.doStart Started SelectChannelConnector@127.0.0.1:46222
   [junit4]   2> 1777309 T2644 oass.SolrDispatchFilter.init SolrDispatchFilter.init()
   [junit4]   2> 1777310 T2644 oasc.SolrResourceLoader.locateSolrHome JNDI not configured for solr (NoInitialContextEx)
   [junit4]   2> 1777310 T2644 oasc.SolrResourceLoader.locateSolrHome using system property solr.solr.home: /mnt/ssd/jenkins/workspace/Lucene-Solr-trunk-Linux/solr/build/solr-core/test/J0/./org.apache.solr.cloud.CollectionsAPIDistributedZkTest-jetty3-1375325834041
   [junit4]   2> 1777310 T2644 oasc.SolrResourceLoader.<init> new SolrResourceLoader for directory: '/mnt/ssd/jenkins/workspace/Lucene-Solr-trunk-Linux/solr/build/solr-core/test/J0/./org.apache.solr.cloud.CollectionsAPIDistributedZkTest-jetty3-1375325834041/'
   [junit4]   2> 1777324 T2644 oasc.ConfigSolr.fromFile Loading container configuration from /mnt/ssd/jenkins/workspace/Lucene-Solr-trunk-Linux/solr/build/solr-core/test/J0/./org.apache.solr.cloud.CollectionsAPIDistributedZkTest-jetty3-1375325834041/solr.xml
   [junit4]   2> 1777371 T2644 oasc.ConfigSolrXml.<init> Config-defined core root directory: 
   [junit4]   2> 1777372 T2644 oasc.CoreContainer.<init> New CoreContainer 22233966
   [junit4]   2> 1777372 T2644 oasc.CoreContainer.load Loading cores into CoreContainer [instanceDir=/mnt/ssd/jenkins/workspace/Lucene-Solr-trunk-Linux/solr/build/solr-core/test/J0/./org.apache.solr.cloud.CollectionsAPIDistributedZkTest-jetty3-1375325834041/]
   [junit4]   2> 1777374 T2644 oashc.HttpShardHandlerFactory.getParameter Setting socketTimeout to: 120000
   [junit4]   2> 1777374 T2644 oashc.HttpShardHandlerFactory.getParameter Setting urlScheme to: http://
   [junit4]   2> 1777374 T2644 oashc.HttpShardHandlerFactory.getParameter Setting connTimeout to: 15000
   [junit4]   2> 1777375 T2644 oashc.HttpShardHandlerFactory.getParameter Setting maxConnectionsPerHost to: 20
   [junit4]   2> 1777375 T2644 oashc.HttpShardHandlerFactory.getParameter Setting corePoolSize to: 0
   [junit4]   2> 1777376 T2644 oashc.HttpShardHandlerFactory.getParameter Setting maximumPoolSize to: 2147483647
   [junit4]   2> 1777376 T2644 oashc.HttpShardHandlerFactory.getParameter Setting maxThreadIdleTime to: 5
   [junit4]   2> 1777376 T2644 oashc.HttpShardHandlerFactory.getParameter Setting sizeOfQueue to: -1
   [junit4]   2> 1777377 T2644 oashc.HttpShardHandlerFactory.getParameter Setting fairnessPolicy to: false
   [junit4]   2> 1777377 T2644 oascsi.HttpClientUtil.createClient Creating new http client, config:maxConnectionsPerHost=20&maxConnections=10000&socketTimeout=120000&connTimeout=15000&retry=false
   [junit4]   2> 1777381 T2644 oasc.ZkContainer.initZooKeeper Zookeeper client=127.0.0.1:43249/solr
   [junit4]   2> 1777381 T2644 oasc.ZkController.checkChrootPath zkHost includes chroot
   [junit4]   2> 1777382 T2644 oascc.ConnectionManager.waitForConnected Waiting for client to connect to ZooKeeper
   [junit4]   2> 1777384 T2710 oascc.ConnectionManager.process Watcher org.apache.solr.common.cloud.ConnectionManager@d05bf name:ZooKeeperConnection Watcher:127.0.0.1:43249 got event WatchedEvent state:SyncConnected type:None path:null path:null type:None
   [junit4]   2> 1777384 T2644 oascc.ConnectionManager.waitForConnected Client is connected to ZooKeeper
   [junit4]   2> 1777387 T2644 oascsi.HttpClientUtil.createClient Creating new http client, config:maxConnections=500&maxConnectionsPerHost=16&socketTimeout=120000&connTimeout=15000
   [junit4]   2> 1777395 T2644 oascc.ConnectionManager.waitForConnected Waiting for client to connect to ZooKeeper
   [junit4]   2> 1777398 T2712 oascc.ConnectionManager.process Watcher org.apache.solr.common.cloud.ConnectionManager@d9760d name:ZooKeeperConnection Watcher:127.0.0.1:43249/solr got event WatchedEvent state:SyncConnected type:None path:null path:null type:None
   [junit4]   2> 1777398 T2644 oascc.ConnectionManager.waitForConnected Client is connected to ZooKeeper
   [junit4]   2> 1777401 T2644 oascc.ZkStateReader.createClusterStateWatchersAndUpdate Updating cluster state from ZooKeeper... 
   [junit4]   2> 1778406 T2644 oasc.ZkController.createEphemeralLiveNode Register node as live in ZooKeeper:/live_nodes/127.0.0.1:46222_g_qa%2Fct
   [junit4]   2> 1778407 T2644 oascc.SolrZkClient.makePath makePath: /live_nodes/127.0.0.1:46222_g_qa%2Fct
   [junit4]   2> 1778408 T2666 oascc.ZkStateReader$3.process Updating live nodes... (4)
   [junit4]   2> 1778409 T2684 oascc.ZkStateReader$3.process Updating live nodes... (4)
   [junit4]   2> 1778409 T2712 oascc.ZkStateReader$3.process Updating live nodes... (4)
   [junit4]   2> 1778409 T2671 oascc.ZkStateReader$3.process Updating live nodes... (4)
   [junit4]   2> 1778409 T2698 oascc.ZkStateReader$3.process Updating live nodes... (4)
   [junit4]   2> 1790425 T2644 oasc.CorePropertiesLocator.discover Looking for core definitions underneath /mnt/ssd/jenkins/workspace/Lucene-Solr-trunk-Linux/solr/build/solr-core/test/J0/./org.apache.solr.cloud.CollectionsAPIDistributedZkTest-jetty3-1375325834041
   [junit4]   2> 1790451 T2644 oasc.CorePropertiesLocator.discoverUnder Found core conf in /mnt/ssd/jenkins/workspace/Lucene-Solr-trunk-Linux/solr/build/solr-core/test/J0/./org.apache.solr.cloud.CollectionsAPIDistributedZkTest-jetty3-1375325834041/conf/
   [junit4]   2> 1790452 T2644 oasc.CorePropertiesLocator.discover Found 1 core definitions
   [junit4]   2> 1790452 T2644 oass.SolrDispatchFilter.init user.dir=/mnt/ssd/jenkins/workspace/Lucene-Solr-trunk-Linux/solr/build/solr-core/test/J0
   [junit4]   2> 1790452 T2644 oass.SolrDispatchFilter.init SolrDispatchFilter.init() done
   [junit4]   2> 1790458 T2644 oascsi.HttpClientUtil.createClient Creating new http client, config:maxConnections=128&maxConnectionsPerHost=32&followRedirects=false
   [junit4]   2> 1790522 T2644 oejs.Server.doStart jetty-8.1.10.v20130312
   [junit4]   2> 1790524 T2644 oejs.AbstractConnector.doStart Started SelectChannelConnector@127.0.0.1:46197
   [junit4]   2> 1790525 T2644 oass.SolrDispatchFilter.init SolrDispatchFilter.init()
   [junit4]   2> 1790525 T2644 oasc.SolrResourceLoader.locateSolrHome JNDI not configured for solr (NoInitialContextEx)
   [junit4]   2> 1790526 T2644 oasc.SolrResourceLoader.locateSolrHome using system property solr.solr.home: /mnt/ssd/jenkins/workspace/Lucene-Solr-trunk-Linux/solr/build/solr-core/test/J0/./org.apache.solr.cloud.CollectionsAPIDistributedZkTest-jetty4-1375325847298
   [junit4]   2> 1790526 T2644 oasc.SolrResourceLoader.<init> new SolrResourceLoader for directory: '/mnt/ssd/jenkins/workspace/Lucene-Solr-trunk-Linux/solr/build/solr-core/test/J0/./org.apache.solr.cloud.CollectionsAPIDistributedZkTest-jetty4-1375325847298/'
   [junit4]   2> 1790535 T2644 oasc.ConfigSolr.fromFile Loading container configuration from /mnt/ssd/jenkins/workspace/Lucene-Solr-trunk-Linux/solr/build/solr-core/test/J0/./org.apache.solr.cloud.CollectionsAPIDistributedZkTest-jetty4-1375325847298/solr.xml
   [junit4]   2> 1790564 T2644 oasc.ConfigSolrXml.<init> Config-defined core root directory: 
   [junit4]   2> 1790564 T2644 oasc.CoreContainer.<init> New CoreContainer 28828407
   [junit4]   2> 1790564 T2644 oasc.CoreContainer.load Loading cores into CoreContainer [instanceDir=/mnt/ssd/jenkins/workspace/Lucene-Solr-trunk-Linux/solr/build/solr-core/test/J0/./org.apache.solr.cloud.CollectionsAPIDistributedZkTest-jetty4-1375325847298/]
   [junit4]   2> 1790565 T2644 oashc.HttpShardHandlerFactory.getParameter Setting socketTimeout to: 120000
   [junit4]   2> 1790566 T2644 oashc.HttpShardHandlerFactory.getParameter Setting urlScheme to: http://
   [junit4]   2> 1790566 T2644 oashc.HttpShardHandlerFactory.getParameter Setting connTimeout to: 15000
   [junit4]   2> 1790566 T2644 oashc.HttpShardHandlerFactory.getParameter Setting maxConnectionsPerHost to: 20
   [junit4]   2> 1790566 T2644 oashc.HttpShardHandlerFactory.getParameter Setting corePoolSize to: 0
   [junit4]   2> 1790567 T2644 oashc.HttpShardHandlerFactory.getParameter Setting maximumPoolSize to: 2147483647
   [junit4]   2> 1790567 T2644 oashc.HttpShardHandlerFactory.getParameter Setting maxThreadIdleTime to: 5
   [junit4]   2> 1790567 T2644 oashc.HttpShardHandlerFactory.getParameter Setting sizeOfQueue to: -1
   [junit4]   2> 1790568 T2644 oashc.HttpShardHandlerFactory.getParameter Setting fairnessPolicy to: false
   [junit4]   2> 1790568 T2644 oascsi.HttpClientUtil.createClient Creating new http client, config:maxConnectionsPerHost=20&maxConnections=10000&socketTimeout=120000&connTimeout=15000&retry=false
   [junit4]   2> 1790571 T2644 oasc.ZkContainer.initZooKeeper Zookeeper client=127.0.0.1:43249/solr
   [junit4]   2> 1790571 T2644 oasc.ZkController.checkChrootPath zkHost includes chroot
   [junit4]   2> 1790571 T2644 oascc.ConnectionManager.waitForConnected Waiting for client to connect to ZooKeeper
   [junit4]   2> 1790573 T2724 oascc.ConnectionManager.process Watcher org.apache.solr.common.cloud.ConnectionManager@f6fd88 name:ZooKeeperConnection Watcher:127.0.0.1:43249 got event WatchedEvent state:SyncConnected type:None path:null path:null type:None
   [junit4]   2> 1790573 T2644 oascc.ConnectionManager.waitForConnected Client is connected to ZooKeeper
   [junit4]   2> 1790574 T2644 oascsi.HttpClientUtil.createClient Creating new http client, config:maxConnections=500&maxConnectionsPerHost=16&socketTimeout=120000&connTimeout=15000
   [junit4]   2> 1790576 T2644 oascc.ConnectionManager.waitForConnected Waiting for client to connect to ZooKeeper
   [junit4]   2> 1790577 T2726 oascc.ConnectionManager.process Watcher org.apache.solr.common.cloud.ConnectionManager@1369867 name:ZooKeeperConnection Watcher:127.0.0.1:43249/solr got event WatchedEvent state:SyncConnected type:None path:null path:null type:None
   [junit4]   2> 1790577 T2644 oascc.ConnectionManager.waitForConnected Client is connected to ZooKeeper
   [junit4]   2> 1790580 T2644 oascc.ZkStateReader.createClusterStateWatchersAndUpdate Updating cluster state from ZooKeeper... 
   [junit4]   2> 1791581 T2644 oasc.ZkController.createEphemeralLiveNode Register node as live in ZooKeeper:/live_nodes/127.0.0.1:46197_g_qa%2Fct
   [junit4]   2> 1791583 T2644 oascc.SolrZkClient.makePath makePath: /live_nodes/127.0.0.1:46197_g_qa%2Fct
   [junit4]   2> 1791584 T2726 oascc.ZkStateReader$3.process Updating live nodes... (5)
   [junit4]   2> 1791584 T2666 oascc.ZkStateReader$3.process Updating live nodes... (5)
   [junit4]   2> 1791584 T2684 oascc.ZkStateReader$3.process Updating live nodes... (5)
   [junit4]   2> 1791584 T2712 oascc.ZkStateReader$3.process Updating live nodes... (5)
   [junit4]   2> 1791584 T2698 oascc.ZkStateReader$3.process Updating live nodes... (5)
   [junit4]   2> 1791584 T2671 oascc.ZkStateReader$3.process Updating live nodes... (5)
   [junit4]   2> 1791588 T2644 oasc.CorePropertiesLocator.discover Looking for core definitions underneath /mnt/ssd/jenkins/workspace/Lucene-Solr-trunk-Linux/solr/build/solr-core/test/J0/./org.apache.solr.cloud.CollectionsAPIDistributedZkTest-jetty4-1375325847298
   [junit4]   2> 1791611 T2644 oasc.CorePropertiesLocator.discoverUnder Found core conf in /mnt/ssd/jenkins/workspace/Lucene-Solr-trunk-Linux/solr/build/solr-core/test/J0/./org.apache.solr.cloud.CollectionsAPIDistributedZkTest-jetty4-1375325847298/conf/
   [junit4]   2> 1791611 T2644 oasc.CorePropertiesLocator.discover Found 1 core definitions
   [junit4]   2> 1791612 T2644 oass.SolrDispatchFilter.init user.dir=/mnt/ssd/jenkins/workspace/Lucene-Solr-trunk-Linux/solr/build/solr-core/test/J0
   [junit4]   2> 1791612 T2644 oass.SolrDispatchFilter.init SolrDispatchFilter.init() done
   [junit4]   2> 1791612 T2644 oascsi.HttpClientUtil.createClient Creating new http client, config:maxConnections=128&maxConnectionsPerHost=32&followRedirects=false
   [junit4]   2> 1791615 T2644 oascsi.HttpClientUtil.createClient Creating new http client, config:maxConnections=128&maxConnectionsPerHost=32&followRedirects=false
   [junit4]   2> 1791618 T2680 oasha.CollectionsHandler.handleCreateAction Creating Collection : numShards=2&name=nodes_used_collection&replicationFactor=2&action=CREATE&wt=javabin&version=2
   [junit4]   2> 1791619 T2666 oasc.DistributedQueue$LatchChildWatcher.process Watcher fired on path: /overseer/collection-queue-work state: SyncConnected type NodeChildrenChanged
   [junit4]   2> 1791620 T2668 oasc.OverseerCollectionProcessor.run Overseer Collection Processor: Get the message id:/overseer/collection-queue-work/qn-0000000000 message:{
   [junit4]   2> 	  "operation":"createcollection",
   [junit4]   2> 	  "numShards":"2",
   [junit4]   2> 	  "name":"nodes_used_collection",
   [junit4]   2> 	  "replicationFactor":"2"}
   [junit4]   2> 1791620 T2668 oasc.OverseerCollectionProcessor.processMessage WARN OverseerCollectionProcessor.processMessage : createcollection , {
   [junit4]   2> 	  "operation":"createcollection",
   [junit4]   2> 	  "numShards":"2",
   [junit4]   2> 	  "name":"nodes_used_collection",
   [junit4]   2> 	  "replicationFactor":"2"}
   [junit4]   2> 1792838 T2667 oascc.ZkStateReader.updateClusterState Updating cloud state from ZooKeeper... 
   [junit4]   2> 1792839 T2667 oasc.Overseer$ClusterStateUpdater.buildCollection building a new collection: nodes_used_collection
   [junit4]   2> 1792839 T2667 oasc.Overseer$ClusterStateUpdater.createCollection Create collection nodes_used_collection with shards [shard1, shard2]
   [junit4]   2> 1792842 T2726 oascc.ZkStateReader$2.process A cluster state change: WatchedEvent state:SyncConnected type:NodeDataChanged path:/clusterstate.json, has occurred - updating... (live nodes size: 5)
   [junit4]   2> 1792843 T2684 oascc.ZkStateReader$2.process A cluster state change: WatchedEvent state:SyncConnected type:NodeDataChanged path:/clusterstate.json, has occurred - updating... (live nodes size: 5)
   [junit4]   2> 1792842 T2712 oascc.ZkStateReader$2.process A cluster state change: WatchedEvent state:SyncConnected type:NodeDataChanged path:/clusterstate.json, has occurred - updating... (live nodes size: 5)
   [junit4]   2> 1792842 T2698 oascc.ZkStateReader$2.process A cluster state change: WatchedEvent state:SyncConnected type:NodeDataChanged path:/clusterstate.json, has occurred - updating... (live nodes size: 5)
   [junit4]   2> 1792842 T2666 oascc.ZkStateReader$2.process A cluster state change: WatchedEvent state:SyncConnected type:NodeDataChanged path:/clusterstate.json, has occurred - updating... (live nodes size: 5)
   [junit4]   2> 1792842 T2671 oascc.ZkStateReader$2.process A cluster state change: WatchedEvent state:SyncConnected type:NodeDataChanged path:/clusterstate.json, has occurred - updating... (live nodes size: 5)
   [junit4]   2> 1792923 T2668 oasc.OverseerCollectionProcessor.createCollection going to create cores replicas shardNames [shard1, shard2] , repFactor : 2
   [junit4]   2> 1792923 T2668 oasc.OverseerCollectionProcessor.createCollection Creating shard nodes_used_collection_shard1_replica1 as part of slice shard1 of collection nodes_used_collection on 127.0.0.1:46222_g_qa%2Fct
   [junit4]   2> 1792923 T2668 oasc.OverseerCollectionProcessor.createCollection Creating shard nodes_used_collection_shard1_replica2 as part of slice shard1 of collection nodes_used_collection on 127.0.0.1:46197_g_qa%2Fct
   [junit4]   2> 1792924 T2668 oasc.OverseerCollectionProcessor.createCollection Creating shard nodes_used_collection_shard2_replica1 as part of slice shard2 of collection nodes_used_collection on 127.0.0.1:37280_g_qa%2Fct
   [junit4]   2> 1792925 T2668 oasc.OverseerCollectionProcessor.createCollection Creating shard nodes_used_collection_shard2_replica2 as part of slice shard2 of collection nodes_used_collection on 127.0.0.1:40811_g_qa%2Fct
   [junit4]   2> 1792926 T2678 oasc.ZkController.publish publishing core=nodes_used_collection_shard2_replica1 state=down
   [junit4]   2> 1792926 T2706 oasc.ZkController.publish publishing core=nodes_used_collection_shard1_replica1 state=down
   [junit4]   2> 1792926 T2721 oasc.ZkController.publish publishing core=nodes_used_collection_shard1_replica2 state=down
   [junit4]   2> 1792927 T2678 oasc.ZkController.waitForCoreNodeName look for our core node name
   [junit4]   2> 1792927 T2706 oasc.ZkController.waitForCoreNodeName look for our core node name
   [junit4]   2> 1792927 T2693 oasc.ZkController.publish publishing core=nodes_used_collection_shard2_replica2 state=down
   [junit4]   2> 1792927 T2721 oasc.ZkController.waitForCoreNodeName look for our core node name
   [junit4]   2> 1792928 T2693 oasc.ZkController.waitForCoreNodeName look for our core node name
   [junit4]   2> 1794346 T2667 oascc.ZkStateReader.updateClusterState Updating cloud state from ZooKeeper... 
   [junit4]   2> 1794347 T2667 oasc.Overseer$ClusterStateUpdater.updateState WARN Could not find collection node for nodes_used_collection, skipping publish state
   [junit4]   2> 1794347 T2667 oasc.Overseer$ClusterStateUpdater.updateState Update state numShards=2 message={
   [junit4]   2> 	  "operation":"state",
   [junit4]   2> 	  "core_node_name":"core_node1",
   [junit4]   2> 	  "numShards":"2",
   [junit4]   2> 	  "shard":"shard2",
   [junit4]   2> 	  "roles":null,
   [junit4]   2> 	  "state":"down",
   [junit4]   2> 	  "shard_state":"active",
   [junit4]   2> 	  "core":"nodes_used_collection_shard2_replica1",
   [junit4]   2> 	  "collection":"nodes_used_collection",
   [junit4]   2> 	  "shard_range":null,
   [junit4]   2> 	  "node_name":"127.0.0.1:37280_g_qa%2Fct",
   [junit4]   2> 	  "base_url":"http://127.0.0.1:37280/g_qa/ct"}
   [junit4]   2> 1794350 T2667 oasc.Overseer$ClusterStateUpdater.updateState WARN Could not find collection node for nodes_used_collection, skipping publish state
   [junit4]   2> 1794350 T2667 oasc.Overseer$ClusterStateUpdater.updateState Update state numShards=2 message={
   [junit4]   2> 	  "operation":"state",
   [junit4]   2> 	  "core_node_name":"core_node2",
   [junit4]   2> 	  "numShards":"2",
   [junit4]   2> 	  "shard":"shard1",
   [junit4]   2> 	  "roles":null,
   [junit4]   2> 	  "state":"down",
   [junit4]   2> 	  "shard_state":"active",
   [junit4]   2> 	  "core":"nodes_used_collection_shard1_replica1",
   [junit4]   2> 	  "collection":"nodes_used_collection",
   [junit4]   2> 	  "shard_range":null,
   [junit4]   2> 	  "node_name":"127.0.0.1:46222_g_qa%2Fct",
   [junit4]   2> 	  "base_url":"http://127.0.0.1:46222/g_qa/ct"}
   [junit4]   2> 1794352 T2667 oasc.Overseer$ClusterStateUpdater.updateState WARN Could not find collection node for nodes_used_collection, skipping publish state
   [junit4]   2> 1794352 T2667 oasc.Overseer$ClusterStateUpdater.updateState Update state numShards=2 message={
   [junit4]   2> 	  "operation":"state",
   [junit4]   2> 	  "core_node_name":"core_node3",
   [junit4]   2> 	  "numShards":"2",
   [junit4]   2> 	  "shard":"shard1",
   [junit4]   2> 	  "roles":null,
   [junit4]   2> 	  "state":"down",
   [junit4]   2> 	  "shard_state":"active",
   [junit4]   2> 	  "core":"nodes_used_collection_shard1_replica2",
   [junit4]   2> 	  "collection":"nodes_used_collection",
   [junit4]   2> 	  "shard_range":null,
   [junit4]   2> 	  "node_name":"127.0.0.1:46197_g_qa%2Fct",
   [junit4]   2> 	  "base_url":"http://127.0.0.1:46197/g_qa/ct"}
   [junit4]   2> 1794354 T2667 oasc.Overseer$ClusterStateUpdater.updateState WARN Could not find collection node for nodes_used_collection, skipping publish state
   [junit4]   2> 1794354 T2667 oasc.Overseer$ClusterStateUpdater.updateState Update state numShards=2 message={
   [junit4]   2> 	  "operation":"state",
   [junit4]   2> 	  "core_node_name":"core_node4",
   [junit4]   2> 	  "numShards":"2",
   [junit4]   2> 	  "shard":"shard2",
   [junit4]   2> 	  "roles":null,
   [junit4]   2> 	  "state":"down",
   [junit4]   2> 	  "shard_state":"active",
   [junit4]   2> 	  "core":"nodes_used_collection_shard2_replica2",
   [junit4]   2> 	  "collection":"nodes_used_collection",
   [junit4]   2> 	  "shard_range":null,
   [junit4]   2> 	  "node_name":"127.0.0.1:40811_g_qa%2Fct",
   [junit4]   2> 	  "base_url":"http://127.0.0.1:40811/g_qa/ct"}
   [junit4]   2> 1794360 T2726 oascc.ZkStateReader$2.process A cluster state change: WatchedEvent state:SyncConnected type:NodeDataChanged path:/clusterstate.json, has occurred - updating... (live nodes size: 5)
   [junit4]   2> 1794360 T2666 oascc.ZkStateReader$2.process A cluster state change: WatchedEvent state:SyncConnected type:NodeDataChanged path:/clusterstate.json, has occurred - updating... (live nodes size: 5)
   [junit4]   2> 1794360 T2698 oascc.ZkStateReader$2.process A cluster state change: WatchedEvent state:SyncConnected type:NodeDataChanged path:/clusterstate.json, has occurred - updating... (live nodes size: 5)
   [junit4]   2> 1794360 T2684 oascc.ZkStateReader$2.process A cluster state change: WatchedEvent state:SyncConnected type:NodeDataChanged path:/clusterstate.json, has occurred - updating... (live nodes size: 5)
   [junit4]   2> 1794360 T2671 oascc.ZkStateReader$2.process A cluster state change: WatchedEvent state:SyncConnected type:NodeDataChanged path:/clusterstate.json, has occurred - updating... (live nodes size: 5)
   [junit4]   2> 1794360 T2712 oascc.ZkStateReader$2.process A cluster state change: WatchedEvent state:SyncConnected type:NodeDataChanged path:/clusterstate.json, has occurred - updating... (live nodes size: 5)
   [junit4]   2> 1794927 T2678 oasc.ZkController.waitForShardId waiting to find shard id in clusterstate for nodes_used_collection_shard2_replica1
   [junit4]   2> 1794927 T2706 oasc.ZkController.waitForShardId waiting to find shard id in clusterstate for nodes_used_collection_shard1_replica1
   [junit4]   2> 1794928 T2678 oasc.CorePropertiesLocator.writePropertiesFile ERROR Couldn't persist core properties to /mnt/ssd/jenkins/workspace/Lucene-Solr-trunk-Linux/solr/build/solr-core/test/J0/./org.apache.solr.cloud.CollectionsAPIDistributedZkTest-jetty1-1375325831699/nodes_used_collection_shard2_replica1/core.properties: java.io.FileNotFoundException: /mnt/ssd/jenkins/workspace/Lucene-Solr-trunk-Linux/solr/build/solr-core/test/J0/./org.apache.solr.cloud.CollectionsAPIDistributedZkTest-jetty1-1375325831699/nodes_used_collection_shard2_replica1/core.properties (No such file or directory)
   [junit4]   2> 1794928 T2706 oasc.CorePropertiesLocator.writePropertiesFile ERROR Couldn't persist core properties to /mnt/ssd/jenkins/workspace/Lucene-Solr-trunk-Linux/solr/build/solr-core/test/J0/./org.apache.solr.cloud.CollectionsAPIDistributedZkTest-jetty3-1375325834041/nodes_used_collection_shard1_replica1/core.properties: java.io.FileNotFoundException: /mnt/ssd/jenkins/workspace/Lucene-Solr-trunk-Linux/solr/build/solr-core/test/J0/./org.apache.solr.cloud.CollectionsAPIDistributedZkTest-jetty3-1375325834041/nodes_used_collection_shard1_replica1/core.properties (No such file or directory)
   [junit4]   2> 1794928 T2693 oasc.ZkController.waitForShardId waiting to find shard id in clusterstate for nodes_used_collection_shard2_replica2
   [junit4]   2> 1794928 T2678 oasc.CoreContainer.create Creating SolrCore 'nodes_used_collection_shard2_replica1' using instanceDir: /mnt/ssd/jenkins/workspace/Lucene-Solr-trunk-Linux/solr/build/solr-core/test/J0/./org.apache.solr.cloud.CollectionsAPIDistributedZkTest-jetty1-1375325831699/nodes_used_collection_shard2_replica1
   [junit4]   2> 1794929 T2678 oasc.ZkController.createCollectionZkNode Check for collection zkNode:nodes_used_collection
   [junit4]   2> 1794928 T2721 oasc.ZkController.waitForShardId waiting to find shard id in clusterstate for nodes_used_collection_shard1_replica2
   [junit4]   2> 1794929 T2693 oasc.CorePropertiesLocator.writePropertiesFile ERROR Couldn't persist core properties to /mnt/ssd/jenkins/workspace/Lucene-Solr-trunk-Linux/solr/build/solr-core/test/J0/./org.apache.solr.cloud.CollectionsAPIDistributedZkTest-jetty2-1375325832866/nodes_used_collection_shard2_replica2/core.properties: java.io.FileNotFoundException: /mnt/ssd/jenkins/workspace/Lucene-Solr-trunk-Linux/solr/build/solr-core/test/J0/./org.apache.solr.cloud.CollectionsAPIDistributedZkTest-jetty2-1375325832866/nodes_used_collection_shard2_replica2/core.properties (No such file or directory)
   [junit4]   2> 1794928 T2706 oasc.CoreContainer.create Creating SolrCore 'nodes_used_collection_shard1_replica1' using instanceDir: /mnt/ssd/jenkins/workspace/Lucene-Solr-trunk-Linux/solr/build/solr-core/test/J0/./org.apache.solr.cloud.CollectionsAPIDistributedZkTest-jetty3-1375325834041/nodes_used_collection_shard1_replica1
   [junit4]   2> 1794930 T2693 oasc.CoreContainer.create Creating SolrCore 'nodes_used_collection_shard2_replica2' using instanceDir: /mnt/ssd/jenkins/workspace/Lucene-Solr-trunk-Linux/solr/build/solr-core/test/J0/./org.apache.solr.cloud.CollectionsAPIDistributedZkTest-jetty2-1375325832866/nodes_used_collection_shard2_replica2
   [junit4]   2> 1794930 T2693 oasc.ZkController.createCollectionZkNode Check for collection zkNode:nodes_used_collection
   [junit4]   2> 1794929 T2721 oasc.CorePropertiesLocator.writePropertiesFile ERROR Couldn't persist core properties to /mnt/ssd/jenkins/workspace/Lucene-Solr-trunk-Linux/solr/build/solr-core/test/J0/./org.apache.solr.cloud.CollectionsAPIDistributedZkTest-jetty4-1375325847298/nodes_used_collection_shard1_replica2/core.properties: java.io.FileNotFoundException: /mnt/ssd/jenkins/workspace/Lucene-Solr-trunk-Linux/solr/build/solr-core/test/J0/./org.apache.solr.cloud.CollectionsAPIDistributedZkTest-jetty4-1375325847298/nodes_used_collection_shard1_replica2/core.properties (No such file or directory)
   [junit4]   2> 1794930 T2693 oasc.ZkController.createCollectionZkNode Creating collection in ZooKeeper:nodes_used_collection
   [junit4]   2> 1794929 T2678 oasc.ZkController.createCollectionZkNode Creating collection in ZooKeeper:nodes_used_collection
   [junit4]   2> 1794931 T2693 oasc.ZkController.getConfName Looking for collection configName
   [junit4]   2> 1794930 T2721 oasc.CoreContainer.create Creating SolrCore 'nodes_used_collection_shard1_replica2' using instanceDir: /mnt/ssd/jenkins/workspace/Lucene-Solr-trunk-Linux/solr/build/solr-core/test/J0/./org.apache.solr.cloud.CollectionsAPIDistributedZkTest-jetty4-1375325847298/nodes_used_collection_shard1_replica2
   [junit4]   2> 1794931 T2721 oasc.ZkController.createCollectionZkNode Check for collection zkNode:nodes_used_collection
   [junit4]   2> 1794930 T2706 oasc.ZkController.createCollectionZkNode Check for collection zkNode:nodes_used_collection
   [junit4]   2> 1794932 T2721 oasc.ZkController.createCollectionZkNode Creating collection in ZooKeeper:nodes_used_collection
   [junit4]   2> 1794932 T2706 oasc.ZkController.createCollectionZkNode Creating collection in ZooKeeper:nodes_used_collection
   [junit4]   2> 1794932 T2721 oasc.ZkController.getConfName Looking for collection configName
   [junit4]   2> 1794931 T2693 oasc.ZkController.getConfName Only one config set found in zk - using it:conf1
   [junit4]   2> 1794931 T2678 oasc.ZkController.getConfName Looking for collection configName
   [junit4]   2> 1794933 T2721 oasc.ZkController.getConfName Only one config set found in zk - using it:conf1
   [junit4]   2> 1794933 T2693 oascc.SolrZkClient.makePath makePath: /collections/nodes_used_collection
   [junit4]   2> 1794932 T2706 oasc.ZkController.getConfName Looking for collection configName
   [junit4]   2> 1794933 T2678 oasc.ZkController.getConfName Only one config set found in zk - using it:conf1
   [junit4]   2> 1794933 T2721 oascc.SolrZkClient.makePath makePath: /collections/nodes_used_collection
   [junit4]   2> 1794934 T2678 oascc.SolrZkClient.makePath makePath: /collections/nodes_used_collection
   [junit4]   2> 1794934 T2706 oasc.ZkController.getConfName Only one config set found in zk - using it:conf1
   [junit4]   2> 1794935 T2693 oasc.ZkController.readConfigName Load collection config from:/collections/nodes_used_collection
   [junit4]   2> 1794935 T2706 oascc.SolrZkClient.makePath makePath: /collections/nodes_used_collection
   [junit4]   2> 1794935 T2721 oasc.ZkController.readConfigName Load collection config from:/collections/nodes_used_collection
   [junit4]   2> 1794935 T2693 oasc.SolrResourceLoader.<init> new SolrResourceLoader for directory: '/mnt/ssd/jenkins/workspace/Lucene-Solr-trunk-Linux/solr/build/solr-core/test/J0/./org.apache.solr.cloud.CollectionsAPIDistributedZkTest-jetty2-1375325832866/nodes_used_collection_shard2_replica2/'
   [junit4]   2> 1794935 T2678 oasc.ZkController.readConfigName Load collection config from:/collections/nodes_used_collection
   [junit4]   2> 1794936 T2721 oasc.SolrResourceLoader.<init> new SolrResourceLoader for directory: '/mnt/ssd/jenkins/workspace/Lucene-Solr-trunk-Linux/solr/build/solr-core/test/J0/./org.apache.solr.cloud.CollectionsAPIDistributedZkTest-jetty4-1375325847298/nodes_used_collection_shard1_replica2/'
   [junit4]   2> 1794936 T2706 oasc.ZkController.readConfigName Load collection config from:/collections/nodes_used_collection
   [junit4]   2> 1794937 T2678 oasc.SolrResourceLoader.<init> new SolrResourceLoader for directory: '/mnt/ssd/jenkins/workspace/Lucene-Solr-trunk-Linux/solr/build/solr-core/test/J0/./org.apache.solr.cloud.CollectionsAPIDistributedZkTest-jetty1-1375325831699/nodes_used_collection_shard2_replica1/'
   [junit4]   2> 1794937 T2706 oasc.SolrResourceLoader.<init> new SolrResourceLoader for directory: '/mnt/ssd/jenkins/workspace/Lucene-Solr-trunk-Linux/solr/build/solr-core/test/J0/./org.apache.solr.cloud.CollectionsAPIDistributedZkTest-jetty3-1375325834041/nodes_used_collection_shard1_replica1/'
   [junit4]   2> 1794968 T2678 oasc.SolrConfig.<init> Using Lucene MatchVersion: LUCENE_50
   [junit4]   2> 1794969 T2721 oasc.SolrConfig.<init> Using Lucene MatchVersion: LUCENE_50
   [junit4]   2> 1794975 T2693 oasc.SolrConfig.<init> Using Lucene MatchVersion: LUCENE_50
   [junit4]   2> 1794981 T2706 oasc.SolrConfig.<init> Using Lucene MatchVersion: LUCENE_50
   [junit4]   2> 1795006 T2678 oasc.SolrConfig.<init> Loaded SolrConfig: solrconfig.xml
   [junit4]   2> 1795007 T2678 oass.IndexSchema.readSchema Reading Solr Schema from schema.xml
   [junit4]   2> 1795007 T2721 oasc.SolrConfig.<init> Loaded SolrConfig: solrconfig.xml
   [junit4]   2> 1795008 T2721 oass.IndexSchema.readSchema Reading Solr Schema from schema.xml
   [junit4]   2> 1795016 T2678 oass.IndexSchema.readSchema [nodes_used_collection_shard2_replica1] Schema name=test
   [junit4]   2> 1795017 T2721 oass.IndexSchema.readSchema [nodes_used_collection_shard1_replica2] Schema name=test
   [junit4]   2> 1795020 T2706 oasc.SolrConfig.<init> Loaded SolrConfig: solrconfig.xml
   [junit4]   2> 1795021 T2706 oass.IndexSchema.readSchema Reading Solr Schema from schema.xml
   [junit4]   2> 1795025 T2693 oasc.SolrConfig.<init> Loaded SolrConfig: solrconfig.xml
   [junit4]   2> 1795027 T2693 oass.IndexSchema.readSchema Reading Solr Schema from schema.xml
   [junit4]   2> 1795027 T2706 oass.IndexSchema.readSchema [nodes_used_collection_shard1_replica1] Schema name=test
   [junit4]   2> 1795035 T2693 oass.IndexSchema.readSchema [nodes_used_collection_shard2_replica2] Schema name=test
   [junit4]   2> 1795352 T2706 oass.OpenExchangeRatesOrgProvider.init Initialized with rates=open-exchange-rates.json, refreshInterval=1440.
   [junit4]   2> 1795357 T2706 oass.IndexSchema.readSchema default search field in schema is text
   [junit4]   2> 1795359 T2706 oass.IndexSchema.readSchema unique key field: id
   [junit4]   2> 1795368 T2706 oass.FileExchangeRateProvider.reload Reloading exchange rates from file currency.xml
   [junit4]   2> 1795374 T2706 oass.FileExchangeRateProvider.reload Reloading exchange rates from file currency.xml
   [junit4]   2> 1795377 T2706 oass.OpenExchangeRatesOrgProvider.reload Reloading exchange rates from open-exchange-rates.json
   [junit4]   2> 1795378 T2706 oass.OpenExchangeRatesOrgProvider$OpenExchangeRates.<init> WARN Unknown key IMPORTANT NOTE
   [junit4]   2> 1795378 T2706 oass.OpenExchangeRatesOrgProvider$OpenExchangeRates.<init> WARN Expected key, got STRING
   [junit4]   2> 1795379 T2706 oass.OpenExchangeRatesOrgProvider.reload Reloading exchange rates from open-exchange-rates.json
   [junit4]   2> 1795379 T2706 oass.OpenExchangeRatesOrgProvider$OpenExchangeRates.<init> WARN Unknown key IMPORTANT NOTE
   [junit4]   2> 1795379 T2706 oass.OpenExchangeRatesOrgProvider$OpenExchangeRates.<init> WARN Expected key, got STRING
   [junit4]   2> 1795380 T2706 oasc.SolrCore.initDirectoryFactory org.apache.solr.core.MockDirectoryFactory
   [junit4]   2> 1795380 T2693 oass.OpenExchangeRatesOrgProvider.init Initialized with rates=open-exchange-rates.json, refreshInterval=1440.
   [junit4]   2> 1795380 T2706 oasc.SolrCore.<init> [nodes_used_collection_shard1_replica1] Opening new SolrCore at /mnt/ssd/jenkins/workspace/Lucene-Solr-trunk-Linux/solr/build/solr-core/test/J0/./org.apache.solr.cloud.CollectionsAPIDistributedZkTest-jetty3-1375325834041/nodes_used_collection_shard1_replica1/, dataDir=/mnt/ssd/jenkins/workspace/Lucene-Solr-trunk-Linux/solr/build/solr-core/test/J0/./org.apache.solr.cloud.CollectionsAPIDistributedZkTest-jetty3-1375325834041//nodes_used_collection_shard1_replica1/data/
   [junit4]   2> 1795380 T2706 oasc.JmxMonitoredMap.<init> JMX monitoring is enabled. Adding Solr mbeans to JMX Server: com.sun.jmx.mbeanserver.JmxMBeanServer@1bb9073
   [junit4]   2> 1795381 T2706 oasc.CachingDirectoryFactory.get return new directory for /mnt/ssd/jenkins/workspace/Lucene-Solr-trunk-Linux/solr/build/solr-core/test/J0/./org.apache.solr.cloud.CollectionsAPIDistributedZkTest-jetty3-1375325834041//nodes_used_collection_shard1_replica1/data
   [junit4]   2> 1795381 T2706 oasc.SolrCore.getNewIndexDir New index directory detected: old=null new=/mnt/ssd/jenkins/workspace/Lucene-Solr-trunk-Linux/solr/build/solr-core/test/J0/./org.apache.solr.cloud.CollectionsAPIDistributedZkTest-jetty3-1375325834041//nodes_used_collection_shard1_replica1/data/index/
   [junit4]   2> 1795382 T2706 oasc.SolrCore.initIndex WARN [nodes_used_collection_shard1_replica1] Solr index directory '/mnt/ssd/jenkins/workspace/Lucene-Solr-trunk-Linux/solr/build/solr-core/test/J0/./org.apache.solr.cloud.CollectionsAPIDistributedZkTest-jetty3-1375325834041/nodes_used_collection_shard1_replica1/data/index' doesn't exist. Creating new index...
   [junit4]   2> 1795382 T2706 oasc.CachingDirectoryFactory.get return new directory for /mnt/ssd/jenkins/workspace/Lucene-Solr-trunk-Linux/solr/build/solr-core/test/J0/./org.apache.solr.cloud.CollectionsAPIDistributedZkTest-jetty3-1375325834041//nodes_used_collection_shard1_replica1/data/index
   [junit4]   2> 1795383 T2706 oasc.SolrDeletionPolicy.onCommit SolrDeletionPolicy.onCommit: commits: num=1
   [junit4]   2> 		commit{dir=MockDirWrapper(org.apache.lucene.store.RAMDirectory@26873d lockFactory=org.apache.lucene.store.NativeFSLockFactory@139238e),segFN=segments_1,generation=1}
   [junit4]   2> 1795384 T2706 oasc.SolrDeletionPolicy.updateCommits newest commit generation = 1
   [junit4]   2> 1795384 T2693 oass.IndexSchema.readSchema default search field in schema is text
   [junit4]   2> 1795386 T2706 oasup.UpdateRequestProcessorChain.init inserting DistributedUpdateProcessorFactory into updateRequestProcessorChain "dedupe"
   [junit4]   2> 1795387 T2706 oasup.UpdateRequestProcessorChain.init inserting DistributedUpdateProcessorFactory into updateRequestProcessorChain "stored_sig"
   [junit4]   2> 1795387 T2693 oass.IndexSchema.readSchema unique key field: id
   [junit4]   2> 1795387 T2706 oasup.UpdateRequestProcessorChain.init inserting DistributedUpdateProcessorFactory into updateRequestProcessorChain "distrib-dup-test-chain-implicit"
   [junit4]   2> 1795387 T2706 oasc.RequestHandlers.initHandlersFromConfig created standard: solr.StandardRequestHandler
   [junit4]   2> 1795388 T2706 oasc.RequestHandlers.initHandlersFromConfig created /get: solr.RealTimeGetHandler
   [junit4]   2> 1795388 T2706 oasc.RequestHandlers.initHandlersFromConfig adding lazy requestHandler: solr.ReplicationHandler
   [junit4]   2> 1795388 T2706 oasc.RequestHandlers.initHandlersFromConfig created /replication: solr.ReplicationHandler
   [junit4]   2> 1795389 T2706 oasc.RequestHandlers.initHandlersFromConfig created /update: solr.UpdateRequestHandler
   [junit4]   2> 1795389 T2706 oasc.RequestHandlers.initHandlersFromConfig created /admin/: org.apache.solr.handler.admin.AdminHandlers
   [junit4]   2> 1795392 T2706 oashl.XMLLoader.init xsltCacheLifetimeSeconds=60
   [junit4]   2> 1795394 T2706 oass.SolrIndexSearcher.<init> Opening Searcher@1073efe main
   [junit4]   2> 1795394 T2706 oasu.CommitTracker.<init> Hard AutoCommit: disabled
   [junit4]   2> 1795395 T2706 oasu.CommitTracker.<init> Soft AutoCommit: disabled
   [junit4]   2> 1795395 T2693 oass.FileExchangeRateProvider.reload Reloading exchange rates from file currency.xml
   [junit4]   2> 1795399 T2693 oass.FileExchangeRateProvider.reload Reloading exchange rates from file currency.xml
   [junit4]   2> 1795401 T2693 oass.OpenExchangeRatesOrgProvider.reload Reloading exchange rates from open-exchange-rates.json
   [junit4]   2> 1795402 T2693 oass.OpenExchangeRatesOrgProvider$OpenExchangeRates.<init> WARN Unknown key IMPORTANT NOTE
   [junit4]   2> 1795402 T2693 oass.OpenExchangeRatesOrgProvider$OpenExchangeRates.<init> WARN Expected key, got STRING
   [junit4]   2> 1795403 T2693 oass.OpenExchangeRatesOrgProvider.reload Reloading exchange rates from open-exchange-rates.json
   [junit4]   2> 1795403 T2693 oass.OpenExchangeRatesOrgProvider$OpenExchangeRates.<init> WARN Unknown key IMPORTANT NOTE
   [junit4]   2> 1795404 T2693 oass.OpenExchangeRatesOrgProvider$OpenExchangeRates.<init> WARN Expected key, got STRING
   [junit4]   2> 1795404 T2693 oasc.SolrCore.initDirectoryFactory org.apache.solr.core.MockDirectoryFactory
   [junit4]   2> 1795404 T2693 oasc.SolrCore.<init> [nodes_used_collection_shard2_replica2] Opening new SolrCore at /mnt/ssd/jenkins/workspace/Lucene-Solr-trunk-Linux/solr/build/solr-core/test/J0/./org.apache.solr.cloud.CollectionsAPIDistributedZkTest-jetty2-1375325832866/nodes_used_collection_shard2_replica2/, dataDir=/mnt/ssd/jenkins/workspace/Lucene-Solr-trunk-Linux/solr/build/solr-core/test/J0/./org.apache.solr.cloud.CollectionsAPIDistributedZkTest-jetty2-1375325832866//nodes_used_collection_shard2_replica2/data/
   [junit4]   2> 1795404 T2693 oasc.JmxMonitoredMap.<init> JMX monitoring is enabled. Adding Solr mbeans to JMX Server: com.sun.jmx.mbeanserver.JmxMBeanServer@1bb9073
   [junit4]   2> 1795405 T2693 oasc.CachingDirectoryFactory.get return new directory for /mnt/ssd/jenkins/workspace/Lucene-Solr-trunk-Linux/solr/build/solr-core/test/J0/./org.apache.solr.cloud.CollectionsAPIDistributedZkTest-jetty2-1375325832866//nodes_used_collection_shard2_replica2/data
   [junit4]   2> 1795405 T2693 oasc.SolrCore.getNewIndexDir New index directory detected: old=null new=/mnt/ssd/jenkins/workspace/Lucene-Solr-trunk-Linux/solr/build/solr-core/test/J0/./org.apache.solr.cloud.CollectionsAPIDistributedZkTest-jetty2-1375325832866//nodes_used_collection_shard2_replica2/data/index/
   [junit4]   2> 1795406 T2693 oasc.SolrCore.initIndex WARN [nodes_used_collection_shard2_replica2] Solr index directory '/mnt/ssd/jenkins/workspace/Lucene-Solr-trunk-Linux/solr/build/solr-core/test/J0/./org.apache.solr.cloud.CollectionsAPIDistributedZkTest-jetty2-1375325832866/nodes_used_collection_shard2_replica2/data/index' doesn't exist. Creating new index...
   [junit4]   2> 1795406 T2693 oasc.CachingDirectoryFactory.get return new directory for /mnt/ssd/jenkins/workspace/Lucene-Solr-trunk-Linux/solr/build/solr-core/test/J0/./org.apache.solr.cloud.CollectionsAPIDistributedZkTest-jetty2-1375325832866//nodes_used_collection_shard2_replica2/data/index
   [junit4]   2> 1795407 T2693 oasc.SolrDeletionPolicy.onCommit SolrDeletionPolicy.onCommit: commits: num=1
   [junit4]   2> 		commit{dir=MockDirWrapper(org.apache.lucene.store.RAMDirectory@1ff6baa lockFactory=org.apache.lucene.store.NativeFSLockFactory@115b7de),segFN=segments_1,generation=1}
   [junit4]   2> 1795408 T2693 oasc.SolrDeletionPolicy.updateCommits newest commit generation = 1
   [junit4]   2> 1795409 T2678 oass.OpenExchangeRatesOrgProvider.init Initialized with rates=open-exchange-rates.json, refreshInterval=1440.
   [junit4]   2> 1795410 T2693 oasup.UpdateRequestProcessorChain.init inserting DistributedUpdateProcessorFactory into updateRequestProcessorChain "dedupe"
   [junit4]   2> 1795410 T2693 oasup.UpdateRequestProcessorChain.init inserting DistributedUpdateProcessorFactory into updateRequestProcessorChain "stored_sig"
   [junit4]   2> 1795411 T2693 oasup.UpdateRequestProcessorChain.init inserting DistributedUpdateProcessorFactory into updateRequestProcessorChain "distrib-dup-test-chain-implicit"
   [junit4]   2> 1795411 T2693 oasc.RequestHandlers.initHandlersFromConfig created standard: solr.StandardRequestHandler
   [junit4]   2> 1795412 T2693 oasc.RequestHandlers.initHandlersFromConfig created /get: solr.RealTimeGetHandler
   [junit4]   2> 1795412 T2693 oasc.RequestHandlers.initHandlersFromConfig adding lazy requestHandler: solr.ReplicationHandler
   [junit4]   2> 1795412 T2693 oasc.RequestHandlers.initHandlersFromConfig created /replication: solr.ReplicationHandler
   [junit4]   2> 1795413 T2693 oasc.RequestHandlers.initHandlersFromConfig created /update: solr.UpdateRequestHandler
   [junit4]   2> 1795413 T2693 oasc.RequestHandlers.initHandlersFromConfig created /admin/: org.apache.solr.handler.admin.AdminHandlers
   [junit4]   2> 1795414 T2678 oass.IndexSchema.readSchema default search field in schema is text
   [junit4]   2> 1795415 T2693 oashl.XMLLoader.init xsltCacheLifetimeSeconds=60
   [junit4]   2> 1795416 T2678 oass.IndexSchema.readSchema unique key field: id
   [junit4]   2> 1795417 T2693 oass.SolrIndexSearcher.<init> Opening Searcher@5d0d31 main
   [junit4]   2> 1795417 T2693 oasu.CommitTracker.<init> Hard AutoCommit: disabled
   [junit4]   2> 1795418 T2693 oasu.CommitTracker.<init> Soft AutoCommit: disabled
   [junit4]   2> 1795420 T2733 oasc.SolrCore.registerSearcher [nodes_used_collection_shard2_replica2] Registered new searcher Searcher@5d0d31 main{StandardDirectoryReader(segments_1:1)}
   [junit4]   2> 1795421 T2693 oasc.CoreContainer.registerCore registering core: nodes_used_collection_shard2_replica2
   [junit4]   2> 1795421 T2693 oasc.ZkController.register Register replica - core:nodes_used_collection_shard2_replica2 address:http://127.0.0.1:40811/g_qa/ct collection:nodes_used_collection shard:shard2
   [junit4]   2> 1795421 T2693 oascsi.HttpClientUtil.createClient Creating new http client, config:maxConnections=10000&maxConnectionsPerHost=20&connTimeout=15000&socketTimeout=30000&retry=false
   [junit4]   2> 1795424 T2693 oascc.SolrZkClient.makePath makePath: /collections/nodes_used_collection/leader_elect/shard2/election
   [junit4]   2> 1795426 T2678 oass.FileExchangeRateProvider.reload Reloading exchange rates from file currency.xml
   [junit4]   2> 1795428 T2693 oasc.ShardLeaderElectionContext.runLeaderProcess Running the leader process for shard shard2
   [junit4]   2> 1795429 T2693 oasc.ShardLeaderElectionContext.waitForReplicasToComeUp Waiting until we see more replicas up for shard shard2: total=2 found=1 timeoutin=180000
   [junit4]   2> 1795430 T2678 oass.FileExchangeRateProvider.reload Reloading exchange rates from file currency.xml
   [junit4]   2> 1795432 T2678 oass.OpenExchangeRatesOrgProvider.reload Reloading exchange rates from open-exchange-rates.json
   [junit4]   2> 1795433 T2678 oass.OpenExchangeRatesOrgProvider$OpenExchangeRates.<init> WARN Unknown key IMPORTANT NOTE
   [junit4]   2> 1795433 T2678 oass.OpenExchangeRatesOrgProvider$OpenExchangeRates.<init> WARN Expected key, got STRING
   [junit4]   2> 1795433 T2678 oass.OpenExchangeRatesOrgProvider.reload Reloading exchange rates from open-exchange-rates.json
   [junit4]   2> 1795434 T2678 oass.OpenExchangeRatesOrgProvider$OpenExchangeRates.<init> WARN Unknown key IMPORTANT NOTE
   [junit4]   2> 1795434 T2678 oass.OpenExchangeRatesOrgProvider$OpenExchangeRates.<init> WARN Expected key, got STRING
   [junit4]   2> 1795434 T2678 oasc.SolrCore.initDirectoryFactory org.apache.solr.core.MockDirectoryFactory
   [junit4]   2> 1795435 T2678 oasc.SolrCore.<init> [nodes_used_collection_shard2_replica1] Opening new SolrCore at /mnt/ssd/jenkins/workspace/Lucene-Solr-trunk-Linux/solr/build/solr-core/test/J0/./org.apache.solr.cloud.CollectionsAPIDistributedZkTest-jetty1-1375325831699/nodes_used_collection_shard2_replica1/, dataDir=/mnt/ssd/jenkins/workspace/Lucene-Solr-trunk-Linux/solr/build/solr-core/test/J0/./org.apache.solr.cloud.CollectionsAPIDistributedZkTest-jetty1-1375325831699//nodes_used_collection_shard2_replica1/data/
   [junit4]   2> 1795435 T2678 oasc.JmxMonitoredMap.<init> JMX monitoring is enabled. Adding Solr mbeans to JMX Server: com.sun.jmx.mbeanserver.JmxMBeanServer@1bb9073
   [junit4]   2> 1795436 T2678 oasc.CachingDirectoryFactory.get return new directory for /mnt/ssd/jenkins/workspace/Lucene-Solr-trunk-Linux/solr/build/solr-core/test/J0/./org.apache.solr.cloud.CollectionsAPIDistributedZkTest-jetty1-1375325831699//nodes_used_collection_shard2_replica1/data
   [junit4]   2> 1795436 T2678 oasc.SolrCore.getNewIndexDir New index directory detected: old=null new=/mnt/ssd/jenkins/workspace/Lucene-Solr-trunk-Linux/solr/build/solr-core/test/J0/./org.apache.solr.cloud.CollectionsAPIDistributedZkTest-jetty1-1375325831699//nodes_used_collection_shard2_replica1/data/index/
   [junit4]   2> 1795436 T2678 oasc.SolrCore.initIndex WARN [nodes_used_collection_shard2_replica1] Solr index directory '/mnt/ssd/jenkins/workspace/Lucene-Solr-trunk-Linux/solr/build/solr-core/test/J0/./org.apache.solr.cloud.CollectionsAPIDistributedZkTest-jetty1-1375325831699/nodes_used_collection_shard2_replica1/data/index' doesn't exist. Creating new index...
   [junit4]   2> 1795437 T2721 oass.OpenExchangeRatesOrgProvider.init Initialized with rates=open-exchange-rates.json, refreshInterval=1440.
   [junit4]   2> 1795437 T2678 oasc.CachingDirectoryFactory.get return new directory for /mnt/ssd/jenkins/workspace/Lucene-Solr-trunk-Linux/solr/build/solr-core/test/J0/./org.apache.solr.cloud.CollectionsAPIDistributedZkTest-jetty1-1375325831699//nodes_used_collection_shard2_replica1/data/index
   [junit4]   2> 1795438 T2678 oasc.SolrDeletionPolicy.onCommit SolrDeletionPolicy.onCommit: commits: num=1
   [junit4]   2> 		commit{dir=MockDirWrapper(org.apache.lucene.store.RAMDirectory@679979 lockFactory=org.apache.lucene.store.NativeFSLockFactory@150e7c5),segFN=segments_1,generation=1}
   [junit4]   2> 1795438 T2678 oasc.SolrDeletionPolicy.updateCommits newest commit generation = 1
   [junit4]   2> 1795441 T2678 oasup.UpdateRequestProcessorChain.init inserting DistributedUpdateProcessorFactory into updateRequestProcessorChain "dedupe"
   [junit4]   2> 1795441 T2678 oasup.UpdateRequestProcessorChain.init inserting DistributedUpdateProcessorFactory into updateRequestProcessorChain "stored_sig"
   [junit4]   2> 1795442 T2678 oasup.UpdateRequestProcessorChain.init inserting DistributedUpdateProcessorFactory into updateRequestProcessorChain "distrib-dup-test-chain-implicit"
   [junit4]   2> 1795442 T2678 oasc.RequestHandlers.initHandlersFromConfig created standard: solr.StandardRequestHandler
   [junit4]   2> 1795442 T2721 oass.IndexSchema.readSchema default search field in schema is text
   [junit4]   2> 1795442 T2678 oasc.RequestHandlers.initHandlersFromConfig created /get: solr.RealTimeGetHandler
   [junit4]   2> 1795443 T2678 oasc.RequestHandlers.initHandlersFromConfig adding lazy requestHandler: solr.ReplicationHandler
   [junit4]   2> 1795443 T2678 oasc.RequestHandlers.initHandlersFromConfig created /replication: solr.ReplicationHandler
   [junit4]   2> 1795443 T2678 oasc.RequestHandlers.initHandlersFromConfig created /update: solr.UpdateRequestHandler
   [junit4]   2> 1795444 T2678 oasc.RequestHandlers.initHandlersFromConfig created /admin/: org.apache.solr.handler.admin.AdminHandlers
   [junit4]   2> 1795445 T2721 oass.IndexSchema.readSchema unique key field: id
   [junit4]   2> 1795446 T2678 oashl.XMLLoader.init xsltCacheLifetimeSeconds=60
   [junit4]   2> 1795448 T2678 oass.SolrIndexSearcher.<init> Opening Searcher@da6509 main
   [junit4]   2> 1795448 T2678 oasu.CommitTracker.<init> Hard AutoCommit: disabled
   [junit4]   2> 1795448 T2678 oasu.CommitTracker.<init> Soft AutoCommit: disabled
   [junit4]   2> 1795452 T2734 oasc.SolrCore.registerSearcher [nodes_used_collection_shard2_replica1] Registered new searcher Searcher@da6509 main{StandardDirectoryReader(segments_1:1)}
   [junit4]   2> 1795452 T2678 oasc.CoreContainer.registerCore registering core: nodes_used_collection_shard2_replica1
   [junit4]   2> 1795452 T2678 oasc.ZkController.register Register replica - core:nodes_used_collection_shard2_replica1 address:http://127.0.0.1:37280/g_qa/ct collection:nodes_used_collection shard:shard2
   [junit4]   2> 1795453 T2678 oascsi.HttpClientUtil.createClient Creating new http client, config:maxConnections=10000&maxConnectionsPerHost=20&connTimeout=15000&socketTimeout=30000&retry=false
   [junit4]   2> 1795454 T2721 oass.FileExchangeRateProvider.reload Reloading exchange rates from file currency.xml
   [junit4]   2> 1795458 T2721 oass.FileExchangeRateProvider.reload Reloading exchange rates from file currency.xml
   [junit4]   2> 1795460 T2721 oass.OpenExchangeRatesOrgProvider.reload Reloading exchange rates from open-exchange-rates.json
   [junit4]   2> 1795461 T2721 oass.OpenExchangeRatesOrgProvider$OpenExchangeRates.<init> WARN Unknown key IMPORTANT NOTE
   [junit4]   2> 1795461 T2721 oass.OpenExchangeRatesOrgProvider$OpenExchangeRates.<init> WARN Expected key, got STRING
   [junit4]   2> 1795461 T2721 oass.OpenExchangeRatesOrgProvider.reload Reloading exchange rates from open-exchange-rates.json
   [junit4]   2> 1795462 T2721 oass.OpenExchangeRatesOrgProvider$OpenExchangeRates.<init> WARN Unknown key IMPORTANT NOTE
   [junit4]   2> 1795463 T2721 oass.OpenExchangeRatesOrgProvider$OpenExchangeRates.<init> WARN Expected key, got STRING
   [junit4]   2> 1795463 T2721 oasc.SolrCore.initDirectoryFactory org.apache.solr.core.MockDirectoryFactory
   [junit4]   2> 1795463 T2721 oasc.SolrCore.<init> [nodes_used_collection_shard1_replica2] Opening new SolrCore at /mnt/ssd/jenkins/workspace/Lucene-Solr-trunk-Linux/solr/build/solr-core/test/J0/./org.apache.solr.cloud.CollectionsAPIDistributedZkTest-jetty4-1375325847298/nodes_used_collection_shard1_replica2/, dataDir=/mnt/ssd/jenkins/workspace/Lucene-Solr-trunk-Linux/solr/build/solr-core/test/J0/./org.apache.solr.cloud.CollectionsAPIDistributedZkTest-jetty4-1375325847298//nodes_used_collection_shard1_replica2/data/
   [junit4]   2> 1795464 T2721 oasc.JmxMonitoredMap.<init> JMX monitoring is enabled. Adding Solr mbeans to JMX Server: com.sun.jmx.mbeanserver.JmxMBeanServer@1bb9073
   [junit4]   2> 1795465 T2721 oasc.CachingDirectoryFactory.get return new directory for /mnt/ssd/jenkins/workspace/Lucene-Solr-trunk-Linux/solr/build/solr-core/test/J0/./org.apache.solr.cloud.CollectionsAPIDistributedZkTest-jetty4-1375325847298//nodes_used_collection_shard1_replica2/data
   [junit4]   2> 1795465 T2721 oasc.SolrCore.getNewIndexDir New index directory detected: old=null new=/mnt/ssd/jenkins/workspace/Lucene-Solr-trunk-Linux/solr/build/solr-core/test/J0/./org.apache.solr.cloud.CollectionsAPIDistributedZkTest-jetty4-1375325847298//nodes_used_collection_shard1_replica2/data/index/
   [junit4]   2> 1795465 T2721 oasc.SolrCore.initIndex WARN [nodes_used_collection_shard1_replica2] Solr index directory '/mnt/ssd/jenkins/workspace/Lucene-Solr-trunk-Linux/solr/build/solr-core/test/J0/./org.apache.solr.cloud.CollectionsAPIDistributedZkTest-jetty4-1375325847298/nodes_used_collection_shard1_replica2/data/index' doesn't exist. Creating new index...
   [junit4]   2> 1795466 T2721 oasc.CachingDirectoryFactory.get return new directory for /mnt/ssd/jenkins/workspace/Lucene-Solr-trunk-Linux/solr/build/solr-core/test/J0/./org.apache.solr.cloud.CollectionsAPIDistributedZkTest-jetty4-1375325847298//nodes_used_collection_shard1_replica2/data/index
   [junit4]   2> 1795467 T2721 oasc.SolrDeletionPolicy.onCommit SolrDeletionPolicy.onCommit: commits: num=1
   [junit4]   2> 		commit{dir=MockDirWrapper(org.apache.lucene.store.RAMDirectory@17beb7e lockFactory=org.apache.lucene.store.NativeFSLockFactory@97ed8a),segFN=segments_1,generation=1}
   [junit4]   2> 1795468 T2721 oasc.SolrDeletionPolicy.updateCommits newest commit generation = 1
   [junit4]   2> 1795470 T2721 oasup.UpdateRequestProcessorChain.init inserting DistributedUpdateProcessorFactory into updateRequestProcessorChain "dedupe"
   [junit4]   2> 1795471 T2721 oasup.UpdateRequestProcessorChain.init inserting DistributedUpdateProcessorFactory into updateRequestProcessorChain "stored_sig"
   [junit4]   2> 1795471 T2721 oasup.UpdateRequestProcessorChain.init inserting DistributedUpdateProcessorFactory into updateRequestProcessorChain "distrib-dup-test-chain-implicit"
   [junit4]   2> 1795472 T2721 oasc.RequestHandlers.initHandlersFromConfig created standard: solr.StandardRequestHandler
   [junit4]   2> 1795472 T2721 oasc.RequestHandlers.initHandlersFromConfig created /get: solr.RealTimeGetHandler
   [junit4]   2> 1795472 T2721 oasc.RequestHandlers.initHandlersFromConfig adding lazy requestHandler: solr.ReplicationHandler
   [junit4]   2> 1795473 T2721 oasc.RequestHandlers.initHandlersFromConfig created /replication: solr.ReplicationHandler
   [junit4]   2> 1795473 T2721 oasc.RequestHandlers.initHandlersFromConfig created /update: solr.UpdateRequestHandler
   [junit4]   2> 1795474 T2721 oasc.RequestHandlers.initHandlersFromConfig created /admin/: org.apache.solr.handler.admin.AdminHandlers
   [junit4]   2> 1795476 T2721 oashl.XMLLoader.init xsltCacheLifetimeSeconds=60
   [junit4]   2> 1795478 T2721 oass.SolrIndexSearcher.<init> Opening Searcher@6c51b1 main
   [junit4]   2> 1795479 T2721 oasu.CommitTracker.<init> Hard AutoCommit: disabled
   [junit4]   2> 1795479 T2721 oasu.CommitTracker.<init> Soft AutoCommit: disabled
   [junit4]   2> 1795481 T2735 oasc.SolrCore.registerSearcher [nodes_used_collection_shard1_replica2] Registered new searcher Searcher@6c51b1 main{StandardDirectoryReader(segments_1:1)}
   [junit4]   2> 1795482 T2721 oasc.CoreContainer.registerCore registering core: nodes_used_collection_shard1_replica2
   [junit4]   2> 1795482 T2721 oasc.ZkController.register Register replica - core:nodes_used_collection_shard1_replica2 address:http://127.0.0.1:46197/g_qa/ct collection:nodes_used_collection shard:shard1
   [junit4]   2> 1795483 T2721 oascsi.HttpClientUtil.createClient Creating new http client, config:maxConnections=10000&maxConnectionsPerHost=20&connTimeout=15000&socketTimeout=30000&retry=false
   [junit4]   2> 1795485 T2721 oascc.SolrZkClient.makePath makePath: /collections/nodes_used_collection/leader_elect/shard1/election
   [junit4]   2> 1795491 T2721 oasc.ShardLeaderElectionContext.runLeaderProcess Running the leader process for shard shard1
   [junit4]   2> 1795492 T2721 oasc.ShardLeaderElectionContext.waitForReplicasToComeUp Waiting until we see more replicas up for shard shard1: total=2 found=1 timeoutin=180000
   [junit4]   2> 1795866 T2667 oascc.ZkStateReader.updateClusterState Updating cloud state from ZooKeeper... 
   [junit4]   2> 1795870 T2726 oascc.ZkStateReader$2.process A cluster state change: WatchedEvent state:SyncConnected type:NodeDataChanged path:/clusterstate.json, has occurred - updating... (live nodes size: 5)
   [junit4]   2> 1795870 T2698 oascc.ZkStateReader$2.process A cluster state change: WatchedEvent state:SyncConnected type:NodeDataChanged path:/clusterstate.json, has occurred - updating... (live nodes size: 5)
   [junit4]   2> 1795870 T2666 oascc.ZkStateReader$2.process A cluster state change: WatchedEvent state:SyncConnected type:NodeDataChanged path:/clusterstate.json, has occurred - updating... (live nodes size: 5)
   [junit4]   2> 1795870 T2684 oascc.ZkStateReader$2.process A cluster state change: WatchedEvent state:SyncConnected type:NodeDataChanged path:/clusterstate.json, has occurred - updating... (live nodes size: 5)
   [junit4]   2> 1795870 T2671 oascc.ZkStateReader$2.process A cluster state change: WatchedEvent state:SyncConnected type:NodeDataChanged path:/clusterstate.json, has occurred - updating... (live nodes size: 5)
   [junit4]   2> 1795870 T2712 oascc.ZkStateReader$2.process A cluster state change: WatchedEvent state:SyncConnected type:NodeDataChanged path:/clusterstate.json, has occurred - updating... (live nodes size: 5)
   [junit4]   2> 1795930 T2693 oasc.ShardLeaderElectionContext.waitForReplicasToComeUp Enough replicas found to continue.
   [junit4]   2> 1795930 T2693 oasc.ShardLeaderElectionContext.runLeaderProcess I may be the new leader - try and sync
   [junit4]   2> 1795931 T2693 oasc.SyncStrategy.sync Sync replicas to http://127.0.0.1:40811/g_qa/ct/nodes_used_collection_shard2_replica2/
   [junit4]   2> 1795931 T2693 oasu.PeerSync.sync PeerSync: core=nodes_used_collection_shard2_replica2 url=http://127.0.0.1:40811/g_qa/ct START replicas=[http://127.0.0.1:37280/g_qa/ct/nodes_used_collection_shard2_replica1/] nUpdates=100
   [junit4]   2> 1795931 T2693 oasu.PeerSync.sync PeerSync: core=nodes_used_collection_shard2_replica2 url=http://127.0.0.1:40811/g_qa/ct DONE.  We have no versions.  sync failed.
   [junit4]   2> 1795932 T2693 oasc.SyncStrategy.syncReplicas Leader's attempt to sync with shard failed, moving to the next candidate
   [junit4]   2> 1795932 T2693 oasc.ShardLeaderElectionContext.runLeaderProcess We failed sync, but we have no versions - we can't sync in that case - we were active before, so become leader anyway
   [junit4]   2> 1795932 T2693 oasc.ShardLeaderElectionContext.runLeaderProcess I am the new leader: http://127.0.0.1:40811/g_qa/ct/nodes_used_collection_shard2_replica2/ shard2
   [junit4]   2> 1795932 T2693 oascc.SolrZkClient.makePath makePath: /collections/nodes_used_collection/leaders/shard2
   [junit4]   2> ASYNC  NEW_CORE C500 name=nodes_used_collection_shard2_replica1 org.apache.solr.core.SolrCore@18c9e2b url=http://127.0.0.1:37280/g_qa/ct/nodes_used_collection_shard2_replica1 node=127.0.0.1:37280_g_qa%2Fct C500_STATE=coll:nodes_used_collection core:nodes_used_collection_shard2_replica1 props:{state=down, core=nodes_used_collection_shard2_replica1, node_name=127.0.0.1:37280_g_qa%2Fct, base_url=http://127.0.0.1:37280/g_qa/ct}
   [junit4]   2> 1795936 T2677 C500 P37280 oasc.SolrCore.execute [nodes_used_collection_shard2_replica1] webapp=/g_qa/ct path=/get params={getVersions=100&distrib=false&wt=javabin&qt=/get&version=2} status=0 QTime=1 
   [junit4]   2> 1797373 T2667 oascc.ZkStateReader.updateClusterState Updating cloud state from ZooKeeper... 
   [junit4]   2> 1797375 T2726 oascc.ZkStateReader$2.process A cluster state change: WatchedEvent state:SyncConnected type:NodeDataChanged path:/clusterstate.json, has occurred - updating... (live nodes size: 5)
   [junit4]   2> 1797376 T2712 oascc.ZkStateReader$2.process A cluster state change: WatchedEvent state:SyncConnected type:NodeDataChanged path:/clusterstate.json, has occurred - updating... (live nodes size: 5)
   [junit4]   2> 1797376 T2698 oascc.ZkStateReader$2.process A cluster state change: WatchedEvent state:SyncConnected type:NodeDataChanged path:/clusterstate.json, has occurred - updating... (live nodes size: 5)
   [junit4]   2> 1797376 T2684 oascc.ZkStateReader$2.process A cluster state change: WatchedEvent state:SyncConnected type:NodeDataChanged path:/clusterstate.json, has occurred - updating... (live nodes size: 5)
   [junit4]   2> 1797376 T2666 oascc.ZkStateReader$2.process A cluster state change: WatchedEvent state:SyncConnected type:NodeDataChanged path:/clusterstate.json, has occurred - updating... (live nodes size: 5)
   [junit4]   2> 1797375 T2671 oascc.ZkStateReader$2.process A cluster state change: WatchedEvent state:SyncConnected type:NodeDataChanged path:/clusterstate.json, has occurred - updating... (live nodes size: 5)
   [junit4]   2> 1797388 T2693 oasc.ZkController.register We are http://127.0.0.1:40811/g_qa/ct/nodes_used_collection

[...truncated too long message...]

x/solr/build/solr-core/test/J0/./org.apache.solr.cloud.CollectionsAPIDistributedZkTest-jetty4-1375325847298//awholynewcollection_0_shard3_replica1/data/index
   [junit4]   2> 1876766 T2644 oasc.CachingDirectoryFactory.closeCacheValue looking to close /mnt/ssd/jenkins/workspace/Lucene-Solr-trunk-Linux/solr/build/solr-core/test/J0/./org.apache.solr.cloud.CollectionsAPIDistributedZkTest-jetty4-1375325847298//awholynewcollection_0_shard3_replica1/data [CachedDir<<refCount=0;path=/mnt/ssd/jenkins/workspace/Lucene-Solr-trunk-Linux/solr/build/solr-core/test/J0/./org.apache.solr.cloud.CollectionsAPIDistributedZkTest-jetty4-1375325847298//awholynewcollection_0_shard3_replica1/data;done=false>>]
   [junit4]   2> 1876766 T2644 oasc.CachingDirectoryFactory.close Closing directory: /mnt/ssd/jenkins/workspace/Lucene-Solr-trunk-Linux/solr/build/solr-core/test/J0/./org.apache.solr.cloud.CollectionsAPIDistributedZkTest-jetty4-1375325847298//awholynewcollection_0_shard3_replica1/data
   [junit4]   2> 1876767 T2644 oasc.SolrCore.close [awholynewcollection_1_shard2_replica2]  CLOSING SolrCore org.apache.solr.core.SolrCore@7c7cc1
   [junit4]   2> 1876771 T2644 oasu.DirectUpdateHandler2.close closing DirectUpdateHandler2{commits=1,autocommits=0,soft autocommits=0,optimizes=0,rollbacks=0,expungeDeletes=0,docsPending=0,adds=0,deletesById=0,deletesByQuery=0,errors=0,cumulative_adds=0,cumulative_deletesById=0,cumulative_deletesByQuery=0,cumulative_errors=0}
   [junit4]   2> 1876771 T2644 oasu.SolrCoreState.decrefSolrCoreState Closing SolrCoreState
   [junit4]   2> 1876772 T2644 oasu.DefaultSolrCoreState.closeIndexWriter SolrCoreState ref count has reached 0 - closing IndexWriter
   [junit4]   2> 1876772 T2644 oasu.DefaultSolrCoreState.closeIndexWriter closing IndexWriter with IndexWriterCloser
   [junit4]   2> 1876773 T2644 oasc.SolrCore.closeSearcher [awholynewcollection_1_shard2_replica2] Closing main searcher on request.
   [junit4]   2> 1876774 T2644 oasc.CachingDirectoryFactory.close Closing MockDirectoryFactory - 2 directories currently being tracked
   [junit4]   2> 1876774 T2644 oasc.CachingDirectoryFactory.closeCacheValue looking to close /mnt/ssd/jenkins/workspace/Lucene-Solr-trunk-Linux/solr/build/solr-core/test/J0/./org.apache.solr.cloud.CollectionsAPIDistributedZkTest-jetty4-1375325847298//awholynewcollection_1_shard2_replica2/data [CachedDir<<refCount=0;path=/mnt/ssd/jenkins/workspace/Lucene-Solr-trunk-Linux/solr/build/solr-core/test/J0/./org.apache.solr.cloud.CollectionsAPIDistributedZkTest-jetty4-1375325847298//awholynewcollection_1_shard2_replica2/data;done=false>>]
   [junit4]   2> 1876774 T2644 oasc.CachingDirectoryFactory.close Closing directory: /mnt/ssd/jenkins/workspace/Lucene-Solr-trunk-Linux/solr/build/solr-core/test/J0/./org.apache.solr.cloud.CollectionsAPIDistributedZkTest-jetty4-1375325847298//awholynewcollection_1_shard2_replica2/data
   [junit4]   2> 1876774 T2644 oasc.CachingDirectoryFactory.closeCacheValue looking to close /mnt/ssd/jenkins/workspace/Lucene-Solr-trunk-Linux/solr/build/solr-core/test/J0/./org.apache.solr.cloud.CollectionsAPIDistributedZkTest-jetty4-1375325847298//awholynewcollection_1_shard2_replica2/data/index [CachedDir<<refCount=0;path=/mnt/ssd/jenkins/workspace/Lucene-Solr-trunk-Linux/solr/build/solr-core/test/J0/./org.apache.solr.cloud.CollectionsAPIDistributedZkTest-jetty4-1375325847298//awholynewcollection_1_shard2_replica2/data/index;done=false>>]
   [junit4]   2> 1876775 T2644 oasc.CachingDirectoryFactory.close Closing directory: /mnt/ssd/jenkins/workspace/Lucene-Solr-trunk-Linux/solr/build/solr-core/test/J0/./org.apache.solr.cloud.CollectionsAPIDistributedZkTest-jetty4-1375325847298//awholynewcollection_1_shard2_replica2/data/index
   [junit4]   2> 1876775 T2902 oasc.Overseer$ClusterStateUpdater.amILeader According to ZK I (id=90133353683484684-127.0.0.1:46197_g_qa%2Fct-n_0000000004) am no longer a leader.
   [junit4]   2> 1876776 T2726 oascc.ZkStateReader$2.process A cluster state change: WatchedEvent state:SyncConnected type:NodeChildrenChanged path:/live_nodes, has occurred - updating... (live nodes size: 1)
   [junit4]   2> 1876776 T2726 oascc.ZkStateReader$2.process WARN ZooKeeper watch triggered, but Solr cannot talk to ZK
   [junit4]   2> 1876776 T2726 oascc.ZkStateReader$3.process WARN ZooKeeper watch triggered, but Solr cannot talk to ZK
   [junit4]   2> 1876798 T2644 oejsh.ContextHandler.doStop stopped o.e.j.s.ServletContextHandler{/g_qa/ct,null}
   [junit4]   2> 1876852 T2644 oas.SolrTestCaseJ4.tearDown ###Ending testDistribSearch
   [junit4]   2> 1876855 T2644 oasc.ZkTestServer.send4LetterWord connecting to 127.0.0.1:43249 43249
   [junit4]   1> client port:0.0.0.0/0.0.0.0:0
   [junit4]   2> NOTE: reproduce with: ant test  -Dtestcase=CollectionsAPIDistributedZkTest -Dtests.method=testDistribSearch -Dtests.seed=262AF3518A09B569 -Dtests.multiplier=3 -Dtests.slow=true -Dtests.locale=es_CO -Dtests.timezone=America/Recife -Dtests.file.encoding=ISO-8859-1
   [junit4] ERROR    102s J0 | CollectionsAPIDistributedZkTest.testDistribSearch <<<
   [junit4]    > Throwable #1: org.apache.solr.client.solrj.impl.HttpSolrServer$RemoteSolrException: collection already exists: awholynewcollection_1
   [junit4]    > 	at __randomizedtesting.SeedInfo.seed([262AF3518A09B569:A7CC7D49FD56D555]:0)
   [junit4]    > 	at org.apache.solr.client.solrj.impl.HttpSolrServer.request(HttpSolrServer.java:424)
   [junit4]    > 	at org.apache.solr.client.solrj.impl.HttpSolrServer.request(HttpSolrServer.java:180)
   [junit4]    > 	at org.apache.solr.client.solrj.impl.LBHttpSolrServer.request(LBHttpSolrServer.java:264)
   [junit4]    > 	at org.apache.solr.client.solrj.impl.CloudSolrServer.request(CloudSolrServer.java:318)
   [junit4]    > 	at org.apache.solr.cloud.AbstractFullDistribZkTestBase.createCollection(AbstractFullDistribZkTestBase.java:1537)
   [junit4]    > 	at org.apache.solr.cloud.AbstractFullDistribZkTestBase.createCollection(AbstractFullDistribZkTestBase.java:1551)
   [junit4]    > 	at org.apache.solr.cloud.CollectionsAPIDistributedZkTest.testCollectionsAPI(CollectionsAPIDistributedZkTest.java:448)
   [junit4]    > 	at org.apache.solr.cloud.CollectionsAPIDistributedZkTest.doTest(CollectionsAPIDistributedZkTest.java:155)
   [junit4]    > 	at org.apache.solr.BaseDistributedSearchTestCase.testDistribSearch(BaseDistributedSearchTestCase.java:835)
   [junit4]    > 	at java.lang.Thread.run(Thread.java:724)
   [junit4]   2> 1876867 T2644 oas.SolrTestCaseJ4.deleteCore ###deleteCore
   [junit4]   2> 102361 T2643 ccr.ThreadLeakControl.checkThreadLeaks WARNING Will linger awaiting termination of 2 leaked thread(s).
   [junit4]   2> NOTE: test params are: codec=Asserting, sim=DefaultSimilarity, locale=es_CO, timezone=America/Recife
   [junit4]   2> NOTE: Linux 3.2.0-51-generic i386/Oracle Corporation 1.7.0_25 (32-bit)/cpus=8,threads=2,free=90982232,total=262144000
   [junit4]   2> NOTE: All tests run in this JVM: [TestPhraseSuggestions, HdfsChaosMonkeySafeLeaderTest, FieldMutatingUpdateProcessorTest, TestFaceting, TestDocumentBuilder, SearchHandlerTest, BasicFunctionalityTest, ChaosMonkeyNothingIsSafeTest, ZkControllerTest, TestRealTimeGet, TestSolrQueryParserResource, TestFastWriter, TestSort, PreAnalyzedUpdateProcessorTest, TestQueryUtils, TestDynamicFieldCollectionResource, SoftAutoCommitTest, CoreAdminHandlerTest, SyncSliceTest, QueryParsingTest, TestSearchPerf, TestCharFilters, CacheHeaderTest, TestExtendedDismaxParser, QueryEqualityTest, ShowFileRequestHandlerTest, ScriptEngineTest, BadComponentTest, CircularListTest, OverseerTest, LoggingHandlerTest, DistributedSpellCheckComponentTest, RegexBoostProcessorTest, TestLMDirichletSimilarityFactory, TestFastLRUCache, RecoveryZkTest, TestSchemaNameResource, TestDocSet, TestSolrQueryParserDefaultOperatorResource, DirectSolrConnectionTest, DirectUpdateHandlerOptimizeTest, TestConfig, ReturnFieldsTest, TestSchemaVersionResource, SolrInfoMBeanTest, TestFieldResource, DocValuesTest, LegacyHTMLStripCharFilterTest, PreAnalyzedFieldTest, IndexSchemaTest, UnloadDistributedZkTest, CSVRequestHandlerTest, TestStressVersions, StatelessScriptUpdateProcessorFactoryTest, BasicDistributedZkTest, PrimitiveFieldTypeTest, SchemaVersionSpecificBehaviorTest, TestSolrXmlPersistence, ExternalFileFieldSortTest, SOLR749Test, PeerSyncTest, DateFieldTest, CoreMergeIndexesAdminHandlerTest, TestLFUCache, TestSolrDeletionPolicy1, BinaryUpdateRequestHandlerTest, TestCoreContainer, ResponseLogComponentTest, ZkCLITest, SolrCoreTest, SuggesterFSTTest, StressHdfsTest, SpellingQueryConverterTest, HdfsBasicDistributedZkTest, TestIBSimilarityFactory, AutoCommitTest, PluginInfoTest, CollectionsAPIDistributedZkTest]
   [junit4] Completed on J0 in 102.88s, 1 test, 1 error <<< FAILURES!

[...truncated 491 lines...]
BUILD FAILED
/mnt/ssd/jenkins/workspace/Lucene-Solr-trunk-Linux/build.xml:389: The following error occurred while executing this line:
/mnt/ssd/jenkins/workspace/Lucene-Solr-trunk-Linux/build.xml:369: The following error occurred while executing this line:
/mnt/ssd/jenkins/workspace/Lucene-Solr-trunk-Linux/build.xml:39: The following error occurred while executing this line:
/mnt/ssd/jenkins/workspace/Lucene-Solr-trunk-Linux/solr/build.xml:181: The following error occurred while executing this line:
/mnt/ssd/jenkins/workspace/Lucene-Solr-trunk-Linux/solr/common-build.xml:449: The following error occurred while executing this line:
/mnt/ssd/jenkins/workspace/Lucene-Solr-trunk-Linux/lucene/common-build.xml:1230: The following error occurred while executing this line:
/mnt/ssd/jenkins/workspace/Lucene-Solr-trunk-Linux/lucene/common-build.xml:873: There were test failures: 320 suites, 1345 tests, 1 error, 34 ignored (6 assumptions)

Total time: 74 minutes 50 seconds
Build step 'Invoke Ant' marked build as failure
Description set: Java: 32bit/jdk1.7.0_25 -server -XX:+UseParallelGC
Archiving artifacts
Recording test results
Email was triggered for: Failure
Sending email for trigger: Failure



Mime
View raw message