lucene-dev mailing list archives

Site index · List index
Message view « Date » · « Thread »
Top « Date » · « Thread »
From Policeman Jenkins Server <jenk...@thetaphi.de>
Subject [JENKINS] Lucene-Solr-trunk-MacOSX (64bit/jdk1.7.0) - Build # 701 - Still Failing!
Date Sat, 03 Aug 2013 08:00:22 GMT
Build: http://jenkins.thetaphi.de/job/Lucene-Solr-trunk-MacOSX/701/
Java: 64bit/jdk1.7.0 -XX:+UseCompressedOops -XX:+UseG1GC

1 tests failed.
FAILED:  org.apache.solr.cloud.CollectionsAPIDistributedZkTest.testDistribSearch

Error Message:
Server refused connection at: http://127.0.0.1:49359

Stack Trace:
org.apache.solr.client.solrj.SolrServerException: Server refused connection at: http://127.0.0.1:49359
	at __randomizedtesting.SeedInfo.seed([169855A5EE00A495:977EDBBD995FC4A9]:0)
	at org.apache.solr.client.solrj.impl.HttpSolrServer.request(HttpSolrServer.java:428)
	at org.apache.solr.client.solrj.impl.HttpSolrServer.request(HttpSolrServer.java:180)
	at org.apache.solr.cloud.AbstractFullDistribZkTestBase.createCollection(AbstractFullDistribZkTestBase.java:1535)
	at org.apache.solr.cloud.CollectionsAPIDistributedZkTest.testCustomCollectionsAPI(CollectionsAPIDistributedZkTest.java:677)
	at org.apache.solr.cloud.CollectionsAPIDistributedZkTest.doTest(CollectionsAPIDistributedZkTest.java:159)
	at org.apache.solr.BaseDistributedSearchTestCase.testDistribSearch(BaseDistributedSearchTestCase.java:835)
	at sun.reflect.NativeMethodAccessorImpl.invoke0(Native Method)
	at sun.reflect.NativeMethodAccessorImpl.invoke(NativeMethodAccessorImpl.java:57)
	at sun.reflect.DelegatingMethodAccessorImpl.invoke(DelegatingMethodAccessorImpl.java:43)
	at java.lang.reflect.Method.invoke(Method.java:606)
	at com.carrotsearch.randomizedtesting.RandomizedRunner.invoke(RandomizedRunner.java:1559)
	at com.carrotsearch.randomizedtesting.RandomizedRunner.access$600(RandomizedRunner.java:79)
	at com.carrotsearch.randomizedtesting.RandomizedRunner$6.evaluate(RandomizedRunner.java:737)
	at com.carrotsearch.randomizedtesting.RandomizedRunner$7.evaluate(RandomizedRunner.java:773)
	at com.carrotsearch.randomizedtesting.RandomizedRunner$8.evaluate(RandomizedRunner.java:787)
	at com.carrotsearch.randomizedtesting.rules.SystemPropertiesRestoreRule$1.evaluate(SystemPropertiesRestoreRule.java:53)
	at org.apache.lucene.util.TestRuleSetupTeardownChained$1.evaluate(TestRuleSetupTeardownChained.java:50)
	at org.apache.lucene.util.TestRuleFieldCacheSanity$1.evaluate(TestRuleFieldCacheSanity.java:51)
	at org.apache.lucene.util.AbstractBeforeAfterRule$1.evaluate(AbstractBeforeAfterRule.java:46)
	at com.carrotsearch.randomizedtesting.rules.SystemPropertiesInvariantRule$1.evaluate(SystemPropertiesInvariantRule.java:55)
	at org.apache.lucene.util.TestRuleThreadAndTestName$1.evaluate(TestRuleThreadAndTestName.java:49)
	at org.apache.lucene.util.TestRuleIgnoreAfterMaxFailures$1.evaluate(TestRuleIgnoreAfterMaxFailures.java:70)
	at org.apache.lucene.util.TestRuleMarkFailure$1.evaluate(TestRuleMarkFailure.java:48)
	at com.carrotsearch.randomizedtesting.rules.StatementAdapter.evaluate(StatementAdapter.java:36)
	at com.carrotsearch.randomizedtesting.ThreadLeakControl$StatementRunner.run(ThreadLeakControl.java:358)
	at com.carrotsearch.randomizedtesting.ThreadLeakControl.forkTimeoutingTask(ThreadLeakControl.java:782)
	at com.carrotsearch.randomizedtesting.ThreadLeakControl$3.evaluate(ThreadLeakControl.java:442)
	at com.carrotsearch.randomizedtesting.RandomizedRunner.runSingleTest(RandomizedRunner.java:746)
	at com.carrotsearch.randomizedtesting.RandomizedRunner$3.evaluate(RandomizedRunner.java:648)
	at com.carrotsearch.randomizedtesting.RandomizedRunner$4.evaluate(RandomizedRunner.java:682)
	at com.carrotsearch.randomizedtesting.RandomizedRunner$5.evaluate(RandomizedRunner.java:693)
	at com.carrotsearch.randomizedtesting.rules.StatementAdapter.evaluate(StatementAdapter.java:36)
	at com.carrotsearch.randomizedtesting.rules.SystemPropertiesRestoreRule$1.evaluate(SystemPropertiesRestoreRule.java:53)
	at org.apache.lucene.util.AbstractBeforeAfterRule$1.evaluate(AbstractBeforeAfterRule.java:46)
	at org.apache.lucene.util.TestRuleStoreClassName$1.evaluate(TestRuleStoreClassName.java:42)
	at com.carrotsearch.randomizedtesting.rules.SystemPropertiesInvariantRule$1.evaluate(SystemPropertiesInvariantRule.java:55)
	at com.carrotsearch.randomizedtesting.rules.NoShadowingOrOverridesOnMethodsRule$1.evaluate(NoShadowingOrOverridesOnMethodsRule.java:39)
	at com.carrotsearch.randomizedtesting.rules.NoShadowingOrOverridesOnMethodsRule$1.evaluate(NoShadowingOrOverridesOnMethodsRule.java:39)
	at com.carrotsearch.randomizedtesting.rules.StatementAdapter.evaluate(StatementAdapter.java:36)
	at org.apache.lucene.util.TestRuleAssertionsRequired$1.evaluate(TestRuleAssertionsRequired.java:43)
	at org.apache.lucene.util.TestRuleMarkFailure$1.evaluate(TestRuleMarkFailure.java:48)
	at org.apache.lucene.util.TestRuleIgnoreAfterMaxFailures$1.evaluate(TestRuleIgnoreAfterMaxFailures.java:70)
	at org.apache.lucene.util.TestRuleIgnoreTestSuites$1.evaluate(TestRuleIgnoreTestSuites.java:55)
	at com.carrotsearch.randomizedtesting.rules.StatementAdapter.evaluate(StatementAdapter.java:36)
	at com.carrotsearch.randomizedtesting.ThreadLeakControl$StatementRunner.run(ThreadLeakControl.java:358)
	at java.lang.Thread.run(Thread.java:724)
Caused by: org.apache.http.conn.HttpHostConnectException: Connection to http://127.0.0.1:49359 refused
	at org.apache.http.impl.conn.DefaultClientConnectionOperator.openConnection(DefaultClientConnectionOperator.java:190)
	at org.apache.http.impl.conn.ManagedClientConnectionImpl.open(ManagedClientConnectionImpl.java:294)
	at org.apache.http.impl.client.DefaultRequestDirector.tryConnect(DefaultRequestDirector.java:645)
	at org.apache.http.impl.client.DefaultRequestDirector.execute(DefaultRequestDirector.java:480)
	at org.apache.http.impl.client.AbstractHttpClient.execute(AbstractHttpClient.java:906)
	at org.apache.http.impl.client.AbstractHttpClient.execute(AbstractHttpClient.java:805)
	at org.apache.http.impl.client.AbstractHttpClient.execute(AbstractHttpClient.java:784)
	at org.apache.solr.client.solrj.impl.HttpSolrServer.request(HttpSolrServer.java:365)
	... 45 more
Caused by: java.net.ConnectException: Connection refused
	at java.net.PlainSocketImpl.socketConnect(Native Method)
	at java.net.AbstractPlainSocketImpl.doConnect(AbstractPlainSocketImpl.java:339)
	at java.net.AbstractPlainSocketImpl.connectToAddress(AbstractPlainSocketImpl.java:200)
	at java.net.AbstractPlainSocketImpl.connect(AbstractPlainSocketImpl.java:182)
	at java.net.SocksSocketImpl.connect(SocksSocketImpl.java:392)
	at java.net.Socket.connect(Socket.java:579)
	at org.apache.http.conn.scheme.PlainSocketFactory.connectSocket(PlainSocketFactory.java:127)
	at org.apache.http.impl.conn.DefaultClientConnectionOperator.openConnection(DefaultClientConnectionOperator.java:180)
	... 52 more




Build Log:
[...truncated 9480 lines...]
   [junit4] Suite: org.apache.solr.cloud.CollectionsAPIDistributedZkTest
   [junit4]   2> 702550 T1147 oas.BaseDistributedSearchTestCase.initHostContext Setting hostContext system property: /
   [junit4]   2> 702559 T1147 oas.SolrTestCaseJ4.setUp ###Starting testDistribSearch
   [junit4]   2> Creating dataDir: /Users/jenkins/jenkins-slave/workspace/Lucene-Solr-trunk-MacOSX/solr/build/solr-core/test/J0/./solrtest-CollectionsAPIDistributedZkTest-1375513284064
   [junit4]   2> 702562 T1147 oasc.ZkTestServer.run STARTING ZK TEST SERVER
   [junit4]   2> 702563 T1148 oasc.ZkTestServer$ZKServerMain.runFromConfig Starting server
   [junit4]   2> 702664 T1147 oasc.ZkTestServer.run start zk server on port:49349
   [junit4]   2> 702666 T1147 oascc.ConnectionManager.waitForConnected Waiting for client to connect to ZooKeeper
   [junit4]   2> 702675 T1154 oascc.ConnectionManager.process Watcher org.apache.solr.common.cloud.ConnectionManager@6c28dcab name:ZooKeeperConnection Watcher:127.0.0.1:49349 got event WatchedEvent state:SyncConnected type:None path:null path:null type:None
   [junit4]   2> 702676 T1147 oascc.ConnectionManager.waitForConnected Client is connected to ZooKeeper
   [junit4]   2> 702676 T1147 oascc.SolrZkClient.makePath makePath: /solr
   [junit4]   2> 702685 T1147 oascc.ConnectionManager.waitForConnected Waiting for client to connect to ZooKeeper
   [junit4]   2> 702691 T1156 oascc.ConnectionManager.process Watcher org.apache.solr.common.cloud.ConnectionManager@2e4b6520 name:ZooKeeperConnection Watcher:127.0.0.1:49349/solr got event WatchedEvent state:SyncConnected type:None path:null path:null type:None
   [junit4]   2> 702691 T1147 oascc.ConnectionManager.waitForConnected Client is connected to ZooKeeper
   [junit4]   2> 702692 T1147 oascc.SolrZkClient.makePath makePath: /collections/collection1
   [junit4]   2> 702700 T1147 oascc.SolrZkClient.makePath makePath: /collections/collection1/shards
   [junit4]   2> 702707 T1147 oascc.SolrZkClient.makePath makePath: /collections/control_collection
   [junit4]   2> 702713 T1147 oascc.SolrZkClient.makePath makePath: /collections/control_collection/shards
   [junit4]   2> 702730 T1147 oasc.AbstractZkTestCase.putConfig put /Users/jenkins/jenkins-slave/workspace/Lucene-Solr-trunk-MacOSX/solr/build/solr-core/test-files/solr/collection1/conf/solrconfig-tlog.xml to /configs/conf1/solrconfig.xml
   [junit4]   2> 702731 T1147 oascc.SolrZkClient.makePath makePath: /configs/conf1/solrconfig.xml
   [junit4]   2> 702744 T1147 oasc.AbstractZkTestCase.putConfig put /Users/jenkins/jenkins-slave/workspace/Lucene-Solr-trunk-MacOSX/solr/build/solr-core/test-files/solr/collection1/conf/schema.xml to /configs/conf1/schema.xml
   [junit4]   2> 702745 T1147 oascc.SolrZkClient.makePath makePath: /configs/conf1/schema.xml
   [junit4]   2> 702753 T1147 oasc.AbstractZkTestCase.putConfig put /Users/jenkins/jenkins-slave/workspace/Lucene-Solr-trunk-MacOSX/solr/build/solr-core/test-files/solr/collection1/conf/stopwords.txt to /configs/conf1/stopwords.txt
   [junit4]   2> 702754 T1147 oascc.SolrZkClient.makePath makePath: /configs/conf1/stopwords.txt
   [junit4]   2> 702764 T1147 oasc.AbstractZkTestCase.putConfig put /Users/jenkins/jenkins-slave/workspace/Lucene-Solr-trunk-MacOSX/solr/build/solr-core/test-files/solr/collection1/conf/protwords.txt to /configs/conf1/protwords.txt
   [junit4]   2> 702765 T1147 oascc.SolrZkClient.makePath makePath: /configs/conf1/protwords.txt
   [junit4]   2> 702772 T1147 oasc.AbstractZkTestCase.putConfig put /Users/jenkins/jenkins-slave/workspace/Lucene-Solr-trunk-MacOSX/solr/build/solr-core/test-files/solr/collection1/conf/currency.xml to /configs/conf1/currency.xml
   [junit4]   2> 702773 T1147 oascc.SolrZkClient.makePath makePath: /configs/conf1/currency.xml
   [junit4]   2> 702781 T1147 oasc.AbstractZkTestCase.putConfig put /Users/jenkins/jenkins-slave/workspace/Lucene-Solr-trunk-MacOSX/solr/build/solr-core/test-files/solr/collection1/conf/open-exchange-rates.json to /configs/conf1/open-exchange-rates.json
   [junit4]   2> 702783 T1147 oascc.SolrZkClient.makePath makePath: /configs/conf1/open-exchange-rates.json
   [junit4]   2> 702798 T1147 oasc.AbstractZkTestCase.putConfig put /Users/jenkins/jenkins-slave/workspace/Lucene-Solr-trunk-MacOSX/solr/build/solr-core/test-files/solr/collection1/conf/mapping-ISOLatin1Accent.txt to /configs/conf1/mapping-ISOLatin1Accent.txt
   [junit4]   2> 702799 T1147 oascc.SolrZkClient.makePath makePath: /configs/conf1/mapping-ISOLatin1Accent.txt
   [junit4]   2> 702807 T1147 oasc.AbstractZkTestCase.putConfig put /Users/jenkins/jenkins-slave/workspace/Lucene-Solr-trunk-MacOSX/solr/build/solr-core/test-files/solr/collection1/conf/old_synonyms.txt to /configs/conf1/old_synonyms.txt
   [junit4]   2> 702808 T1147 oascc.SolrZkClient.makePath makePath: /configs/conf1/old_synonyms.txt
   [junit4]   2> 702817 T1147 oasc.AbstractZkTestCase.putConfig put /Users/jenkins/jenkins-slave/workspace/Lucene-Solr-trunk-MacOSX/solr/build/solr-core/test-files/solr/collection1/conf/synonyms.txt to /configs/conf1/synonyms.txt
   [junit4]   2> 702818 T1147 oascc.SolrZkClient.makePath makePath: /configs/conf1/synonyms.txt
   [junit4]   2> 703438 T1147 oejs.Server.doStart jetty-8.1.10.v20130312
   [junit4]   2> 703450 T1147 oejs.AbstractConnector.doStart Started SelectChannelConnector@127.0.0.1:49352
   [junit4]   2> 703451 T1147 oass.SolrDispatchFilter.init SolrDispatchFilter.init()
   [junit4]   2> 703451 T1147 oasc.SolrResourceLoader.locateSolrHome JNDI not configured for solr (NoInitialContextEx)
   [junit4]   2> 703452 T1147 oasc.SolrResourceLoader.locateSolrHome using system property solr.solr.home: /Users/jenkins/jenkins-slave/workspace/Lucene-Solr-trunk-MacOSX/solr/build/solr-core/test/J0/./org.apache.solr.cloud.CollectionsAPIDistributedZkTest-controljetty-1375513284331
   [junit4]   2> 703452 T1147 oasc.SolrResourceLoader.<init> new SolrResourceLoader for directory: '/Users/jenkins/jenkins-slave/workspace/Lucene-Solr-trunk-MacOSX/solr/build/solr-core/test/J0/./org.apache.solr.cloud.CollectionsAPIDistributedZkTest-controljetty-1375513284331/'
   [junit4]   2> 703504 T1147 oasc.ConfigSolr.fromFile Loading container configuration from /Users/jenkins/jenkins-slave/workspace/Lucene-Solr-trunk-MacOSX/solr/build/solr-core/test/J0/./org.apache.solr.cloud.CollectionsAPIDistributedZkTest-controljetty-1375513284331/solr.xml
   [junit4]   2> 703630 T1147 oasc.ConfigSolrXml.<init> Config-defined core root directory: 
   [junit4]   2> 703631 T1147 oasc.CoreContainer.<init> New CoreContainer 847604410
   [junit4]   2> 703632 T1147 oasc.CoreContainer.load Loading cores into CoreContainer [instanceDir=/Users/jenkins/jenkins-slave/workspace/Lucene-Solr-trunk-MacOSX/solr/build/solr-core/test/J0/./org.apache.solr.cloud.CollectionsAPIDistributedZkTest-controljetty-1375513284331/]
   [junit4]   2> 703634 T1147 oashc.HttpShardHandlerFactory.getParameter Setting socketTimeout to: 120000
   [junit4]   2> 703635 T1147 oashc.HttpShardHandlerFactory.getParameter Setting urlScheme to: http://
   [junit4]   2> 703636 T1147 oashc.HttpShardHandlerFactory.getParameter Setting connTimeout to: 15000
   [junit4]   2> 703636 T1147 oashc.HttpShardHandlerFactory.getParameter Setting maxConnectionsPerHost to: 20
   [junit4]   2> 703637 T1147 oashc.HttpShardHandlerFactory.getParameter Setting corePoolSize to: 0
   [junit4]   2> 703637 T1147 oashc.HttpShardHandlerFactory.getParameter Setting maximumPoolSize to: 2147483647
   [junit4]   2> 703638 T1147 oashc.HttpShardHandlerFactory.getParameter Setting maxThreadIdleTime to: 5
   [junit4]   2> 703638 T1147 oashc.HttpShardHandlerFactory.getParameter Setting sizeOfQueue to: -1
   [junit4]   2> 703639 T1147 oashc.HttpShardHandlerFactory.getParameter Setting fairnessPolicy to: false
   [junit4]   2> 703639 T1147 oascsi.HttpClientUtil.createClient Creating new http client, config:maxConnectionsPerHost=20&maxConnections=10000&socketTimeout=120000&connTimeout=15000&retry=false
   [junit4]   2> 703668 T1147 oasc.ZkContainer.initZooKeeper Zookeeper client=127.0.0.1:49349/solr
   [junit4]   2> 703669 T1147 oasc.ZkController.checkChrootPath zkHost includes chroot
   [junit4]   2> 703672 T1147 oascc.ConnectionManager.waitForConnected Waiting for client to connect to ZooKeeper
   [junit4]   2> 703677 T1167 oascc.ConnectionManager.process Watcher org.apache.solr.common.cloud.ConnectionManager@27eefead name:ZooKeeperConnection Watcher:127.0.0.1:49349 got event WatchedEvent state:SyncConnected type:None path:null path:null type:None
   [junit4]   2> 703678 T1147 oascc.ConnectionManager.waitForConnected Client is connected to ZooKeeper
   [junit4]   2> 703683 T1147 oascsi.HttpClientUtil.createClient Creating new http client, config:maxConnections=500&maxConnectionsPerHost=16&socketTimeout=120000&connTimeout=15000
   [junit4]   2> 703722 T1147 oascc.ConnectionManager.waitForConnected Waiting for client to connect to ZooKeeper
   [junit4]   2> 703727 T1169 oascc.ConnectionManager.process Watcher org.apache.solr.common.cloud.ConnectionManager@2c4c78e5 name:ZooKeeperConnection Watcher:127.0.0.1:49349/solr got event WatchedEvent state:SyncConnected type:None path:null path:null type:None
   [junit4]   2> 703727 T1147 oascc.ConnectionManager.waitForConnected Client is connected to ZooKeeper
   [junit4]   2> 703731 T1147 oascc.SolrZkClient.makePath makePath: /overseer/queue
   [junit4]   2> 703770 T1147 oascc.SolrZkClient.makePath makePath: /overseer/collection-queue-work
   [junit4]   2> 703780 T1147 oascc.SolrZkClient.makePath makePath: /live_nodes
   [junit4]   2> 703786 T1147 oasc.ZkController.createEphemeralLiveNode Register node as live in ZooKeeper:/live_nodes/127.0.0.1:49352_
   [junit4]   2> 703790 T1147 oascc.SolrZkClient.makePath makePath: /live_nodes/127.0.0.1:49352_
   [junit4]   2> 703801 T1147 oascc.SolrZkClient.makePath makePath: /overseer_elect/election
   [junit4]   2> 703825 T1147 oascc.SolrZkClient.makePath makePath: /overseer_elect/leader
   [junit4]   2> 703833 T1147 oasc.Overseer.start Overseer (id=90145638585008131-127.0.0.1:49352_-n_0000000000) starting
   [junit4]   2> 703843 T1147 oascc.SolrZkClient.makePath makePath: /overseer/queue-work
   [junit4]   2> 703856 T1171 oasc.OverseerCollectionProcessor.run Process current queue of collection creations
   [junit4]   2> 703863 T1147 oascc.SolrZkClient.makePath makePath: /clusterstate.json
   [junit4]   2> 703871 T1147 oascc.SolrZkClient.makePath makePath: /aliases.json
   [junit4]   2> 703876 T1147 oascc.ZkStateReader.createClusterStateWatchersAndUpdate Updating cluster state from ZooKeeper... 
   [junit4]   2> 703884 T1170 oasc.Overseer$ClusterStateUpdater.run Starting to work on the main queue
   [junit4]   2> 703889 T1147 oasc.CorePropertiesLocator.discover Looking for core definitions underneath /Users/jenkins/jenkins-slave/workspace/Lucene-Solr-trunk-MacOSX/solr/build/solr-core/test/J0/./org.apache.solr.cloud.CollectionsAPIDistributedZkTest-controljetty-1375513284331
   [junit4]   2> 704077 T1147 oasc.CorePropertiesLocator.discoverUnder Found core conf in /Users/jenkins/jenkins-slave/workspace/Lucene-Solr-trunk-MacOSX/solr/build/solr-core/test/J0/./org.apache.solr.cloud.CollectionsAPIDistributedZkTest-controljetty-1375513284331/conf/
   [junit4]   2> 704090 T1147 oasc.CorePropertiesLocator.discover Found 1 core definitions
   [junit4]   2> 704093 T1147 oass.SolrDispatchFilter.init user.dir=/Users/jenkins/jenkins-slave/workspace/Lucene-Solr-trunk-MacOSX/solr/build/solr-core/test/J0
   [junit4]   2> 704094 T1147 oass.SolrDispatchFilter.init SolrDispatchFilter.init() done
   [junit4]   2> 704095 T1147 oascsi.HttpClientUtil.createClient Creating new http client, config:maxConnections=128&maxConnectionsPerHost=32&followRedirects=false
   [junit4]   2> 704131 T1147 oascsi.HttpClientUtil.createClient Creating new http client, config:
   [junit4]   2> 704134 T1147 oascc.ConnectionManager.waitForConnected Waiting for client to connect to ZooKeeper
   [junit4]   2> 704138 T1174 oascc.ConnectionManager.process Watcher org.apache.solr.common.cloud.ConnectionManager@3f71d4ff name:ZooKeeperConnection Watcher:127.0.0.1:49349/solr got event WatchedEvent state:SyncConnected type:None path:null path:null type:None
   [junit4]   2> 704139 T1147 oascc.ConnectionManager.waitForConnected Client is connected to ZooKeeper
   [junit4]   2> 704142 T1147 oascc.ZkStateReader.createClusterStateWatchersAndUpdate Updating cluster state from ZooKeeper... 
   [junit4]   2> 704149 T1147 oasc.ChaosMonkey.monkeyLog monkey: init - expire sessions:true cause connection loss:true
   [junit4]   2> 704751 T1147 oejs.Server.doStart jetty-8.1.10.v20130312
   [junit4]   2> 704775 T1147 oejs.AbstractConnector.doStart Started SelectChannelConnector@127.0.0.1:49356
   [junit4]   2> 704778 T1147 oass.SolrDispatchFilter.init SolrDispatchFilter.init()
   [junit4]   2> 704779 T1147 oasc.SolrResourceLoader.locateSolrHome JNDI not configured for solr (NoInitialContextEx)
   [junit4]   2> 704780 T1147 oasc.SolrResourceLoader.locateSolrHome using system property solr.solr.home: /Users/jenkins/jenkins-slave/workspace/Lucene-Solr-trunk-MacOSX/solr/build/solr-core/test/J0/./org.apache.solr.cloud.CollectionsAPIDistributedZkTest-jetty1-1375513285653
   [junit4]   2> 704781 T1147 oasc.SolrResourceLoader.<init> new SolrResourceLoader for directory: '/Users/jenkins/jenkins-slave/workspace/Lucene-Solr-trunk-MacOSX/solr/build/solr-core/test/J0/./org.apache.solr.cloud.CollectionsAPIDistributedZkTest-jetty1-1375513285653/'
   [junit4]   2> 704831 T1147 oasc.ConfigSolr.fromFile Loading container configuration from /Users/jenkins/jenkins-slave/workspace/Lucene-Solr-trunk-MacOSX/solr/build/solr-core/test/J0/./org.apache.solr.cloud.CollectionsAPIDistributedZkTest-jetty1-1375513285653/solr.xml
   [junit4]   2> 704951 T1147 oasc.ConfigSolrXml.<init> Config-defined core root directory: 
   [junit4]   2> 704953 T1147 oasc.CoreContainer.<init> New CoreContainer 794393832
   [junit4]   2> 704953 T1147 oasc.CoreContainer.load Loading cores into CoreContainer [instanceDir=/Users/jenkins/jenkins-slave/workspace/Lucene-Solr-trunk-MacOSX/solr/build/solr-core/test/J0/./org.apache.solr.cloud.CollectionsAPIDistributedZkTest-jetty1-1375513285653/]
   [junit4]   2> 704955 T1147 oashc.HttpShardHandlerFactory.getParameter Setting socketTimeout to: 120000
   [junit4]   2> 704956 T1147 oashc.HttpShardHandlerFactory.getParameter Setting urlScheme to: http://
   [junit4]   2> 704956 T1147 oashc.HttpShardHandlerFactory.getParameter Setting connTimeout to: 15000
   [junit4]   2> 704957 T1147 oashc.HttpShardHandlerFactory.getParameter Setting maxConnectionsPerHost to: 20
   [junit4]   2> 704957 T1147 oashc.HttpShardHandlerFactory.getParameter Setting corePoolSize to: 0
   [junit4]   2> 704958 T1147 oashc.HttpShardHandlerFactory.getParameter Setting maximumPoolSize to: 2147483647
   [junit4]   2> 704958 T1147 oashc.HttpShardHandlerFactory.getParameter Setting maxThreadIdleTime to: 5
   [junit4]   2> 704959 T1147 oashc.HttpShardHandlerFactory.getParameter Setting sizeOfQueue to: -1
   [junit4]   2> 704959 T1147 oashc.HttpShardHandlerFactory.getParameter Setting fairnessPolicy to: false
   [junit4]   2> 704960 T1147 oascsi.HttpClientUtil.createClient Creating new http client, config:maxConnectionsPerHost=20&maxConnections=10000&socketTimeout=120000&connTimeout=15000&retry=false
   [junit4]   2> 704985 T1147 oasc.ZkContainer.initZooKeeper Zookeeper client=127.0.0.1:49349/solr
   [junit4]   2> 704986 T1147 oasc.ZkController.checkChrootPath zkHost includes chroot
   [junit4]   2> 704987 T1147 oascc.ConnectionManager.waitForConnected Waiting for client to connect to ZooKeeper
   [junit4]   2> 704991 T1185 oascc.ConnectionManager.process Watcher org.apache.solr.common.cloud.ConnectionManager@3065d037 name:ZooKeeperConnection Watcher:127.0.0.1:49349 got event WatchedEvent state:SyncConnected type:None path:null path:null type:None
   [junit4]   2> 704992 T1147 oascc.ConnectionManager.waitForConnected Client is connected to ZooKeeper
   [junit4]   2> 704995 T1147 oascsi.HttpClientUtil.createClient Creating new http client, config:maxConnections=500&maxConnectionsPerHost=16&socketTimeout=120000&connTimeout=15000
   [junit4]   2> 705014 T1147 oascc.ConnectionManager.waitForConnected Waiting for client to connect to ZooKeeper
   [junit4]   2> 705018 T1187 oascc.ConnectionManager.process Watcher org.apache.solr.common.cloud.ConnectionManager@2e5dcd8f name:ZooKeeperConnection Watcher:127.0.0.1:49349/solr got event WatchedEvent state:SyncConnected type:None path:null path:null type:None
   [junit4]   2> 705019 T1147 oascc.ConnectionManager.waitForConnected Client is connected to ZooKeeper
   [junit4]   2> 705028 T1147 oascc.ZkStateReader.createClusterStateWatchersAndUpdate Updating cluster state from ZooKeeper... 
   [junit4]   2> 706037 T1147 oasc.ZkController.createEphemeralLiveNode Register node as live in ZooKeeper:/live_nodes/127.0.0.1:49356_
   [junit4]   2> 706040 T1147 oascc.SolrZkClient.makePath makePath: /live_nodes/127.0.0.1:49356_
   [junit4]   2> 706059 T1169 oascc.ZkStateReader$3.process Updating live nodes... (2)
   [junit4]   2> 706060 T1187 oascc.ZkStateReader$3.process Updating live nodes... (2)
   [junit4]   2> 706061 T1174 oascc.ZkStateReader$3.process Updating live nodes... (2)
   [junit4]   2> 706074 T1147 oasc.CorePropertiesLocator.discover Looking for core definitions underneath /Users/jenkins/jenkins-slave/workspace/Lucene-Solr-trunk-MacOSX/solr/build/solr-core/test/J0/./org.apache.solr.cloud.CollectionsAPIDistributedZkTest-jetty1-1375513285653
   [junit4]   2> 706277 T1147 oasc.CorePropertiesLocator.discoverUnder Found core conf in /Users/jenkins/jenkins-slave/workspace/Lucene-Solr-trunk-MacOSX/solr/build/solr-core/test/J0/./org.apache.solr.cloud.CollectionsAPIDistributedZkTest-jetty1-1375513285653/conf/
   [junit4]   2> 706284 T1147 oasc.CorePropertiesLocator.discover Found 1 core definitions
   [junit4]   2> 706285 T1147 oass.SolrDispatchFilter.init user.dir=/Users/jenkins/jenkins-slave/workspace/Lucene-Solr-trunk-MacOSX/solr/build/solr-core/test/J0
   [junit4]   2> 706286 T1147 oass.SolrDispatchFilter.init SolrDispatchFilter.init() done
   [junit4]   2> 706287 T1147 oascsi.HttpClientUtil.createClient Creating new http client, config:maxConnections=128&maxConnectionsPerHost=32&followRedirects=false
   [junit4]   2> 706859 T1147 oejs.Server.doStart jetty-8.1.10.v20130312
   [junit4]   2> 706868 T1147 oejs.AbstractConnector.doStart Started SelectChannelConnector@127.0.0.1:49359
   [junit4]   2> 706870 T1147 oass.SolrDispatchFilter.init SolrDispatchFilter.init()
   [junit4]   2> 706871 T1147 oasc.SolrResourceLoader.locateSolrHome JNDI not configured for solr (NoInitialContextEx)
   [junit4]   2> 706872 T1147 oasc.SolrResourceLoader.locateSolrHome using system property solr.solr.home: /Users/jenkins/jenkins-slave/workspace/Lucene-Solr-trunk-MacOSX/solr/build/solr-core/test/J0/./org.apache.solr.cloud.CollectionsAPIDistributedZkTest-jetty2-1375513287811
   [junit4]   2> 706873 T1147 oasc.SolrResourceLoader.<init> new SolrResourceLoader for directory: '/Users/jenkins/jenkins-slave/workspace/Lucene-Solr-trunk-MacOSX/solr/build/solr-core/test/J0/./org.apache.solr.cloud.CollectionsAPIDistributedZkTest-jetty2-1375513287811/'
   [junit4]   2> 706955 T1147 oasc.ConfigSolr.fromFile Loading container configuration from /Users/jenkins/jenkins-slave/workspace/Lucene-Solr-trunk-MacOSX/solr/build/solr-core/test/J0/./org.apache.solr.cloud.CollectionsAPIDistributedZkTest-jetty2-1375513287811/solr.xml
   [junit4]   2> 707112 T1147 oasc.ConfigSolrXml.<init> Config-defined core root directory: 
   [junit4]   2> 707114 T1147 oasc.CoreContainer.<init> New CoreContainer 112230612
   [junit4]   2> 707114 T1147 oasc.CoreContainer.load Loading cores into CoreContainer [instanceDir=/Users/jenkins/jenkins-slave/workspace/Lucene-Solr-trunk-MacOSX/solr/build/solr-core/test/J0/./org.apache.solr.cloud.CollectionsAPIDistributedZkTest-jetty2-1375513287811/]
   [junit4]   2> 707117 T1147 oashc.HttpShardHandlerFactory.getParameter Setting socketTimeout to: 120000
   [junit4]   2> 707118 T1147 oashc.HttpShardHandlerFactory.getParameter Setting urlScheme to: http://
   [junit4]   2> 707119 T1147 oashc.HttpShardHandlerFactory.getParameter Setting connTimeout to: 15000
   [junit4]   2> 707119 T1147 oashc.HttpShardHandlerFactory.getParameter Setting maxConnectionsPerHost to: 20
   [junit4]   2> 707120 T1147 oashc.HttpShardHandlerFactory.getParameter Setting corePoolSize to: 0
   [junit4]   2> 707121 T1147 oashc.HttpShardHandlerFactory.getParameter Setting maximumPoolSize to: 2147483647
   [junit4]   2> 707122 T1147 oashc.HttpShardHandlerFactory.getParameter Setting maxThreadIdleTime to: 5
   [junit4]   2> 707122 T1147 oashc.HttpShardHandlerFactory.getParameter Setting sizeOfQueue to: -1
   [junit4]   2> 707123 T1147 oashc.HttpShardHandlerFactory.getParameter Setting fairnessPolicy to: false
   [junit4]   2> 707124 T1147 oascsi.HttpClientUtil.createClient Creating new http client, config:maxConnectionsPerHost=20&maxConnections=10000&socketTimeout=120000&connTimeout=15000&retry=false
   [junit4]   2> 707152 T1147 oasc.ZkContainer.initZooKeeper Zookeeper client=127.0.0.1:49349/solr
   [junit4]   2> 707153 T1147 oasc.ZkController.checkChrootPath zkHost includes chroot
   [junit4]   2> 707156 T1147 oascc.ConnectionManager.waitForConnected Waiting for client to connect to ZooKeeper
   [junit4]   2> 707167 T1199 oascc.ConnectionManager.process Watcher org.apache.solr.common.cloud.ConnectionManager@5ec59db3 name:ZooKeeperConnection Watcher:127.0.0.1:49349 got event WatchedEvent state:SyncConnected type:None path:null path:null type:None
   [junit4]   2> 707168 T1147 oascc.ConnectionManager.waitForConnected Client is connected to ZooKeeper
   [junit4]   2> 707175 T1147 oascsi.HttpClientUtil.createClient Creating new http client, config:maxConnections=500&maxConnectionsPerHost=16&socketTimeout=120000&connTimeout=15000
   [junit4]   2> 707181 T1149 oazs.NIOServerCnxn.doIO WARN caught end of stream exception EndOfStreamException: Unable to read additional data from client sessionid 0x14042fb0de90007, likely client has closed socket
   [junit4]   2> 	at org.apache.zookeeper.server.NIOServerCnxn.doIO(NIOServerCnxn.java:220)
   [junit4]   2> 	at org.apache.zookeeper.server.NIOServerCnxnFactory.run(NIOServerCnxnFactory.java:208)
   [junit4]   2> 	at java.lang.Thread.run(Thread.java:724)
   [junit4]   2> 
   [junit4]   2> 707204 T1147 oascc.ConnectionManager.waitForConnected Waiting for client to connect to ZooKeeper
   [junit4]   2> 707211 T1201 oascc.ConnectionManager.process Watcher org.apache.solr.common.cloud.ConnectionManager@28131dc name:ZooKeeperConnection Watcher:127.0.0.1:49349/solr got event WatchedEvent state:SyncConnected type:None path:null path:null type:None
   [junit4]   2> 707211 T1147 oascc.ConnectionManager.waitForConnected Client is connected to ZooKeeper
   [junit4]   2> 707232 T1147 oascc.ZkStateReader.createClusterStateWatchersAndUpdate Updating cluster state from ZooKeeper... 
   [junit4]   2> 708252 T1147 oasc.ZkController.createEphemeralLiveNode Register node as live in ZooKeeper:/live_nodes/127.0.0.1:49359_
   [junit4]   2> 708255 T1147 oascc.SolrZkClient.makePath makePath: /live_nodes/127.0.0.1:49359_
   [junit4]   2> 708264 T1169 oascc.ZkStateReader$3.process Updating live nodes... (3)
   [junit4]   2> 708265 T1187 oascc.ZkStateReader$3.process Updating live nodes... (3)
   [junit4]   2> 708264 T1174 oascc.ZkStateReader$3.process Updating live nodes... (3)
   [junit4]   2> 708266 T1201 oascc.ZkStateReader$3.process Updating live nodes... (3)
   [junit4]   2> 708288 T1147 oasc.CorePropertiesLocator.discover Looking for core definitions underneath /Users/jenkins/jenkins-slave/workspace/Lucene-Solr-trunk-MacOSX/solr/build/solr-core/test/J0/./org.apache.solr.cloud.CollectionsAPIDistributedZkTest-jetty2-1375513287811
   [junit4]   2> 708460 T1147 oasc.CorePropertiesLocator.discoverUnder Found core conf in /Users/jenkins/jenkins-slave/workspace/Lucene-Solr-trunk-MacOSX/solr/build/solr-core/test/J0/./org.apache.solr.cloud.CollectionsAPIDistributedZkTest-jetty2-1375513287811/conf/
   [junit4]   2> 708466 T1147 oasc.CorePropertiesLocator.discover Found 1 core definitions
   [junit4]   2> 708467 T1147 oass.SolrDispatchFilter.init user.dir=/Users/jenkins/jenkins-slave/workspace/Lucene-Solr-trunk-MacOSX/solr/build/solr-core/test/J0
   [junit4]   2> 708467 T1147 oass.SolrDispatchFilter.init SolrDispatchFilter.init() done
   [junit4]   2> 708468 T1147 oascsi.HttpClientUtil.createClient Creating new http client, config:maxConnections=128&maxConnectionsPerHost=32&followRedirects=false
   [junit4]   2> 709154 T1147 oejs.Server.doStart jetty-8.1.10.v20130312
   [junit4]   2> 709163 T1147 oejs.AbstractConnector.doStart Started SelectChannelConnector@127.0.0.1:49362
   [junit4]   2> 709164 T1147 oass.SolrDispatchFilter.init SolrDispatchFilter.init()
   [junit4]   2> 709165 T1147 oasc.SolrResourceLoader.locateSolrHome JNDI not configured for solr (NoInitialContextEx)
   [junit4]   2> 709165 T1147 oasc.SolrResourceLoader.locateSolrHome using system property solr.solr.home: /Users/jenkins/jenkins-slave/workspace/Lucene-Solr-trunk-MacOSX/solr/build/solr-core/test/J0/./org.apache.solr.cloud.CollectionsAPIDistributedZkTest-jetty3-1375513289998
   [junit4]   2> 709166 T1147 oasc.SolrResourceLoader.<init> new SolrResourceLoader for directory: '/Users/jenkins/jenkins-slave/workspace/Lucene-Solr-trunk-MacOSX/solr/build/solr-core/test/J0/./org.apache.solr.cloud.CollectionsAPIDistributedZkTest-jetty3-1375513289998/'
   [junit4]   2> 709218 T1147 oasc.ConfigSolr.fromFile Loading container configuration from /Users/jenkins/jenkins-slave/workspace/Lucene-Solr-trunk-MacOSX/solr/build/solr-core/test/J0/./org.apache.solr.cloud.CollectionsAPIDistributedZkTest-jetty3-1375513289998/solr.xml
   [junit4]   2> 709346 T1147 oasc.ConfigSolrXml.<init> Config-defined core root directory: 
   [junit4]   2> 709347 T1147 oasc.CoreContainer.<init> New CoreContainer 1462666415
   [junit4]   2> 709347 T1147 oasc.CoreContainer.load Loading cores into CoreContainer [instanceDir=/Users/jenkins/jenkins-slave/workspace/Lucene-Solr-trunk-MacOSX/solr/build/solr-core/test/J0/./org.apache.solr.cloud.CollectionsAPIDistributedZkTest-jetty3-1375513289998/]
   [junit4]   2> 709351 T1147 oashc.HttpShardHandlerFactory.getParameter Setting socketTimeout to: 120000
   [junit4]   2> 709352 T1147 oashc.HttpShardHandlerFactory.getParameter Setting urlScheme to: http://
   [junit4]   2> 709353 T1147 oashc.HttpShardHandlerFactory.getParameter Setting connTimeout to: 15000
   [junit4]   2> 709354 T1147 oashc.HttpShardHandlerFactory.getParameter Setting maxConnectionsPerHost to: 20
   [junit4]   2> 709355 T1147 oashc.HttpShardHandlerFactory.getParameter Setting corePoolSize to: 0
   [junit4]   2> 709356 T1147 oashc.HttpShardHandlerFactory.getParameter Setting maximumPoolSize to: 2147483647
   [junit4]   2> 709357 T1147 oashc.HttpShardHandlerFactory.getParameter Setting maxThreadIdleTime to: 5
   [junit4]   2> 709358 T1147 oashc.HttpShardHandlerFactory.getParameter Setting sizeOfQueue to: -1
   [junit4]   2> 709358 T1147 oashc.HttpShardHandlerFactory.getParameter Setting fairnessPolicy to: false
   [junit4]   2> 709359 T1147 oascsi.HttpClientUtil.createClient Creating new http client, config:maxConnectionsPerHost=20&maxConnections=10000&socketTimeout=120000&connTimeout=15000&retry=false
   [junit4]   2> 709435 T1147 oasc.ZkContainer.initZooKeeper Zookeeper client=127.0.0.1:49349/solr
   [junit4]   2> 709436 T1147 oasc.ZkController.checkChrootPath zkHost includes chroot
   [junit4]   2> 709439 T1147 oascc.ConnectionManager.waitForConnected Waiting for client to connect to ZooKeeper
   [junit4]   2> 709443 T1213 oascc.ConnectionManager.process Watcher org.apache.solr.common.cloud.ConnectionManager@166a0d27 name:ZooKeeperConnection Watcher:127.0.0.1:49349 got event WatchedEvent state:SyncConnected type:None path:null path:null type:None
   [junit4]   2> 709444 T1147 oascc.ConnectionManager.waitForConnected Client is connected to ZooKeeper
   [junit4]   2> 709458 T1147 oascsi.HttpClientUtil.createClient Creating new http client, config:maxConnections=500&maxConnectionsPerHost=16&socketTimeout=120000&connTimeout=15000
   [junit4]   2> 709482 T1147 oascc.ConnectionManager.waitForConnected Waiting for client to connect to ZooKeeper
   [junit4]   2> 709488 T1215 oascc.ConnectionManager.process Watcher org.apache.solr.common.cloud.ConnectionManager@67b98523 name:ZooKeeperConnection Watcher:127.0.0.1:49349/solr got event WatchedEvent state:SyncConnected type:None path:null path:null type:None
   [junit4]   2> 709489 T1147 oascc.ConnectionManager.waitForConnected Client is connected to ZooKeeper
   [junit4]   2> 709501 T1147 oascc.ZkStateReader.createClusterStateWatchersAndUpdate Updating cluster state from ZooKeeper... 
   [junit4]   2> 710515 T1147 oasc.ZkController.createEphemeralLiveNode Register node as live in ZooKeeper:/live_nodes/127.0.0.1:49362_
   [junit4]   2> 710519 T1147 oascc.SolrZkClient.makePath makePath: /live_nodes/127.0.0.1:49362_
   [junit4]   2> 710535 T1169 oascc.ZkStateReader$3.process Updating live nodes... (4)
   [junit4]   2> 710536 T1187 oascc.ZkStateReader$3.process Updating live nodes... (4)
   [junit4]   2> 710535 T1201 oascc.ZkStateReader$3.process Updating live nodes... (4)
   [junit4]   2> 710538 T1174 oascc.ZkStateReader$3.process Updating live nodes... (4)
   [junit4]   2> 710541 T1215 oascc.ZkStateReader$3.process Updating live nodes... (4)
   [junit4]   2> 710558 T1147 oasc.CorePropertiesLocator.discover Looking for core definitions underneath /Users/jenkins/jenkins-slave/workspace/Lucene-Solr-trunk-MacOSX/solr/build/solr-core/test/J0/./org.apache.solr.cloud.CollectionsAPIDistributedZkTest-jetty3-1375513289998
   [junit4]   2> 710780 T1147 oasc.CorePropertiesLocator.discoverUnder Found core conf in /Users/jenkins/jenkins-slave/workspace/Lucene-Solr-trunk-MacOSX/solr/build/solr-core/test/J0/./org.apache.solr.cloud.CollectionsAPIDistributedZkTest-jetty3-1375513289998/conf/
   [junit4]   2> 710787 T1147 oasc.CorePropertiesLocator.discover Found 1 core definitions
   [junit4]   2> 710789 T1147 oass.SolrDispatchFilter.init user.dir=/Users/jenkins/jenkins-slave/workspace/Lucene-Solr-trunk-MacOSX/solr/build/solr-core/test/J0
   [junit4]   2> 710789 T1147 oass.SolrDispatchFilter.init SolrDispatchFilter.init() done
   [junit4]   2> 710790 T1147 oascsi.HttpClientUtil.createClient Creating new http client, config:maxConnections=128&maxConnectionsPerHost=32&followRedirects=false
   [junit4]   2> 711332 T1147 oejs.Server.doStart jetty-8.1.10.v20130312
   [junit4]   2> 711356 T1147 oejs.AbstractConnector.doStart Started SelectChannelConnector@127.0.0.1:49365
   [junit4]   2> 711358 T1147 oass.SolrDispatchFilter.init SolrDispatchFilter.init()
   [junit4]   2> 711359 T1147 oasc.SolrResourceLoader.locateSolrHome JNDI not configured for solr (NoInitialContextEx)
   [junit4]   2> 711360 T1147 oasc.SolrResourceLoader.locateSolrHome using system property solr.solr.home: /Users/jenkins/jenkins-slave/workspace/Lucene-Solr-trunk-MacOSX/solr/build/solr-core/test/J0/./org.apache.solr.cloud.CollectionsAPIDistributedZkTest-jetty4-1375513292315
   [junit4]   2> 711361 T1147 oasc.SolrResourceLoader.<init> new SolrResourceLoader for directory: '/Users/jenkins/jenkins-slave/workspace/Lucene-Solr-trunk-MacOSX/solr/build/solr-core/test/J0/./org.apache.solr.cloud.CollectionsAPIDistributedZkTest-jetty4-1375513292315/'
   [junit4]   2> 711427 T1147 oasc.ConfigSolr.fromFile Loading container configuration from /Users/jenkins/jenkins-slave/workspace/Lucene-Solr-trunk-MacOSX/solr/build/solr-core/test/J0/./org.apache.solr.cloud.CollectionsAPIDistributedZkTest-jetty4-1375513292315/solr.xml
   [junit4]   2> 711623 T1147 oasc.ConfigSolrXml.<init> Config-defined core root directory: 
   [junit4]   2> 711623 T1147 oasc.CoreContainer.<init> New CoreContainer 165051494
   [junit4]   2> 711624 T1147 oasc.CoreContainer.load Loading cores into CoreContainer [instanceDir=/Users/jenkins/jenkins-slave/workspace/Lucene-Solr-trunk-MacOSX/solr/build/solr-core/test/J0/./org.apache.solr.cloud.CollectionsAPIDistributedZkTest-jetty4-1375513292315/]
   [junit4]   2> 711627 T1147 oashc.HttpShardHandlerFactory.getParameter Setting socketTimeout to: 120000
   [junit4]   2> 711627 T1147 oashc.HttpShardHandlerFactory.getParameter Setting urlScheme to: http://
   [junit4]   2> 711628 T1147 oashc.HttpShardHandlerFactory.getParameter Setting connTimeout to: 15000
   [junit4]   2> 711628 T1147 oashc.HttpShardHandlerFactory.getParameter Setting maxConnectionsPerHost to: 20
   [junit4]   2> 711629 T1147 oashc.HttpShardHandlerFactory.getParameter Setting corePoolSize to: 0
   [junit4]   2> 711629 T1147 oashc.HttpShardHandlerFactory.getParameter Setting maximumPoolSize to: 2147483647
   [junit4]   2> 711630 T1147 oashc.HttpShardHandlerFactory.getParameter Setting maxThreadIdleTime to: 5
   [junit4]   2> 711630 T1147 oashc.HttpShardHandlerFactory.getParameter Setting sizeOfQueue to: -1
   [junit4]   2> 711631 T1147 oashc.HttpShardHandlerFactory.getParameter Setting fairnessPolicy to: false
   [junit4]   2> 711631 T1147 oascsi.HttpClientUtil.createClient Creating new http client, config:maxConnectionsPerHost=20&maxConnections=10000&socketTimeout=120000&connTimeout=15000&retry=false
   [junit4]   2> 711651 T1147 oasc.ZkContainer.initZooKeeper Zookeeper client=127.0.0.1:49349/solr
   [junit4]   2> 711652 T1147 oasc.ZkController.checkChrootPath zkHost includes chroot
   [junit4]   2> 711655 T1147 oascc.ConnectionManager.waitForConnected Waiting for client to connect to ZooKeeper
   [junit4]   2> 711660 T1227 oascc.ConnectionManager.process Watcher org.apache.solr.common.cloud.ConnectionManager@26bcf5b1 name:ZooKeeperConnection Watcher:127.0.0.1:49349 got event WatchedEvent state:SyncConnected type:None path:null path:null type:None
   [junit4]   2> 711661 T1147 oascc.ConnectionManager.waitForConnected Client is connected to ZooKeeper
   [junit4]   2> 711665 T1147 oascsi.HttpClientUtil.createClient Creating new http client, config:maxConnections=500&maxConnectionsPerHost=16&socketTimeout=120000&connTimeout=15000
   [junit4]   2> 711692 T1147 oascc.ConnectionManager.waitForConnected Waiting for client to connect to ZooKeeper
   [junit4]   2> 711697 T1229 oascc.ConnectionManager.process Watcher org.apache.solr.common.cloud.ConnectionManager@3f2425ce name:ZooKeeperConnection Watcher:127.0.0.1:49349/solr got event WatchedEvent state:SyncConnected type:None path:null path:null type:None
   [junit4]   2> 711698 T1147 oascc.ConnectionManager.waitForConnected Client is connected to ZooKeeper
   [junit4]   2> 711713 T1147 oascc.ZkStateReader.createClusterStateWatchersAndUpdate Updating cluster state from ZooKeeper... 
   [junit4]   2> 712725 T1147 oasc.ZkController.createEphemeralLiveNode Register node as live in ZooKeeper:/live_nodes/127.0.0.1:49365_
   [junit4]   2> 712728 T1147 oascc.SolrZkClient.makePath makePath: /live_nodes/127.0.0.1:49365_
   [junit4]   2> 712749 T1215 oascc.ZkStateReader$3.process Updating live nodes... (5)
   [junit4]   2> 712750 T1187 oascc.ZkStateReader$3.process Updating live nodes... (5)
   [junit4]   2> 712752 T1169 oascc.ZkStateReader$3.process Updating live nodes... (5)
   [junit4]   2> 712753 T1201 oascc.ZkStateReader$3.process Updating live nodes... (5)
   [junit4]   2> 712753 T1174 oascc.ZkStateReader$3.process Updating live nodes... (5)
   [junit4]   2> 712753 T1229 oascc.ZkStateReader$3.process Updating live nodes... (5)
   [junit4]   2> 712765 T1147 oasc.CorePropertiesLocator.discover Looking for core definitions underneath /Users/jenkins/jenkins-slave/workspace/Lucene-Solr-trunk-MacOSX/solr/build/solr-core/test/J0/./org.apache.solr.cloud.CollectionsAPIDistributedZkTest-jetty4-1375513292315
   [junit4]   2> 712964 T1147 oasc.CorePropertiesLocator.discoverUnder Found core conf in /Users/jenkins/jenkins-slave/workspace/Lucene-Solr-trunk-MacOSX/solr/build/solr-core/test/J0/./org.apache.solr.cloud.CollectionsAPIDistributedZkTest-jetty4-1375513292315/conf/
   [junit4]   2> 712973 T1147 oasc.CorePropertiesLocator.discover Found 1 core definitions
   [junit4]   2> 712975 T1147 oass.SolrDispatchFilter.init user.dir=/Users/jenkins/jenkins-slave/workspace/Lucene-Solr-trunk-MacOSX/solr/build/solr-core/test/J0
   [junit4]   2> 712975 T1147 oass.SolrDispatchFilter.init SolrDispatchFilter.init() done
   [junit4]   2> 712976 T1147 oascsi.HttpClientUtil.createClient Creating new http client, config:maxConnections=128&maxConnectionsPerHost=32&followRedirects=false
   [junit4]   2> 712996 T1147 oascsi.HttpClientUtil.createClient Creating new http client, config:maxConnections=128&maxConnectionsPerHost=32&followRedirects=false
   [junit4]   2> 713017 T1179 oasha.CollectionsHandler.handleCreateAction Creating Collection : numShards=2&name=nodes_used_collection&replicationFactor=2&action=CREATE&wt=javabin&version=2
   [junit4]   2> 713020 T1169 oasc.DistributedQueue$LatchChildWatcher.process Watcher fired on path: /overseer/collection-queue-work state: SyncConnected type NodeChildrenChanged
   [junit4]   2> 713025 T1171 oasc.OverseerCollectionProcessor.run Overseer Collection Processor: Get the message id:/overseer/collection-queue-work/qn-0000000000 message:{
   [junit4]   2> 	  "operation":"createcollection",
   [junit4]   2> 	  "numShards":"2",
   [junit4]   2> 	  "name":"nodes_used_collection",
   [junit4]   2> 	  "replicationFactor":"2"}
   [junit4]   2> 713026 T1171 oasc.OverseerCollectionProcessor.processMessage WARN OverseerCollectionProcessor.processMessage : createcollection , {
   [junit4]   2> 	  "operation":"createcollection",
   [junit4]   2> 	  "numShards":"2",
   [junit4]   2> 	  "name":"nodes_used_collection",
   [junit4]   2> 	  "replicationFactor":"2"}
   [junit4]   2> 714468 T1170 oascc.ZkStateReader.updateClusterState Updating cloud state from ZooKeeper... 
   [junit4]   2> 714470 T1170 oasc.Overseer$ClusterStateUpdater.buildCollection building a new collection: nodes_used_collection
   [junit4]   2> 714470 T1170 oasc.Overseer$ClusterStateUpdater.createCollection Create collection nodes_used_collection with shards [shard1, shard2]
   [junit4]   2> 714484 T1215 oascc.ZkStateReader$2.process A cluster state change: WatchedEvent state:SyncConnected type:NodeDataChanged path:/clusterstate.json, has occurred - updating... (live nodes size: 5)
   [junit4]   2> 714491 T1169 oascc.ZkStateReader$2.process A cluster state change: WatchedEvent state:SyncConnected type:NodeDataChanged path:/clusterstate.json, has occurred - updating... (live nodes size: 5)
   [junit4]   2> 714492 T1201 oascc.ZkStateReader$2.process A cluster state change: WatchedEvent state:SyncConnected type:NodeDataChanged path:/clusterstate.json, has occurred - updating... (live nodes size: 5)
   [junit4]   2> 714493 T1174 oascc.ZkStateReader$2.process A cluster state change: WatchedEvent state:SyncConnected type:NodeDataChanged path:/clusterstate.json, has occurred - updating... (live nodes size: 5)
   [junit4]   2> 714494 T1187 oascc.ZkStateReader$2.process A cluster state change: WatchedEvent state:SyncConnected type:NodeDataChanged path:/clusterstate.json, has occurred - updating... (live nodes size: 5)
   [junit4]   2> 714494 T1229 oascc.ZkStateReader$2.process A cluster state change: WatchedEvent state:SyncConnected type:NodeDataChanged path:/clusterstate.json, has occurred - updating... (live nodes size: 5)
   [junit4]   2> 714559 T1171 oasc.OverseerCollectionProcessor.createCollection going to create cores replicas shardNames [shard1, shard2] , repFactor : 2
   [junit4]   2> 714560 T1171 oasc.OverseerCollectionProcessor.createCollection Creating shard nodes_used_collection_shard1_replica1 as part of slice shard1 of collection nodes_used_collection on 127.0.0.1:49365_
   [junit4]   2> 714561 T1171 oasc.OverseerCollectionProcessor.createCollection Creating shard nodes_used_collection_shard1_replica2 as part of slice shard1 of collection nodes_used_collection on 127.0.0.1:49362_
   [junit4]   2> 714563 T1171 oasc.OverseerCollectionProcessor.createCollection Creating shard nodes_used_collection_shard2_replica1 as part of slice shard2 of collection nodes_used_collection on 127.0.0.1:49359_
   [junit4]   2> 714563 T1171 oasc.OverseerCollectionProcessor.createCollection Creating shard nodes_used_collection_shard2_replica2 as part of slice shard2 of collection nodes_used_collection on 127.0.0.1:49356_
   [junit4]   2> 714596 T1222 oasc.ZkController.publish publishing core=nodes_used_collection_shard1_replica1 state=down
   [junit4]   2> 714599 T1183 oasc.ZkController.publish publishing core=nodes_used_collection_shard2_replica2 state=down
   [junit4]   2> 714602 T1207 oasc.ZkController.publish publishing core=nodes_used_collection_shard1_replica2 state=down
   [junit4]   2> 714599 T1193 oasc.ZkController.publish publishing core=nodes_used_collection_shard2_replica1 state=down
   [junit4]   2> 714607 T1183 oasc.ZkController.waitForCoreNodeName look for our core node name
   [junit4]   2> 714607 T1222 oasc.ZkController.waitForCoreNodeName look for our core node name
   [junit4]   2> 714609 T1193 oasc.ZkController.waitForCoreNodeName look for our core node name
   [junit4]   2> 714609 T1207 oasc.ZkController.waitForCoreNodeName look for our core node name
   [junit4]   2> 716021 T1170 oascc.ZkStateReader.updateClusterState Updating cloud state from ZooKeeper... 
   [junit4]   2> 716025 T1170 oasc.Overseer$ClusterStateUpdater.updateState WARN Could not find collection node for nodes_used_collection, skipping publish state
   [junit4]   2> 716026 T1170 oasc.Overseer$ClusterStateUpdater.updateState Update state numShards=2 message={
   [junit4]   2> 	  "operation":"state",
   [junit4]   2> 	  "core_node_name":"core_node1",
   [junit4]   2> 	  "numShards":"2",
   [junit4]   2> 	  "shard":"shard1",
   [junit4]   2> 	  "roles":null,
   [junit4]   2> 	  "state":"down",
   [junit4]   2> 	  "shard_state":"active",
   [junit4]   2> 	  "core":"nodes_used_collection_shard1_replica1",
   [junit4]   2> 	  "collection":"nodes_used_collection",
   [junit4]   2> 	  "shard_range":null,
   [junit4]   2> 	  "node_name":"127.0.0.1:49365_",
   [junit4]   2> 	  "base_url":"http://127.0.0.1:49365"}
   [junit4]   2> 716040 T1170 oasc.Overseer$ClusterStateUpdater.updateState WARN Could not find collection node for nodes_used_collection, skipping publish state
   [junit4]   2> 716041 T1170 oasc.Overseer$ClusterStateUpdater.updateState Update state numShards=2 message={
   [junit4]   2> 	  "operation":"state",
   [junit4]   2> 	  "core_node_name":"core_node2",
   [junit4]   2> 	  "numShards":"2",
   [junit4]   2> 	  "shard":"shard2",
   [junit4]   2> 	  "roles":null,
   [junit4]   2> 	  "state":"down",
   [junit4]   2> 	  "shard_state":"active",
   [junit4]   2> 	  "core":"nodes_used_collection_shard2_replica2",
   [junit4]   2> 	  "collection":"nodes_used_collection",
   [junit4]   2> 	  "shard_range":null,
   [junit4]   2> 	  "node_name":"127.0.0.1:49356_",
   [junit4]   2> 	  "base_url":"http://127.0.0.1:49356"}
   [junit4]   2> 716055 T1170 oasc.Overseer$ClusterStateUpdater.updateState WARN Could not find collection node for nodes_used_collection, skipping publish state
   [junit4]   2> 716055 T1170 oasc.Overseer$ClusterStateUpdater.updateState Update state numShards=2 message={
   [junit4]   2> 	  "operation":"state",
   [junit4]   2> 	  "core_node_name":"core_node3",
   [junit4]   2> 	  "numShards":"2",
   [junit4]   2> 	  "shard":"shard2",
   [junit4]   2> 	  "roles":null,
   [junit4]   2> 	  "state":"down",
   [junit4]   2> 	  "shard_state":"active",
   [junit4]   2> 	  "core":"nodes_used_collection_shard2_replica1",
   [junit4]   2> 	  "collection":"nodes_used_collection",
   [junit4]   2> 	  "shard_range":null,
   [junit4]   2> 	  "node_name":"127.0.0.1:49359_",
   [junit4]   2> 	  "base_url":"http://127.0.0.1:49359"}
   [junit4]   2> 716070 T1170 oasc.Overseer$ClusterStateUpdater.updateState WARN Could not find collection node for nodes_used_collection, skipping publish state
   [junit4]   2> 716071 T1170 oasc.Overseer$ClusterStateUpdater.updateState Update state numShards=2 message={
   [junit4]   2> 	  "operation":"state",
   [junit4]   2> 	  "core_node_name":"core_node4",
   [junit4]   2> 	  "numShards":"2",
   [junit4]   2> 	  "shard":"shard1",
   [junit4]   2> 	  "roles":null,
   [junit4]   2> 	  "state":"down",
   [junit4]   2> 	  "shard_state":"active",
   [junit4]   2> 	  "core":"nodes_used_collection_shard1_replica2",
   [junit4]   2> 	  "collection":"nodes_used_collection",
   [junit4]   2> 	  "shard_range":null,
   [junit4]   2> 	  "node_name":"127.0.0.1:49362_",
   [junit4]   2> 	  "base_url":"http://127.0.0.1:49362"}
   [junit4]   2> 716087 T1174 oascc.ZkStateReader$2.process A cluster state change: WatchedEvent state:SyncConnected type:NodeDataChanged path:/clusterstate.json, has occurred - updating... (live nodes size: 5)
   [junit4]   2> 716088 T1169 oascc.ZkStateReader$2.process A cluster state change: WatchedEvent state:SyncConnected type:NodeDataChanged path:/clusterstate.json, has occurred - updating... (live nodes size: 5)
   [junit4]   2> 716089 T1229 oascc.ZkStateReader$2.process A cluster state change: WatchedEvent state:SyncConnected type:NodeDataChanged path:/clusterstate.json, has occurred - updating... (live nodes size: 5)
   [junit4]   2> 716089 T1215 oascc.ZkStateReader$2.process A cluster state change: WatchedEvent state:SyncConnected type:NodeDataChanged path:/clusterstate.json, has occurred - updating... (live nodes size: 5)
   [junit4]   2> 716090 T1201 oascc.ZkStateReader$2.process A cluster state change: WatchedEvent state:SyncConnected type:NodeDataChanged path:/clusterstate.json, has occurred - updating... (live nodes size: 5)
   [junit4]   2> 716100 T1187 oascc.ZkStateReader$2.process A cluster state change: WatchedEvent state:SyncConnected type:NodeDataChanged path:/clusterstate.json, has occurred - updating... (live nodes size: 5)
   [junit4]   2> 716610 T1183 oasc.ZkController.waitForShardId waiting to find shard id in clusterstate for nodes_used_collection_shard2_replica2
   [junit4]   2> 716613 T1222 oasc.ZkController.waitForShardId waiting to find shard id in clusterstate for nodes_used_collection_shard1_replica1
   [junit4]   2> 716615 T1193 oasc.ZkController.waitForShardId waiting to find shard id in clusterstate for nodes_used_collection_shard2_replica1
   [junit4]   2> 716617 T1207 oasc.ZkController.waitForShardId waiting to find shard id in clusterstate for nodes_used_collection_shard1_replica2
   [junit4]   2> 716613 T1183 oasc.CorePropertiesLocator.writePropertiesFile ERROR Couldn't persist core properties to /Users/jenkins/jenkins-slave/workspace/Lucene-Solr-trunk-MacOSX/solr/build/solr-core/test/J0/./org.apache.solr.cloud.CollectionsAPIDistributedZkTest-jetty1-1375513285653/nodes_used_collection_shard2_replica2/core.properties: java.io.FileNotFoundException: /Users/jenkins/jenkins-slave/workspace/Lucene-Solr-trunk-MacOSX/solr/build/solr-core/test/J0/./org.apache.solr.cloud.CollectionsAPIDistributedZkTest-jetty1-1375513285653/nodes_used_collection_shard2_replica2/core.properties (No such file or directory)
   [junit4]   2> 716620 T1183 oasc.CoreContainer.create Creating SolrCore 'nodes_used_collection_shard2_replica2' using instanceDir: /Users/jenkins/jenkins-slave/workspace/Lucene-Solr-trunk-MacOSX/solr/build/solr-core/test/J0/./org.apache.solr.cloud.CollectionsAPIDistributedZkTest-jetty1-1375513285653/nodes_used_collection_shard2_replica2
   [junit4]   2> 716621 T1183 oasc.ZkController.createCollectionZkNode Check for collection zkNode:nodes_used_collection
   [junit4]   2> 716615 T1222 oasc.CorePropertiesLocator.writePropertiesFile ERROR Couldn't persist core properties to /Users/jenkins/jenkins-slave/workspace/Lucene-Solr-trunk-MacOSX/solr/build/solr-core/test/J0/./org.apache.solr.cloud.CollectionsAPIDistributedZkTest-jetty4-1375513292315/nodes_used_collection_shard1_replica1/core.properties: java.io.FileNotFoundException: /Users/jenkins/jenkins-slave/workspace/Lucene-Solr-trunk-MacOSX/solr/build/solr-core/test/J0/./org.apache.solr.cloud.CollectionsAPIDistributedZkTest-jetty4-1375513292315/nodes_used_collection_shard1_replica1/core.properties (No such file or directory)
   [junit4]   2> 716622 T1222 oasc.CoreContainer.create Creating SolrCore 'nodes_used_collection_shard1_replica1' using instanceDir: /Users/jenkins/jenkins-slave/workspace/Lucene-Solr-trunk-MacOSX/solr/build/solr-core/test/J0/./org.apache.solr.cloud.CollectionsAPIDistributedZkTest-jetty4-1375513292315/nodes_used_collection_shard1_replica1
   [junit4]   2> 716623 T1222 oasc.ZkController.createCollectionZkNode Check for collection zkNode:nodes_used_collection
   [junit4]   2> 716617 T1193 oasc.CorePropertiesLocator.writePropertiesFile ERROR Couldn't persist core properties to /Users/jenkins/jenkins-slave/workspace/Lucene-Solr-trunk-MacOSX/solr/build/solr-core/test/J0/./org.apache.solr.cloud.CollectionsAPIDistributedZkTest-jetty2-1375513287811/nodes_used_collection_shard2_replica1/core.properties: java.io.FileNotFoundException: /Users/jenkins/jenkins-slave/workspace/Lucene-Solr-trunk-MacOSX/solr/build/solr-core/test/J0/./org.apache.solr.cloud.CollectionsAPIDistributedZkTest-jetty2-1375513287811/nodes_used_collection_shard2_replica1/core.properties (No such file or directory)
   [junit4]   2> 716625 T1193 oasc.CoreContainer.create Creating SolrCore 'nodes_used_collection_shard2_replica1' using instanceDir: /Users/jenkins/jenkins-slave/workspace/Lucene-Solr-trunk-MacOSX/solr/build/solr-core/test/J0/./org.apache.solr.cloud.CollectionsAPIDistributedZkTest-jetty2-1375513287811/nodes_used_collection_shard2_replica1
   [junit4]   2> 716625 T1193 oasc.ZkController.createCollectionZkNode Check for collection zkNode:nodes_used_collection
   [junit4]   2> 716619 T1207 oasc.CorePropertiesLocator.writePropertiesFile ERROR Couldn't persist core properties to /Users/jenkins/jenkins-slave/workspace/Lucene-Solr-trunk-MacOSX/solr/build/solr-core/test/J0/./org.apache.solr.cloud.CollectionsAPIDistributedZkTest-jetty3-1375513289998/nodes_used_collection_shard1_replica2/core.properties: java.io.FileNotFoundException: /Users/jenkins/jenkins-slave/workspace/Lucene-Solr-trunk-MacOSX/solr/build/solr-core/test/J0/./org.apache.solr.cloud.CollectionsAPIDistributedZkTest-jetty3-1375513289998/nodes_used_collection_shard1_replica2/core.properties (No such file or directory)
   [junit4]   2> 716628 T1207 oasc.CoreContainer.create Creating SolrCore 'nodes_used_collection_shard1_replica2' using instanceDir: /Users/jenkins/jenkins-slave/workspace/Lucene-Solr-trunk-MacOSX/solr/build/solr-core/test/J0/./org.apache.solr.cloud.CollectionsAPIDistributedZkTest-jetty3-1375513289998/nodes_used_collection_shard1_replica2
   [junit4]   2> 716628 T1207 oasc.ZkController.createCollectionZkNode Check for collection zkNode:nodes_used_collection
   [junit4]   2> 716634 T1183 oasc.ZkController.createCollectionZkNode Creating collection in ZooKeeper:nodes_used_collection
   [junit4]   2> 716634 T1183 oasc.ZkController.getConfName Looking for collection configName
   [junit4]   2> 716635 T1222 oasc.ZkController.createCollectionZkNode Creating collection in ZooKeeper:nodes_used_collection
   [junit4]   2> 716635 T1222 oasc.ZkController.getConfName Looking for collection configName
   [junit4]   2> 716637 T1207 oasc.ZkController.createCollectionZkNode Creating collection in ZooKeeper:nodes_used_collection
   [junit4]   2> 716637 T1207 oasc.ZkController.getConfName Looking for collection configName
   [junit4]   2> 716642 T1193 oasc.ZkController.createCollectionZkNode Creating collection in ZooKeeper:nodes_used_collection
   [junit4]   2> 716646 T1193 oasc.ZkController.getConfName Looking for collection configName
   [junit4]   2> 716649 T1183 oasc.ZkController.getConfName Only one config set found in zk - using it:conf1
   [junit4]   2> 716649 T1207 oasc.ZkController.getConfName Only one config set found in zk - using it:conf1
   [junit4]   2> 716650 T1207 oascc.SolrZkClient.makePath makePath: /collections/nodes_used_collection
   [junit4]   2> 716650 T1193 oasc.ZkController.getConfName Only one config set found in zk - using it:conf1
   [junit4]   2> 716651 T1193 oascc.SolrZkClient.makePath makePath: /collections/nodes_used_collection
   [junit4]   2> 716650 T1222 oasc.ZkController.getConfName Only one config set found in zk - using it:conf1
   [junit4]   2> 716650 T1183 oascc.SolrZkClient.makePath makePath: /collections/nodes_used_collection
   [junit4]   2> 716652 T1222 oascc.SolrZkClient.makePath makePath: /collections/nodes_used_collection
   [junit4]   2> 716657 T1193 oasc.ZkController.readConfigName Load collection config from:/collections/nodes_used_collection
   [junit4]   2> 716661 T1207 oasc.ZkController.readConfigName Load collection config from:/collections/nodes_used_collection
   [junit4]   2> 716662 T1193 oasc.SolrResourceLoader.<init> new SolrResourceLoader for directory: '/Users/jenkins/jenkins-slave/workspace/Lucene-Solr-trunk-MacOSX/solr/build/solr-core/test/J0/./org.apache.solr.cloud.CollectionsAPIDistributedZkTest-jetty2-1375513287811/nodes_used_collection_shard2_replica1/'
   [junit4]   2> 716663 T1183 oasc.ZkController.readConfigName Load collection config from:/collections/nodes_used_collection
   [junit4]   2> 716670 T1183 oasc.SolrResourceLoader.<init> new SolrResourceLoader for directory: '/Users/jenkins/jenkins-slave/workspace/Lucene-Solr-trunk-MacOSX/solr/build/solr-core/test/J0/./org.apache.solr.cloud.CollectionsAPIDistributedZkTest-jetty1-1375513285653/nodes_used_collection_shard2_replica2/'
   [junit4]   2> 716671 T1207 oasc.SolrResourceLoader.<init> new SolrResourceLoader for directory: '/Users/jenkins/jenkins-slave/workspace/Lucene-Solr-trunk-MacOSX/solr/build/solr-core/test/J0/./org.apache.solr.cloud.CollectionsAPIDistributedZkTest-jetty3-1375513289998/nodes_used_collection_shard1_replica2/'
   [junit4]   2> 716678 T1222 oasc.ZkController.readConfigName Load collection config from:/collections/nodes_used_collection
   [junit4]   2> 716721 T1222 oasc.SolrResourceLoader.<init> new SolrResourceLoader for directory: '/Users/jenkins/jenkins-slave/workspace/Lucene-Solr-trunk-MacOSX/solr/build/solr-core/test/J0/./org.apache.solr.cloud.CollectionsAPIDistributedZkTest-jetty4-1375513292315/nodes_used_collection_shard1_replica1/'
   [junit4]   2> 716927 T1207 oasc.SolrConfig.<init> Using Lucene MatchVersion: LUCENE_50
   [junit4]   2> 716960 T1193 oasc.SolrConfig.<init> Using Lucene MatchVersion: LUCENE_50
   [junit4]   2> 716965 T1222 oasc.SolrConfig.<init> Using Lucene MatchVersion: LUCENE_50
   [junit4]   2> 716995 T1183 oasc.SolrConfig.<init> Using Lucene MatchVersion: LUCENE_50
   [junit4]   2> 717139 T1207 oasc.SolrConfig.<init> Loaded SolrConfig: solrconfig.xml
   [junit4]   2> 717184 T1207 oass.IndexSchema.readSchema Reading Solr Schema from schema.xml
   [junit4]   2> 717200 T1207 oass.IndexSchema.readSchema [nodes_used_collection_shard1_replica2] Schema name=test
   [junit4]   2> 717226 T1222 oasc.SolrConfig.<init> Loaded SolrConfig: solrconfig.xml
   [junit4]   2> 717239 T1183 oasc.SolrConfig.<init> Loaded SolrConfig: solrconfig.xml
   [junit4]   2> 717247 T1193 oasc.SolrConfig.<init> Loaded SolrConfig: solrconfig.xml
   [junit4]   2> 717250 T1222 oass.IndexSchema.readSchema Reading Solr Schema from schema.xml
   [junit4]   2> 717258 T1183 oass.IndexSchema.readSchema Reading Solr Schema from schema.xml
   [junit4]   2> 717267 T1222 oass.IndexSchema.readSchema [nodes_used_collection_shard1_replica1] Schema name=test
   [junit4]   2> 717268 T1193 oass.IndexSchema.readSchema Reading Solr Schema from schema.xml
   [junit4]   2> 717287 T1183 oass.IndexSchema.readSchema [nodes_used_collection_shard2_replica2] Schema name=test
   [junit4]   2> 717314 T1193 oass.IndexSchema.readSchema [nodes_used_collection_shard2_replica1] Schema name=test
   [junit4]   2> 719903 T1207 oass.OpenExchangeRatesOrgProvider.init Initialized with rates=open-exchange-rates.json, refreshInterval=1440.
   [junit4]   2> 719967 T1207 oass.IndexSchema.readSchema default search field in schema is text
   [junit4]   2> 719973 T1207 oass.IndexSchema.readSchema unique key field: id
   [junit4]   2> 719987 T1222 oass.OpenExchangeRatesOrgProvider.init Initialized with rates=open-exchange-rates.json, refreshInterval=1440.
   [junit4]   2> 719988 T1183 oass.OpenExchangeRatesOrgProvider.init Initialized with rates=open-exchange-rates.json, refreshInterval=1440.
   [junit4]   2> 720012 T1222 oass.IndexSchema.readSchema default search field in schema is text
   [junit4]   2> 720017 T1222 oass.IndexSchema.readSchema unique key field: id
   [junit4]   2> 720032 T1183 oass.IndexSchema.readSchema default search field in schema is text
   [junit4]   2> 720056 T1183 oass.IndexSchema.readSchema unique key field: id
   [junit4]   2> 720178 T1193 oass.OpenExchangeRatesOrgProvider.init Initialized with rates=open-exchange-rates.json, refreshInterval=1440.
   [junit4]   2> 720190 T1207 oass.FileExchangeRateProvider.reload Reloading exchange rates from file currency.xml
   [junit4]   2> 720198 T1193 oass.IndexSchema.readSchema default search field in schema is text
   [junit4]   2> 720203 T1193 oass.IndexSchema.readSchema unique key field: id
   [junit4]   2> 720208 T1183 oass.FileExchangeRateProvider.reload Reloading exchange rates from file currency.xml
   [junit4]   2> 720224 T1207 oass.FileExchangeRateProvider.reload Reloading exchange rates from file currency.xml
   [junit4]   2> 720225 T1183 oass.FileExchangeRateProvider.reload Reloading exchange rates from file currency.xml
   [junit4]   2> 720237 T1207 oass.OpenExchangeRatesOrgProvider.reload Reloading exchange rates from open-exchange-rates.json
   [junit4]   2> 720241 T1222 oass.FileExchangeRateProvider.reload Reloading exchange rates from file currency.xml
   [junit4]   2> 720244 T1207 oass.OpenExchangeRatesOrgProvider$OpenExchangeRates.<init> WARN Unknown key IMPORTANT NOTE
   [junit4]   2> 720245 T1207 oass.OpenExchangeRatesOrgProvider$OpenExchangeRates.<init> WARN Expected key, got STRING
   [junit4]   2> 720245 T1207 oass.OpenExchangeRatesOrgProvider.reload Reloading exchange rates from open-exchange-rates.json
   [junit4]   2> 720248 T1183 oass.OpenExchangeRatesOrgProvider.reload Reloading exchange rates from open-exchange-rates.json
   [junit4]   2> 720253 T1222 oass.FileExchangeRateProvider.reload Reloading exchange rates from file currency.xml
   [junit4]   2> 720255 T1207 oass.OpenExchangeRatesOrgProvider$OpenExchangeRates.<init> WARN Unknown key IMPORTANT NOTE
   [junit4]   2> 720256 T1207 oass.OpenExchangeRatesOrgProvider$OpenExchangeRates.<init> WARN Expected key, got STRING
   [junit4]   2> 720256 T1207 oasc.SolrCore.initDirectoryFactory org.apache.solr.core.MockDirectoryFactory
   [junit4]   2> 720257 T1207 oasc.SolrCore.<init> [nodes_used_collection_shard1_replica2] Opening new SolrCore at /Users/jenkins/jenkins-slave/workspace/Lucene-Solr-trunk-MacOSX/solr/build/solr-core/test/J0/./org.apache.solr.cloud.CollectionsAPIDistributedZkTest-jetty3-1375513289998/nodes_used_collection_shard1_replica2/, dataDir=/Users/jenkins/jenkins-slave/workspace/Lucene-Solr-trunk-MacOSX/solr/build/solr-core/test/J0/./org.apache.solr.cloud.CollectionsAPIDistributedZkTest-jetty3-1375513289998//nodes_used_collection_shard1_replica2/data/
   [junit4]   2> 720258 T1207 oasc.JmxMonitoredMap.<init> JMX monitoring is enabled. Adding Solr mbeans to JMX Server: com.sun.jmx.mbeanserver.JmxMBeanServer@33802b75
   [junit4]   2> 720259 T1207 oasc.CachingDirectoryFactory.get return new directory for /Users/jenkins/jenkins-slave/workspace/Lucene-Solr-trunk-MacOSX/solr/build/solr-core/test/J0/./org.apache.solr.cloud.CollectionsAPIDistributedZkTest-jetty3-1375513289998//nodes_used_collection_shard1_replica2/data
   [junit4]   2> 720263 T1207 oasc.SolrCore.getNewIndexDir New index directory detected: old=null new=/Users/jenkins/jenkins-slave/workspace/Lucene-Solr-trunk-MacOSX/solr/build/solr-core/test/J0/./org.apache.solr.cloud.CollectionsAPIDistributedZkTest-jetty3-1375513289998//nodes_used_collection_shard1_replica2/data/index/
   [junit4]   2> 720263 T1207 oasc.SolrCore.initIndex WARN [nodes_used_collection_shard1_replica2] Solr index directory '/Users/jenkins/jenkins-slave/workspace/Lucene-Solr-trunk-MacOSX/solr/build/solr-core/test/J0/./org.apache.solr.cloud.CollectionsAPIDistributedZkTest-jetty3-1375513289998/nodes_used_collection_shard1_replica2/data/index' doesn't exist. Creating new index...
   [junit4]   2> 720264 T1207 oasc.CachingDirectoryFactory.get return new directory for /Users/jenkins/jenkins-slave/workspace/Lucene-Solr-trunk-MacOSX/solr/build/solr-core/test/J0/./org.apache.solr.cloud.CollectionsAPIDistributedZkTest-jetty3-1375513289998//nodes_used_collection_shard1_replica2/data/index
   [junit4]   2> 720269 T1183 oass.OpenExchangeRatesOrgProvider$OpenExchangeRates.<init> WARN Unknown key IMPORTANT NOTE
   [junit4]   2> 720270 T1183 oass.OpenExchangeRatesOrgProvider$OpenExchangeRates.<init> WARN Expected key, got STRING
   [junit4]   2> 720270 T1183 oass.OpenExchangeRatesOrgProvider.reload Reloading exchange rates from open-exchange-rates.json
   [junit4]   2> 720277 T1183 oass.OpenExchangeRatesOrgProvider$OpenExchangeRates.<init> WARN Unknown key IMPORTANT NOTE
   [junit4]   2> 720282 T1183 oass.OpenExchangeRatesOrgProvider$OpenExchangeRates.<init> WARN Expected key, got STRING
   [junit4]   2> 720284 T1183 oasc.SolrCore.initDirectoryFactory org.apache.solr.core.MockDirectoryFactory
   [junit4]   2> 720285 T1183 oasc.SolrCore.<init> [nodes_used_collection_shard2_replica2] Opening new SolrCore at /Users/jenkins/jenkins-slave/workspace/Lucene-Solr-trunk-MacOSX/solr/build/solr-core/test/J0/./org.apache.solr.cloud.CollectionsAPIDistributedZkTest-jetty1-1375513285653/nodes_used_collection_shard2_replica2/, dataDir=/Users/jenkins/jenkins-slave/workspace/Lucene-Solr-trunk-MacOSX/solr/build/solr-core/test/J0/./org.apache.solr.cloud.CollectionsAPIDistributedZkTest-jetty1-1375513285653//nodes_used_collection_shard2_replica2/data/
   [junit4]   2> 720286 T1183 oasc.JmxMonitoredMap.<init> JMX monitoring is enabled. Adding Solr mbeans to JMX Server: com.sun.jmx.mbeanserver.JmxMBeanServer@33802b75
   [junit4]   2> 720287 T1183 oasc.CachingDirectoryFactory.get return new directory for /Users/jenkins/jenkins-slave/workspace/Lucene-Solr-trunk-MacOSX/solr/build/solr-core/test/J0/./org.apache.solr.cloud.CollectionsAPIDistributedZkTest-jetty1-1375513285653//nodes_used_collection_shard2_replica2/data
   [junit4]   2> 720288 T1222 oass.OpenExchangeRatesOrgProvider.reload Reloading exchange rates from open-exchange-rates.json
   [junit4]   2> 720288 T1183 oasc.SolrCore.getNewIndexDir New index directory detected: old=null new=/Users/jenkins/jenkins-slave/workspace/Lucene-Solr-trunk-MacOSX/solr/build/solr-core/test/J0/./org.apache.solr.cloud.CollectionsAPIDistributedZkTest-jetty1-1375513285653//nodes_used_collection_shard2_replica2/data/index/
   [junit4]   2> 720289 T1207 oasc.SolrDeletionPolicy.onCommit SolrDeletionPolicy.onCommit: commits: num=1
   [junit4]   2> 		commit{dir=MockDirWrapper(org.apache.lucene.store.RAMDirectory@bbe5da1 lockFactory=org.apache.lucene.store.NativeFSLockFactory@323c29b7),segFN=segments_1,generation=1}
   [junit4]   2> 720292 T1207 oasc.SolrDeletionPolicy.updateCommits newest commit generation = 1
   [junit4]   2> 720289 T1183 oasc.SolrCore.initIndex WARN [nodes_used_collection_shard2_replica2] Solr index directory '/Users/jenkins/jenkins-slave/workspace/Lucene-Solr-trunk-MacOSX/solr/build/solr-core/test/J0/./org.apache.solr.cloud.CollectionsAPIDistributedZkTest-jetty1-1375513285653/nodes_used_collection_shard2_replica2/data/index' doesn't exist. Creating new index...
   [junit4]   2> 720295 T1183 oasc.CachingDirectoryFactory.get return new directory for /Users/jenkins/jenkins-slave/workspace/Lucene-Solr-trunk-MacOSX/solr/build/solr-core/test/J0/./org.apache.solr.cloud.CollectionsAPIDistributedZkTest-jetty1-1375513285653//nodes_used_collection_shard2_replica2/data/index
   [junit4]   2> 720301 T1222 oass.OpenExchangeRatesOrgProvider$OpenExchangeRates.<init> WARN Unknown key IMPORTANT NOTE
   [junit4]   2> 720302 T1222 oass.OpenExchangeRatesOrgProvider$OpenExchangeRates.<init> WARN Expected key, got STRING
   [junit4]   2> 720303 T1222 oass.OpenExchangeRatesOrgProvider.reload Reloading exchange rates from open-exchange-rates.json
   [junit4]   2> 720306 T1207 oasup.UpdateRequestProcessorChain.init inserting DistributedUpdateProcessorFactory into updateRequestProcessorChain "dedupe"
   [junit4]   2> 720306 T1207 oasup.UpdateRequestProcessorChain.init inserting DistributedUpdateProcessorFactory into updateRequestProcessorChain "stored_sig"
   [junit4]   2> 720308 T1207 oasup.UpdateRequestProcessorChain.init inserting DistributedUpdateProcessorFactory into updateRequestProcessorChain "distrib-dup-test-chain-implicit"
   [junit4]   2> 720309 T1207 oasc.RequestHandlers.initHandlersFromConfig created standard: solr.StandardRequestHandler
   [junit4]   2> 720310 T1207 oasc.RequestHandlers.initHandlersFromConfig created /get: solr.RealTimeGetHandler
   [junit4]   2> 720310 T1207 oasc.RequestHandlers.initHandlersFromConfig adding lazy requestHandler: solr.ReplicationHandler
   [junit4]   2> 720311 T1207 oasc.RequestHandlers.initHandlersFromConfig created /replication: solr.ReplicationHandler
   [junit4]   2> 720312 T1183 oasc.SolrDeletionPolicy.onCommit SolrDeletionPolicy.onCommit: commits: num=1
   [junit4]   2> 		commit{dir=MockDirWrapper(org.apache.lucene.store.RAMDirectory@5efb599 lockFactory=org.apache.lucene.store.NativeFSLockFactory@4b0f079d),segFN=segments_1,generation=1}
   [junit4]   2> 720313 T1183 oasc.SolrDeletionPolicy.updateCommits newest commit generation = 1
   [junit4]   2> 720317 T1207 oasc.RequestHandlers.initHandlersFromConfig created /update: solr.UpdateRequestHandler
   [junit4]   2> 720318 T1207 oasc.RequestHandlers.initHandlersFromConfig created /admin/: org.apache.solr.handler.admin.AdminHandlers
   [junit4]   2> 720323 T1183 oasup.UpdateRequestProcessorChain.init inserting DistributedUpdateProcessorFactory into updateRequestProcessorChain "dedupe"
   [junit4]   2> 720325 T1183 oasup.UpdateRequestProcessorChain.init inserting DistributedUpdateProcessorFactory into updateRequestProcessorChain "stored_sig"
   [junit4]   2> 720326 T1183 oasup.UpdateRequestProcessorChain.init inserting DistributedUpdateProcessorFactory into updateRequestProcessorChain "distrib-dup-test-chain-implicit"
   [junit4]   2> 720327 T1183 oasc.RequestHandlers.initHandlersFromConfig created standard: solr.StandardRequestHandler
   [junit4]   2> 720328 T1183 oasc.RequestHandlers.initHandlersFromConfig created /get: solr.RealTimeGetHandler
   [junit4]   2> 720329 T1183 oasc.RequestHandlers.initHandlersFromConfig adding lazy requestHandler: solr.ReplicationHandler
   [junit4]   2> 720330 T1183 oasc.RequestHandlers.initHandlersFromConfig created /replication: solr.ReplicationHandler
   [junit4]   2> 720333 T1222 oass.OpenExchangeRatesOrgProvider$OpenExchangeRates.<init> WARN Unknown key IMPORTANT NOTE
   [junit4]   2> 720334 T1222 oass.OpenExchangeRatesOrgProvider$OpenExchangeRates.<init> WARN Expected key, got STRING
   [junit4]   2> 720334 T1222 oasc.SolrCore.initDirectoryFactory org.apache.solr.core.MockDirectoryFactory
   [junit4]   2> 720335 T1222 oasc.SolrCore.<init> [nodes_used_collection_shard1_replica1] Opening new SolrCore at /Users/jenkins/jenkins-slave/workspace/Lucene-Solr-trunk-MacOSX/solr/build/solr-core/test/J0/./org.apache.solr.cloud.CollectionsAPIDistributedZkTest-jetty4-1375513292315/nodes_used_collection_shard1_replica1/, dataDir=/Users/jenkins/jenkins-slave/workspace/Lucene-Solr-trunk-MacOSX/solr/build/solr-core/test/J0/./org.apache.solr.cloud.CollectionsAPIDistributedZkTest-jetty4-1375513292315//nodes_used_collection_shard1_replica1/data/
   [junit4]   2> 720335 T1222 oasc.JmxMonitoredMap.<init> JMX monitoring is enabled. Adding Solr mbeans to JMX Server: com.sun.jmx.mbeanserver.JmxMBeanServer@33802b75
   [junit4]   2> 720337 T1222 oasc.CachingDirectoryFactory.get return new directory for /Users/jenkins/jenkins-slave/workspace/Lucene-Solr-trunk-MacOSX/solr/build/solr-core/test/J0/./org.apache.solr.cloud.CollectionsAPIDistributedZkTest-jetty4-1375513292315//nodes_used_collection_shard1_replica1/data
   [junit4]   2> 720341 T1207 oashl.XMLLoader.init xsltCacheLifetimeSeconds=60
   [junit4]   2> 720346 T1183 oasc.RequestHandlers.initHandlersFromConfig created /update: solr.UpdateRequestHandler
   [junit4]   2> 720346 T1183 oasc.RequestHandlers.initHandlersFromConfig created /admin/: org.apache.solr.handler.admin.AdminHandlers
   [junit4]   2> 720349 T1222 oasc.SolrCore.getNewIndexDir New index directory detected: old=null new=/Users/jenkins/jenkins-slave/workspace/Lucene-Solr-trunk-MacOSX/solr/build/solr-core/test/J0/./org.apache.solr.cloud.CollectionsAPIDistributedZkTest-jetty4-1375513292315//nodes_used_collection_shard1_replica1/data/index/
   [junit4]   2> 720349 T1222 oasc.SolrCore.initIndex WARN [nodes_used_collection_shard1_replica1] Solr index directory '/Users/jenkins/jenkins-slave/workspace/Lucene-Solr-trunk-MacOSX/solr/build/solr-core/test/J0/./org.apache.solr.cloud.CollectionsAPIDistributedZkTest-jetty4-1375513292315/nodes_used_collection_shard1_replica1/data/index' doesn't exist. Creating new index...
   [junit4]   2> 720350 T1222 oasc.CachingDirectoryFactory.get return new directory for /Users/jenkins/jenkins-slave/workspace/Lucene-Solr-trunk-MacOSX/solr/build/solr-core/test/J0/./org.apache.solr.cloud.CollectionsAPIDistributedZkTest-jetty4-1375513292315//nodes_used_collection_shard1_replica1/data/index
   [junit4]   2> 720361 T1183 oashl.XMLLoader.init xsltCacheLifetimeSeconds=60
   [junit4]   2> 720362 T1207 oass.SolrIndexSearcher.<init> Opening Searcher@7b9bcfc1 main
   [junit4]   2> 720361 T1222 oasc.SolrDeletionPolicy.onCommit SolrDeletionPolicy.onCommit: commits: num=1
   [junit4]   2> 		commit{dir=MockDirWrapper(org.apache.lucene.store.RAMDirectory@13d6674c lockFactory=org.apache.lucene.store.NativeFSLockFactory@4475e436),segFN=segments_1,generation=1}
   [junit4]   2> 720363 T1222 oasc.SolrDeletionPolicy.updateCommits newest commit generation = 1
   [junit4]   2> 720364 T1207 oasu.CommitTracker.<init> Hard AutoCommit: disabled
   [junit4]   2> 720365 T1207 oasu.CommitTracker.<init> Soft AutoCommit: disabled
   [junit4]   2> 720374 T1183 oass.SolrIndexSearcher.<init> Opening Searcher@57a518b6 main
   [junit4]   2> 720376 T1183 oasu.CommitTracker.<init> Hard AutoCommit: disabled
   [junit4]   2> 720376 T1183 oasu.CommitTracker.<init> Soft AutoCommit: disabled
   [junit4]   2> 720381 T1235 oasc.SolrCore.registerSearcher [nodes_used_collection_shard1_replica2] Registered new searcher Searcher@7b9bcfc1 main{StandardDirectoryReader(segments_1:1)}
   [junit4]   2> 720382 T1193 oass.FileExchangeRateProvider.reload Reloading exchange rates from file currency.xml
   [junit4]   2> 720408 T1193 oass.FileExchangeRateProvider.reload Reloading exchange rates from file currency.xml
   [junit4]   2> 720411 T1222 oasup.UpdateRequestProcessorChain.init inserting DistributedUpdateProcessorFactory into updateRequestProcessorChain "dedupe"
   [junit4]   2> 720411 T1222 oasup.UpdateRequestProcessorChain.init inserting DistributedUpdateProcessorFactory into updateRequestProcessorChain "stored_sig"
   [junit4]   2> 720424 T1222 oasup.UpdateRequestProcessorChain.init inserting DistributedUpdateProcessorFactory into updateRequestProcessorChain "distrib-dup-test-chain-implicit"
   [junit4]   2> 720432 T1193 oass.OpenExchangeRatesOrgProvider.reload Reloading exchange rates from open-exchange-rates.json
   [junit4]   2> 720434 T1236 oasc.SolrCore.registerSearcher [nodes_used_collection_shard2_replica2] Registered new searcher Searcher@57a518b6 main{StandardDirectoryReader(segments_1:1)}
   [junit4]   2> 720434 T1222 oasc.RequestHandlers.initHandlersFromConfig created standard: solr.StandardRequestHandler
   [junit4]   2> 720446 T1222 oasc.RequestHandlers.initHandlersFromConfig created /get: solr.RealTimeGetHandler
   [junit4]   2> 720447 T1222 oasc.RequestHandlers.initHandlersFromConfig adding lazy requestHandler: solr.ReplicationHandler
   [junit4]   2> 720448 T1193 oass.OpenExchangeRatesOrgProvider$OpenExchangeRates.<init> WARN Unknown key IMPORTANT NOTE
   [junit4]   2> 720448 T1193 oass.OpenExchangeRatesOrgProvider$OpenExchangeRates.<init> WARN Expected key, got STRING
   [junit4]   2> 720449 T1193 oass.OpenExchangeRatesOrgProvider.reload Reloading exchange rates from open-exchange-rates.json
   [junit4]   2> 720449 T1222 oasc.RequestHandlers.initHandlersFromConfig created /replication: solr.ReplicationHandler
   [junit4]   2> 720452 T1222 oasc.RequestHandlers.initHandlersFromConfig created /update: solr.UpdateRequestHandler
   [junit4]   2> 720453 T1222 oasc.RequestHandlers.initHandlersFromConfig created /admin/: org.apache.solr.handler.admin.AdminHandlers
   [junit4]   2> 720472 T1222 oashl.XMLLoader.init xsltCacheLifetimeSeconds=60
   [junit4]   2> 720475 T1193 oass.OpenExchangeRatesOrgProvider$OpenExchangeRates.<init> WARN Unknown key IMPORTANT NOTE
   [junit4]   2> 720476 T1193 oass.OpenExchangeRatesOrgProvider$OpenExchangeRates.<init> WARN Expected key, got STRING
   [junit4]   2> 720476 T1193 oasc.SolrCore.initDirectoryFactory org.apache.solr.core.MockDirectoryFactory
   [junit4]   2> 720477 T1193 oasc.SolrCore.<init> [nodes_used_collection_shard2_replica1] Opening new SolrCore at /Users/jenkins/jenkins-slave/workspace/Lucene-Solr-trunk-MacOSX/solr/build/solr-core/test/J0/./org.apache.solr.cloud.CollectionsAPIDistributedZkTest-jetty2-1375513287811/nodes_used_collection_shard2_replica1/, dataDir=/Users/jenkins/jenkins-slave/workspace/Lucene-Solr-trunk-MacOSX/solr/build/solr-core/test/J0/./org.apache.solr.cloud.CollectionsAPIDistributedZkTest-jetty2-1375513287811//nodes_used_collection_shard2_replica1/data/
   [junit4]   2> 720477 T1193 oasc.JmxMonitoredMap.<init> JMX monitoring is enabled. Adding Solr mbeans to JMX Server: com.sun.jmx.mbeanserver.JmxMBeanServer@33802b75
   [junit4]   2> 720479 T1207 oasc.CoreContainer.registerCore registering core: nodes_used_collection_shard1_replica2
   [junit4]   2> 720480 T1207 oasc.ZkController.register Register replica - core:nodes_used_collection_shard1_replica2 address:http://127.0.0.1:49362 collection:nodes_used_collection shard:shard1
   [junit4]   2> 720480 T1207 oascsi.HttpClientUtil.createClient Creating new http client, config:maxConnections=10000&maxConnectionsPerHost=20&connTimeout=15000&socketTimeout=30000&retry=false
   [junit4]   2> 720484 T1183 oasc.CoreContainer.registerCore registering core: nodes_used_collection_shard2_replica2
   [junit4]   2> 720485 T1183 oasc.ZkController.register Register replica - core:nodes_used_collection_shard2_replica2 address:http://127.0.0.1:49356 collection:nodes_used_collection shard:shard2
   [junit4]   2> 720485 T1183 oascsi.HttpClientUtil.createClient Creating new http client, config:maxConnections=10000&maxConnectionsPerHost=20&connTimeout=15000&socketTimeout=30000&retry=false
   [junit4]   2> 720480 T1193 oasc.CachingDirectoryFactory.get return new directory for /Users/jenkins/jenkins-slave/workspace/Lucene-Solr-trunk-MacOSX/solr/build/solr-core/test/J0/./org.apache.solr.cloud.CollectionsAPIDistributedZkTest-jetty2-1375513287811//nodes_used_collection_shard2_replica1/data
   [junit4]   2> 720490 T1193 oasc.SolrCore.getNewIndexDir New index directory detected: old=null new=/Users/jenkins/jenkins-slave/workspace/Lucene-Solr-trunk-MacOSX/solr/build/solr-core/test/J0/./org.apache.solr.cloud.CollectionsAPIDistributedZkTest-jetty2-1375513287811//nodes_used_collection_shard2_replica1/data/index/
   [junit4]   2> 720490 T1193 oasc.SolrCore.initIndex WARN [nodes_used_collection_shard2_replica1] Solr index directory '/Users/jenkins/jenkins-slave/workspace/Lucene-Solr-trunk-MacOSX/solr/build/solr-core/test/J0/./org.apache.solr.cloud.CollectionsAPIDistributedZkTest-jetty2-1375513287811/nodes_used_collection_shard2_replica1/data/index' doesn't exist. Creating new index...
   [junit4]   2> 720491 T1193 oasc.CachingDirectoryFactory.get return new directory for /Users/jenkins/jenkins-slave/workspace/Lucene-Solr-trunk-MacOSX/solr/build/solr-core/test/J0/./org.apache.solr.cloud.CollectionsAPIDistributedZkTest-jetty2-1375513287811//nodes_used_collection_shard2_replica1/data/index
   [junit4]   2> 720497 T1193 oasc.SolrDeletionPolicy.onCommit SolrDeletionPolicy.onCommit: commits: num=1
   [junit4]   2> 		commit{dir=MockDirWrapper(org.apache.lucene.store.RAMDirectory@174098ad lockFactory=org.apache.lucene.store.NativeFSLockFactory@319276e7),segFN=segments_1,generation=1}
   [junit4]   2> 720497 T1193 oasc.SolrDeletionPolicy.updateCommits newest commit generation = 1
   [junit4]   2> 720511 T1193 oasup.UpdateRequestProcessorChain.init inserting DistributedUpdateProcessorFactory into updateRequestProcessorChain "dedupe"
   [junit4]   2> 720511 T1193 oasup.UpdateRequestProcessorChain.init inserting DistributedUpdateProcessorFactory into updateRequestProcessorChain "stored_sig"
   [junit4]   2> 720512 T1193 oasup.UpdateRequestProcessorChain.init inserting DistributedUpdateProcessorFactory into updateRequestProcessorChain "distrib-dup-test-chain-implicit"
   [junit4]   2> 720513 T1193 oasc.RequestHandlers.initHandlersFromConfig created standard: solr.StandardRequestHandler
   [junit4]   2> 720515 T1193 oasc.RequestHandlers.initHandlersFromConfig created /get: solr.RealTimeGetHandler
   [junit4]   2> 720516 T1193 oasc.RequestHandlers.initHandlersFromConfig adding lazy requestHandler: solr.ReplicationHandler
   [junit4]   2> 720517 T1193 oasc.RequestHandlers.initHandlersFromConfig created /replication: solr.ReplicationHandler
   [junit4]   2> 720518 T1193 oasc.RequestHandlers.initHandlersFromConfig created /update: solr.UpdateRequestHandler
   [junit4]   2> 720518 T1193 oasc.RequestHandlers.initHandlersFromConfig created /admin/: org.apache.solr.handler.admin.AdminHandlers
   [junit4]   2> 720526 T1207 oascc.SolrZkClient.makePath makePath: /collections/nodes_used_collection/leader_elect/shard1/election
   [junit4]   2> 720527 T1222 oass.SolrIndexSearcher.<init> Opening Searcher@1caf472a main
   [junit4]   2> 720529 T1222 oasu.CommitTracker.<init> Hard AutoCommit: disabled
   [junit4]   2> 720529 T1222 oasu.CommitTracker.<init> Soft AutoCommit: disabled
   [junit4]   2> 720542 T1193 oashl.XMLLoader.init xsltCacheLifetimeSeconds=60
   [junit4]   2> 720545 T1183 oascc.SolrZkClient.makePath makePath: /collections/nodes_used_collection/leader_elect/shard2/election
   [junit4]   2> 720551 T1237 oasc.SolrCore.registerSearcher [nodes_used_collection_shard1_replica1] Registered new searcher Searcher@1caf472a main{StandardDirectoryReader(segments_1:1)}
   [junit4]   2> 720555 T1222 oasc.CoreContainer.registerCore registering core: nodes_used_collection_shard1_replica1
   [junit4]   2> 720555 T1222 oasc.ZkController.register Register replica - core:nodes_used_collection_shard1_replica1 address:http://127.0.0.1:49365 collection:nodes_used_collection shard:shard1
   [junit4]   2> 720556 T1222 oascsi.HttpClientUtil.createClient Creating new http client, config:maxConnections=10000&maxConnectionsPerHost=20&connTimeout=15000&socketTimeout=30000&retry=false
   [junit4]   2> 720580 T1222 oascc.SolrZkClient.makePath makePath: /collections/nodes_used_collection/leader_elect/shard1/election
   [junit4]   2> 720582 T1193 oass.SolrIndexSearcher.<init> Opening Searcher@774c1fc7 main
   [junit4]   2> 720585 T1193 oasu.CommitTracker.<init> Hard AutoCommit: disabled
   [junit4]   2> 720587 T1193 oasu.CommitTracker.<init> Soft AutoCommit: disabled
   [junit4]   2> 720592 T1238 oasc.SolrCore.registerSearcher [nodes_used_collection_shard2_replica1] Registered new searcher Searcher@774c1fc7 main{StandardDirectoryReader(segments_1:1)}
   [junit4]   2> 720597 T1193 oasc.CoreContainer.registerCore registering core: nodes_used_collection_shard2_replica1
   [junit4]   2> 720598 T1193 oasc.ZkController.register Register replica - core:nodes_used_collection_shard2_replica1 address:http://127.0.0.1:49359 collection:nodes_used_collection shard:shard2
   [junit4]   2> 720598 T1193 oascsi.HttpClientUtil.createClient Creating new http client, config:maxConnections=10000&maxConnectionsPerHost=20&connTimeout=15000&socketTimeout=30000&retry=false
   [junit4]   2> 720623 T1183 oasc.ShardLeaderElectionContext.runLeaderProcess Running the leader process for shard shard2
   [junit4]   2> 720624 T1207 oasc.ShardLeaderElectionContext.runLeaderProcess Running the leader process for shard shard1
   [junit4]   2> 720640 T1183 oasc.ShardLeaderElectionContext.waitForReplicasToComeUp Waiting until we see more replicas up for shard shard2: total=2 found=1 timeoutin=179998
   [junit4]   2> 720642 T1207 oasc.ShardLeaderElectionContext.waitForReplicasToComeUp Enough replicas found to continue.
   [junit4]   2> 720643 T1207 oasc.ShardLeaderElectionContext.runLeaderProcess I may be the new leader - try and sync
   [junit4]   2> 720643 T1207 oasc.SyncStrategy.sync Sync replicas to http://127.0.0.1:49362/nodes_used_collection_shard1_replica2/
   [junit4]   2> 720644 T1207 oasu.PeerSync.sync PeerSync: core=nodes_used_collection_shard1_replica2 url=http://127.0.0.1:49362 START replicas=[http://127.0.0.1:49365/nodes_used_collection_shard1_replica1/] nUpdates=100
   [junit4]   2> 720645 T1207 oasu.PeerSync.sync PeerSync: core=nodes_used_collection_shard1_replica2 url=http://127.0.0.1:49362 DONE.  We have no versions.  sync failed.
   [junit4]   2> 720645 T1207 oasc.SyncStrategy.syncReplicas Leader's attempt to sync with shard failed, moving to the next candidate
   [junit4]   2> 720646 T1207 oasc.ShardLeaderElectionContext.runLeaderProcess We failed sync, but we have no versions - we can't sync in that case - we were active before, so become leader anyway
   [junit4]   2> 720649 T1207 oasc.ShardLeaderElectionContext.runLeaderProcess I am the new leader: http://127.0.0.1:49362/nodes_used_collection_shard1_replica2/ shard1
   [junit4]   2> 720649 T1207 oascc.SolrZkClient.makePath makePath: /collections/nodes_used_collection/leaders/shard1
   [junit4]   2> ASYNC  NEW_CORE C223 name=nodes_used_collection_shard1_replica1 org.apache.solr.core.SolrCore@50b3cbe1 url=http://127.0.0.1:49365/nodes_used_collection_shard1_replica1 node=127.0.0.1:49365_ C223_STATE=coll:nodes_used_collection core:nodes_used_collection_shard1_replica1 props:{state=down, core=nodes_used_collection_shard1_replica1, node_name=127.0.0.1:49365_, base_url=http://127.0.0.1:49365}
   [junit4]   2> 720661 T1223 C223 P49365 oasc.SolrCore.execute [nodes_used_collection_shard1_replica1] webapp= path=/get params={getVersions=100&distrib=false&wt=javabin&qt=/get&version=2} status=0 QTime=4 
   [junit4]   2> 720687 T1170 oascc.ZkStateReader.updateClusterState Updating cloud state from ZooKeeper... 
   [junit4]   2>

[...truncated too long message...]

t org.apache.http.impl.client.AbstractHttpClient.execute(AbstractHttpClient.java:805)
   [junit4]    > 	at org.apache.http.impl.client.AbstractHttpClient.execute(AbstractHttpClient.java:784)
   [junit4]    > 	at org.apache.solr.client.solrj.impl.HttpSolrServer.request(HttpSolrServer.java:365)
   [junit4]    > 	... 45 more
   [junit4]    > Caused by: java.net.ConnectException: Connection refused
   [junit4]    > 	at java.net.PlainSocketImpl.socketConnect(Native Method)
   [junit4]    > 	at java.net.AbstractPlainSocketImpl.doConnect(AbstractPlainSocketImpl.java:339)
   [junit4]    > 	at java.net.AbstractPlainSocketImpl.connectToAddress(AbstractPlainSocketImpl.java:200)
   [junit4]    > 	at java.net.AbstractPlainSocketImpl.connect(AbstractPlainSocketImpl.java:182)
   [junit4]    > 	at java.net.SocksSocketImpl.connect(SocksSocketImpl.java:392)
   [junit4]    > 	at java.net.Socket.connect(Socket.java:579)
   [junit4]    > 	at org.apache.http.conn.scheme.PlainSocketFactory.connectSocket(PlainSocketFactory.java:127)
   [junit4]    > 	at org.apache.http.impl.conn.DefaultClientConnectionOperator.openConnection(DefaultClientConnectionOperator.java:180)
   [junit4]    > 	... 52 more
   [junit4]   2> 918921 T1147 oas.SolrTestCaseJ4.deleteCore ###deleteCore
   [junit4]   2> 216386 T1146 ccr.ThreadLeakControl.checkThreadLeaks WARNING Will linger awaiting termination of 2 leaked thread(s).
   [junit4]   2> 919974 T1229 oasc.LeaderElector$1.process WARN  org.apache.zookeeper.KeeperException$SessionExpiredException: KeeperErrorCode = Session expired for /collections/new_implicit_coll_0/leader_elect/d/election
   [junit4]   2> 	at org.apache.zookeeper.KeeperException.create(KeeperException.java:127)
   [junit4]   2> 	at org.apache.zookeeper.KeeperException.create(KeeperException.java:51)
   [junit4]   2> 	at org.apache.zookeeper.ZooKeeper.getChildren(ZooKeeper.java:1468)
   [junit4]   2> 	at org.apache.solr.common.cloud.SolrZkClient$6.execute(SolrZkClient.java:235)
   [junit4]   2> 	at org.apache.solr.common.cloud.SolrZkClient$6.execute(SolrZkClient.java:232)
   [junit4]   2> 	at org.apache.solr.common.cloud.ZkCmdExecutor.retryOperation(ZkCmdExecutor.java:65)
   [junit4]   2> 	at org.apache.solr.common.cloud.SolrZkClient.getChildren(SolrZkClient.java:232)
   [junit4]   2> 	at org.apache.solr.cloud.LeaderElector.checkIfIamLeader(LeaderElector.java:84)
   [junit4]   2> 	at org.apache.solr.cloud.LeaderElector.access$000(LeaderElector.java:55)
   [junit4]   2> 	at org.apache.solr.cloud.LeaderElector$1.process(LeaderElector.java:129)
   [junit4]   2> 	at org.apache.zookeeper.ClientCnxn$EventThread.processEvent(ClientCnxn.java:519)
   [junit4]   2> 	at org.apache.zookeeper.ClientCnxn$EventThread.run(ClientCnxn.java:495)
   [junit4]   2> 
   [junit4]   2> 919975 T1229 oasc.LeaderElector$1.process WARN  org.apache.zookeeper.KeeperException$SessionExpiredException: KeeperErrorCode = Session expired for /collections/new_implicit_coll_1/leader_elect/c/election
   [junit4]   2> 	at org.apache.zookeeper.KeeperException.create(KeeperException.java:127)
   [junit4]   2> 	at org.apache.zookeeper.KeeperException.create(KeeperException.java:51)
   [junit4]   2> 	at org.apache.zookeeper.ZooKeeper.getChildren(ZooKeeper.java:1468)
   [junit4]   2> 	at org.apache.solr.common.cloud.SolrZkClient$6.execute(SolrZkClient.java:235)
   [junit4]   2> 	at org.apache.solr.common.cloud.SolrZkClient$6.execute(SolrZkClient.java:232)
   [junit4]   2> 	at org.apache.solr.common.cloud.ZkCmdExecutor.retryOperation(ZkCmdExecutor.java:65)
   [junit4]   2> 	at org.apache.solr.common.cloud.SolrZkClient.getChildren(SolrZkClient.java:232)
   [junit4]   2> 	at org.apache.solr.cloud.LeaderElector.checkIfIamLeader(LeaderElector.java:84)
   [junit4]   2> 	at org.apache.solr.cloud.LeaderElector.access$000(LeaderElector.java:55)
   [junit4]   2> 	at org.apache.solr.cloud.LeaderElector$1.process(LeaderElector.java:129)
   [junit4]   2> 	at org.apache.zookeeper.ClientCnxn$EventThread.processEvent(ClientCnxn.java:519)
   [junit4]   2> 	at org.apache.zookeeper.ClientCnxn$EventThread.run(ClientCnxn.java:495)
   [junit4]   2> 
   [junit4]   2> 919976 T1229 oasc.LeaderElector$1.process WARN  org.apache.zookeeper.KeeperException$SessionExpiredException: KeeperErrorCode = Session expired for /collections/new_implicit_coll_0/leader_elect/a/election
   [junit4]   2> 	at org.apache.zookeeper.KeeperException.create(KeeperException.java:127)
   [junit4]   2> 	at org.apache.zookeeper.KeeperException.create(KeeperException.java:51)
   [junit4]   2> 	at org.apache.zookeeper.ZooKeeper.getChildren(ZooKeeper.java:1468)
   [junit4]   2> 	at org.apache.solr.common.cloud.SolrZkClient$6.execute(SolrZkClient.java:235)
   [junit4]   2> 	at org.apache.solr.common.cloud.SolrZkClient$6.execute(SolrZkClient.java:232)
   [junit4]   2> 	at org.apache.solr.common.cloud.ZkCmdExecutor.retryOperation(ZkCmdExecutor.java:65)
   [junit4]   2> 	at org.apache.solr.common.cloud.SolrZkClient.getChildren(SolrZkClient.java:232)
   [junit4]   2> 	at org.apache.solr.cloud.LeaderElector.checkIfIamLeader(LeaderElector.java:84)
   [junit4]   2> 	at org.apache.solr.cloud.LeaderElector.access$000(LeaderElector.java:55)
   [junit4]   2> 	at org.apache.solr.cloud.LeaderElector$1.process(LeaderElector.java:129)
   [junit4]   2> 	at org.apache.zookeeper.ClientCnxn$EventThread.processEvent(ClientCnxn.java:519)
   [junit4]   2> 	at org.apache.zookeeper.ClientCnxn$EventThread.run(ClientCnxn.java:495)
   [junit4]   2> 
   [junit4]   2> 919977 T1229 oascc.ZkStateReader$3.process WARN ZooKeeper watch triggered, but Solr cannot talk to ZK
   [junit4]   2> 919978 T1229 oascc.ZkStateReader$2.process A cluster state change: WatchedEvent state:SyncConnected type:NodeChildrenChanged path:/live_nodes, has occurred - updating... (live nodes size: 1)
   [junit4]   2> 919978 T1229 oascc.ZkStateReader$2.process WARN ZooKeeper watch triggered, but Solr cannot talk to ZK
   [junit4]   2> NOTE: test params are: codec=Lucene42: {timestamp=PostingsFormat(name=Memory doPackFST= false), range_facet_l=PostingsFormat(name=Memory doPackFST= false), id=PostingsFormat(name=Direct), range_facet_sl=PostingsFormat(name=Direct), a_t=PostingsFormat(name=Memory doPackFST= false), text=PostingsFormat(name=Lucene41VarGapFixedInterval), range_facet_si=PostingsFormat(name=Memory doPackFST= false), _version_=Pulsing41(freqCutoff=16 minBlockSize=77 maxBlockSize=249), other_tl1=Pulsing41(freqCutoff=16 minBlockSize=77 maxBlockSize=249), multiDefault=PostingsFormat(name=Memory doPackFST= false), a_si=Pulsing41(freqCutoff=16 minBlockSize=77 maxBlockSize=249), intDefault=Pulsing41(freqCutoff=16 minBlockSize=77 maxBlockSize=249)}, docValues:{timestamp=DocValuesFormat(name=CheapBastard)}, sim=RandomSimilarityProvider(queryNorm=false,coord=crazy): {}, locale=tr, timezone=Antarctica/DumontDUrville
   [junit4]   2> NOTE: Mac OS X 10.8.4 x86_64/Oracle Corporation 1.7.0_25 (64-bit)/cpus=2,threads=2,free=92752536,total=536870912
   [junit4]   2> NOTE: All tests run in this JVM: [SliceStateUpdateTest, TestZkChroot, MoreLikeThisHandlerTest, TestSolr4Spatial, AddSchemaFieldsUpdateProcessorFactoryTest, EchoParamsTest, TestBM25SimilarityFactory, TestComponentsName, TestFieldResource, FileBasedSpellCheckerTest, TestAddFieldRealTimeGet, TestDefaultSimilarityFactory, BinaryUpdateRequestHandlerTest, TestPerFieldSimilarity, TestFastLRUCache, HardAutoCommitTest, XsltUpdateRequestHandlerTest, TestMaxScoreQueryParser, IndexSchemaTest, HdfsBasicDistributedZk2Test, TestFastWriter, SimpleFacetsTest, SuggesterTest, TestStressVersions, TestRandomFaceting, TestCollationField, ParsingFieldUpdateProcessorsTest, SampleTest, TestDFRSimilarityFactory, SOLR749Test, ZkNodePropsTest, JSONWriterTest, SuggesterFSTTest, QueryElevationComponentTest, TestIndexingPerformance, TestValueSourceCache, StatelessScriptUpdateProcessorFactoryTest, TestRealTimeGet, ResponseLogComponentTest, TestSchemaSimilarityResource, SolrRequestParserTest, TestFastOutputStream, PingRequestHandlerTest, TestElisionMultitermQuery, LoggingHandlerTest, TestQueryTypes, TestAnalyzedSuggestions, TestSchemaResource, TestCloudManagedSchema, TestManagedSchemaFieldResource, TestSweetSpotSimilarityFactory, AliasIntegrationTest, TestRecoveryHdfs, SignatureUpdateProcessorFactoryTest, DocValuesMultiTest, PreAnalyzedFieldTest, TestReloadAndDeleteDocs, TestOmitPositions, TestSolrXmlPersistence, DateMathParserTest, ZkCLITest, PreAnalyzedUpdateProcessorTest, CurrencyFieldOpenExchangeTest, TestLMJelinekMercerSimilarityFactory, TestFieldTypeCollectionResource, CollectionsAPIDistributedZkTest]
   [junit4] Completed in 217.73s, 1 test, 1 error <<< FAILURES!

[...truncated 791 lines...]
BUILD FAILED
/Users/jenkins/jenkins-slave/workspace/Lucene-Solr-trunk-MacOSX/build.xml:389: The following error occurred while executing this line:
/Users/jenkins/jenkins-slave/workspace/Lucene-Solr-trunk-MacOSX/build.xml:369: The following error occurred while executing this line:
/Users/jenkins/jenkins-slave/workspace/Lucene-Solr-trunk-MacOSX/build.xml:39: The following error occurred while executing this line:
/Users/jenkins/jenkins-slave/workspace/Lucene-Solr-trunk-MacOSX/solr/build.xml:181: The following error occurred while executing this line:
/Users/jenkins/jenkins-slave/workspace/Lucene-Solr-trunk-MacOSX/solr/common-build.xml:449: The following error occurred while executing this line:
/Users/jenkins/jenkins-slave/workspace/Lucene-Solr-trunk-MacOSX/lucene/common-build.xml:1230: The following error occurred while executing this line:
/Users/jenkins/jenkins-slave/workspace/Lucene-Solr-trunk-MacOSX/lucene/common-build.xml:873: There were test failures: 320 suites, 1347 tests, 1 error, 39 ignored (5 assumptions)

Total time: 115 minutes 3 seconds
Build step 'Invoke Ant' marked build as failure
Description set: Java: 64bit/jdk1.7.0 -XX:+UseCompressedOops -XX:+UseG1GC
Archiving artifacts
Recording test results
Email was triggered for: Failure
Sending email for trigger: Failure



Mime
View raw message