lucene-dev mailing list archives

Site index · List index
Message view « Date » · « Thread »
Top « Date » · « Thread »
From Apache Jenkins Server <jenk...@builds.apache.org>
Subject [JENKINS] Lucene-Solr-Tests-trunk-Java7 - Build # 4208 - Still Failing
Date Sat, 03 Aug 2013 23:31:24 GMT
Build: https://builds.apache.org/job/Lucene-Solr-Tests-trunk-Java7/4208/

1 tests failed.
FAILED:  org.apache.solr.cloud.CollectionsAPIDistributedZkTest.testDistribSearch

Error Message:
IOException occured when talking to server at: http://127.0.0.1:54704/djn

Stack Trace:
org.apache.solr.client.solrj.SolrServerException: IOException occured when talking to server at: http://127.0.0.1:54704/djn
	at __randomizedtesting.SeedInfo.seed([9E9FBBC428AC8A4E:1F7935DC5FF3EA72]:0)
	at org.apache.solr.client.solrj.impl.HttpSolrServer.request(HttpSolrServer.java:435)
	at org.apache.solr.client.solrj.impl.HttpSolrServer.request(HttpSolrServer.java:180)
	at org.apache.solr.cloud.CollectionsAPIDistributedZkTest.testCustomCollectionsAPI(CollectionsAPIDistributedZkTest.java:764)
	at org.apache.solr.cloud.CollectionsAPIDistributedZkTest.doTest(CollectionsAPIDistributedZkTest.java:159)
	at org.apache.solr.BaseDistributedSearchTestCase.testDistribSearch(BaseDistributedSearchTestCase.java:835)
	at sun.reflect.NativeMethodAccessorImpl.invoke0(Native Method)
	at sun.reflect.NativeMethodAccessorImpl.invoke(NativeMethodAccessorImpl.java:57)
	at sun.reflect.DelegatingMethodAccessorImpl.invoke(DelegatingMethodAccessorImpl.java:43)
	at java.lang.reflect.Method.invoke(Method.java:606)
	at com.carrotsearch.randomizedtesting.RandomizedRunner.invoke(RandomizedRunner.java:1559)
	at com.carrotsearch.randomizedtesting.RandomizedRunner.access$600(RandomizedRunner.java:79)
	at com.carrotsearch.randomizedtesting.RandomizedRunner$6.evaluate(RandomizedRunner.java:737)
	at com.carrotsearch.randomizedtesting.RandomizedRunner$7.evaluate(RandomizedRunner.java:773)
	at com.carrotsearch.randomizedtesting.RandomizedRunner$8.evaluate(RandomizedRunner.java:787)
	at com.carrotsearch.randomizedtesting.rules.SystemPropertiesRestoreRule$1.evaluate(SystemPropertiesRestoreRule.java:53)
	at org.apache.lucene.util.TestRuleSetupTeardownChained$1.evaluate(TestRuleSetupTeardownChained.java:50)
	at org.apache.lucene.util.TestRuleFieldCacheSanity$1.evaluate(TestRuleFieldCacheSanity.java:51)
	at org.apache.lucene.util.AbstractBeforeAfterRule$1.evaluate(AbstractBeforeAfterRule.java:46)
	at com.carrotsearch.randomizedtesting.rules.SystemPropertiesInvariantRule$1.evaluate(SystemPropertiesInvariantRule.java:55)
	at org.apache.lucene.util.TestRuleThreadAndTestName$1.evaluate(TestRuleThreadAndTestName.java:49)
	at org.apache.lucene.util.TestRuleIgnoreAfterMaxFailures$1.evaluate(TestRuleIgnoreAfterMaxFailures.java:70)
	at org.apache.lucene.util.TestRuleMarkFailure$1.evaluate(TestRuleMarkFailure.java:48)
	at com.carrotsearch.randomizedtesting.rules.StatementAdapter.evaluate(StatementAdapter.java:36)
	at com.carrotsearch.randomizedtesting.ThreadLeakControl$StatementRunner.run(ThreadLeakControl.java:358)
	at com.carrotsearch.randomizedtesting.ThreadLeakControl.forkTimeoutingTask(ThreadLeakControl.java:782)
	at com.carrotsearch.randomizedtesting.ThreadLeakControl$3.evaluate(ThreadLeakControl.java:442)
	at com.carrotsearch.randomizedtesting.RandomizedRunner.runSingleTest(RandomizedRunner.java:746)
	at com.carrotsearch.randomizedtesting.RandomizedRunner$3.evaluate(RandomizedRunner.java:648)
	at com.carrotsearch.randomizedtesting.RandomizedRunner$4.evaluate(RandomizedRunner.java:682)
	at com.carrotsearch.randomizedtesting.RandomizedRunner$5.evaluate(RandomizedRunner.java:693)
	at com.carrotsearch.randomizedtesting.rules.StatementAdapter.evaluate(StatementAdapter.java:36)
	at com.carrotsearch.randomizedtesting.rules.SystemPropertiesRestoreRule$1.evaluate(SystemPropertiesRestoreRule.java:53)
	at org.apache.lucene.util.AbstractBeforeAfterRule$1.evaluate(AbstractBeforeAfterRule.java:46)
	at org.apache.lucene.util.TestRuleStoreClassName$1.evaluate(TestRuleStoreClassName.java:42)
	at com.carrotsearch.randomizedtesting.rules.SystemPropertiesInvariantRule$1.evaluate(SystemPropertiesInvariantRule.java:55)
	at com.carrotsearch.randomizedtesting.rules.NoShadowingOrOverridesOnMethodsRule$1.evaluate(NoShadowingOrOverridesOnMethodsRule.java:39)
	at com.carrotsearch.randomizedtesting.rules.NoShadowingOrOverridesOnMethodsRule$1.evaluate(NoShadowingOrOverridesOnMethodsRule.java:39)
	at com.carrotsearch.randomizedtesting.rules.StatementAdapter.evaluate(StatementAdapter.java:36)
	at org.apache.lucene.util.TestRuleAssertionsRequired$1.evaluate(TestRuleAssertionsRequired.java:43)
	at org.apache.lucene.util.TestRuleMarkFailure$1.evaluate(TestRuleMarkFailure.java:48)
	at org.apache.lucene.util.TestRuleIgnoreAfterMaxFailures$1.evaluate(TestRuleIgnoreAfterMaxFailures.java:70)
	at org.apache.lucene.util.TestRuleIgnoreTestSuites$1.evaluate(TestRuleIgnoreTestSuites.java:55)
	at com.carrotsearch.randomizedtesting.rules.StatementAdapter.evaluate(StatementAdapter.java:36)
	at com.carrotsearch.randomizedtesting.ThreadLeakControl$StatementRunner.run(ThreadLeakControl.java:358)
	at java.lang.Thread.run(Thread.java:724)
Caused by: org.apache.http.conn.ConnectTimeoutException: Connect to 127.0.0.1:54704 timed out
	at org.apache.http.conn.scheme.PlainSocketFactory.connectSocket(PlainSocketFactory.java:129)
	at org.apache.http.impl.conn.DefaultClientConnectionOperator.openConnection(DefaultClientConnectionOperator.java:180)
	at org.apache.http.impl.conn.ManagedClientConnectionImpl.open(ManagedClientConnectionImpl.java:294)
	at org.apache.http.impl.client.DefaultRequestDirector.tryConnect(DefaultRequestDirector.java:645)
	at org.apache.http.impl.client.DefaultRequestDirector.execute(DefaultRequestDirector.java:480)
	at org.apache.http.impl.client.AbstractHttpClient.execute(AbstractHttpClient.java:906)
	at org.apache.http.impl.client.AbstractHttpClient.execute(AbstractHttpClient.java:805)
	at org.apache.http.impl.client.AbstractHttpClient.execute(AbstractHttpClient.java:784)
	at org.apache.solr.client.solrj.impl.HttpSolrServer.request(HttpSolrServer.java:365)
	... 44 more




Build Log:
[...truncated 9794 lines...]
   [junit4] Suite: org.apache.solr.cloud.CollectionsAPIDistributedZkTest
   [junit4]   2> 1137358 T3108 oas.BaseDistributedSearchTestCase.initHostContext Setting hostContext system property: /djn/
   [junit4]   2> 1137364 T3108 oas.SolrTestCaseJ4.setUp ###Starting testDistribSearch
   [junit4]   2> Creating dataDir: /usr/home/hudson/hudson-slave/workspace/Lucene-Solr-Tests-trunk-Java7/solr/build/solr-core/test/J0/./solrtest-CollectionsAPIDistributedZkTest-1375571694534
   [junit4]   2> 1137366 T3108 oasc.ZkTestServer.run STARTING ZK TEST SERVER
   [junit4]   2> 1137366 T3109 oasc.ZkTestServer$ZKServerMain.runFromConfig Starting server
   [junit4]   2> 1137467 T3108 oasc.ZkTestServer.run start zk server on port:40955
   [junit4]   2> 1137468 T3108 oascc.ConnectionManager.waitForConnected Waiting for client to connect to ZooKeeper
   [junit4]   2> 1137497 T3115 oascc.ConnectionManager.process Watcher org.apache.solr.common.cloud.ConnectionManager@31f67f87 name:ZooKeeperConnection Watcher:127.0.0.1:40955 got event WatchedEvent state:SyncConnected type:None path:null path:null type:None
   [junit4]   2> 1137498 T3108 oascc.ConnectionManager.waitForConnected Client is connected to ZooKeeper
   [junit4]   2> 1137498 T3108 oascc.SolrZkClient.makePath makePath: /solr
   [junit4]   2> 1137525 T3108 oascc.ConnectionManager.waitForConnected Waiting for client to connect to ZooKeeper
   [junit4]   2> 1137527 T3117 oascc.ConnectionManager.process Watcher org.apache.solr.common.cloud.ConnectionManager@b54b1c6 name:ZooKeeperConnection Watcher:127.0.0.1:40955/solr got event WatchedEvent state:SyncConnected type:None path:null path:null type:None
   [junit4]   2> 1137527 T3108 oascc.ConnectionManager.waitForConnected Client is connected to ZooKeeper
   [junit4]   2> 1137528 T3108 oascc.SolrZkClient.makePath makePath: /collections/collection1
   [junit4]   2> 1137538 T3108 oascc.SolrZkClient.makePath makePath: /collections/collection1/shards
   [junit4]   2> 1137549 T3108 oascc.SolrZkClient.makePath makePath: /collections/control_collection
   [junit4]   2> 1137552 T3108 oascc.SolrZkClient.makePath makePath: /collections/control_collection/shards
   [junit4]   2> 1137555 T3108 oasc.AbstractZkTestCase.putConfig put /usr/home/hudson/hudson-slave/workspace/Lucene-Solr-Tests-trunk-Java7/solr/build/solr-core/test-files/solr/collection1/conf/solrconfig-tlog.xml to /configs/conf1/solrconfig.xml
   [junit4]   2> 1137556 T3108 oascc.SolrZkClient.makePath makePath: /configs/conf1/solrconfig.xml
   [junit4]   2> 1137569 T3108 oasc.AbstractZkTestCase.putConfig put /usr/home/hudson/hudson-slave/workspace/Lucene-Solr-Tests-trunk-Java7/solr/build/solr-core/test-files/solr/collection1/conf/schema.xml to /configs/conf1/schema.xml
   [junit4]   2> 1137569 T3108 oascc.SolrZkClient.makePath makePath: /configs/conf1/schema.xml
   [junit4]   2> 1137673 T3108 oasc.AbstractZkTestCase.putConfig put /usr/home/hudson/hudson-slave/workspace/Lucene-Solr-Tests-trunk-Java7/solr/build/solr-core/test-files/solr/collection1/conf/stopwords.txt to /configs/conf1/stopwords.txt
   [junit4]   2> 1137674 T3108 oascc.SolrZkClient.makePath makePath: /configs/conf1/stopwords.txt
   [junit4]   2> 1137676 T3108 oasc.AbstractZkTestCase.putConfig put /usr/home/hudson/hudson-slave/workspace/Lucene-Solr-Tests-trunk-Java7/solr/build/solr-core/test-files/solr/collection1/conf/protwords.txt to /configs/conf1/protwords.txt
   [junit4]   2> 1137677 T3108 oascc.SolrZkClient.makePath makePath: /configs/conf1/protwords.txt
   [junit4]   2> 1137688 T3108 oasc.AbstractZkTestCase.putConfig put /usr/home/hudson/hudson-slave/workspace/Lucene-Solr-Tests-trunk-Java7/solr/build/solr-core/test-files/solr/collection1/conf/currency.xml to /configs/conf1/currency.xml
   [junit4]   2> 1137689 T3108 oascc.SolrZkClient.makePath makePath: /configs/conf1/currency.xml
   [junit4]   2> 1137691 T3108 oasc.AbstractZkTestCase.putConfig put /usr/home/hudson/hudson-slave/workspace/Lucene-Solr-Tests-trunk-Java7/solr/build/solr-core/test-files/solr/collection1/conf/open-exchange-rates.json to /configs/conf1/open-exchange-rates.json
   [junit4]   2> 1137692 T3108 oascc.SolrZkClient.makePath makePath: /configs/conf1/open-exchange-rates.json
   [junit4]   2> 1137695 T3108 oasc.AbstractZkTestCase.putConfig put /usr/home/hudson/hudson-slave/workspace/Lucene-Solr-Tests-trunk-Java7/solr/build/solr-core/test-files/solr/collection1/conf/mapping-ISOLatin1Accent.txt to /configs/conf1/mapping-ISOLatin1Accent.txt
   [junit4]   2> 1137695 T3108 oascc.SolrZkClient.makePath makePath: /configs/conf1/mapping-ISOLatin1Accent.txt
   [junit4]   2> 1137698 T3108 oasc.AbstractZkTestCase.putConfig put /usr/home/hudson/hudson-slave/workspace/Lucene-Solr-Tests-trunk-Java7/solr/build/solr-core/test-files/solr/collection1/conf/old_synonyms.txt to /configs/conf1/old_synonyms.txt
   [junit4]   2> 1137699 T3108 oascc.SolrZkClient.makePath makePath: /configs/conf1/old_synonyms.txt
   [junit4]   2> 1137702 T3108 oasc.AbstractZkTestCase.putConfig put /usr/home/hudson/hudson-slave/workspace/Lucene-Solr-Tests-trunk-Java7/solr/build/solr-core/test-files/solr/collection1/conf/synonyms.txt to /configs/conf1/synonyms.txt
   [junit4]   2> 1137703 T3108 oascc.SolrZkClient.makePath makePath: /configs/conf1/synonyms.txt
   [junit4]   2> 1137975 T3108 oejs.Server.doStart jetty-8.1.10.v20130312
   [junit4]   2> 1137979 T3108 oejs.AbstractConnector.doStart Started SocketConnector@127.0.0.1:14295
   [junit4]   2> 1137980 T3108 oass.SolrDispatchFilter.init SolrDispatchFilter.init()
   [junit4]   2> 1137981 T3108 oasc.SolrResourceLoader.locateSolrHome JNDI not configured for solr (NoInitialContextEx)
   [junit4]   2> 1137981 T3108 oasc.SolrResourceLoader.locateSolrHome using system property solr.solr.home: /usr/home/hudson/hudson-slave/workspace/Lucene-Solr-Tests-trunk-Java7/solr/build/solr-core/test/J0/./org.apache.solr.cloud.CollectionsAPIDistributedZkTest-controljetty-1375571694882
   [junit4]   2> 1137982 T3108 oasc.SolrResourceLoader.<init> new SolrResourceLoader for directory: '/usr/home/hudson/hudson-slave/workspace/Lucene-Solr-Tests-trunk-Java7/solr/build/solr-core/test/J0/./org.apache.solr.cloud.CollectionsAPIDistributedZkTest-controljetty-1375571694882/'
   [junit4]   2> 1138019 T3108 oasc.ConfigSolr.fromFile Loading container configuration from /usr/home/hudson/hudson-slave/workspace/Lucene-Solr-Tests-trunk-Java7/solr/build/solr-core/test/J0/./org.apache.solr.cloud.CollectionsAPIDistributedZkTest-controljetty-1375571694882/solr.xml
   [junit4]   2> 1138108 T3108 oasc.ConfigSolrXml.<init> Config-defined core root directory: 
   [junit4]   2> 1138108 T3108 oasc.CoreContainer.<init> New CoreContainer 638671275
   [junit4]   2> 1138109 T3108 oasc.CoreContainer.load Loading cores into CoreContainer [instanceDir=/usr/home/hudson/hudson-slave/workspace/Lucene-Solr-Tests-trunk-Java7/solr/build/solr-core/test/J0/./org.apache.solr.cloud.CollectionsAPIDistributedZkTest-controljetty-1375571694882/]
   [junit4]   2> 1138111 T3108 oashc.HttpShardHandlerFactory.getParameter Setting socketTimeout to: 120000
   [junit4]   2> 1138111 T3108 oashc.HttpShardHandlerFactory.getParameter Setting urlScheme to: http://
   [junit4]   2> 1138112 T3108 oashc.HttpShardHandlerFactory.getParameter Setting connTimeout to: 15000
   [junit4]   2> 1138112 T3108 oashc.HttpShardHandlerFactory.getParameter Setting maxConnectionsPerHost to: 20
   [junit4]   2> 1138113 T3108 oashc.HttpShardHandlerFactory.getParameter Setting corePoolSize to: 0
   [junit4]   2> 1138113 T3108 oashc.HttpShardHandlerFactory.getParameter Setting maximumPoolSize to: 2147483647
   [junit4]   2> 1138113 T3108 oashc.HttpShardHandlerFactory.getParameter Setting maxThreadIdleTime to: 5
   [junit4]   2> 1138114 T3108 oashc.HttpShardHandlerFactory.getParameter Setting sizeOfQueue to: -1
   [junit4]   2> 1138114 T3108 oashc.HttpShardHandlerFactory.getParameter Setting fairnessPolicy to: false
   [junit4]   2> 1138115 T3108 oascsi.HttpClientUtil.createClient Creating new http client, config:maxConnectionsPerHost=20&maxConnections=10000&socketTimeout=120000&connTimeout=15000&retry=false
   [junit4]   2> 1138132 T3108 oasc.ZkContainer.initZooKeeper Zookeeper client=127.0.0.1:40955/solr
   [junit4]   2> 1138133 T3108 oasc.ZkController.checkChrootPath zkHost includes chroot
   [junit4]   2> 1138134 T3108 oascc.ConnectionManager.waitForConnected Waiting for client to connect to ZooKeeper
   [junit4]   2> 1138137 T3128 oascc.ConnectionManager.process Watcher org.apache.solr.common.cloud.ConnectionManager@42f48969 name:ZooKeeperConnection Watcher:127.0.0.1:40955 got event WatchedEvent state:SyncConnected type:None path:null path:null type:None
   [junit4]   2> 1138137 T3108 oascc.ConnectionManager.waitForConnected Client is connected to ZooKeeper
   [junit4]   2> 1138147 T3108 oascsi.HttpClientUtil.createClient Creating new http client, config:maxConnections=500&maxConnectionsPerHost=16&socketTimeout=120000&connTimeout=15000
   [junit4]   2> 1138159 T3108 oascc.ConnectionManager.waitForConnected Waiting for client to connect to ZooKeeper
   [junit4]   2> 1138161 T3130 oascc.ConnectionManager.process Watcher org.apache.solr.common.cloud.ConnectionManager@a8c1be5 name:ZooKeeperConnection Watcher:127.0.0.1:40955/solr got event WatchedEvent state:SyncConnected type:None path:null path:null type:None
   [junit4]   2> 1138161 T3108 oascc.ConnectionManager.waitForConnected Client is connected to ZooKeeper
   [junit4]   2> 1138168 T3108 oascc.SolrZkClient.makePath makePath: /overseer/queue
   [junit4]   2> 1138172 T3108 oascc.SolrZkClient.makePath makePath: /overseer/collection-queue-work
   [junit4]   2> 1138180 T3108 oascc.SolrZkClient.makePath makePath: /live_nodes
   [junit4]   2> 1138181 T3108 oasc.ZkController.createEphemeralLiveNode Register node as live in ZooKeeper:/live_nodes/127.0.0.1:14295_djn
   [junit4]   2> 1138183 T3108 oascc.SolrZkClient.makePath makePath: /live_nodes/127.0.0.1:14295_djn
   [junit4]   2> 1138187 T3108 oascc.SolrZkClient.makePath makePath: /overseer_elect/election
   [junit4]   2> 1138207 T3108 oascc.SolrZkClient.makePath makePath: /overseer_elect/leader
   [junit4]   2> 1138209 T3108 oasc.Overseer.start Overseer (id=90149466573570051-127.0.0.1:14295_djn-n_0000000000) starting
   [junit4]   2> 1138213 T3108 oascc.SolrZkClient.makePath makePath: /overseer/queue-work
   [junit4]   2> 1138229 T3132 oasc.OverseerCollectionProcessor.run Process current queue of collection creations
   [junit4]   2> 1138229 T3108 oascc.SolrZkClient.makePath makePath: /clusterstate.json
   [junit4]   2> 1138231 T3108 oascc.SolrZkClient.makePath makePath: /aliases.json
   [junit4]   2> 1138233 T3108 oascc.ZkStateReader.createClusterStateWatchersAndUpdate Updating cluster state from ZooKeeper... 
   [junit4]   2> 1138235 T3131 oasc.Overseer$ClusterStateUpdater.run Starting to work on the main queue
   [junit4]   2> 1138238 T3108 oasc.CorePropertiesLocator.discover Looking for core definitions underneath /usr/home/hudson/hudson-slave/workspace/Lucene-Solr-Tests-trunk-Java7/solr/build/solr-core/test/J0/./org.apache.solr.cloud.CollectionsAPIDistributedZkTest-controljetty-1375571694882
   [junit4]   2> 1138240 T3108 oasc.CorePropertiesLocator.discoverUnder Found core conf in /usr/home/hudson/hudson-slave/workspace/Lucene-Solr-Tests-trunk-Java7/solr/build/solr-core/test/J0/./org.apache.solr.cloud.CollectionsAPIDistributedZkTest-controljetty-1375571694882/conf/
   [junit4]   2> 1138408 T3108 oasc.CorePropertiesLocator.discover Found 1 core definitions
   [junit4]   2> 1138409 T3108 oass.SolrDispatchFilter.init user.dir=/usr/home/hudson/hudson-slave/workspace/Lucene-Solr-Tests-trunk-Java7/solr/build/solr-core/test/J0
   [junit4]   2> 1138409 T3108 oass.SolrDispatchFilter.init SolrDispatchFilter.init() done
   [junit4]   2> 1138410 T3108 oascsi.HttpClientUtil.createClient Creating new http client, config:maxConnections=128&maxConnectionsPerHost=32&followRedirects=false
   [junit4]   2> 1138427 T3108 oascsi.HttpClientUtil.createClient Creating new http client, config:
   [junit4]   2> 1138428 T3108 oascc.ConnectionManager.waitForConnected Waiting for client to connect to ZooKeeper
   [junit4]   2> 1138448 T3135 oascc.ConnectionManager.process Watcher org.apache.solr.common.cloud.ConnectionManager@677a428f name:ZooKeeperConnection Watcher:127.0.0.1:40955/solr got event WatchedEvent state:SyncConnected type:None path:null path:null type:None
   [junit4]   2> 1138449 T3108 oascc.ConnectionManager.waitForConnected Client is connected to ZooKeeper
   [junit4]   2> 1138450 T3108 oascc.ZkStateReader.createClusterStateWatchersAndUpdate Updating cluster state from ZooKeeper... 
   [junit4]   2> 1138452 T3108 oasc.ChaosMonkey.monkeyLog monkey: init - expire sessions:true cause connection loss:true
   [junit4]   2> 1138776 T3108 oejs.Server.doStart jetty-8.1.10.v20130312
   [junit4]   2> 1138779 T3108 oejs.AbstractConnector.doStart Started SocketConnector@127.0.0.1:54704
   [junit4]   2> 1138780 T3108 oass.SolrDispatchFilter.init SolrDispatchFilter.init()
   [junit4]   2> 1138780 T3108 oasc.SolrResourceLoader.locateSolrHome JNDI not configured for solr (NoInitialContextEx)
   [junit4]   2> 1138781 T3108 oasc.SolrResourceLoader.locateSolrHome using system property solr.solr.home: /usr/home/hudson/hudson-slave/workspace/Lucene-Solr-Tests-trunk-Java7/solr/build/solr-core/test/J0/./org.apache.solr.cloud.CollectionsAPIDistributedZkTest-jetty1-1375571695621
   [junit4]   2> 1138781 T3108 oasc.SolrResourceLoader.<init> new SolrResourceLoader for directory: '/usr/home/hudson/hudson-slave/workspace/Lucene-Solr-Tests-trunk-Java7/solr/build/solr-core/test/J0/./org.apache.solr.cloud.CollectionsAPIDistributedZkTest-jetty1-1375571695621/'
   [junit4]   2> 1138830 T3108 oasc.ConfigSolr.fromFile Loading container configuration from /usr/home/hudson/hudson-slave/workspace/Lucene-Solr-Tests-trunk-Java7/solr/build/solr-core/test/J0/./org.apache.solr.cloud.CollectionsAPIDistributedZkTest-jetty1-1375571695621/solr.xml
   [junit4]   2> 1138920 T3108 oasc.ConfigSolrXml.<init> Config-defined core root directory: 
   [junit4]   2> 1138921 T3108 oasc.CoreContainer.<init> New CoreContainer 1578351353
   [junit4]   2> 1138921 T3108 oasc.CoreContainer.load Loading cores into CoreContainer [instanceDir=/usr/home/hudson/hudson-slave/workspace/Lucene-Solr-Tests-trunk-Java7/solr/build/solr-core/test/J0/./org.apache.solr.cloud.CollectionsAPIDistributedZkTest-jetty1-1375571695621/]
   [junit4]   2> 1138923 T3108 oashc.HttpShardHandlerFactory.getParameter Setting socketTimeout to: 120000
   [junit4]   2> 1138923 T3108 oashc.HttpShardHandlerFactory.getParameter Setting urlScheme to: http://
   [junit4]   2> 1138924 T3108 oashc.HttpShardHandlerFactory.getParameter Setting connTimeout to: 15000
   [junit4]   2> 1138924 T3108 oashc.HttpShardHandlerFactory.getParameter Setting maxConnectionsPerHost to: 20
   [junit4]   2> 1138925 T3108 oashc.HttpShardHandlerFactory.getParameter Setting corePoolSize to: 0
   [junit4]   2> 1138925 T3108 oashc.HttpShardHandlerFactory.getParameter Setting maximumPoolSize to: 2147483647
   [junit4]   2> 1138926 T3108 oashc.HttpShardHandlerFactory.getParameter Setting maxThreadIdleTime to: 5
   [junit4]   2> 1138926 T3108 oashc.HttpShardHandlerFactory.getParameter Setting sizeOfQueue to: -1
   [junit4]   2> 1138926 T3108 oashc.HttpShardHandlerFactory.getParameter Setting fairnessPolicy to: false
   [junit4]   2> 1138927 T3108 oascsi.HttpClientUtil.createClient Creating new http client, config:maxConnectionsPerHost=20&maxConnections=10000&socketTimeout=120000&connTimeout=15000&retry=false
   [junit4]   2> 1138944 T3108 oasc.ZkContainer.initZooKeeper Zookeeper client=127.0.0.1:40955/solr
   [junit4]   2> 1138945 T3108 oasc.ZkController.checkChrootPath zkHost includes chroot
   [junit4]   2> 1138946 T3108 oascc.ConnectionManager.waitForConnected Waiting for client to connect to ZooKeeper
   [junit4]   2> 1138948 T3146 oascc.ConnectionManager.process Watcher org.apache.solr.common.cloud.ConnectionManager@4f6d948b name:ZooKeeperConnection Watcher:127.0.0.1:40955 got event WatchedEvent state:SyncConnected type:None path:null path:null type:None
   [junit4]   2> 1138948 T3108 oascc.ConnectionManager.waitForConnected Client is connected to ZooKeeper
   [junit4]   2> 1138950 T3108 oascsi.HttpClientUtil.createClient Creating new http client, config:maxConnections=500&maxConnectionsPerHost=16&socketTimeout=120000&connTimeout=15000
   [junit4]   2> 1138963 T3108 oascc.ConnectionManager.waitForConnected Waiting for client to connect to ZooKeeper
   [junit4]   2> 1138965 T3148 oascc.ConnectionManager.process Watcher org.apache.solr.common.cloud.ConnectionManager@2a9180fa name:ZooKeeperConnection Watcher:127.0.0.1:40955/solr got event WatchedEvent state:SyncConnected type:None path:null path:null type:None
   [junit4]   2> 1138965 T3108 oascc.ConnectionManager.waitForConnected Client is connected to ZooKeeper
   [junit4]   2> 1138976 T3108 oascc.ZkStateReader.createClusterStateWatchersAndUpdate Updating cluster state from ZooKeeper... 
   [junit4]   2> 1139985 T3108 oasc.ZkController.createEphemeralLiveNode Register node as live in ZooKeeper:/live_nodes/127.0.0.1:54704_djn
   [junit4]   2> 1139987 T3108 oascc.SolrZkClient.makePath makePath: /live_nodes/127.0.0.1:54704_djn
   [junit4]   2> 1139990 T3135 oascc.ZkStateReader$3.process Updating live nodes... (2)
   [junit4]   2> 1139991 T3148 oascc.ZkStateReader$3.process Updating live nodes... (2)
   [junit4]   2> 1139990 T3130 oascc.ZkStateReader$3.process Updating live nodes... (2)
   [junit4]   2> 1140002 T3108 oasc.CorePropertiesLocator.discover Looking for core definitions underneath /usr/home/hudson/hudson-slave/workspace/Lucene-Solr-Tests-trunk-Java7/solr/build/solr-core/test/J0/./org.apache.solr.cloud.CollectionsAPIDistributedZkTest-jetty1-1375571695621
   [junit4]   2> 1140179 T3108 oasc.CorePropertiesLocator.discoverUnder Found core conf in /usr/home/hudson/hudson-slave/workspace/Lucene-Solr-Tests-trunk-Java7/solr/build/solr-core/test/J0/./org.apache.solr.cloud.CollectionsAPIDistributedZkTest-jetty1-1375571695621/conf/
   [junit4]   2> 1140184 T3108 oasc.CorePropertiesLocator.discover Found 1 core definitions
   [junit4]   2> 1140184 T3108 oass.SolrDispatchFilter.init user.dir=/usr/home/hudson/hudson-slave/workspace/Lucene-Solr-Tests-trunk-Java7/solr/build/solr-core/test/J0
   [junit4]   2> 1140185 T3108 oass.SolrDispatchFilter.init SolrDispatchFilter.init() done
   [junit4]   2> 1140185 T3108 oascsi.HttpClientUtil.createClient Creating new http client, config:maxConnections=128&maxConnectionsPerHost=32&followRedirects=false
   [junit4]   2> 1140507 T3108 oejs.Server.doStart jetty-8.1.10.v20130312
   [junit4]   2> 1140511 T3108 oejs.AbstractConnector.doStart Started SocketConnector@127.0.0.1:22021
   [junit4]   2> 1140512 T3108 oass.SolrDispatchFilter.init SolrDispatchFilter.init()
   [junit4]   2> 1140512 T3108 oasc.SolrResourceLoader.locateSolrHome JNDI not configured for solr (NoInitialContextEx)
   [junit4]   2> 1140513 T3108 oasc.SolrResourceLoader.locateSolrHome using system property solr.solr.home: /usr/home/hudson/hudson-slave/workspace/Lucene-Solr-Tests-trunk-Java7/solr/build/solr-core/test/J0/./org.apache.solr.cloud.CollectionsAPIDistributedZkTest-jetty2-1375571697371
   [junit4]   2> 1140513 T3108 oasc.SolrResourceLoader.<init> new SolrResourceLoader for directory: '/usr/home/hudson/hudson-slave/workspace/Lucene-Solr-Tests-trunk-Java7/solr/build/solr-core/test/J0/./org.apache.solr.cloud.CollectionsAPIDistributedZkTest-jetty2-1375571697371/'
   [junit4]   2> 1140556 T3108 oasc.ConfigSolr.fromFile Loading container configuration from /usr/home/hudson/hudson-slave/workspace/Lucene-Solr-Tests-trunk-Java7/solr/build/solr-core/test/J0/./org.apache.solr.cloud.CollectionsAPIDistributedZkTest-jetty2-1375571697371/solr.xml
   [junit4]   2> 1140658 T3108 oasc.ConfigSolrXml.<init> Config-defined core root directory: 
   [junit4]   2> 1140659 T3108 oasc.CoreContainer.<init> New CoreContainer 769492804
   [junit4]   2> 1140660 T3108 oasc.CoreContainer.load Loading cores into CoreContainer [instanceDir=/usr/home/hudson/hudson-slave/workspace/Lucene-Solr-Tests-trunk-Java7/solr/build/solr-core/test/J0/./org.apache.solr.cloud.CollectionsAPIDistributedZkTest-jetty2-1375571697371/]
   [junit4]   2> 1140662 T3108 oashc.HttpShardHandlerFactory.getParameter Setting socketTimeout to: 120000
   [junit4]   2> 1140662 T3108 oashc.HttpShardHandlerFactory.getParameter Setting urlScheme to: http://
   [junit4]   2> 1140663 T3108 oashc.HttpShardHandlerFactory.getParameter Setting connTimeout to: 15000
   [junit4]   2> 1140663 T3108 oashc.HttpShardHandlerFactory.getParameter Setting maxConnectionsPerHost to: 20
   [junit4]   2> 1140664 T3108 oashc.HttpShardHandlerFactory.getParameter Setting corePoolSize to: 0
   [junit4]   2> 1140664 T3108 oashc.HttpShardHandlerFactory.getParameter Setting maximumPoolSize to: 2147483647
   [junit4]   2> 1140664 T3108 oashc.HttpShardHandlerFactory.getParameter Setting maxThreadIdleTime to: 5
   [junit4]   2> 1140665 T3108 oashc.HttpShardHandlerFactory.getParameter Setting sizeOfQueue to: -1
   [junit4]   2> 1140665 T3108 oashc.HttpShardHandlerFactory.getParameter Setting fairnessPolicy to: false
   [junit4]   2> 1140666 T3108 oascsi.HttpClientUtil.createClient Creating new http client, config:maxConnectionsPerHost=20&maxConnections=10000&socketTimeout=120000&connTimeout=15000&retry=false
   [junit4]   2> 1140683 T3108 oasc.ZkContainer.initZooKeeper Zookeeper client=127.0.0.1:40955/solr
   [junit4]   2> 1140683 T3108 oasc.ZkController.checkChrootPath zkHost includes chroot
   [junit4]   2> 1140684 T3108 oascc.ConnectionManager.waitForConnected Waiting for client to connect to ZooKeeper
   [junit4]   2> 1140687 T3160 oascc.ConnectionManager.process Watcher org.apache.solr.common.cloud.ConnectionManager@bed4ebe name:ZooKeeperConnection Watcher:127.0.0.1:40955 got event WatchedEvent state:SyncConnected type:None path:null path:null type:None
   [junit4]   2> 1140687 T3108 oascc.ConnectionManager.waitForConnected Client is connected to ZooKeeper
   [junit4]   2> 1140689 T3108 oascsi.HttpClientUtil.createClient Creating new http client, config:maxConnections=500&maxConnectionsPerHost=16&socketTimeout=120000&connTimeout=15000
   [junit4]   2> 1140700 T3108 oascc.ConnectionManager.waitForConnected Waiting for client to connect to ZooKeeper
   [junit4]   2> 1140702 T3162 oascc.ConnectionManager.process Watcher org.apache.solr.common.cloud.ConnectionManager@1a798ece name:ZooKeeperConnection Watcher:127.0.0.1:40955/solr got event WatchedEvent state:SyncConnected type:None path:null path:null type:None
   [junit4]   2> 1140702 T3108 oascc.ConnectionManager.waitForConnected Client is connected to ZooKeeper
   [junit4]   2> 1140711 T3108 oascc.ZkStateReader.createClusterStateWatchersAndUpdate Updating cluster state from ZooKeeper... 
   [junit4]   2> 1141714 T3108 oasc.ZkController.createEphemeralLiveNode Register node as live in ZooKeeper:/live_nodes/127.0.0.1:22021_djn
   [junit4]   2> 1141716 T3108 oascc.SolrZkClient.makePath makePath: /live_nodes/127.0.0.1:22021_djn
   [junit4]   2> 1141719 T3148 oascc.ZkStateReader$3.process Updating live nodes... (3)
   [junit4]   2> 1141719 T3135 oascc.ZkStateReader$3.process Updating live nodes... (3)
   [junit4]   2> 1141719 T3130 oascc.ZkStateReader$3.process Updating live nodes... (3)
   [junit4]   2> 1141719 T3162 oascc.ZkStateReader$3.process Updating live nodes... (3)
   [junit4]   2> 1141776 T3108 oasc.CorePropertiesLocator.discover Looking for core definitions underneath /usr/home/hudson/hudson-slave/workspace/Lucene-Solr-Tests-trunk-Java7/solr/build/solr-core/test/J0/./org.apache.solr.cloud.CollectionsAPIDistributedZkTest-jetty2-1375571697371
   [junit4]   2> 1141778 T3108 oasc.CorePropertiesLocator.discoverUnder Found core conf in /usr/home/hudson/hudson-slave/workspace/Lucene-Solr-Tests-trunk-Java7/solr/build/solr-core/test/J0/./org.apache.solr.cloud.CollectionsAPIDistributedZkTest-jetty2-1375571697371/conf/
   [junit4]   2> 1141945 T3108 oasc.CorePropertiesLocator.discover Found 1 core definitions
   [junit4]   2> 1141946 T3108 oass.SolrDispatchFilter.init user.dir=/usr/home/hudson/hudson-slave/workspace/Lucene-Solr-Tests-trunk-Java7/solr/build/solr-core/test/J0
   [junit4]   2> 1141947 T3108 oass.SolrDispatchFilter.init SolrDispatchFilter.init() done
   [junit4]   2> 1141947 T3108 oascsi.HttpClientUtil.createClient Creating new http client, config:maxConnections=128&maxConnectionsPerHost=32&followRedirects=false
   [junit4]   2> 1142226 T3108 oejs.Server.doStart jetty-8.1.10.v20130312
   [junit4]   2> 1142230 T3108 oejs.AbstractConnector.doStart Started SocketConnector@127.0.0.1:42695
   [junit4]   2> 1142231 T3108 oass.SolrDispatchFilter.init SolrDispatchFilter.init()
   [junit4]   2> 1142231 T3108 oasc.SolrResourceLoader.locateSolrHome JNDI not configured for solr (NoInitialContextEx)
   [junit4]   2> 1142232 T3108 oasc.SolrResourceLoader.locateSolrHome using system property solr.solr.home: /usr/home/hudson/hudson-slave/workspace/Lucene-Solr-Tests-trunk-Java7/solr/build/solr-core/test/J0/./org.apache.solr.cloud.CollectionsAPIDistributedZkTest-jetty3-1375571699131
   [junit4]   2> 1142232 T3108 oasc.SolrResourceLoader.<init> new SolrResourceLoader for directory: '/usr/home/hudson/hudson-slave/workspace/Lucene-Solr-Tests-trunk-Java7/solr/build/solr-core/test/J0/./org.apache.solr.cloud.CollectionsAPIDistributedZkTest-jetty3-1375571699131/'
   [junit4]   2> 1142271 T3108 oasc.ConfigSolr.fromFile Loading container configuration from /usr/home/hudson/hudson-slave/workspace/Lucene-Solr-Tests-trunk-Java7/solr/build/solr-core/test/J0/./org.apache.solr.cloud.CollectionsAPIDistributedZkTest-jetty3-1375571699131/solr.xml
   [junit4]   2> 1142361 T3108 oasc.ConfigSolrXml.<init> Config-defined core root directory: 
   [junit4]   2> 1142361 T3108 oasc.CoreContainer.<init> New CoreContainer 1687942746
   [junit4]   2> 1142362 T3108 oasc.CoreContainer.load Loading cores into CoreContainer [instanceDir=/usr/home/hudson/hudson-slave/workspace/Lucene-Solr-Tests-trunk-Java7/solr/build/solr-core/test/J0/./org.apache.solr.cloud.CollectionsAPIDistributedZkTest-jetty3-1375571699131/]
   [junit4]   2> 1142364 T3108 oashc.HttpShardHandlerFactory.getParameter Setting socketTimeout to: 120000
   [junit4]   2> 1142364 T3108 oashc.HttpShardHandlerFactory.getParameter Setting urlScheme to: http://
   [junit4]   2> 1142365 T3108 oashc.HttpShardHandlerFactory.getParameter Setting connTimeout to: 15000
   [junit4]   2> 1142365 T3108 oashc.HttpShardHandlerFactory.getParameter Setting maxConnectionsPerHost to: 20
   [junit4]   2> 1142366 T3108 oashc.HttpShardHandlerFactory.getParameter Setting corePoolSize to: 0
   [junit4]   2> 1142366 T3108 oashc.HttpShardHandlerFactory.getParameter Setting maximumPoolSize to: 2147483647
   [junit4]   2> 1142366 T3108 oashc.HttpShardHandlerFactory.getParameter Setting maxThreadIdleTime to: 5
   [junit4]   2> 1142367 T3108 oashc.HttpShardHandlerFactory.getParameter Setting sizeOfQueue to: -1
   [junit4]   2> 1142367 T3108 oashc.HttpShardHandlerFactory.getParameter Setting fairnessPolicy to: false
   [junit4]   2> 1142368 T3108 oascsi.HttpClientUtil.createClient Creating new http client, config:maxConnectionsPerHost=20&maxConnections=10000&socketTimeout=120000&connTimeout=15000&retry=false
   [junit4]   2> 1142409 T3108 oasc.ZkContainer.initZooKeeper Zookeeper client=127.0.0.1:40955/solr
   [junit4]   2> 1142410 T3108 oasc.ZkController.checkChrootPath zkHost includes chroot
   [junit4]   2> 1142411 T3108 oascc.ConnectionManager.waitForConnected Waiting for client to connect to ZooKeeper
   [junit4]   2> 1142414 T3174 oascc.ConnectionManager.process Watcher org.apache.solr.common.cloud.ConnectionManager@76ee54cc name:ZooKeeperConnection Watcher:127.0.0.1:40955 got event WatchedEvent state:SyncConnected type:None path:null path:null type:None
   [junit4]   2> 1142414 T3108 oascc.ConnectionManager.waitForConnected Client is connected to ZooKeeper
   [junit4]   2> 1142416 T3108 oascsi.HttpClientUtil.createClient Creating new http client, config:maxConnections=500&maxConnectionsPerHost=16&socketTimeout=120000&connTimeout=15000
   [junit4]   2> 1142427 T3108 oascc.ConnectionManager.waitForConnected Waiting for client to connect to ZooKeeper
   [junit4]   2> 1142428 T3176 oascc.ConnectionManager.process Watcher org.apache.solr.common.cloud.ConnectionManager@14dca98e name:ZooKeeperConnection Watcher:127.0.0.1:40955/solr got event WatchedEvent state:SyncConnected type:None path:null path:null type:None
   [junit4]   2> 1142429 T3108 oascc.ConnectionManager.waitForConnected Client is connected to ZooKeeper
   [junit4]   2> 1142433 T3108 oascc.ZkStateReader.createClusterStateWatchersAndUpdate Updating cluster state from ZooKeeper... 
   [junit4]   2> 1143435 T3108 oasc.ZkController.createEphemeralLiveNode Register node as live in ZooKeeper:/live_nodes/127.0.0.1:42695_djn
   [junit4]   2> 1143463 T3108 oascc.SolrZkClient.makePath makePath: /live_nodes/127.0.0.1:42695_djn
   [junit4]   2> 1143466 T3130 oascc.ZkStateReader$3.process Updating live nodes... (4)
   [junit4]   2> 1143466 T3162 oascc.ZkStateReader$3.process Updating live nodes... (4)
   [junit4]   2> 1143466 T3135 oascc.ZkStateReader$3.process Updating live nodes... (4)
   [junit4]   2> 1143466 T3176 oascc.ZkStateReader$3.process Updating live nodes... (4)
   [junit4]   2> 1143466 T3148 oascc.ZkStateReader$3.process Updating live nodes... (4)
   [junit4]   2> 1143472 T3108 oasc.CorePropertiesLocator.discover Looking for core definitions underneath /usr/home/hudson/hudson-slave/workspace/Lucene-Solr-Tests-trunk-Java7/solr/build/solr-core/test/J0/./org.apache.solr.cloud.CollectionsAPIDistributedZkTest-jetty3-1375571699131
   [junit4]   2> 1143476 T3108 oasc.CorePropertiesLocator.discoverUnder Found core conf in /usr/home/hudson/hudson-slave/workspace/Lucene-Solr-Tests-trunk-Java7/solr/build/solr-core/test/J0/./org.apache.solr.cloud.CollectionsAPIDistributedZkTest-jetty3-1375571699131/conf/
   [junit4]   2> 1143643 T3108 oasc.CorePropertiesLocator.discover Found 1 core definitions
   [junit4]   2> 1143644 T3108 oass.SolrDispatchFilter.init user.dir=/usr/home/hudson/hudson-slave/workspace/Lucene-Solr-Tests-trunk-Java7/solr/build/solr-core/test/J0
   [junit4]   2> 1143644 T3108 oass.SolrDispatchFilter.init SolrDispatchFilter.init() done
   [junit4]   2> 1143645 T3108 oascsi.HttpClientUtil.createClient Creating new http client, config:maxConnections=128&maxConnectionsPerHost=32&followRedirects=false
   [junit4]   2> 1143926 T3108 oejs.Server.doStart jetty-8.1.10.v20130312
   [junit4]   2> 1143930 T3108 oejs.AbstractConnector.doStart Started SocketConnector@127.0.0.1:53665
   [junit4]   2> 1143931 T3108 oass.SolrDispatchFilter.init SolrDispatchFilter.init()
   [junit4]   2> 1143931 T3108 oasc.SolrResourceLoader.locateSolrHome JNDI not configured for solr (NoInitialContextEx)
   [junit4]   2> 1143932 T3108 oasc.SolrResourceLoader.locateSolrHome using system property solr.solr.home: /usr/home/hudson/hudson-slave/workspace/Lucene-Solr-Tests-trunk-Java7/solr/build/solr-core/test/J0/./org.apache.solr.cloud.CollectionsAPIDistributedZkTest-jetty4-1375571700830
   [junit4]   2> 1143932 T3108 oasc.SolrResourceLoader.<init> new SolrResourceLoader for directory: '/usr/home/hudson/hudson-slave/workspace/Lucene-Solr-Tests-trunk-Java7/solr/build/solr-core/test/J0/./org.apache.solr.cloud.CollectionsAPIDistributedZkTest-jetty4-1375571700830/'
   [junit4]   2> 1143970 T3108 oasc.ConfigSolr.fromFile Loading container configuration from /usr/home/hudson/hudson-slave/workspace/Lucene-Solr-Tests-trunk-Java7/solr/build/solr-core/test/J0/./org.apache.solr.cloud.CollectionsAPIDistributedZkTest-jetty4-1375571700830/solr.xml
   [junit4]   2> 1144058 T3108 oasc.ConfigSolrXml.<init> Config-defined core root directory: 
   [junit4]   2> 1144059 T3108 oasc.CoreContainer.<init> New CoreContainer 2054450237
   [junit4]   2> 1144059 T3108 oasc.CoreContainer.load Loading cores into CoreContainer [instanceDir=/usr/home/hudson/hudson-slave/workspace/Lucene-Solr-Tests-trunk-Java7/solr/build/solr-core/test/J0/./org.apache.solr.cloud.CollectionsAPIDistributedZkTest-jetty4-1375571700830/]
   [junit4]   2> 1144061 T3108 oashc.HttpShardHandlerFactory.getParameter Setting socketTimeout to: 120000
   [junit4]   2> 1144062 T3108 oashc.HttpShardHandlerFactory.getParameter Setting urlScheme to: http://
   [junit4]   2> 1144062 T3108 oashc.HttpShardHandlerFactory.getParameter Setting connTimeout to: 15000
   [junit4]   2> 1144063 T3108 oashc.HttpShardHandlerFactory.getParameter Setting maxConnectionsPerHost to: 20
   [junit4]   2> 1144063 T3108 oashc.HttpShardHandlerFactory.getParameter Setting corePoolSize to: 0
   [junit4]   2> 1144063 T3108 oashc.HttpShardHandlerFactory.getParameter Setting maximumPoolSize to: 2147483647
   [junit4]   2> 1144064 T3108 oashc.HttpShardHandlerFactory.getParameter Setting maxThreadIdleTime to: 5
   [junit4]   2> 1144064 T3108 oashc.HttpShardHandlerFactory.getParameter Setting sizeOfQueue to: -1
   [junit4]   2> 1144065 T3108 oashc.HttpShardHandlerFactory.getParameter Setting fairnessPolicy to: false
   [junit4]   2> 1144065 T3108 oascsi.HttpClientUtil.createClient Creating new http client, config:maxConnectionsPerHost=20&maxConnections=10000&socketTimeout=120000&connTimeout=15000&retry=false
   [junit4]   2> 1144083 T3108 oasc.ZkContainer.initZooKeeper Zookeeper client=127.0.0.1:40955/solr
   [junit4]   2> 1144083 T3108 oasc.ZkController.checkChrootPath zkHost includes chroot
   [junit4]   2> 1144084 T3108 oascc.ConnectionManager.waitForConnected Waiting for client to connect to ZooKeeper
   [junit4]   2> 1144087 T3188 oascc.ConnectionManager.process Watcher org.apache.solr.common.cloud.ConnectionManager@218ac4b2 name:ZooKeeperConnection Watcher:127.0.0.1:40955 got event WatchedEvent state:SyncConnected type:None path:null path:null type:None
   [junit4]   2> 1144087 T3108 oascc.ConnectionManager.waitForConnected Client is connected to ZooKeeper
   [junit4]   2> 1144098 T3108 oascsi.HttpClientUtil.createClient Creating new http client, config:maxConnections=500&maxConnectionsPerHost=16&socketTimeout=120000&connTimeout=15000
   [junit4]   2> 1144111 T3108 oascc.ConnectionManager.waitForConnected Waiting for client to connect to ZooKeeper
   [junit4]   2> 1144113 T3190 oascc.ConnectionManager.process Watcher org.apache.solr.common.cloud.ConnectionManager@2131ef54 name:ZooKeeperConnection Watcher:127.0.0.1:40955/solr got event WatchedEvent state:SyncConnected type:None path:null path:null type:None
   [junit4]   2> 1144113 T3108 oascc.ConnectionManager.waitForConnected Client is connected to ZooKeeper
   [junit4]   2> 1144117 T3108 oascc.ZkStateReader.createClusterStateWatchersAndUpdate Updating cluster state from ZooKeeper... 
   [junit4]   2> 1145120 T3108 oasc.ZkController.createEphemeralLiveNode Register node as live in ZooKeeper:/live_nodes/127.0.0.1:53665_djn
   [junit4]   2> 1145122 T3108 oascc.SolrZkClient.makePath makePath: /live_nodes/127.0.0.1:53665_djn
   [junit4]   2> 1145125 T3135 oascc.ZkStateReader$3.process Updating live nodes... (5)
   [junit4]   2> 1145126 T3148 oascc.ZkStateReader$3.process Updating live nodes... (5)
   [junit4]   2> 1145126 T3176 oascc.ZkStateReader$3.process Updating live nodes... (5)
   [junit4]   2> 1145126 T3190 oascc.ZkStateReader$3.process Updating live nodes... (5)
   [junit4]   2> 1145125 T3130 oascc.ZkStateReader$3.process Updating live nodes... (5)
   [junit4]   2> 1145125 T3162 oascc.ZkStateReader$3.process Updating live nodes... (5)
   [junit4]   2> 1145144 T3108 oasc.CorePropertiesLocator.discover Looking for core definitions underneath /usr/home/hudson/hudson-slave/workspace/Lucene-Solr-Tests-trunk-Java7/solr/build/solr-core/test/J0/./org.apache.solr.cloud.CollectionsAPIDistributedZkTest-jetty4-1375571700830
   [junit4]   2> 1145146 T3108 oasc.CorePropertiesLocator.discoverUnder Found core conf in /usr/home/hudson/hudson-slave/workspace/Lucene-Solr-Tests-trunk-Java7/solr/build/solr-core/test/J0/./org.apache.solr.cloud.CollectionsAPIDistributedZkTest-jetty4-1375571700830/conf/
   [junit4]   2> 1145347 T3108 oasc.CorePropertiesLocator.discover Found 1 core definitions
   [junit4]   2> 1145348 T3108 oass.SolrDispatchFilter.init user.dir=/usr/home/hudson/hudson-slave/workspace/Lucene-Solr-Tests-trunk-Java7/solr/build/solr-core/test/J0
   [junit4]   2> 1145348 T3108 oass.SolrDispatchFilter.init SolrDispatchFilter.init() done
   [junit4]   2> 1145349 T3108 oascsi.HttpClientUtil.createClient Creating new http client, config:maxConnections=128&maxConnectionsPerHost=32&followRedirects=false
   [junit4]   2> 1145370 T3108 oascsi.HttpClientUtil.createClient Creating new http client, config:maxConnections=128&maxConnectionsPerHost=32&followRedirects=false
   [junit4]   2> 1145383 T3138 oasha.CollectionsHandler.handleCreateAction Creating Collection : numShards=2&name=nodes_used_collection&replicationFactor=2&action=CREATE&wt=javabin&version=2
   [junit4]   2> 1145385 T3130 oasc.DistributedQueue$LatchChildWatcher.process Watcher fired on path: /overseer/collection-queue-work state: SyncConnected type NodeChildrenChanged
   [junit4]   2> 1145387 T3132 oasc.OverseerCollectionProcessor.run Overseer Collection Processor: Get the message id:/overseer/collection-queue-work/qn-0000000000 message:{
   [junit4]   2> 	  "operation":"createcollection",
   [junit4]   2> 	  "numShards":"2",
   [junit4]   2> 	  "name":"nodes_used_collection",
   [junit4]   2> 	  "replicationFactor":"2"}
   [junit4]   2> 1145387 T3132 oasc.OverseerCollectionProcessor.processMessage WARN OverseerCollectionProcessor.processMessage : createcollection , {
   [junit4]   2> 	  "operation":"createcollection",
   [junit4]   2> 	  "numShards":"2",
   [junit4]   2> 	  "name":"nodes_used_collection",
   [junit4]   2> 	  "replicationFactor":"2"}
   [junit4]   2> 1145746 T3131 oascc.ZkStateReader.updateClusterState Updating cloud state from ZooKeeper... 
   [junit4]   2> 1145746 T3131 oasc.Overseer$ClusterStateUpdater.buildCollection building a new collection: nodes_used_collection
   [junit4]   2> 1145747 T3131 oasc.Overseer$ClusterStateUpdater.createCollection Create collection nodes_used_collection with shards [shard1, shard2]
   [junit4]   2> 1145763 T3130 oascc.ZkStateReader$2.process A cluster state change: WatchedEvent state:SyncConnected type:NodeDataChanged path:/clusterstate.json, has occurred - updating... (live nodes size: 5)
   [junit4]   2> 1145764 T3190 oascc.ZkStateReader$2.process A cluster state change: WatchedEvent state:SyncConnected type:NodeDataChanged path:/clusterstate.json, has occurred - updating... (live nodes size: 5)
   [junit4]   2> 1145764 T3162 oascc.ZkStateReader$2.process A cluster state change: WatchedEvent state:SyncConnected type:NodeDataChanged path:/clusterstate.json, has occurred - updating... (live nodes size: 5)
   [junit4]   2> 1145764 T3176 oascc.ZkStateReader$2.process A cluster state change: WatchedEvent state:SyncConnected type:NodeDataChanged path:/clusterstate.json, has occurred - updating... (live nodes size: 5)
   [junit4]   2> 1145764 T3148 oascc.ZkStateReader$2.process A cluster state change: WatchedEvent state:SyncConnected type:NodeDataChanged path:/clusterstate.json, has occurred - updating... (live nodes size: 5)
   [junit4]   2> 1145763 T3135 oascc.ZkStateReader$2.process A cluster state change: WatchedEvent state:SyncConnected type:NodeDataChanged path:/clusterstate.json, has occurred - updating... (live nodes size: 5)
   [junit4]   2> 1145802 T3132 oasc.OverseerCollectionProcessor.createCollection going to create cores replicas shardNames [shard1, shard2] , repFactor : 2
   [junit4]   2> 1145802 T3132 oasc.OverseerCollectionProcessor.createCollection Creating shard nodes_used_collection_shard1_replica1 as part of slice shard1 of collection nodes_used_collection on 127.0.0.1:53665_djn
   [junit4]   2> 1145803 T3132 oasc.OverseerCollectionProcessor.createCollection Creating shard nodes_used_collection_shard1_replica2 as part of slice shard1 of collection nodes_used_collection on 127.0.0.1:42695_djn
   [junit4]   2> 1145804 T3132 oasc.OverseerCollectionProcessor.createCollection Creating shard nodes_used_collection_shard2_replica1 as part of slice shard2 of collection nodes_used_collection on 127.0.0.1:54704_djn
   [junit4]   2> 1145805 T3132 oasc.OverseerCollectionProcessor.createCollection Creating shard nodes_used_collection_shard2_replica2 as part of slice shard2 of collection nodes_used_collection on 127.0.0.1:14295_djn
   [junit4]   2> 1145816 T3180 oasc.ZkController.publish publishing core=nodes_used_collection_shard1_replica1 state=down
   [junit4]   2> 1145816 T3120 oasc.ZkController.publish publishing core=nodes_used_collection_shard2_replica2 state=down
   [junit4]   2> 1145816 T3139 oasc.ZkController.publish publishing core=nodes_used_collection_shard2_replica1 state=down
   [junit4]   2> 1145816 T3166 oasc.ZkController.publish publishing core=nodes_used_collection_shard1_replica2 state=down
   [junit4]   2> 1145818 T3180 oasc.ZkController.waitForCoreNodeName look for our core node name
   [junit4]   2> 1145818 T3120 oasc.ZkController.waitForCoreNodeName look for our core node name
   [junit4]   2> 1145818 T3139 oasc.ZkController.waitForCoreNodeName look for our core node name
   [junit4]   2> 1145829 T3166 oasc.ZkController.waitForCoreNodeName look for our core node name
   [junit4]   2> 1147268 T3131 oascc.ZkStateReader.updateClusterState Updating cloud state from ZooKeeper... 
   [junit4]   2> 1147269 T3131 oasc.Overseer$ClusterStateUpdater.updateState WARN Could not find collection node for nodes_used_collection, skipping publish state
   [junit4]   2> 1147270 T3131 oasc.Overseer$ClusterStateUpdater.updateState Update state numShards=2 message={
   [junit4]   2> 	  "operation":"state",
   [junit4]   2> 	  "core_node_name":"core_node1",
   [junit4]   2> 	  "numShards":"2",
   [junit4]   2> 	  "shard":"shard1",
   [junit4]   2> 	  "roles":null,
   [junit4]   2> 	  "state":"down",
   [junit4]   2> 	  "shard_state":"active",
   [junit4]   2> 	  "core":"nodes_used_collection_shard1_replica1",
   [junit4]   2> 	  "collection":"nodes_used_collection",
   [junit4]   2> 	  "shard_range":null,
   [junit4]   2> 	  "node_name":"127.0.0.1:53665_djn",
   [junit4]   2> 	  "base_url":"http://127.0.0.1:53665/djn"}
   [junit4]   2> 1147328 T3131 oasc.Overseer$ClusterStateUpdater.updateState WARN Could not find collection node for nodes_used_collection, skipping publish state
   [junit4]   2> 1147328 T3131 oasc.Overseer$ClusterStateUpdater.updateState Update state numShards=2 message={
   [junit4]   2> 	  "operation":"state",
   [junit4]   2> 	  "core_node_name":"core_node2",
   [junit4]   2> 	  "numShards":"2",
   [junit4]   2> 	  "shard":"shard2",
   [junit4]   2> 	  "roles":null,
   [junit4]   2> 	  "state":"down",
   [junit4]   2> 	  "shard_state":"active",
   [junit4]   2> 	  "core":"nodes_used_collection_shard2_replica2",
   [junit4]   2> 	  "collection":"nodes_used_collection",
   [junit4]   2> 	  "shard_range":null,
   [junit4]   2> 	  "node_name":"127.0.0.1:14295_djn",
   [junit4]   2> 	  "base_url":"http://127.0.0.1:14295/djn"}
   [junit4]   2> 1147342 T3131 oasc.Overseer$ClusterStateUpdater.updateState WARN Could not find collection node for nodes_used_collection, skipping publish state
   [junit4]   2> 1147342 T3131 oasc.Overseer$ClusterStateUpdater.updateState Update state numShards=2 message={
   [junit4]   2> 	  "operation":"state",
   [junit4]   2> 	  "core_node_name":"core_node3",
   [junit4]   2> 	  "numShards":"2",
   [junit4]   2> 	  "shard":"shard2",
   [junit4]   2> 	  "roles":null,
   [junit4]   2> 	  "state":"down",
   [junit4]   2> 	  "shard_state":"active",
   [junit4]   2> 	  "core":"nodes_used_collection_shard2_replica1",
   [junit4]   2> 	  "collection":"nodes_used_collection",
   [junit4]   2> 	  "shard_range":null,
   [junit4]   2> 	  "node_name":"127.0.0.1:54704_djn",
   [junit4]   2> 	  "base_url":"http://127.0.0.1:54704/djn"}
   [junit4]   2> 1147345 T3131 oasc.Overseer$ClusterStateUpdater.updateState WARN Could not find collection node for nodes_used_collection, skipping publish state
   [junit4]   2> 1147346 T3131 oasc.Overseer$ClusterStateUpdater.updateState Update state numShards=2 message={
   [junit4]   2> 	  "operation":"state",
   [junit4]   2> 	  "core_node_name":"core_node4",
   [junit4]   2> 	  "numShards":"2",
   [junit4]   2> 	  "shard":"shard1",
   [junit4]   2> 	  "roles":null,
   [junit4]   2> 	  "state":"down",
   [junit4]   2> 	  "shard_state":"active",
   [junit4]   2> 	  "core":"nodes_used_collection_shard1_replica2",
   [junit4]   2> 	  "collection":"nodes_used_collection",
   [junit4]   2> 	  "shard_range":null,
   [junit4]   2> 	  "node_name":"127.0.0.1:42695_djn",
   [junit4]   2> 	  "base_url":"http://127.0.0.1:42695/djn"}
   [junit4]   2> 1147362 T3130 oascc.ZkStateReader$2.process A cluster state change: WatchedEvent state:SyncConnected type:NodeDataChanged path:/clusterstate.json, has occurred - updating... (live nodes size: 5)
   [junit4]   2> 1147362 T3148 oascc.ZkStateReader$2.process A cluster state change: WatchedEvent state:SyncConnected type:NodeDataChanged path:/clusterstate.json, has occurred - updating... (live nodes size: 5)
   [junit4]   2> 1147362 T3176 oascc.ZkStateReader$2.process A cluster state change: WatchedEvent state:SyncConnected type:NodeDataChanged path:/clusterstate.json, has occurred - updating... (live nodes size: 5)
   [junit4]   2> 1147362 T3135 oascc.ZkStateReader$2.process A cluster state change: WatchedEvent state:SyncConnected type:NodeDataChanged path:/clusterstate.json, has occurred - updating... (live nodes size: 5)
   [junit4]   2> 1147362 T3162 oascc.ZkStateReader$2.process A cluster state change: WatchedEvent state:SyncConnected type:NodeDataChanged path:/clusterstate.json, has occurred - updating... (live nodes size: 5)
   [junit4]   2> 1147362 T3190 oascc.ZkStateReader$2.process A cluster state change: WatchedEvent state:SyncConnected type:NodeDataChanged path:/clusterstate.json, has occurred - updating... (live nodes size: 5)
   [junit4]   2> 1147820 T3180 oasc.ZkController.waitForShardId waiting to find shard id in clusterstate for nodes_used_collection_shard1_replica1
   [junit4]   2> 1147821 T3139 oasc.ZkController.waitForShardId waiting to find shard id in clusterstate for nodes_used_collection_shard2_replica1
   [junit4]   2> 1147821 T3120 oasc.ZkController.waitForShardId waiting to find shard id in clusterstate for nodes_used_collection_shard2_replica2
   [junit4]   2> 1147821 T3180 oasc.CorePropertiesLocator.writePropertiesFile ERROR Couldn't persist core properties to /usr/home/hudson/hudson-slave/workspace/Lucene-Solr-Tests-trunk-Java7/solr/build/solr-core/test/J0/./org.apache.solr.cloud.CollectionsAPIDistributedZkTest-jetty4-1375571700830/nodes_used_collection_shard1_replica1/core.properties: java.io.FileNotFoundException: /usr/home/hudson/hudson-slave/workspace/Lucene-Solr-Tests-trunk-Java7/solr/build/solr-core/test/J0/./org.apache.solr.cloud.CollectionsAPIDistributedZkTest-jetty4-1375571700830/nodes_used_collection_shard1_replica1/core.properties (No such file or directory)
   [junit4]   2> 1147822 T3139 oasc.CorePropertiesLocator.writePropertiesFile ERROR Couldn't persist core properties to /usr/home/hudson/hudson-slave/workspace/Lucene-Solr-Tests-trunk-Java7/solr/build/solr-core/test/J0/./org.apache.solr.cloud.CollectionsAPIDistributedZkTest-jetty1-1375571695621/nodes_used_collection_shard2_replica1/core.properties: java.io.FileNotFoundException: /usr/home/hudson/hudson-slave/workspace/Lucene-Solr-Tests-trunk-Java7/solr/build/solr-core/test/J0/./org.apache.solr.cloud.CollectionsAPIDistributedZkTest-jetty1-1375571695621/nodes_used_collection_shard2_replica1/core.properties (No such file or directory)
   [junit4]   2> 1147823 T3120 oasc.CorePropertiesLocator.writePropertiesFile ERROR Couldn't persist core properties to /usr/home/hudson/hudson-slave/workspace/Lucene-Solr-Tests-trunk-Java7/solr/build/solr-core/test/J0/./org.apache.solr.cloud.CollectionsAPIDistributedZkTest-controljetty-1375571694882/nodes_used_collection_shard2_replica2/core.properties: java.io.FileNotFoundException: /usr/home/hudson/hudson-slave/workspace/Lucene-Solr-Tests-trunk-Java7/solr/build/solr-core/test/J0/./org.apache.solr.cloud.CollectionsAPIDistributedZkTest-controljetty-1375571694882/nodes_used_collection_shard2_replica2/core.properties (No such file or directory)
   [junit4]   2> 1147823 T3180 oasc.CoreContainer.create Creating SolrCore 'nodes_used_collection_shard1_replica1' using instanceDir: /usr/home/hudson/hudson-slave/workspace/Lucene-Solr-Tests-trunk-Java7/solr/build/solr-core/test/J0/./org.apache.solr.cloud.CollectionsAPIDistributedZkTest-jetty4-1375571700830/nodes_used_collection_shard1_replica1
   [junit4]   2> 1147824 T3120 oasc.CoreContainer.create Creating SolrCore 'nodes_used_collection_shard2_replica2' using instanceDir: /usr/home/hudson/hudson-slave/workspace/Lucene-Solr-Tests-trunk-Java7/solr/build/solr-core/test/J0/./org.apache.solr.cloud.CollectionsAPIDistributedZkTest-controljetty-1375571694882/nodes_used_collection_shard2_replica2
   [junit4]   2> 1147824 T3120 oasc.ZkController.createCollectionZkNode Check for collection zkNode:nodes_used_collection
   [junit4]   2> 1147823 T3139 oasc.CoreContainer.create Creating SolrCore 'nodes_used_collection_shard2_replica1' using instanceDir: /usr/home/hudson/hudson-slave/workspace/Lucene-Solr-Tests-trunk-Java7/solr/build/solr-core/test/J0/./org.apache.solr.cloud.CollectionsAPIDistributedZkTest-jetty1-1375571695621/nodes_used_collection_shard2_replica1
   [junit4]   2> 1147824 T3180 oasc.ZkController.createCollectionZkNode Check for collection zkNode:nodes_used_collection
   [junit4]   2> 1147825 T3120 oasc.ZkController.createCollectionZkNode Creating collection in ZooKeeper:nodes_used_collection
   [junit4]   2> 1147825 T3139 oasc.ZkController.createCollectionZkNode Check for collection zkNode:nodes_used_collection
   [junit4]   2> 1147826 T3120 oasc.ZkController.getConfName Looking for collection configName
   [junit4]   2> 1147826 T3139 oasc.ZkController.createCollectionZkNode Creating collection in ZooKeeper:nodes_used_collection
   [junit4]   2> 1147826 T3180 oasc.ZkController.createCollectionZkNode Creating collection in ZooKeeper:nodes_used_collection
   [junit4]   2> 1147827 T3120 oasc.ZkController.getConfName Only one config set found in zk - using it:conf1
   [junit4]   2> 1147827 T3180 oasc.ZkController.getConfName Looking for collection configName
   [junit4]   2> 1147827 T3139 oasc.ZkController.getConfName Looking for collection configName
   [junit4]   2> 1147827 T3120 oascc.SolrZkClient.makePath makePath: /collections/nodes_used_collection
   [junit4]   2> 1147828 T3180 oasc.ZkController.getConfName Only one config set found in zk - using it:conf1
   [junit4]   2> 1147829 T3139 oasc.ZkController.getConfName Only one config set found in zk - using it:conf1
   [junit4]   2> 1147829 T3180 oascc.SolrZkClient.makePath makePath: /collections/nodes_used_collection
   [junit4]   2> 1147829 T3139 oascc.SolrZkClient.makePath makePath: /collections/nodes_used_collection
   [junit4]   2> 1147831 T3166 oasc.ZkController.waitForShardId waiting to find shard id in clusterstate for nodes_used_collection_shard1_replica2
   [junit4]   2> 1147832 T3166 oasc.CorePropertiesLocator.writePropertiesFile ERROR Couldn't persist core properties to /usr/home/hudson/hudson-slave/workspace/Lucene-Solr-Tests-trunk-Java7/solr/build/solr-core/test/J0/./org.apache.solr.cloud.CollectionsAPIDistributedZkTest-jetty3-1375571699131/nodes_used_collection_shard1_replica2/core.properties: java.io.FileNotFoundException: /usr/home/hudson/hudson-slave/workspace/Lucene-Solr-Tests-trunk-Java7/solr/build/solr-core/test/J0/./org.apache.solr.cloud.CollectionsAPIDistributedZkTest-jetty3-1375571699131/nodes_used_collection_shard1_replica2/core.properties (No such file or directory)
   [junit4]   2> 1147832 T3166 oasc.CoreContainer.create Creating SolrCore 'nodes_used_collection_shard1_replica2' using instanceDir: /usr/home/hudson/hudson-slave/workspace/Lucene-Solr-Tests-trunk-Java7/solr/build/solr-core/test/J0/./org.apache.solr.cloud.CollectionsAPIDistributedZkTest-jetty3-1375571699131/nodes_used_collection_shard1_replica2
   [junit4]   2> 1147832 T3120 oasc.ZkController.readConfigName Load collection config from:/collections/nodes_used_collection
   [junit4]   2> 1147832 T3166 oasc.ZkController.createCollectionZkNode Check for collection zkNode:nodes_used_collection
   [junit4]   2> 1147833 T3180 oasc.ZkController.readConfigName Load collection config from:/collections/nodes_used_collection
   [junit4]   2> 1147833 T3166 oasc.ZkController.createCollectionZkNode Collection zkNode exists
   [junit4]   2> 1147834 T3166 oasc.ZkController.readConfigName Load collection config from:/collections/nodes_used_collection
   [junit4]   2> 1147834 T3180 oasc.SolrResourceLoader.<init> new SolrResourceLoader for directory: '/usr/home/hudson/hudson-slave/workspace/Lucene-Solr-Tests-trunk-Java7/solr/build/solr-core/test/J0/./org.apache.solr.cloud.CollectionsAPIDistributedZkTest-jetty4-1375571700830/nodes_used_collection_shard1_replica1/'
   [junit4]   2> 1147833 T3139 oasc.ZkController.readConfigName Load collection config from:/collections/nodes_used_collection
   [junit4]   2> 1147834 T3120 oasc.SolrResourceLoader.<init> new SolrResourceLoader for directory: '/usr/home/hudson/hudson-slave/workspace/Lucene-Solr-Tests-trunk-Java7/solr/build/solr-core/test/J0/./org.apache.solr.cloud.CollectionsAPIDistributedZkTest-controljetty-1375571694882/nodes_used_collection_shard2_replica2/'
   [junit4]   2> 1147835 T3166 oasc.SolrResourceLoader.<init> new SolrResourceLoader for directory: '/usr/home/hudson/hudson-slave/workspace/Lucene-Solr-Tests-trunk-Java7/solr/build/solr-core/test/J0/./org.apache.solr.cloud.CollectionsAPIDistributedZkTest-jetty3-1375571699131/nodes_used_collection_shard1_replica2/'
   [junit4]   2> 1147836 T3139 oasc.SolrResourceLoader.<init> new SolrResourceLoader for directory: '/usr/home/hudson/hudson-slave/workspace/Lucene-Solr-Tests-trunk-Java7/solr/build/solr-core/test/J0/./org.apache.solr.cloud.CollectionsAPIDistributedZkTest-jetty1-1375571695621/nodes_used_collection_shard2_replica1/'
   [junit4]   2> 1147979 T3139 oasc.SolrConfig.<init> Using Lucene MatchVersion: LUCENE_50
   [junit4]   2> 1147979 T3166 oasc.SolrConfig.<init> Using Lucene MatchVersion: LUCENE_50
   [junit4]   2> 1147980 T3120 oasc.SolrConfig.<init> Using Lucene MatchVersion: LUCENE_50
   [junit4]   2> 1147979 T3180 oasc.SolrConfig.<init> Using Lucene MatchVersion: LUCENE_50
   [junit4]   2> 1148057 T3139 oasc.SolrConfig.<init> Loaded SolrConfig: solrconfig.xml
   [junit4]   2> 1148057 T3180 oasc.SolrConfig.<init> Loaded SolrConfig: solrconfig.xml
   [junit4]   2> 1148059 T3166 oasc.SolrConfig.<init> Loaded SolrConfig: solrconfig.xml
   [junit4]   2> 1148059 T3120 oasc.SolrConfig.<init> Loaded SolrConfig: solrconfig.xml
   [junit4]   2> 1148158 T3139 oass.IndexSchema.readSchema Reading Solr Schema from schema.xml
   [junit4]   2> 1148158 T3180 oass.IndexSchema.readSchema Reading Solr Schema from schema.xml
   [junit4]   2> 1148160 T3120 oass.IndexSchema.readSchema Reading Solr Schema from schema.xml
   [junit4]   2> 1148160 T3166 oass.IndexSchema.readSchema Reading Solr Schema from schema.xml
   [junit4]   2> 1148171 T3139 oass.IndexSchema.readSchema [nodes_used_collection_shard2_replica1] Schema name=test
   [junit4]   2> 1148171 T3180 oass.IndexSchema.readSchema [nodes_used_collection_shard1_replica1] Schema name=test
   [junit4]   2> 1148172 T3120 oass.IndexSchema.readSchema [nodes_used_collection_shard2_replica2] Schema name=test
   [junit4]   2> 1148173 T3166 oass.IndexSchema.readSchema [nodes_used_collection_shard1_replica2] Schema name=test
   [junit4]   2> 1149002 T3120 oass.OpenExchangeRatesOrgProvider.init Initialized with rates=open-exchange-rates.json, refreshInterval=1440.
   [junit4]   2> 1149011 T3180 oass.OpenExchangeRatesOrgProvider.init Initialized with rates=open-exchange-rates.json, refreshInterval=1440.
   [junit4]   2> 1149015 T3120 oass.IndexSchema.readSchema default search field in schema is text
   [junit4]   2> 1149019 T3180 oass.IndexSchema.readSchema default search field in schema is text
   [junit4]   2> 1149020 T3120 oass.IndexSchema.readSchema unique key field: id
   [junit4]   2> 1149024 T3180 oass.IndexSchema.readSchema unique key field: id
   [junit4]   2> 1149024 T3139 oass.OpenExchangeRatesOrgProvider.init Initialized with rates=open-exchange-rates.json, refreshInterval=1440.
   [junit4]   2> 1149024 T3166 oass.OpenExchangeRatesOrgProvider.init Initialized with rates=open-exchange-rates.json, refreshInterval=1440.
   [junit4]   2> 1149033 T3139 oass.IndexSchema.readSchema default search field in schema is text
   [junit4]   2> 1149033 T3120 oass.FileExchangeRateProvider.reload Reloading exchange rates from file currency.xml
   [junit4]   2> 1149034 T3166 oass.IndexSchema.readSchema default search field in schema is text
   [junit4]   2> 1149036 T3180 oass.FileExchangeRateProvider.reload Reloading exchange rates from file currency.xml
   [junit4]   2> 1149037 T3139 oass.IndexSchema.readSchema unique key field: id
   [junit4]   2> 1149038 T3166 oass.IndexSchema.readSchema unique key field: id
   [junit4]   2> 1149039 T3120 oass.FileExchangeRateProvider.reload Reloading exchange rates from file currency.xml
   [junit4]   2> 1149041 T3180 oass.FileExchangeRateProvider.reload Reloading exchange rates from file currency.xml
   [junit4]   2> 1149064 T3120 oass.OpenExchangeRatesOrgProvider.reload Reloading exchange rates from open-exchange-rates.json
   [junit4]   2> 1149065 T3120 oass.OpenExchangeRatesOrgProvider$OpenExchangeRates.<init> WARN Unknown key IMPORTANT NOTE
   [junit4]   2> 1149065 T3120 oass.OpenExchangeRatesOrgProvider$OpenExchangeRates.<init> WARN Expected key, got STRING
   [junit4]   2> 1149066 T3120 oass.OpenExchangeRatesOrgProvider.reload Reloading exchange rates from open-exchange-rates.json
   [junit4]   2> 1149067 T3180 oass.OpenExchangeRatesOrgProvider.reload Reloading exchange rates from open-exchange-rates.json
   [junit4]   2> 1149067 T3120 oass.OpenExchangeRatesOrgProvider$OpenExchangeRates.<init> WARN Unknown key IMPORTANT NOTE
   [junit4]   2> 1149067 T3120 oass.OpenExchangeRatesOrgProvider$OpenExchangeRates.<init> WARN Expected key, got STRING
   [junit4]   2> 1149068 T3120 oasc.SolrCore.initDirectoryFactory org.apache.solr.core.MockDirectoryFactory
   [junit4]   2> 1149068 T3180 oass.OpenExchangeRatesOrgProvider$OpenExchangeRates.<init> WARN Unknown key IMPORTANT NOTE
   [junit4]   2> 1149068 T3120 oasc.SolrCore.<init> [nodes_used_collection_shard2_replica2] Opening new SolrCore at /usr/home/hudson/hudson-slave/workspace/Lucene-Solr-Tests-trunk-Java7/solr/build/solr-core/test/J0/./org.apache.solr.cloud.CollectionsAPIDistributedZkTest-controljetty-1375571694882/nodes_used_collection_shard2_replica2/, dataDir=/usr/home/hudson/hudson-slave/workspace/Lucene-Solr-Tests-trunk-Java7/solr/build/solr-core/test/J0/./org.apache.solr.cloud.CollectionsAPIDistributedZkTest-controljetty-1375571694882//nodes_used_collection_shard2_replica2/data/
   [junit4]   2> 1149069 T3180 oass.OpenExchangeRatesOrgProvider$OpenExchangeRates.<init> WARN Expected key, got STRING
   [junit4]   2> 1149069 T3120 oasc.JmxMonitoredMap.<init> JMX monitoring is enabled. Adding Solr mbeans to JMX Server: com.sun.jmx.mbeanserver.JmxMBeanServer@e29b003
   [junit4]   2> 1149069 T3180 oass.OpenExchangeRatesOrgProvider.reload Reloading exchange rates from open-exchange-rates.json
   [junit4]   2> 1149070 T3180 oass.OpenExchangeRatesOrgProvider$OpenExchangeRates.<init> WARN Unknown key IMPORTANT NOTE
   [junit4]   2> 1149071 T3120 oasc.CachingDirectoryFactory.get return new directory for /usr/home/hudson/hudson-slave/workspace/Lucene-Solr-Tests-trunk-Java7/solr/build/solr-core/test/J0/./org.apache.solr.cloud.CollectionsAPIDistributedZkTest-controljetty-1375571694882//nodes_used_collection_shard2_replica2/data
   [junit4]   2> 1149071 T3180 oass.OpenExchangeRatesOrgProvider$OpenExchangeRates.<init> WARN Expected key, got STRING
   [junit4]   2> 1149071 T3139 oass.FileExchangeRateProvider.reload Reloading exchange rates from file currency.xml
   [junit4]   2> 1149072 T3166 oass.FileExchangeRateProvider.reload Reloading exchange rates from file currency.xml
   [junit4]   2> 1149072 T3180 oasc.SolrCore.initDirectoryFactory org.apache.solr.core.MockDirectoryFactory
   [junit4]   2> 1149071 T3120 oasc.SolrCore.getNewIndexDir New index directory detected: old=null new=/usr/home/hudson/hudson-slave/workspace/Lucene-Solr-Tests-trunk-Java7/solr/build/solr-core/test/J0/./org.apache.solr.cloud.CollectionsAPIDistributedZkTest-controljetty-1375571694882//nodes_used_collection_shard2_replica2/data/index/
   [junit4]   2> 1149073 T3180 oasc.SolrCore.<init> [nodes_used_collection_shard1_replica1] Opening new SolrCore at /usr/home/hudson/hudson-slave/workspace/Lucene-Solr-Tests-trunk-Java7/solr/build/solr-core/test/J0/./org.apache.solr.cloud.CollectionsAPIDistributedZkTest-jetty4-1375571700830/nodes_used_collection_shard1_replica1/, dataDir=/usr/home/hudson/hudson-slave/workspace/Lucene-Solr-Tests-trunk-Java7/solr/build/solr-core/test/J0/./org.apache.solr.cloud.CollectionsAPIDistributedZkTest-jetty4-1375571700830//nodes_used_collection_shard1_replica1/data/
   [junit4]   2> 1149073 T3120 oasc.SolrCore.initIndex WARN [nodes_used_collection_shard2_replica2] Solr index directory '/usr/home/hudson/hudson-slave/workspace/Lucene-Solr-Tests-trunk-Java7/solr/build/solr-core/test/J0/./org.apache.solr.cloud.CollectionsAPIDistributedZkTest-controljetty-1375571694882/nodes_used_collection_shard2_replica2/data/index' doesn't exist. Creating new index...
   [junit4]   2> 1149074 T3180 oasc.JmxMonitoredMap.<init> JMX monitoring is enabled. Adding Solr mbeans to JMX Server: com.sun.jmx.mbeanserver.JmxMBeanServer@e29b003
   [junit4]   2> 1149075 T3120 oasc.CachingDirectoryFactory.get return new directory for /usr/home/hudson/hudson-slave/workspace/Lucene-Solr-Tests-trunk-Java7/solr/build/solr-core/test/J0/./org.apache.solr.cloud.CollectionsAPIDistributedZkTest-controljetty-1375571694882//nodes_used_collection_shard2_replica2/data/index
   [junit4]   2> 1149076 T3180 oasc.CachingDirectoryFactory.get return new directory for /usr/home/hudson/hudson-slave/workspace/Lucene-Solr-Tests-trunk-Java7/solr/build/solr-core/test/J0/./org.apache.solr.cloud.CollectionsAPIDistributedZkTest-jetty4-1375571700830//nodes_used_collection_shard1_replica1/data
   [junit4]   2> 1149076 T3180 oasc.SolrCore.getNewIndexDir New index directory detected: old=null new=/usr/home/hudson/hudson-slave/workspace/Lucene-Solr-Tests-trunk-Java7/solr/build/solr-core/test/J0/./org.apache.solr.cloud.CollectionsAPIDistributedZkTest-jetty4-1375571700830//nodes_used_collection_shard1_replica1/data/index/
   [junit4]   2> 1149076 T3180 oasc.SolrCore.initIndex WARN [nodes_used_collection_shard1_replica1] Solr index directory '/usr/home/hudson/hudson-slave/workspace/Lucene-Solr-Tests-trunk-Java7/solr/build/solr-core/test/J0/./org.apache.solr.cloud.CollectionsAPIDistributedZkTest-jetty4-1375571700830/nodes_used_collection_shard1_replica1/data/index' doesn't exist. Creating new index...
   [junit4]   2> 1149077 T3180 oasc.CachingDirectoryFactory.get return new directory for /usr/home/hudson/hudson-slave/workspace/Lucene-Solr-Tests-trunk-Java7/solr/build/solr-core/test/J0/./org.apache.solr.cloud.CollectionsAPIDistributedZkTest-jetty4-1375571700830//nodes_used_collection_shard1_replica1/data/index
   [junit4]   2> 1149078 T3166 oass.FileExchangeRateProvider.reload Reloading exchange rates from file currency.xml
   [junit4]   2> 1149078 T3139 oass.FileExchangeRateProvider.reload Reloading exchange rates from file currency.xml
   [junit4]   2> 1149080 T3120 oasc.SolrDeletionPolicy.onCommit SolrDeletionPolicy.onCommit: commits: num=1
   [junit4]   2> 		commit{dir=MockDirWrapper(org.apache.lucene.store.RAMDirectory@6c02b0f5 lockFactory=org.apache.lucene.store.NativeFSLockFactory@dec9e19),segFN=segments_1,generation=1}
   [junit4]   2> 1149081 T3120 oasc.SolrDeletionPolicy.updateCommits newest commit generation = 1
   [junit4]   2> 1149082 T3180 oasc.SolrDeletionPolicy.onCommit SolrDeletionPolicy.onCommit: commits: num=1
   [junit4]   2> 		commit{dir=MockDirWrapper(org.apache.lucene.store.RAMDirectory@2c7bf549 lockFactory=org.apache.lucene.store.NativeFSLockFactory@56abc422),segFN=segments_1,generation=1}
   [junit4]   2> 1149082 T3180 oasc.SolrDeletionPolicy.updateCommits newest commit generation = 1
   [junit4]   2> 1149087 T3120 oasup.UpdateRequestProcessorChain.init inserting DistributedUpdateProcessorFactory into updateRequestProcessorChain "dedupe"
   [junit4]   2> 1149087 T3120 oasup.UpdateRequestProcessorChain.init inserting DistributedUpdateProcessorFactory into updateRequestProcessorChain "stored_sig"
   [junit4]   2> 1149088 T3120 oasup.UpdateRequestProcessorChain.init inserting DistributedUpdateProcessorFactory into updateRequestProcessorChain "distrib-dup-test-chain-implicit"
   [junit4]   2> 1149088 T3180 oasup.UpdateRequestProcessorChain.init inserting DistributedUpdateProcessorFactory into updateRequestProcessorChain "dedupe"
   [junit4]   2> 1149089 T3166 oass.OpenExchangeRatesOrgProvider.reload Reloading exchange rates from open-exchange-rates.json
   [junit4]   2> 1149089 T3139 oass.OpenExchangeRatesOrgProvider.reload Reloading exchange rates from open-exchange-rates.json
   [junit4]   2> 1149089 T3180 oasup.UpdateRequestProcessorChain.init inserting DistributedUpdateProcessorFactory into updateRequestProcessorChain "stored_sig"
   [junit4]   2> 1149089 T3120 oasc.RequestHandlers.initHandlersFromConfig created standard: solr.StandardRequestHandler
   [junit4]   2> 1149090 T3139 oass.OpenExchangeRatesOrgProvider$OpenExchangeRates.<init> WARN Unknown key IMPORTANT NOTE
   [junit4]   2> 1149090 T3166 oass.OpenExchangeRatesOrgProvider$OpenExchangeRates.<init> WARN Unknown key IMPORTANT NOTE
   [junit4]   2> 1149091 T3139 oass.OpenExchangeRatesOrgProvider$OpenExchangeRates.<init> WARN Expected key, got STRING
   [junit4]   2> 1149091 T3120 oasc.RequestHandlers.initHandlersFromConfig created /get: solr.RealTimeGetHandler
   [junit4]   2> 1149092 T3120 oasc.RequestHandlers.initHandlersFromConfig adding lazy requestHandler: solr.ReplicationHandler
   [junit4]   2> 1149090 T3180 oasup.UpdateRequestProcessorChain.init inserting DistributedUpdateProcessorFactory into updateRequestProcessorChain "distrib-dup-test-chain-implicit"
   [junit4]   2> 1149092 T3120 oasc.RequestHandlers.initHandlersFromConfig created /replication: solr.ReplicationHandler
   [junit4]   2> 1149091 T3139 oass.OpenExchangeRatesOrgProvider.reload Reloading exchange rates from open-exchange-rates.json
   [junit4]   2> 1149091 T3166 oass.OpenExchangeRatesOrgProvider$OpenExchangeRates.<init> WARN Expected key, got STRING
   [junit4]   2> 1149093 T3120 oasc.RequestHandlers.initHandlersFromConfig created /update: solr.UpdateRequestHandler
   [junit4]   2> 1149094 T3139 oass.OpenExchangeRatesOrgProvider$OpenExchangeRates.<init> WARN Unknown key IMPORTANT NOTE
   [junit4]   2> 1149093 T3180 oasc.RequestHandlers.initHandlersFromConfig created standard: solr.StandardRequestHandler
   [junit4]   2> 1149094 T3139 oass.OpenExchangeRatesOrgProvider$OpenExchangeRates.<init> WARN Expected key, got STRING
   [junit4]   2> 1149094 T3120 oasc.RequestHandlers.initHandlersFromConfig created /admin/: org.apache.solr.handler.admin.AdminHandlers
   [junit4]   2> 1149094 T3166 oass.OpenExchangeRatesOrgProvider.reload Reloading exchange rates from open-exchange-rates.json
   [junit4]   2> 1149095 T3139 oasc.SolrCore.initDirectoryFactory org.apache.solr.core.MockDirectoryFactory
   [junit4]   2> 1149095 T3180 oasc.RequestHandlers.initHandlersFromConfig created /get: solr.RealTimeGetHandler
   [junit4]   2> 1149096 T3166 oass.OpenExchangeRatesOrgProvider$OpenExchangeRates.<init> WARN Unknown key IMPORTANT NOTE
   [junit4]   2> 1149096 T3139 oasc.SolrCore.<init> [nodes_used_collection_shard2_replica1] Opening new SolrCore at /usr/home/hudson/hudson-slave/workspace/Lucene-Solr-Tests-trunk-Java7/solr/build/solr-core/test/J0/./org.apache.solr.cloud.CollectionsAPIDistributedZkTest-jetty1-1375571695621/nodes_used_collection_shard2_replica1/, dataDir=/usr/home/hudson/hudson-slave/workspace/Lucene-Solr-Tests-trunk-Java7/solr/build/solr-core/test/J0/./org.apache.solr.cloud.CollectionsAPIDistributedZkTest-jetty1-1375571695621//nodes_used_collection_shard2_replica1/data/
   [junit4]   2> 1149097 T3166 oass.OpenExchangeRatesOrgProvider$OpenExchangeRates.<init> WARN Expected key, got STRING
   [junit4]   2> 1149096 T3180 oasc.RequestHandlers.initHandlersFromConfig adding lazy requestHandler: solr.ReplicationHandler
   [junit4]   2> 1149098 T3166 oasc.SolrCore.initDirectoryFactory org.apache.solr.core.MockDirectoryFactory
   [junit4]   2> 1149097 T3139 oasc.JmxMonitoredMap.<init> JMX monitoring is enabled. Adding Solr mbeans to JMX Server: com.sun.jmx.mbeanserver.JmxMBeanServer@e29b003
   [junit4]   2> 1149098 T3166 oasc.SolrCore.<init> [nodes_used_collection_shard1_replica2] Opening new SolrCore at /usr/home/hudson/hudson-slave/workspace/Lucene-Solr-Tests-trunk-Java7/solr/build/solr-core/test/J0/./org.apache.solr.cloud.CollectionsAPIDistributedZkTest-jetty3-1375571699131/nodes_used_collection_shard1_replica2/, dataDir=/usr/home/hudson/hudson-slave/workspace/Lucene-Solr-Tests-trunk-Java7/solr/build/solr-core/test/J0/./org.apache.solr.cloud.CollectionsAPIDistributedZkTest-jetty3-1375571699131//nodes_used_collection_shard1_replica2/data/
   [junit4]   2> 1149098 T3180 oasc.RequestHandlers.initHandlersFromConfig created /replication: solr.ReplicationHandler
   [junit4]   2> 1149099 T3166 oasc.JmxMonitoredMap.<init> JMX monitoring is enabled. Adding Solr mbeans to JMX Server: com.sun.jmx.mbeanserver.JmxMBeanServer@e29b003
   [junit4]   2> 1149100 T3139 oasc.CachingDirectoryFactory.get return new directory for /usr/home/hudson/hudson-slave/workspace/Lucene-Solr-Tests-trunk-Java7/solr/build/solr-core/test/J0/./org.apache.solr.cloud.CollectionsAPIDistributedZkTest-jetty1-1375571695621//nodes_used_collection_shard2_replica1/data
   [junit4]   2> 1149100 T3180 oasc.RequestHandlers.initHandlersFromConfig created /update: solr.UpdateRequestHandler
   [junit4]   2> 1149100 T3139 oasc.SolrCore.getNewIndexDir New index directory detected: old=null new=/usr/home/hudson/hudson-slave/workspace/Lucene-Solr-Tests-trunk-Java7/solr/build/solr-core/test/J0/./org.apache.solr.cloud.CollectionsAPIDistributedZkTest-jetty1-1375571695621//nodes_used_collection_shard2_replica1/data/index/
   [junit4]   2> 1149101 T3180 oasc.RequestHandlers.initHandlersFromConfig created /admin/: org.apache.solr.handler.admin.AdminHandlers
   [junit4]   2> 1149100 T3166 oasc.CachingDirectoryFactory.get return new directory for /usr/home/hudson/hudson-slave/workspace/Lucene-Solr-Tests-trunk-Java7/solr/build/solr-core/test/J0/./org.apache.solr.cloud.CollectionsAPIDistributedZkTest-jetty3-1375571699131//nodes_used_collection_shard1_replica2/data
   [junit4]   2> 1149101 T3139 oasc.SolrCore.initIndex WARN [nodes_used_collection_shard2_replica1] Solr index directory '/usr/home/hudson/hudson-slave/workspace/Lucene-Solr-Tests-trunk-Java7/solr/build/solr-core/test/J0/./org.apache.solr.cloud.CollectionsAPIDistributedZkTest-jetty1-1375571695621/nodes_used_collection_shard2_replica1/data/index' doesn't exist. Creating new index...
   [junit4]   2> 1149102 T3166 oasc.SolrCore.getNewIndexDir New index directory detected: old=null new=/usr/home/hudson/hudson-slave/workspace/Lucene-Solr-Tests-trunk-Java7/solr/build/solr-core/test/J0/./org.apache.solr.cloud.CollectionsAPIDistributedZkTest-jetty3-1375571699131//nodes_used_collection_shard1_replica2/data/index/
   [junit4]   2> 1149102 T3139 oasc.CachingDirectoryFactory.get return new directory for /usr/home/hudson/hudson-slave/workspace/Lucene-Solr-Tests-trunk-Java7/solr/build/solr-core/test/J0/./org.apache.solr.cloud.CollectionsAPIDistributedZkTest-jetty1-1375571695621//nodes_used_collection_shard2_replica1/data/index
   [junit4]   2> 1149102 T3166 oasc.SolrCore.initIndex WARN [nodes_used_collection_shard1_replica2] Solr index directory '/usr/home/hudson/hudson-slave/workspace/Lucene-Solr-Tests-trunk-Java7/solr/build/solr-core/test/J0/./org.apache.solr.cloud.CollectionsAPIDistributedZkTest-jetty3-1375571699131/nodes_used_collection_shard1_replica2/data/index' doesn't exist. Creating new index...
   [junit4]   2> 1149103 T3166 oasc.CachingDirectoryFactory.get return new directory for /usr/home/hudson/hudson-slave/workspace/Lucene-Solr-Tests-trunk-Java7/solr/build/solr-core/test/J0/./org.apache.solr.cloud.CollectionsAPIDistributedZkTest-jetty3-1375571699131//nodes_used_collection_shard1_replica2/data/index
   [junit4]   2> 1149110 T3139 oasc.SolrDeletionPolicy.onCommit SolrDeletionPolicy.onCommit: commits: num=1
   [junit4]   2> 		commit{dir=MockDirWrapper(org.apache.lucene.store.RAMDirectory@5dbc6672 lockFactory=org.apache.lucene.store.NativeFSLockFactory@234e1a71),segFN=segments_1,generation=1}
   [junit4]   2> 1149110 T3139 oasc.SolrDeletionPolicy.updateCommits newest commit generation = 1
   [junit4]   2> 1149110 T3166 oasc.SolrDeletionPolicy.onCommit SolrDeletionPolicy.onCommit: commits: num=1
   [junit4]   2> 		commit{dir=MockDirWrapper(org.apache.lucene.store.RAMDirectory@1d9f5885 lockFactory=org.apache.lucene.store.NativeFSLockFactory@690068f1),segFN=segments_1,generation=1}
   [junit4]   2> 1149111 T3166 oasc.SolrDeletionPolicy.updateCommits newest commit generation = 1
   [junit4]   2> 1149116 T3139 oasup.UpdateRequestProcessorChain.init inserting DistributedUpdateProcessorFactory into updateRequestProcessorChain "dedupe"
   [junit4]   2> 1149117 T3139 oasup.UpdateRequestProcessorChain.init inserting DistributedUpdateProcessorFactory into updateRequestProcessorChain "stored_sig"
   [junit4]   2> 1149117 T3166 oasup.UpdateRequestProcessorChain.init inserting DistributedUpdateProcessorFactory into updateRequestProcessorChain "dedupe"
   [junit4]   2> 1149118 T3180 oashl.XMLLoader.init xsltCacheLifetimeSeconds=60
   [junit4]   2> 1149117 T3120 oashl.XMLLoader.init xsltCacheLifetimeSeconds=60
   [junit4]   2> 1149118 T3139 oasup.UpdateRequestProcessorChain.init inserting DistributedUpdateProcessorFactory into updateRequestProcessorChain "distrib-dup-test-chain-implicit"
   [junit4]   2> 1149118 T3166 oasup.UpdateRequestProcessorChain.init inserting DistributedUpdateProcessorFactory into updateRequestProcessorChain "stored_sig"
   [junit4]   2> 1149119 T3139 oasc.RequestHandlers.initHandlersFromConfig created standard: solr.StandardRequestHandler
   [junit4]   2> 1149120 T3166 oasup.UpdateRequestProcessorChain.init inserting DistributedUpdateProcessorFactory into updateRequestProcessorChain "distrib-dup-test-chain-implicit"
   [junit4]   2> 1149120 T3139 oasc.RequestHandlers.initHandlersFromConfig created /get: solr.RealTimeGetHandler
   [junit4]   2> 1149120 T3139 oasc.RequestHandlers.initHandlersFromConfig adding lazy requestHandler: solr.ReplicationHandler
   [junit4]   2> 1149120 T3166 oasc.RequestHandlers.initHandlersFromConfig created standard: solr.StandardRequestHandler
   [junit4]   2> 1149121 T3139 oasc.RequestHandlers.initHandlersFromConfig created /replication: solr.ReplicationHandler
   [junit4]   2> 1149122 T3166 oasc.RequestHandlers.initHandlersFromConfig created /get: solr.RealTimeGetHandler
   [junit4]   2> 1149122 T3166 oasc.RequestHandlers.initHandlersFromConfig adding lazy requestHandler: solr.ReplicationHandler
   [junit4]   2> 1149122 T3139 oasc.RequestHandlers.initHandlersFromConfig created /update: solr.UpdateRequestHandler
   [junit4]   2> 1149122 T3166 oasc.RequestHandlers.initHandlersFromConfig created /replication: solr.ReplicationHandler
   [junit4]   2> 1149123 T3139 oasc.RequestHandlers.initHandlersFromConfig created /admin/: org.apache.solr.handler.admin.AdminHandlers
   [junit4]   2> 1149123 T3166 oasc.RequestHandlers.initHandlersFromConfig created /update: solr.UpdateRequestHandler
   [junit4]   2> 1149124 T3166 oasc.RequestHandlers.initHandlersFromConfig created /admin/: org.apache.solr.handler.admin.AdminHandlers
   [junit4]   2> 1149128 T3180 oass.SolrIndexSearcher.<init> Opening Searcher@5434c3f1 main
   [junit4]   2> 1149129 T3120 oass.SolrIndexSearcher.<init> Opening Searcher@3e2a5b8b main
   [junit4]   2> 1149130 T3180 oasu.CommitTracker.<init> Hard AutoCommit: disabled
   [junit4]   2> 1149131 T3120 oasu.CommitTracker.<init> Hard AutoCommit: disabled
   [junit4]   2> 1149131 T3180 oasu.CommitTracker.<init> Soft AutoCommit: disabled
   [junit4]   2> 1149131 T3120 oasu.CommitTracker.<init> Soft AutoCommit: disabled
   [junit4]   2> 1149136 T3197 oasc.SolrCore.registerSearcher [nodes_used_collection_shard2_replica2] Registered new searcher Searcher@3e2a5b8b main{StandardDirectoryReader(segments_1:1)}
   [junit4]   2> 1149136 T3196 oasc.SolrCore.registerSearcher [nodes_used_collection_shard1_replica1] Registered new searcher Searcher@5434c3f1 main{StandardDirectoryReader(segments_1:1)}
   [junit4]   2> 1149139 T3120 oasc.CoreContainer.registerCore registering core: nodes_used_collection_shard2_replica2
   [junit4]   2> 1149139 T3180 oasc.CoreContainer.registerCore registering core: nodes_used_collection_shard1_replica1
   [junit4]   2> 1149139 T3120 oasc.ZkController.register Register replica - core:nodes_used_collection_shard2_replica2 address:http://127.0.0.1:14295/djn collection:nodes_used_collection shard:shard2
   [junit4]   2> 1149139 T3180 oasc.ZkController.register Register replica - core:nodes_used_collection_shard1_replica1 address:http://127.0.0.1:53665/djn collection:nodes_used_collection shard:shard1
   [junit4]   2> 1149140 T3120 oascsi.HttpClientUtil.createClient Creating new http client, config:maxConnections=10000&maxConnectionsPerHost=20&connTimeout=15000&socketTimeout=30000&retry=false
   [junit4]   2> 1149140 T3180 oascsi.HttpClientUtil.createClient Creating new http client, config:maxConnections=10000&maxConnectionsPerHost=20&connTimeout=15000&socketTimeout=30000&retry=false
   [junit4]   2> 1149144 T3139 oashl.XMLLoader.init xsltCacheLifetimeSeconds=60
   [junit4]   2> 1149144 T3166 oashl.XMLLoader.init xsltCacheLifetimeSeconds=60
   [junit4]   2> 1149148 T3139 oass.SolrIndexSearcher.<init> Opening Searcher@2d647872 main
   [junit4]   2> 1149148 T3166 oass.SolrIndexSearcher.<init> Opening Searcher@398cd5aa main
   [junit4]   2> 1149149 T3139 oasu.CommitTracker.<init> Hard AutoCommit: disabled
   [junit4]   2> 1149150 T3166 oasu.CommitTracker.<init> Hard AutoCommit: disabled
   [junit4]   2> 1149150 T3139 oasu.CommitTracker.<init> Soft AutoCommit: disabled
   [junit4]   2> 1149150 T3166 oasu.CommitTracker.<init> Soft AutoCommit: disabled
   [junit4]   2> 1149154 T3198 oasc.SolrCore.registerSearcher [nodes_used_collection_shard2_replica1] Registered new searcher Searcher@2d647872 main{StandardDirectoryReader(segments_1:1)}
   [junit4]   2> 1149154 T3199 oasc.SolrCore.registerSearcher [nodes_used_collection_shard1_replica2] Registered new searcher Searcher@398cd5aa main{StandardDirectoryReader(segments_1:1)}
   [junit4]   2> 1149157 T3139 oasc.CoreContainer.registerCore registering core: nodes_used_collection_shard2_replica1
   [junit4]   2> 1149157 T3166 oasc.CoreContainer.registerCore registering core: nodes_used_collection_shard1_replica2
   [junit4]   2> 1149157 T3139 oasc.ZkController.register Register replica - core:nodes_used_collection_shard2_replica1 address:http://127.0.0.1:54704/djn collection:nodes_used_collection shard:shard2
   [junit4]   2> 1149158 T3166 oasc.ZkController.register Register replica - core:nodes_used_collection_shard1_replica2 address:http://127.0.0.1:42695/djn collection:nodes_used_collection shard:shard1
   [junit4]   2> 1149158 T3139 oascsi.HttpClientUtil.createClient Creating new http client, config:maxConnections=10000&maxConnectionsPerHost=20&connTimeout=15000&socketTimeout=30000&retry=false
   [junit4]   2> 1149158 T3166 oascsi.HttpClientUtil.createClient Creating new http client, config:maxConnections=10000&maxConnectionsPerHost=20&connTimeout=15000&socketTimeout=30000&retry=false
   [junit4]   2> 1149166 T3120 oascc.SolrZkClient.makePath makePath: /collections/nodes_used_collection/leader_elect/shard2/election
   [junit4]   2> 1149166 T3180 oascc.SolrZkClient.makePath makePath: /collections/nodes_used_collection/leader_elect/shard1/election
   [junit4]   2> 1149195 T3120 oasc.ShardLeaderElectionContext.runLeaderProcess Running the leader process for shard shard2
   [junit4]   2> 1149196 T3166 oasc.ShardLeaderElectionContext.runLeaderProcess Running the leader process for shard shard1
   [junit4]   2> 1149198 T3120 oasc.ShardLeaderElectionContext.waitForReplicasToComeUp Enough replicas found to continue.
   [junit4]   2> 1149198 T3166 oasc.ShardLeaderElectionContext.waitForReplicasToComeUp Enough replicas found to continue.
   [junit4]   2> 1149199 T3166 oasc.ShardLeaderElectionContext.runLeaderProcess I may be the new leader - try and sync
   [junit4]   2> 1149198 T3120 oasc.ShardLeaderElectionContext.runLeaderProcess I may be the new leader - try and sync
   [junit4]   2> 1149199 T3166 oasc.SyncStrategy.sync Sync replicas to http://127.0.0.1:42695/djn/nodes_used_collection_shard1_replica2/
   [junit4]   2> 1149199 T3120 oasc.SyncStrategy.sync Sync replicas to http://127.0.0.1:14295/djn/nodes_used_collection_shard2_replica2/
   [junit4]   2> 1149200 T3166 oasu.PeerSync.sync PeerSync: core=nodes_used_collection_shard1_replica2 url=http://127.0.0.1:42695/djn START replicas=[http://127.0.0.1:53665/djn/nodes_used_collection_shard1_replica1/] nUpdates=100
   [junit4]   2> 1149200 T3120 oasu.PeerSync.sync PeerSync: core=nodes_used_collection_shard2_replica2 url=http://127.0.0.1:14295/djn START replicas=[http://127.0.0.1:54704/djn/nodes_used_collection_shard2_replica1/] nUpdates=100
   [junit4]   2> 1149201 T3166 oasu.PeerSync.sync PeerSync: core=nodes_used_collection_shard1_replica2 url=http://127.0.0.1:42695/djn DONE.  We have no versions.  sync failed.
   [junit4]   2> 1149201 T3120 oasu.PeerSync.sync PeerSync: core=nodes_used_collection_shard2_replica2 url=http://127.0.0.1:14295/djn DONE.  We have no versions.  sync failed.
   [junit4]   2> 1149202 T3120 oasc.SyncStrategy.syncReplicas Leader's attempt to sync with shard failed, moving to the next candidate
   [junit4]   2> 1149201 T3166 oasc.SyncStrategy.syncReplicas Leader's attempt to sync with shard failed, moving to the next candidate
   [junit4]   2> 1149202 T3120 oasc.ShardLeaderElectionContext.runLeaderProcess We failed sync, but we have no versions - we can't sync in that case - we were active before, so become leader anyway
   [junit4]   2> 1149203 T3166 oasc.ShardLeaderElectionContext.runLeaderProcess We failed sync, but we have no versions - we can't sync in that case - we were active before, so become leader anyway
   [junit4]   2> 1149203 T3120 oasc.ShardLeaderElectionContext.runLeaderProcess I am the new leader: http://127.0.0.1:14295/djn/nodes_used_collection_shard2_replica2/ shard2
   [junit4]   2> 1149203 T3166 oasc.ShardLeaderElectionContext.runLeaderProcess I am the new leader: http://127.0.0.1:42695/djn/nodes_used_collection_shard1_replica2/ shard1
   [junit4]   2> 1149204 T3120 oascc.SolrZkClient.makePath makePath: /collections/nodes_used_collection/leaders/shard2
   [junit4]   2> 1149204 T3166 oascc.SolrZkClient.makePath makePath: /collections/nodes_used_collection/leaders/shard1
   [junit4]   2> ASYNC  NEW_CORE C796 name=nodes_u

[...truncated too long message...]

tributedZkTest-jetty4-1375571700830//new_implicit_coll_1_a_replica1/data
   [junit4]   2> 1278473 T3108 oasc.SolrCore.close [new_implicit_coll_1_d_replica1]  CLOSING SolrCore org.apache.solr.core.SolrCore@5655fd80
   [junit4]   2> 1278483 T3108 oasu.DirectUpdateHandler2.close closing DirectUpdateHandler2{commits=4,autocommits=0,soft autocommits=0,optimizes=0,rollbacks=0,expungeDeletes=0,docsPending=0,adds=0,deletesById=0,deletesByQuery=0,errors=0,cumulative_adds=0,cumulative_deletesById=0,cumulative_deletesByQuery=1,cumulative_errors=0}
   [junit4]   2> 1278483 T3108 oasu.SolrCoreState.decrefSolrCoreState Closing SolrCoreState
   [junit4]   2> 1278484 T3108 oasu.DefaultSolrCoreState.closeIndexWriter SolrCoreState ref count has reached 0 - closing IndexWriter
   [junit4]   2> 1278484 T3108 oasu.DefaultSolrCoreState.closeIndexWriter closing IndexWriter with IndexWriterCloser
   [junit4]   2> 1278487 T3108 oasc.SolrCore.closeSearcher [new_implicit_coll_1_d_replica1] Closing main searcher on request.
   [junit4]   2> 1278487 T3108 oasc.CachingDirectoryFactory.close Closing MockDirectoryFactory - 2 directories currently being tracked
   [junit4]   2> 1278487 T3108 oasc.CachingDirectoryFactory.closeCacheValue looking to close /usr/home/hudson/hudson-slave/workspace/Lucene-Solr-Tests-trunk-Java7/solr/build/solr-core/test/J0/./org.apache.solr.cloud.CollectionsAPIDistributedZkTest-jetty4-1375571700830//new_implicit_coll_1_d_replica1/data/index [CachedDir<<refCount=0;path=/usr/home/hudson/hudson-slave/workspace/Lucene-Solr-Tests-trunk-Java7/solr/build/solr-core/test/J0/./org.apache.solr.cloud.CollectionsAPIDistributedZkTest-jetty4-1375571700830//new_implicit_coll_1_d_replica1/data/index;done=false>>]
   [junit4]   2> 1278488 T3108 oasc.CachingDirectoryFactory.close Closing directory: /usr/home/hudson/hudson-slave/workspace/Lucene-Solr-Tests-trunk-Java7/solr/build/solr-core/test/J0/./org.apache.solr.cloud.CollectionsAPIDistributedZkTest-jetty4-1375571700830//new_implicit_coll_1_d_replica1/data/index
   [junit4]   2> 1278488 T3108 oasc.CachingDirectoryFactory.closeCacheValue looking to close /usr/home/hudson/hudson-slave/workspace/Lucene-Solr-Tests-trunk-Java7/solr/build/solr-core/test/J0/./org.apache.solr.cloud.CollectionsAPIDistributedZkTest-jetty4-1375571700830//new_implicit_coll_1_d_replica1/data [CachedDir<<refCount=0;path=/usr/home/hudson/hudson-slave/workspace/Lucene-Solr-Tests-trunk-Java7/solr/build/solr-core/test/J0/./org.apache.solr.cloud.CollectionsAPIDistributedZkTest-jetty4-1375571700830//new_implicit_coll_1_d_replica1/data;done=false>>]
   [junit4]   2> 1278489 T3108 oasc.CachingDirectoryFactory.close Closing directory: /usr/home/hudson/hudson-slave/workspace/Lucene-Solr-Tests-trunk-Java7/solr/build/solr-core/test/J0/./org.apache.solr.cloud.CollectionsAPIDistributedZkTest-jetty4-1375571700830//new_implicit_coll_1_d_replica1/data
   [junit4]   2> 1278490 T3475 oasc.Overseer$ClusterStateUpdater.amILeader According to ZK I (id=90149466573570060-127.0.0.1:53665_djn-n_0000000004) am no longer a leader.
   [junit4]   2> 1278492 T3108 oejsh.ContextHandler.doStop stopped o.e.j.s.ServletContextHandler{/djn,null}
   [junit4]   2> 1278549 T3108 oas.SolrTestCaseJ4.tearDown ###Ending testDistribSearch
   [junit4]   2> 1278552 T3108 oasc.ZkTestServer.send4LetterWord connecting to 127.0.0.1:40955 40955
   [junit4]   1> client port:0.0.0.0/0.0.0.0:0
   [junit4]   2> NOTE: reproduce with: ant test  -Dtestcase=CollectionsAPIDistributedZkTest -Dtests.method=testDistribSearch -Dtests.seed=9E9FBBC428AC8A4E -Dtests.multiplier=3 -Dtests.slow=true -Dtests.locale=sk -Dtests.timezone=America/Rainy_River -Dtests.file.encoding=UTF-8
   [junit4] ERROR    142s J0 | CollectionsAPIDistributedZkTest.testDistribSearch <<<
   [junit4]    > Throwable #1: org.apache.solr.client.solrj.SolrServerException: IOException occured when talking to server at: http://127.0.0.1:54704/djn
   [junit4]    > 	at __randomizedtesting.SeedInfo.seed([9E9FBBC428AC8A4E:1F7935DC5FF3EA72]:0)
   [junit4]    > 	at org.apache.solr.client.solrj.impl.HttpSolrServer.request(HttpSolrServer.java:435)
   [junit4]    > 	at org.apache.solr.client.solrj.impl.HttpSolrServer.request(HttpSolrServer.java:180)
   [junit4]    > 	at org.apache.solr.cloud.CollectionsAPIDistributedZkTest.testCustomCollectionsAPI(CollectionsAPIDistributedZkTest.java:764)
   [junit4]    > 	at org.apache.solr.cloud.CollectionsAPIDistributedZkTest.doTest(CollectionsAPIDistributedZkTest.java:159)
   [junit4]    > 	at org.apache.solr.BaseDistributedSearchTestCase.testDistribSearch(BaseDistributedSearchTestCase.java:835)
   [junit4]    > 	at java.lang.Thread.run(Thread.java:724)
   [junit4]    > Caused by: org.apache.http.conn.ConnectTimeoutException: Connect to 127.0.0.1:54704 timed out
   [junit4]    > 	at org.apache.http.conn.scheme.PlainSocketFactory.connectSocket(PlainSocketFactory.java:129)
   [junit4]    > 	at org.apache.http.impl.conn.DefaultClientConnectionOperator.openConnection(DefaultClientConnectionOperator.java:180)
   [junit4]    > 	at org.apache.http.impl.conn.ManagedClientConnectionImpl.open(ManagedClientConnectionImpl.java:294)
   [junit4]    > 	at org.apache.http.impl.client.DefaultRequestDirector.tryConnect(DefaultRequestDirector.java:645)
   [junit4]    > 	at org.apache.http.impl.client.DefaultRequestDirector.execute(DefaultRequestDirector.java:480)
   [junit4]    > 	at org.apache.http.impl.client.AbstractHttpClient.execute(AbstractHttpClient.java:906)
   [junit4]    > 	at org.apache.http.impl.client.AbstractHttpClient.execute(AbstractHttpClient.java:805)
   [junit4]    > 	at org.apache.http.impl.client.AbstractHttpClient.execute(AbstractHttpClient.java:784)
   [junit4]    > 	at org.apache.solr.client.solrj.impl.HttpSolrServer.request(HttpSolrServer.java:365)
   [junit4]    > 	... 44 more
   [junit4]   2> 1279633 T3108 oas.SolrTestCaseJ4.deleteCore ###deleteCore
   [junit4]   2> 142286 T3107 ccr.ThreadLeakControl.checkThreadLeaks WARNING Will linger awaiting termination of 1 leaked thread(s).
   [junit4]   2> 1279792 T3190 oascc.ZkStateReader$3.process WARN ZooKeeper watch triggered, but Solr cannot talk to ZK
   [junit4]   2> 1279792 T3190 oascc.ZkStateReader$2.process A cluster state change: WatchedEvent state:SyncConnected type:NodeChildrenChanged path:/live_nodes, has occurred - updating... (live nodes size: 1)
   [junit4]   2> 1279792 T3190 oascc.ZkStateReader$2.process WARN ZooKeeper watch triggered, but Solr cannot talk to ZK
   [junit4]   2> NOTE: test params are: codec=Asserting, sim=DefaultSimilarity, locale=sk, timezone=America/Rainy_River
   [junit4]   2> NOTE: FreeBSD 9.1-RELEASE-p3 amd64/Oracle Corporation 1.7.0_25 (64-bit)/cpus=16,threads=4,free=145985224,total=511705088
   [junit4]   2> NOTE: All tests run in this JVM: [JsonLoaderTest, TestGroupingSearch, TermsComponentTest, TestQuerySenderListener, TestDynamicFieldCollectionResource, TestXIncludeConfig, TestPhraseSuggestions, PluginInfoTest, TestSchemaVersionResource, TestCloudManagedSchemaAddField, SimpleFacetsTest, TestLMDirichletSimilarityFactory, TestBadConfig, OverseerTest, PrimitiveFieldTypeTest, TestQueryUtils, SpatialFilterTest, TermVectorComponentTest, SchemaVersionSpecificBehaviorTest, TestFaceting, MinimalSchemaTest, TestMaxScoreQueryParser, PolyFieldTest, TestPseudoReturnFields, WordBreakSolrSpellCheckerTest, ChaosMonkeyNothingIsSafeTest, TestDocumentBuilder, AlternateDirectoryTest, UUIDFieldTest, TestSurroundQueryParser, RecoveryZkTest, TestFastWriter, TestShardHandlerFactory, CoreMergeIndexesAdminHandlerTest, CircularListTest, TestSolrIndexConfig, TestPHPSerializedResponseWriter, UpdateRequestProcessorFactoryTest, TestFieldTypeResource, StressHdfsTest, MoreLikeThisHandlerTest, TestWriterPerf, TestSolrQueryParser, PeerSyncTest, TestFastLRUCache, IndexSchemaTest, CacheHeaderTest, BasicFunctionalityTest, RegexBoostProcessorTest, ZkControllerTest, SystemInfoHandlerTest, ReturnFieldsTest, ShowFileRequestHandlerTest, TestReplicationHandler, SolrInfoMBeanTest, SearchHandlerTest, TestJoin, TestTrie, PreAnalyzedUpdateProcessorTest, TestCoreContainer, AddSchemaFieldsUpdateProcessorFactoryTest, ResourceLoaderTest, SolrTestCaseJ4Test, DistributedQueryElevationComponentTest, BadComponentTest, InfoHandlerTest, TestSolrQueryParserDefaultOperatorResource, SoftAutoCommitTest, TestSerializedLuceneMatchVersion, FieldMutatingUpdateProcessorTest, DirectUpdateHandlerOptimizeTest, TestIBSimilarityFactory, BlockDirectoryTest, ShardRoutingTest, CachingDirectoryFactoryTest, TestSolrDeletionPolicy2, TestReversedWildcardFilterFactory, ChaosMonkeySafeLeaderTest, CollectionsAPIDistributedZkTest]
   [junit4] Completed on J0 in 142.57s, 1 test, 1 error <<< FAILURES!

[...truncated 493 lines...]
BUILD FAILED
/usr/home/hudson/hudson-slave/workspace/Lucene-Solr-Tests-trunk-Java7/build.xml:389: The following error occurred while executing this line:
/usr/home/hudson/hudson-slave/workspace/Lucene-Solr-Tests-trunk-Java7/build.xml:369: The following error occurred while executing this line:
/usr/home/hudson/hudson-slave/workspace/Lucene-Solr-Tests-trunk-Java7/build.xml:39: The following error occurred while executing this line:
/usr/home/hudson/hudson-slave/workspace/Lucene-Solr-Tests-trunk-Java7/solr/build.xml:181: The following error occurred while executing this line:
/usr/home/hudson/hudson-slave/workspace/Lucene-Solr-Tests-trunk-Java7/solr/common-build.xml:449: The following error occurred while executing this line:
/usr/home/hudson/hudson-slave/workspace/Lucene-Solr-Tests-trunk-Java7/lucene/common-build.xml:1230: The following error occurred while executing this line:
/usr/home/hudson/hudson-slave/workspace/Lucene-Solr-Tests-trunk-Java7/lucene/common-build.xml:873: There were test failures: 320 suites, 1347 tests, 1 error, 34 ignored (6 assumptions)

Total time: 57 minutes 11 seconds
Build step 'Invoke Ant' marked build as failure
Archiving artifacts
Recording test results
Email was triggered for: Failure
Sending email for trigger: Failure



Mime
View raw message