lucene-dev mailing list archives

Site index · List index
Message view « Date » · « Thread »
Top « Date » · « Thread »
From Policeman Jenkins Server <jenk...@thetaphi.de>
Subject [JENKINS] Lucene-Solr-4.x-Linux (32bit/jdk1.6.0_45) - Build # 6776 - Still Failing!
Date Sat, 03 Aug 2013 03:46:23 GMT
Build: http://jenkins.thetaphi.de/job/Lucene-Solr-4.x-Linux/6776/
Java: 32bit/jdk1.6.0_45 -server -XX:+UseParallelGC

1 tests failed.
FAILED:  org.apache.solr.cloud.CollectionsAPIDistributedZkTest.testDistribSearch

Error Message:
Server refused connection at: http://127.0.0.1:54076

Stack Trace:
org.apache.solr.client.solrj.SolrServerException: Server refused connection at: http://127.0.0.1:54076
	at __randomizedtesting.SeedInfo.seed([28BC2E40482BEFCE:A95AA0583F748FF2]:0)
	at org.apache.solr.client.solrj.impl.HttpSolrServer.request(HttpSolrServer.java:428)
	at org.apache.solr.client.solrj.impl.HttpSolrServer.request(HttpSolrServer.java:180)
	at org.apache.solr.cloud.AbstractFullDistribZkTestBase.createCollection(AbstractFullDistribZkTestBase.java:1535)
	at org.apache.solr.cloud.CollectionsAPIDistributedZkTest.testCustomCollectionsAPI(CollectionsAPIDistributedZkTest.java:677)
	at org.apache.solr.cloud.CollectionsAPIDistributedZkTest.doTest(CollectionsAPIDistributedZkTest.java:159)
	at org.apache.solr.BaseDistributedSearchTestCase.testDistribSearch(BaseDistributedSearchTestCase.java:835)
	at sun.reflect.NativeMethodAccessorImpl.invoke0(Native Method)
	at sun.reflect.NativeMethodAccessorImpl.invoke(NativeMethodAccessorImpl.java:39)
	at sun.reflect.DelegatingMethodAccessorImpl.invoke(DelegatingMethodAccessorImpl.java:25)
	at java.lang.reflect.Method.invoke(Method.java:597)
	at com.carrotsearch.randomizedtesting.RandomizedRunner.invoke(RandomizedRunner.java:1559)
	at com.carrotsearch.randomizedtesting.RandomizedRunner.access$600(RandomizedRunner.java:79)
	at com.carrotsearch.randomizedtesting.RandomizedRunner$6.evaluate(RandomizedRunner.java:737)
	at com.carrotsearch.randomizedtesting.RandomizedRunner$7.evaluate(RandomizedRunner.java:773)
	at com.carrotsearch.randomizedtesting.RandomizedRunner$8.evaluate(RandomizedRunner.java:787)
	at com.carrotsearch.randomizedtesting.rules.SystemPropertiesRestoreRule$1.evaluate(SystemPropertiesRestoreRule.java:53)
	at org.apache.lucene.util.TestRuleSetupTeardownChained$1.evaluate(TestRuleSetupTeardownChained.java:50)
	at org.apache.lucene.util.TestRuleFieldCacheSanity$1.evaluate(TestRuleFieldCacheSanity.java:51)
	at org.apache.lucene.util.AbstractBeforeAfterRule$1.evaluate(AbstractBeforeAfterRule.java:46)
	at com.carrotsearch.randomizedtesting.rules.SystemPropertiesInvariantRule$1.evaluate(SystemPropertiesInvariantRule.java:55)
	at org.apache.lucene.util.TestRuleThreadAndTestName$1.evaluate(TestRuleThreadAndTestName.java:49)
	at org.apache.lucene.util.TestRuleIgnoreAfterMaxFailures$1.evaluate(TestRuleIgnoreAfterMaxFailures.java:70)
	at org.apache.lucene.util.TestRuleMarkFailure$1.evaluate(TestRuleMarkFailure.java:48)
	at com.carrotsearch.randomizedtesting.rules.StatementAdapter.evaluate(StatementAdapter.java:36)
	at com.carrotsearch.randomizedtesting.ThreadLeakControl$StatementRunner.run(ThreadLeakControl.java:358)
	at com.carrotsearch.randomizedtesting.ThreadLeakControl.forkTimeoutingTask(ThreadLeakControl.java:782)
	at com.carrotsearch.randomizedtesting.ThreadLeakControl$3.evaluate(ThreadLeakControl.java:442)
	at com.carrotsearch.randomizedtesting.RandomizedRunner.runSingleTest(RandomizedRunner.java:746)
	at com.carrotsearch.randomizedtesting.RandomizedRunner$3.evaluate(RandomizedRunner.java:648)
	at com.carrotsearch.randomizedtesting.RandomizedRunner$4.evaluate(RandomizedRunner.java:682)
	at com.carrotsearch.randomizedtesting.RandomizedRunner$5.evaluate(RandomizedRunner.java:693)
	at com.carrotsearch.randomizedtesting.rules.StatementAdapter.evaluate(StatementAdapter.java:36)
	at com.carrotsearch.randomizedtesting.rules.SystemPropertiesRestoreRule$1.evaluate(SystemPropertiesRestoreRule.java:53)
	at org.apache.lucene.util.AbstractBeforeAfterRule$1.evaluate(AbstractBeforeAfterRule.java:46)
	at org.apache.lucene.util.TestRuleStoreClassName$1.evaluate(TestRuleStoreClassName.java:42)
	at com.carrotsearch.randomizedtesting.rules.SystemPropertiesInvariantRule$1.evaluate(SystemPropertiesInvariantRule.java:55)
	at com.carrotsearch.randomizedtesting.rules.NoShadowingOrOverridesOnMethodsRule$1.evaluate(NoShadowingOrOverridesOnMethodsRule.java:39)
	at com.carrotsearch.randomizedtesting.rules.NoShadowingOrOverridesOnMethodsRule$1.evaluate(NoShadowingOrOverridesOnMethodsRule.java:39)
	at com.carrotsearch.randomizedtesting.rules.StatementAdapter.evaluate(StatementAdapter.java:36)
	at org.apache.lucene.util.TestRuleAssertionsRequired$1.evaluate(TestRuleAssertionsRequired.java:43)
	at org.apache.lucene.util.TestRuleMarkFailure$1.evaluate(TestRuleMarkFailure.java:48)
	at org.apache.lucene.util.TestRuleIgnoreAfterMaxFailures$1.evaluate(TestRuleIgnoreAfterMaxFailures.java:70)
	at org.apache.lucene.util.TestRuleIgnoreTestSuites$1.evaluate(TestRuleIgnoreTestSuites.java:55)
	at com.carrotsearch.randomizedtesting.rules.StatementAdapter.evaluate(StatementAdapter.java:36)
	at com.carrotsearch.randomizedtesting.ThreadLeakControl$StatementRunner.run(ThreadLeakControl.java:358)
	at java.lang.Thread.run(Thread.java:662)
Caused by: org.apache.http.conn.HttpHostConnectException: Connection to http://127.0.0.1:54076 refused
	at org.apache.http.impl.conn.DefaultClientConnectionOperator.openConnection(DefaultClientConnectionOperator.java:190)
	at org.apache.http.impl.conn.ManagedClientConnectionImpl.open(ManagedClientConnectionImpl.java:294)
	at org.apache.http.impl.client.DefaultRequestDirector.tryConnect(DefaultRequestDirector.java:645)
	at org.apache.http.impl.client.DefaultRequestDirector.execute(DefaultRequestDirector.java:480)
	at org.apache.http.impl.client.AbstractHttpClient.execute(AbstractHttpClient.java:906)
	at org.apache.http.impl.client.AbstractHttpClient.execute(AbstractHttpClient.java:805)
	at org.apache.http.impl.client.AbstractHttpClient.execute(AbstractHttpClient.java:784)
	at org.apache.solr.client.solrj.impl.HttpSolrServer.request(HttpSolrServer.java:365)
	... 45 more
Caused by: java.net.ConnectException: Connection refused
	at java.net.PlainSocketImpl.socketConnect(Native Method)
	at java.net.PlainSocketImpl.doConnect(PlainSocketImpl.java:351)
	at java.net.PlainSocketImpl.connectToAddress(PlainSocketImpl.java:213)
	at java.net.PlainSocketImpl.connect(PlainSocketImpl.java:200)
	at java.net.SocksSocketImpl.connect(SocksSocketImpl.java:366)
	at java.net.Socket.connect(Socket.java:529)
	at org.apache.http.conn.scheme.PlainSocketFactory.connectSocket(PlainSocketFactory.java:127)
	at org.apache.http.impl.conn.DefaultClientConnectionOperator.openConnection(DefaultClientConnectionOperator.java:180)
	... 52 more




Build Log:
[...truncated 9243 lines...]
   [junit4] Suite: org.apache.solr.cloud.CollectionsAPIDistributedZkTest
   [junit4]   2> 751453 T2241 oas.BaseDistributedSearchTestCase.initHostContext Setting hostContext system property: /
   [junit4]   2> 751458 T2241 oas.SolrTestCaseJ4.setUp ###Starting testDistribSearch
   [junit4]   2> Creating dataDir: /mnt/ssd/jenkins/workspace/Lucene-Solr-4.x-Linux/solr/build/solr-core/test/J0/./solrtest-CollectionsAPIDistributedZkTest-1375500973844
   [junit4]   2> 751458 T2241 oasc.ZkTestServer.run STARTING ZK TEST SERVER
   [junit4]   2> 751459 T2242 oasc.ZkTestServer$ZKServerMain.runFromConfig Starting server
   [junit4]   2> 751559 T2241 oasc.ZkTestServer.run start zk server on port:41165
   [junit4]   2> 751560 T2241 oascc.ConnectionManager.waitForConnected Waiting for client to connect to ZooKeeper
   [junit4]   2> 751625 T2248 oascc.ConnectionManager.process Watcher org.apache.solr.common.cloud.ConnectionManager@141815c name:ZooKeeperConnection Watcher:127.0.0.1:41165 got event WatchedEvent state:SyncConnected type:None path:null path:null type:None
   [junit4]   2> 751625 T2241 oascc.ConnectionManager.waitForConnected Client is connected to ZooKeeper
   [junit4]   2> 751625 T2241 oascc.SolrZkClient.makePath makePath: /solr
   [junit4]   2> 751630 T2241 oascc.ConnectionManager.waitForConnected Waiting for client to connect to ZooKeeper
   [junit4]   2> 751631 T2250 oascc.ConnectionManager.process Watcher org.apache.solr.common.cloud.ConnectionManager@1ed8fa6 name:ZooKeeperConnection Watcher:127.0.0.1:41165/solr got event WatchedEvent state:SyncConnected type:None path:null path:null type:None
   [junit4]   2> 751631 T2241 oascc.ConnectionManager.waitForConnected Client is connected to ZooKeeper
   [junit4]   2> 751632 T2241 oascc.SolrZkClient.makePath makePath: /collections/collection1
   [junit4]   2> 751635 T2241 oascc.SolrZkClient.makePath makePath: /collections/collection1/shards
   [junit4]   2> 751639 T2241 oascc.SolrZkClient.makePath makePath: /collections/control_collection
   [junit4]   2> 751642 T2241 oascc.SolrZkClient.makePath makePath: /collections/control_collection/shards
   [junit4]   2> 751646 T2241 oasc.AbstractZkTestCase.putConfig put /mnt/ssd/jenkins/workspace/Lucene-Solr-4.x-Linux/solr/build/solr-core/test-files/solr/collection1/conf/solrconfig-tlog.xml to /configs/conf1/solrconfig.xml
   [junit4]   2> 751646 T2241 oascc.SolrZkClient.makePath makePath: /configs/conf1/solrconfig.xml
   [junit4]   2> 751652 T2241 oasc.AbstractZkTestCase.putConfig put /mnt/ssd/jenkins/workspace/Lucene-Solr-4.x-Linux/solr/build/solr-core/test-files/solr/collection1/conf/schema.xml to /configs/conf1/schema.xml
   [junit4]   2> 751653 T2241 oascc.SolrZkClient.makePath makePath: /configs/conf1/schema.xml
   [junit4]   2> 751657 T2241 oasc.AbstractZkTestCase.putConfig put /mnt/ssd/jenkins/workspace/Lucene-Solr-4.x-Linux/solr/build/solr-core/test-files/solr/collection1/conf/stopwords.txt to /configs/conf1/stopwords.txt
   [junit4]   2> 751657 T2241 oascc.SolrZkClient.makePath makePath: /configs/conf1/stopwords.txt
   [junit4]   2> 751661 T2241 oasc.AbstractZkTestCase.putConfig put /mnt/ssd/jenkins/workspace/Lucene-Solr-4.x-Linux/solr/build/solr-core/test-files/solr/collection1/conf/protwords.txt to /configs/conf1/protwords.txt
   [junit4]   2> 751662 T2241 oascc.SolrZkClient.makePath makePath: /configs/conf1/protwords.txt
   [junit4]   2> 751665 T2241 oasc.AbstractZkTestCase.putConfig put /mnt/ssd/jenkins/workspace/Lucene-Solr-4.x-Linux/solr/build/solr-core/test-files/solr/collection1/conf/currency.xml to /configs/conf1/currency.xml
   [junit4]   2> 751666 T2241 oascc.SolrZkClient.makePath makePath: /configs/conf1/currency.xml
   [junit4]   2> 751669 T2241 oasc.AbstractZkTestCase.putConfig put /mnt/ssd/jenkins/workspace/Lucene-Solr-4.x-Linux/solr/build/solr-core/test-files/solr/collection1/conf/open-exchange-rates.json to /configs/conf1/open-exchange-rates.json
   [junit4]   2> 751670 T2241 oascc.SolrZkClient.makePath makePath: /configs/conf1/open-exchange-rates.json
   [junit4]   2> 751674 T2241 oasc.AbstractZkTestCase.putConfig put /mnt/ssd/jenkins/workspace/Lucene-Solr-4.x-Linux/solr/build/solr-core/test-files/solr/collection1/conf/mapping-ISOLatin1Accent.txt to /configs/conf1/mapping-ISOLatin1Accent.txt
   [junit4]   2> 751674 T2241 oascc.SolrZkClient.makePath makePath: /configs/conf1/mapping-ISOLatin1Accent.txt
   [junit4]   2> 751678 T2241 oasc.AbstractZkTestCase.putConfig put /mnt/ssd/jenkins/workspace/Lucene-Solr-4.x-Linux/solr/build/solr-core/test-files/solr/collection1/conf/old_synonyms.txt to /configs/conf1/old_synonyms.txt
   [junit4]   2> 751678 T2241 oascc.SolrZkClient.makePath makePath: /configs/conf1/old_synonyms.txt
   [junit4]   2> 751682 T2241 oasc.AbstractZkTestCase.putConfig put /mnt/ssd/jenkins/workspace/Lucene-Solr-4.x-Linux/solr/build/solr-core/test-files/solr/collection1/conf/synonyms.txt to /configs/conf1/synonyms.txt
   [junit4]   2> 751682 T2241 oascc.SolrZkClient.makePath makePath: /configs/conf1/synonyms.txt
   [junit4]   2> 751769 T2241 oejs.Server.doStart jetty-8.1.10.v20130312
   [junit4]   2> 751772 T2241 oejs.AbstractConnector.doStart Started SelectChannelConnector@127.0.0.1:44838
   [junit4]   2> 751772 T2241 oass.SolrDispatchFilter.init SolrDispatchFilter.init()
   [junit4]   2> 751773 T2241 oasc.SolrResourceLoader.locateSolrHome JNDI not configured for solr (NoInitialContextEx)
   [junit4]   2> 751773 T2241 oasc.SolrResourceLoader.locateSolrHome using system property solr.solr.home: /mnt/ssd/jenkins/workspace/Lucene-Solr-4.x-Linux/solr/build/solr-core/test/J0/./org.apache.solr.cloud.CollectionsAPIDistributedZkTest-controljetty-1375500974074
   [junit4]   2> 751773 T2241 oasc.SolrResourceLoader.<init> new SolrResourceLoader for directory: '/mnt/ssd/jenkins/workspace/Lucene-Solr-4.x-Linux/solr/build/solr-core/test/J0/./org.apache.solr.cloud.CollectionsAPIDistributedZkTest-controljetty-1375500974074/'
   [junit4]   2> 751785 T2241 oasc.ConfigSolr.fromFile Loading container configuration from /mnt/ssd/jenkins/workspace/Lucene-Solr-4.x-Linux/solr/build/solr-core/test/J0/./org.apache.solr.cloud.CollectionsAPIDistributedZkTest-controljetty-1375500974074/solr.xml
   [junit4]   2> 751820 T2241 oasc.ConfigSolrXml.<init> Config-defined core root directory: 
   [junit4]   2> 751820 T2241 oasc.CoreContainer.<init> New CoreContainer 5934438
   [junit4]   2> 751821 T2241 oasc.CoreContainer.load Loading cores into CoreContainer [instanceDir=/mnt/ssd/jenkins/workspace/Lucene-Solr-4.x-Linux/solr/build/solr-core/test/J0/./org.apache.solr.cloud.CollectionsAPIDistributedZkTest-controljetty-1375500974074/]
   [junit4]   2> 751822 T2241 oashc.HttpShardHandlerFactory.getParameter Setting socketTimeout to: 120000
   [junit4]   2> 751822 T2241 oashc.HttpShardHandlerFactory.getParameter Setting urlScheme to: http://
   [junit4]   2> 751823 T2241 oashc.HttpShardHandlerFactory.getParameter Setting connTimeout to: 15000
   [junit4]   2> 751823 T2241 oashc.HttpShardHandlerFactory.getParameter Setting maxConnectionsPerHost to: 20
   [junit4]   2> 751823 T2241 oashc.HttpShardHandlerFactory.getParameter Setting corePoolSize to: 0
   [junit4]   2> 751824 T2241 oashc.HttpShardHandlerFactory.getParameter Setting maximumPoolSize to: 2147483647
   [junit4]   2> 751824 T2241 oashc.HttpShardHandlerFactory.getParameter Setting maxThreadIdleTime to: 5
   [junit4]   2> 751824 T2241 oashc.HttpShardHandlerFactory.getParameter Setting sizeOfQueue to: -1
   [junit4]   2> 751825 T2241 oashc.HttpShardHandlerFactory.getParameter Setting fairnessPolicy to: false
   [junit4]   2> 751825 T2241 oascsi.HttpClientUtil.createClient Creating new http client, config:maxConnectionsPerHost=20&maxConnections=10000&socketTimeout=120000&connTimeout=15000&retry=false
   [junit4]   2> 751828 T2241 oasc.ZkContainer.initZooKeeper Zookeeper client=127.0.0.1:41165/solr
   [junit4]   2> 751829 T2241 oasc.ZkController.checkChrootPath zkHost includes chroot
   [junit4]   2> 751829 T2241 oascc.ConnectionManager.waitForConnected Waiting for client to connect to ZooKeeper
   [junit4]   2> 751831 T2261 oascc.ConnectionManager.process Watcher org.apache.solr.common.cloud.ConnectionManager@f94bba name:ZooKeeperConnection Watcher:127.0.0.1:41165 got event WatchedEvent state:SyncConnected type:None path:null path:null type:None
   [junit4]   2> 751831 T2241 oascc.ConnectionManager.waitForConnected Client is connected to ZooKeeper
   [junit4]   2> 751833 T2241 oascsi.HttpClientUtil.createClient Creating new http client, config:maxConnections=500&maxConnectionsPerHost=16&socketTimeout=120000&connTimeout=15000
   [junit4]   2> 751835 T2241 oascc.ConnectionManager.waitForConnected Waiting for client to connect to ZooKeeper
   [junit4]   2> 751837 T2263 oascc.ConnectionManager.process Watcher org.apache.solr.common.cloud.ConnectionManager@a07606 name:ZooKeeperConnection Watcher:127.0.0.1:41165/solr got event WatchedEvent state:SyncConnected type:None path:null path:null type:None
   [junit4]   2> 751837 T2241 oascc.ConnectionManager.waitForConnected Client is connected to ZooKeeper
   [junit4]   2> 751839 T2241 oascc.SolrZkClient.makePath makePath: /overseer/queue
   [junit4]   2> 751843 T2241 oascc.SolrZkClient.makePath makePath: /overseer/collection-queue-work
   [junit4]   2> 751847 T2241 oascc.SolrZkClient.makePath makePath: /live_nodes
   [junit4]   2> 751850 T2241 oasc.ZkController.createEphemeralLiveNode Register node as live in ZooKeeper:/live_nodes/127.0.0.1:44838_
   [junit4]   2> 751851 T2241 oascc.SolrZkClient.makePath makePath: /live_nodes/127.0.0.1:44838_
   [junit4]   2> 751856 T2241 oascc.SolrZkClient.makePath makePath: /overseer_elect/election
   [junit4]   2> 751863 T2241 oascc.SolrZkClient.makePath makePath: /overseer_elect/leader
   [junit4]   2> 751866 T2241 oasc.Overseer.start Overseer (id=90144831822036995-127.0.0.1:44838_-n_0000000000) starting
   [junit4]   2> 751869 T2241 oascc.SolrZkClient.makePath makePath: /overseer/queue-work
   [junit4]   2> 751874 T2265 oasc.OverseerCollectionProcessor.run Process current queue of collection creations
   [junit4]   2> 751875 T2241 oascc.SolrZkClient.makePath makePath: /clusterstate.json
   [junit4]   2> 751879 T2241 oascc.SolrZkClient.makePath makePath: /aliases.json
   [junit4]   2> 751881 T2241 oascc.ZkStateReader.createClusterStateWatchersAndUpdate Updating cluster state from ZooKeeper... 
   [junit4]   2> 751885 T2264 oasc.Overseer$ClusterStateUpdater.run Starting to work on the main queue
   [junit4]   2> 751887 T2241 oasc.CorePropertiesLocator.discover Looking for core definitions underneath /mnt/ssd/jenkins/workspace/Lucene-Solr-4.x-Linux/solr/build/solr-core/test/J0/./org.apache.solr.cloud.CollectionsAPIDistributedZkTest-controljetty-1375500974074
   [junit4]   2> 751914 T2241 oasc.CorePropertiesLocator.discoverUnder Found core conf in /mnt/ssd/jenkins/workspace/Lucene-Solr-4.x-Linux/solr/build/solr-core/test/J0/./org.apache.solr.cloud.CollectionsAPIDistributedZkTest-controljetty-1375500974074/conf/
   [junit4]   2> 751914 T2241 oasc.CorePropertiesLocator.discover Found 1 core definitions
   [junit4]   2> 751915 T2241 oass.SolrDispatchFilter.init user.dir=/mnt/ssd/jenkins/workspace/Lucene-Solr-4.x-Linux/solr/build/solr-core/test/J0
   [junit4]   2> 751915 T2241 oass.SolrDispatchFilter.init SolrDispatchFilter.init() done
   [junit4]   2> 751915 T2241 oascsi.HttpClientUtil.createClient Creating new http client, config:maxConnections=128&maxConnectionsPerHost=32&followRedirects=false
   [junit4]   2> 751919 T2241 oascsi.HttpClientUtil.createClient Creating new http client, config:
   [junit4]   2> 751920 T2241 oascc.ConnectionManager.waitForConnected Waiting for client to connect to ZooKeeper
   [junit4]   2> 751921 T2268 oascc.ConnectionManager.process Watcher org.apache.solr.common.cloud.ConnectionManager@a24a0e name:ZooKeeperConnection Watcher:127.0.0.1:41165/solr got event WatchedEvent state:SyncConnected type:None path:null path:null type:None
   [junit4]   2> 751921 T2241 oascc.ConnectionManager.waitForConnected Client is connected to ZooKeeper
   [junit4]   2> 751923 T2241 oascc.ZkStateReader.createClusterStateWatchersAndUpdate Updating cluster state from ZooKeeper... 
   [junit4]   2> 751926 T2241 oasc.ChaosMonkey.monkeyLog monkey: init - expire sessions:true cause connection loss:true
   [junit4]   2> 752001 T2241 oejs.Server.doStart jetty-8.1.10.v20130312
   [junit4]   2> 752003 T2241 oejs.AbstractConnector.doStart Started SelectChannelConnector@127.0.0.1:45099
   [junit4]   2> 752004 T2241 oass.SolrDispatchFilter.init SolrDispatchFilter.init()
   [junit4]   2> 752004 T2241 oasc.SolrResourceLoader.locateSolrHome JNDI not configured for solr (NoInitialContextEx)
   [junit4]   2> 752005 T2241 oasc.SolrResourceLoader.locateSolrHome using system property solr.solr.home: /mnt/ssd/jenkins/workspace/Lucene-Solr-4.x-Linux/solr/build/solr-core/test/J0/./org.apache.solr.cloud.CollectionsAPIDistributedZkTest-jetty1-1375500974313
   [junit4]   2> 752005 T2241 oasc.SolrResourceLoader.<init> new SolrResourceLoader for directory: '/mnt/ssd/jenkins/workspace/Lucene-Solr-4.x-Linux/solr/build/solr-core/test/J0/./org.apache.solr.cloud.CollectionsAPIDistributedZkTest-jetty1-1375500974313/'
   [junit4]   2> 752017 T2241 oasc.ConfigSolr.fromFile Loading container configuration from /mnt/ssd/jenkins/workspace/Lucene-Solr-4.x-Linux/solr/build/solr-core/test/J0/./org.apache.solr.cloud.CollectionsAPIDistributedZkTest-jetty1-1375500974313/solr.xml
   [junit4]   2> 752052 T2241 oasc.ConfigSolrXml.<init> Config-defined core root directory: 
   [junit4]   2> 752053 T2241 oasc.CoreContainer.<init> New CoreContainer 5367096
   [junit4]   2> 752053 T2241 oasc.CoreContainer.load Loading cores into CoreContainer [instanceDir=/mnt/ssd/jenkins/workspace/Lucene-Solr-4.x-Linux/solr/build/solr-core/test/J0/./org.apache.solr.cloud.CollectionsAPIDistributedZkTest-jetty1-1375500974313/]
   [junit4]   2> 752054 T2241 oashc.HttpShardHandlerFactory.getParameter Setting socketTimeout to: 120000
   [junit4]   2> 752055 T2241 oashc.HttpShardHandlerFactory.getParameter Setting urlScheme to: http://
   [junit4]   2> 752055 T2241 oashc.HttpShardHandlerFactory.getParameter Setting connTimeout to: 15000
   [junit4]   2> 752055 T2241 oashc.HttpShardHandlerFactory.getParameter Setting maxConnectionsPerHost to: 20
   [junit4]   2> 752056 T2241 oashc.HttpShardHandlerFactory.getParameter Setting corePoolSize to: 0
   [junit4]   2> 752056 T2241 oashc.HttpShardHandlerFactory.getParameter Setting maximumPoolSize to: 2147483647
   [junit4]   2> 752056 T2241 oashc.HttpShardHandlerFactory.getParameter Setting maxThreadIdleTime to: 5
   [junit4]   2> 752057 T2241 oashc.HttpShardHandlerFactory.getParameter Setting sizeOfQueue to: -1
   [junit4]   2> 752057 T2241 oashc.HttpShardHandlerFactory.getParameter Setting fairnessPolicy to: false
   [junit4]   2> 752058 T2241 oascsi.HttpClientUtil.createClient Creating new http client, config:maxConnectionsPerHost=20&maxConnections=10000&socketTimeout=120000&connTimeout=15000&retry=false
   [junit4]   2> 752060 T2241 oasc.ZkContainer.initZooKeeper Zookeeper client=127.0.0.1:41165/solr
   [junit4]   2> 752061 T2241 oasc.ZkController.checkChrootPath zkHost includes chroot
   [junit4]   2> 752062 T2241 oascc.ConnectionManager.waitForConnected Waiting for client to connect to ZooKeeper
   [junit4]   2> 752063 T2279 oascc.ConnectionManager.process Watcher org.apache.solr.common.cloud.ConnectionManager@9fc2c5 name:ZooKeeperConnection Watcher:127.0.0.1:41165 got event WatchedEvent state:SyncConnected type:None path:null path:null type:None
   [junit4]   2> 752063 T2241 oascc.ConnectionManager.waitForConnected Client is connected to ZooKeeper
   [junit4]   2> 752065 T2241 oascsi.HttpClientUtil.createClient Creating new http client, config:maxConnections=500&maxConnectionsPerHost=16&socketTimeout=120000&connTimeout=15000
   [junit4]   2> 752068 T2241 oascc.ConnectionManager.waitForConnected Waiting for client to connect to ZooKeeper
   [junit4]   2> 752080 T2281 oascc.ConnectionManager.process Watcher org.apache.solr.common.cloud.ConnectionManager@1f5d09b name:ZooKeeperConnection Watcher:127.0.0.1:41165/solr got event WatchedEvent state:SyncConnected type:None path:null path:null type:None
   [junit4]   2> 752080 T2241 oascc.ConnectionManager.waitForConnected Client is connected to ZooKeeper
   [junit4]   2> 752085 T2241 oascc.ZkStateReader.createClusterStateWatchersAndUpdate Updating cluster state from ZooKeeper... 
   [junit4]   2> 753089 T2241 oasc.ZkController.createEphemeralLiveNode Register node as live in ZooKeeper:/live_nodes/127.0.0.1:45099_
   [junit4]   2> 753091 T2241 oascc.SolrZkClient.makePath makePath: /live_nodes/127.0.0.1:45099_
   [junit4]   2> 753096 T2281 oascc.ZkStateReader$3.process Updating live nodes... (2)
   [junit4]   2> 753097 T2263 oascc.ZkStateReader$3.process Updating live nodes... (2)
   [junit4]   2> 753097 T2268 oascc.ZkStateReader$3.process Updating live nodes... (2)
   [junit4]   2> 753103 T2241 oasc.CorePropertiesLocator.discover Looking for core definitions underneath /mnt/ssd/jenkins/workspace/Lucene-Solr-4.x-Linux/solr/build/solr-core/test/J0/./org.apache.solr.cloud.CollectionsAPIDistributedZkTest-jetty1-1375500974313
   [junit4]   2> 753127 T2241 oasc.CorePropertiesLocator.discoverUnder Found core conf in /mnt/ssd/jenkins/workspace/Lucene-Solr-4.x-Linux/solr/build/solr-core/test/J0/./org.apache.solr.cloud.CollectionsAPIDistributedZkTest-jetty1-1375500974313/conf/
   [junit4]   2> 753128 T2241 oasc.CorePropertiesLocator.discover Found 1 core definitions
   [junit4]   2> 753128 T2241 oass.SolrDispatchFilter.init user.dir=/mnt/ssd/jenkins/workspace/Lucene-Solr-4.x-Linux/solr/build/solr-core/test/J0
   [junit4]   2> 753129 T2241 oass.SolrDispatchFilter.init SolrDispatchFilter.init() done
   [junit4]   2> 753129 T2241 oascsi.HttpClientUtil.createClient Creating new http client, config:maxConnections=128&maxConnectionsPerHost=32&followRedirects=false
   [junit4]   2> 753220 T2241 oejs.Server.doStart jetty-8.1.10.v20130312
   [junit4]   2> 753222 T2241 oejs.AbstractConnector.doStart Started SelectChannelConnector@127.0.0.1:54076
   [junit4]   2> 753223 T2241 oass.SolrDispatchFilter.init SolrDispatchFilter.init()
   [junit4]   2> 753223 T2241 oasc.SolrResourceLoader.locateSolrHome JNDI not configured for solr (NoInitialContextEx)
   [junit4]   2> 753223 T2241 oasc.SolrResourceLoader.locateSolrHome using system property solr.solr.home: /mnt/ssd/jenkins/workspace/Lucene-Solr-4.x-Linux/solr/build/solr-core/test/J0/./org.apache.solr.cloud.CollectionsAPIDistributedZkTest-jetty2-1375500975518
   [junit4]   2> 753224 T2241 oasc.SolrResourceLoader.<init> new SolrResourceLoader for directory: '/mnt/ssd/jenkins/workspace/Lucene-Solr-4.x-Linux/solr/build/solr-core/test/J0/./org.apache.solr.cloud.CollectionsAPIDistributedZkTest-jetty2-1375500975518/'
   [junit4]   2> 753234 T2241 oasc.ConfigSolr.fromFile Loading container configuration from /mnt/ssd/jenkins/workspace/Lucene-Solr-4.x-Linux/solr/build/solr-core/test/J0/./org.apache.solr.cloud.CollectionsAPIDistributedZkTest-jetty2-1375500975518/solr.xml
   [junit4]   2> 753267 T2241 oasc.ConfigSolrXml.<init> Config-defined core root directory: 
   [junit4]   2> 753267 T2241 oasc.CoreContainer.<init> New CoreContainer 13826504
   [junit4]   2> 753268 T2241 oasc.CoreContainer.load Loading cores into CoreContainer [instanceDir=/mnt/ssd/jenkins/workspace/Lucene-Solr-4.x-Linux/solr/build/solr-core/test/J0/./org.apache.solr.cloud.CollectionsAPIDistributedZkTest-jetty2-1375500975518/]
   [junit4]   2> 753269 T2241 oashc.HttpShardHandlerFactory.getParameter Setting socketTimeout to: 120000
   [junit4]   2> 753269 T2241 oashc.HttpShardHandlerFactory.getParameter Setting urlScheme to: http://
   [junit4]   2> 753269 T2241 oashc.HttpShardHandlerFactory.getParameter Setting connTimeout to: 15000
   [junit4]   2> 753270 T2241 oashc.HttpShardHandlerFactory.getParameter Setting maxConnectionsPerHost to: 20
   [junit4]   2> 753270 T2241 oashc.HttpShardHandlerFactory.getParameter Setting corePoolSize to: 0
   [junit4]   2> 753270 T2241 oashc.HttpShardHandlerFactory.getParameter Setting maximumPoolSize to: 2147483647
   [junit4]   2> 753271 T2241 oashc.HttpShardHandlerFactory.getParameter Setting maxThreadIdleTime to: 5
   [junit4]   2> 753271 T2241 oashc.HttpShardHandlerFactory.getParameter Setting sizeOfQueue to: -1
   [junit4]   2> 753271 T2241 oashc.HttpShardHandlerFactory.getParameter Setting fairnessPolicy to: false
   [junit4]   2> 753272 T2241 oascsi.HttpClientUtil.createClient Creating new http client, config:maxConnectionsPerHost=20&maxConnections=10000&socketTimeout=120000&connTimeout=15000&retry=false
   [junit4]   2> 753275 T2241 oasc.ZkContainer.initZooKeeper Zookeeper client=127.0.0.1:41165/solr
   [junit4]   2> 753275 T2241 oasc.ZkController.checkChrootPath zkHost includes chroot
   [junit4]   2> 753276 T2241 oascc.ConnectionManager.waitForConnected Waiting for client to connect to ZooKeeper
   [junit4]   2> 753277 T2293 oascc.ConnectionManager.process Watcher org.apache.solr.common.cloud.ConnectionManager@10ce600 name:ZooKeeperConnection Watcher:127.0.0.1:41165 got event WatchedEvent state:SyncConnected type:None path:null path:null type:None
   [junit4]   2> 753277 T2241 oascc.ConnectionManager.waitForConnected Client is connected to ZooKeeper
   [junit4]   2> 753279 T2241 oascsi.HttpClientUtil.createClient Creating new http client, config:maxConnections=500&maxConnectionsPerHost=16&socketTimeout=120000&connTimeout=15000
   [junit4]   2> 753282 T2241 oascc.ConnectionManager.waitForConnected Waiting for client to connect to ZooKeeper
   [junit4]   2> 753283 T2295 oascc.ConnectionManager.process Watcher org.apache.solr.common.cloud.ConnectionManager@90dd82 name:ZooKeeperConnection Watcher:127.0.0.1:41165/solr got event WatchedEvent state:SyncConnected type:None path:null path:null type:None
   [junit4]   2> 753283 T2241 oascc.ConnectionManager.waitForConnected Client is connected to ZooKeeper
   [junit4]   2> 753288 T2241 oascc.ZkStateReader.createClusterStateWatchersAndUpdate Updating cluster state from ZooKeeper... 
   [junit4]   2> 754293 T2241 oasc.ZkController.createEphemeralLiveNode Register node as live in ZooKeeper:/live_nodes/127.0.0.1:54076_
   [junit4]   2> 754294 T2241 oascc.SolrZkClient.makePath makePath: /live_nodes/127.0.0.1:54076_
   [junit4]   2> 754299 T2281 oascc.ZkStateReader$3.process Updating live nodes... (3)
   [junit4]   2> 754299 T2263 oascc.ZkStateReader$3.process Updating live nodes... (3)
   [junit4]   2> 754300 T2295 oascc.ZkStateReader$3.process Updating live nodes... (3)
   [junit4]   2> 754300 T2268 oascc.ZkStateReader$3.process Updating live nodes... (3)
   [junit4]   2> 754307 T2241 oasc.CorePropertiesLocator.discover Looking for core definitions underneath /mnt/ssd/jenkins/workspace/Lucene-Solr-4.x-Linux/solr/build/solr-core/test/J0/./org.apache.solr.cloud.CollectionsAPIDistributedZkTest-jetty2-1375500975518
   [junit4]   2> 754334 T2241 oasc.CorePropertiesLocator.discoverUnder Found core conf in /mnt/ssd/jenkins/workspace/Lucene-Solr-4.x-Linux/solr/build/solr-core/test/J0/./org.apache.solr.cloud.CollectionsAPIDistributedZkTest-jetty2-1375500975518/conf/
   [junit4]   2> 754335 T2241 oasc.CorePropertiesLocator.discover Found 1 core definitions
   [junit4]   2> 754335 T2241 oass.SolrDispatchFilter.init user.dir=/mnt/ssd/jenkins/workspace/Lucene-Solr-4.x-Linux/solr/build/solr-core/test/J0
   [junit4]   2> 754335 T2241 oass.SolrDispatchFilter.init SolrDispatchFilter.init() done
   [junit4]   2> 754336 T2241 oascsi.HttpClientUtil.createClient Creating new http client, config:maxConnections=128&maxConnectionsPerHost=32&followRedirects=false
   [junit4]   2> 754406 T2241 oejs.Server.doStart jetty-8.1.10.v20130312
   [junit4]   2> 754408 T2241 oejs.AbstractConnector.doStart Started SelectChannelConnector@127.0.0.1:38163
   [junit4]   2> 754408 T2241 oass.SolrDispatchFilter.init SolrDispatchFilter.init()
   [junit4]   2> 754409 T2241 oasc.SolrResourceLoader.locateSolrHome JNDI not configured for solr (NoInitialContextEx)
   [junit4]   2> 754409 T2241 oasc.SolrResourceLoader.locateSolrHome using system property solr.solr.home: /mnt/ssd/jenkins/workspace/Lucene-Solr-4.x-Linux/solr/build/solr-core/test/J0/./org.apache.solr.cloud.CollectionsAPIDistributedZkTest-jetty3-1375500976724
   [junit4]   2> 754410 T2241 oasc.SolrResourceLoader.<init> new SolrResourceLoader for directory: '/mnt/ssd/jenkins/workspace/Lucene-Solr-4.x-Linux/solr/build/solr-core/test/J0/./org.apache.solr.cloud.CollectionsAPIDistributedZkTest-jetty3-1375500976724/'
   [junit4]   2> 754420 T2241 oasc.ConfigSolr.fromFile Loading container configuration from /mnt/ssd/jenkins/workspace/Lucene-Solr-4.x-Linux/solr/build/solr-core/test/J0/./org.apache.solr.cloud.CollectionsAPIDistributedZkTest-jetty3-1375500976724/solr.xml
   [junit4]   2> 754453 T2241 oasc.ConfigSolrXml.<init> Config-defined core root directory: 
   [junit4]   2> 754453 T2241 oasc.CoreContainer.<init> New CoreContainer 27206436
   [junit4]   2> 754453 T2241 oasc.CoreContainer.load Loading cores into CoreContainer [instanceDir=/mnt/ssd/jenkins/workspace/Lucene-Solr-4.x-Linux/solr/build/solr-core/test/J0/./org.apache.solr.cloud.CollectionsAPIDistributedZkTest-jetty3-1375500976724/]
   [junit4]   2> 754455 T2241 oashc.HttpShardHandlerFactory.getParameter Setting socketTimeout to: 120000
   [junit4]   2> 754455 T2241 oashc.HttpShardHandlerFactory.getParameter Setting urlScheme to: http://
   [junit4]   2> 754455 T2241 oashc.HttpShardHandlerFactory.getParameter Setting connTimeout to: 15000
   [junit4]   2> 754456 T2241 oashc.HttpShardHandlerFactory.getParameter Setting maxConnectionsPerHost to: 20
   [junit4]   2> 754456 T2241 oashc.HttpShardHandlerFactory.getParameter Setting corePoolSize to: 0
   [junit4]   2> 754456 T2241 oashc.HttpShardHandlerFactory.getParameter Setting maximumPoolSize to: 2147483647
   [junit4]   2> 754457 T2241 oashc.HttpShardHandlerFactory.getParameter Setting maxThreadIdleTime to: 5
   [junit4]   2> 754457 T2241 oashc.HttpShardHandlerFactory.getParameter Setting sizeOfQueue to: -1
   [junit4]   2> 754457 T2241 oashc.HttpShardHandlerFactory.getParameter Setting fairnessPolicy to: false
   [junit4]   2> 754458 T2241 oascsi.HttpClientUtil.createClient Creating new http client, config:maxConnectionsPerHost=20&maxConnections=10000&socketTimeout=120000&connTimeout=15000&retry=false
   [junit4]   2> 754460 T2241 oasc.ZkContainer.initZooKeeper Zookeeper client=127.0.0.1:41165/solr
   [junit4]   2> 754461 T2241 oasc.ZkController.checkChrootPath zkHost includes chroot
   [junit4]   2> 754462 T2241 oascc.ConnectionManager.waitForConnected Waiting for client to connect to ZooKeeper
   [junit4]   2> 754463 T2307 oascc.ConnectionManager.process Watcher org.apache.solr.common.cloud.ConnectionManager@bc49bc name:ZooKeeperConnection Watcher:127.0.0.1:41165 got event WatchedEvent state:SyncConnected type:None path:null path:null type:None
   [junit4]   2> 754463 T2241 oascc.ConnectionManager.waitForConnected Client is connected to ZooKeeper
   [junit4]   2> 754465 T2241 oascsi.HttpClientUtil.createClient Creating new http client, config:maxConnections=500&maxConnectionsPerHost=16&socketTimeout=120000&connTimeout=15000
   [junit4]   2> 754468 T2241 oascc.ConnectionManager.waitForConnected Waiting for client to connect to ZooKeeper
   [junit4]   2> 754469 T2309 oascc.ConnectionManager.process Watcher org.apache.solr.common.cloud.ConnectionManager@17d7fd9 name:ZooKeeperConnection Watcher:127.0.0.1:41165/solr got event WatchedEvent state:SyncConnected type:None path:null path:null type:None
   [junit4]   2> 754469 T2241 oascc.ConnectionManager.waitForConnected Client is connected to ZooKeeper
   [junit4]   2> 754474 T2241 oascc.ZkStateReader.createClusterStateWatchersAndUpdate Updating cluster state from ZooKeeper... 
   [junit4]   2> 755479 T2241 oasc.ZkController.createEphemeralLiveNode Register node as live in ZooKeeper:/live_nodes/127.0.0.1:38163_
   [junit4]   2> 755480 T2241 oascc.SolrZkClient.makePath makePath: /live_nodes/127.0.0.1:38163_
   [junit4]   2> 755488 T2295 oascc.ZkStateReader$3.process Updating live nodes... (4)
   [junit4]   2> 755488 T2263 oascc.ZkStateReader$3.process Updating live nodes... (4)
   [junit4]   2> 755489 T2309 oascc.ZkStateReader$3.process Updating live nodes... (4)
   [junit4]   2> 755490 T2268 oascc.ZkStateReader$3.process Updating live nodes... (4)
   [junit4]   2> 755490 T2281 oascc.ZkStateReader$3.process Updating live nodes... (4)
   [junit4]   2> 755498 T2241 oasc.CorePropertiesLocator.discover Looking for core definitions underneath /mnt/ssd/jenkins/workspace/Lucene-Solr-4.x-Linux/solr/build/solr-core/test/J0/./org.apache.solr.cloud.CollectionsAPIDistributedZkTest-jetty3-1375500976724
   [junit4]   2> 755522 T2241 oasc.CorePropertiesLocator.discoverUnder Found core conf in /mnt/ssd/jenkins/workspace/Lucene-Solr-4.x-Linux/solr/build/solr-core/test/J0/./org.apache.solr.cloud.CollectionsAPIDistributedZkTest-jetty3-1375500976724/conf/
   [junit4]   2> 755523 T2241 oasc.CorePropertiesLocator.discover Found 1 core definitions
   [junit4]   2> 755523 T2241 oass.SolrDispatchFilter.init user.dir=/mnt/ssd/jenkins/workspace/Lucene-Solr-4.x-Linux/solr/build/solr-core/test/J0
   [junit4]   2> 755524 T2241 oass.SolrDispatchFilter.init SolrDispatchFilter.init() done
   [junit4]   2> 755524 T2241 oascsi.HttpClientUtil.createClient Creating new http client, config:maxConnections=128&maxConnectionsPerHost=32&followRedirects=false
   [junit4]   2> 755601 T2241 oejs.Server.doStart jetty-8.1.10.v20130312
   [junit4]   2> 755602 T2241 oejs.AbstractConnector.doStart Started SelectChannelConnector@127.0.0.1:37275
   [junit4]   2> 755603 T2241 oass.SolrDispatchFilter.init SolrDispatchFilter.init()
   [junit4]   2> 755604 T2241 oasc.SolrResourceLoader.locateSolrHome JNDI not configured for solr (NoInitialContextEx)
   [junit4]   2> 755604 T2241 oasc.SolrResourceLoader.locateSolrHome using system property solr.solr.home: /mnt/ssd/jenkins/workspace/Lucene-Solr-4.x-Linux/solr/build/solr-core/test/J0/./org.apache.solr.cloud.CollectionsAPIDistributedZkTest-jetty4-1375500977913
   [junit4]   2> 755604 T2241 oasc.SolrResourceLoader.<init> new SolrResourceLoader for directory: '/mnt/ssd/jenkins/workspace/Lucene-Solr-4.x-Linux/solr/build/solr-core/test/J0/./org.apache.solr.cloud.CollectionsAPIDistributedZkTest-jetty4-1375500977913/'
   [junit4]   2> 755615 T2241 oasc.ConfigSolr.fromFile Loading container configuration from /mnt/ssd/jenkins/workspace/Lucene-Solr-4.x-Linux/solr/build/solr-core/test/J0/./org.apache.solr.cloud.CollectionsAPIDistributedZkTest-jetty4-1375500977913/solr.xml
   [junit4]   2> 755647 T2241 oasc.ConfigSolrXml.<init> Config-defined core root directory: 
   [junit4]   2> 755647 T2241 oasc.CoreContainer.<init> New CoreContainer 16375865
   [junit4]   2> 755647 T2241 oasc.CoreContainer.load Loading cores into CoreContainer [instanceDir=/mnt/ssd/jenkins/workspace/Lucene-Solr-4.x-Linux/solr/build/solr-core/test/J0/./org.apache.solr.cloud.CollectionsAPIDistributedZkTest-jetty4-1375500977913/]
   [junit4]   2> 755649 T2241 oashc.HttpShardHandlerFactory.getParameter Setting socketTimeout to: 120000
   [junit4]   2> 755649 T2241 oashc.HttpShardHandlerFactory.getParameter Setting urlScheme to: http://
   [junit4]   2> 755649 T2241 oashc.HttpShardHandlerFactory.getParameter Setting connTimeout to: 15000
   [junit4]   2> 755649 T2241 oashc.HttpShardHandlerFactory.getParameter Setting maxConnectionsPerHost to: 20
   [junit4]   2> 755650 T2241 oashc.HttpShardHandlerFactory.getParameter Setting corePoolSize to: 0
   [junit4]   2> 755650 T2241 oashc.HttpShardHandlerFactory.getParameter Setting maximumPoolSize to: 2147483647
   [junit4]   2> 755650 T2241 oashc.HttpShardHandlerFactory.getParameter Setting maxThreadIdleTime to: 5
   [junit4]   2> 755651 T2241 oashc.HttpShardHandlerFactory.getParameter Setting sizeOfQueue to: -1
   [junit4]   2> 755651 T2241 oashc.HttpShardHandlerFactory.getParameter Setting fairnessPolicy to: false
   [junit4]   2> 755651 T2241 oascsi.HttpClientUtil.createClient Creating new http client, config:maxConnectionsPerHost=20&maxConnections=10000&socketTimeout=120000&connTimeout=15000&retry=false
   [junit4]   2> 755654 T2241 oasc.ZkContainer.initZooKeeper Zookeeper client=127.0.0.1:41165/solr
   [junit4]   2> 755655 T2241 oasc.ZkController.checkChrootPath zkHost includes chroot
   [junit4]   2> 755655 T2241 oascc.ConnectionManager.waitForConnected Waiting for client to connect to ZooKeeper
   [junit4]   2> 755657 T2321 oascc.ConnectionManager.process Watcher org.apache.solr.common.cloud.ConnectionManager@efc3d0 name:ZooKeeperConnection Watcher:127.0.0.1:41165 got event WatchedEvent state:SyncConnected type:None path:null path:null type:None
   [junit4]   2> 755657 T2241 oascc.ConnectionManager.waitForConnected Client is connected to ZooKeeper
   [junit4]   2> 755659 T2241 oascsi.HttpClientUtil.createClient Creating new http client, config:maxConnections=500&maxConnectionsPerHost=16&socketTimeout=120000&connTimeout=15000
   [junit4]   2> 755662 T2241 oascc.ConnectionManager.waitForConnected Waiting for client to connect to ZooKeeper
   [junit4]   2> 755663 T2323 oascc.ConnectionManager.process Watcher org.apache.solr.common.cloud.ConnectionManager@d44dc8 name:ZooKeeperConnection Watcher:127.0.0.1:41165/solr got event WatchedEvent state:SyncConnected type:None path:null path:null type:None
   [junit4]   2> 755663 T2241 oascc.ConnectionManager.waitForConnected Client is connected to ZooKeeper
   [junit4]   2> 755668 T2241 oascc.ZkStateReader.createClusterStateWatchersAndUpdate Updating cluster state from ZooKeeper... 
   [junit4]   2> 756672 T2241 oasc.ZkController.createEphemeralLiveNode Register node as live in ZooKeeper:/live_nodes/127.0.0.1:37275_
   [junit4]   2> 756675 T2241 oascc.SolrZkClient.makePath makePath: /live_nodes/127.0.0.1:37275_
   [junit4]   2> 756681 T2295 oascc.ZkStateReader$3.process Updating live nodes... (5)
   [junit4]   2> 756682 T2268 oascc.ZkStateReader$3.process Updating live nodes... (5)
   [junit4]   2> 756682 T2309 oascc.ZkStateReader$3.process Updating live nodes... (5)
   [junit4]   2> 756682 T2323 oascc.ZkStateReader$3.process Updating live nodes... (5)
   [junit4]   2> 756683 T2263 oascc.ZkStateReader$3.process Updating live nodes... (5)
   [junit4]   2> 756683 T2281 oascc.ZkStateReader$3.process Updating live nodes... (5)
   [junit4]   2> 756690 T2241 oasc.CorePropertiesLocator.discover Looking for core definitions underneath /mnt/ssd/jenkins/workspace/Lucene-Solr-4.x-Linux/solr/build/solr-core/test/J0/./org.apache.solr.cloud.CollectionsAPIDistributedZkTest-jetty4-1375500977913
   [junit4]   2> 756715 T2241 oasc.CorePropertiesLocator.discoverUnder Found core conf in /mnt/ssd/jenkins/workspace/Lucene-Solr-4.x-Linux/solr/build/solr-core/test/J0/./org.apache.solr.cloud.CollectionsAPIDistributedZkTest-jetty4-1375500977913/conf/
   [junit4]   2> 756716 T2241 oasc.CorePropertiesLocator.discover Found 1 core definitions
   [junit4]   2> 756717 T2241 oass.SolrDispatchFilter.init user.dir=/mnt/ssd/jenkins/workspace/Lucene-Solr-4.x-Linux/solr/build/solr-core/test/J0
   [junit4]   2> 756717 T2241 oass.SolrDispatchFilter.init SolrDispatchFilter.init() done
   [junit4]   2> 756717 T2241 oascsi.HttpClientUtil.createClient Creating new http client, config:maxConnections=128&maxConnectionsPerHost=32&followRedirects=false
   [junit4]   2> 756720 T2241 oascsi.HttpClientUtil.createClient Creating new http client, config:maxConnections=128&maxConnectionsPerHost=32&followRedirects=false
   [junit4]   2> 756723 T2275 oasha.CollectionsHandler.handleCreateAction Creating Collection : numShards=2&name=nodes_used_collection&replicationFactor=2&action=CREATE&wt=javabin&version=2
   [junit4]   2> 756724 T2263 oasc.DistributedQueue$LatchChildWatcher.process Watcher fired on path: /overseer/collection-queue-work state: SyncConnected type NodeChildrenChanged
   [junit4]   2> 756726 T2263 oasc.DistributedQueue$LatchChildWatcher.process Watcher fired on path: /overseer/collection-queue-work state: SyncConnected type NodeChildrenChanged
   [junit4]   2> 756727 T2265 oasc.OverseerCollectionProcessor.run Overseer Collection Processor: Get the message id:/overseer/collection-queue-work/qn-0000000000 message:{
   [junit4]   2> 	  "operation":"createcollection",
   [junit4]   2> 	  "numShards":"2",
   [junit4]   2> 	  "name":"nodes_used_collection",
   [junit4]   2> 	  "replicationFactor":"2"}
   [junit4]   2> 756727 T2265 oasc.OverseerCollectionProcessor.processMessage WARN OverseerCollectionProcessor.processMessage : createcollection , {
   [junit4]   2> 	  "operation":"createcollection",
   [junit4]   2> 	  "numShards":"2",
   [junit4]   2> 	  "name":"nodes_used_collection",
   [junit4]   2> 	  "replicationFactor":"2"}
   [junit4]   2> 757898 T2264 oascc.ZkStateReader.updateClusterState Updating cloud state from ZooKeeper... 
   [junit4]   2> 757899 T2264 oasc.Overseer$ClusterStateUpdater.buildCollection building a new collection: nodes_used_collection
   [junit4]   2> 757899 T2264 oasc.Overseer$ClusterStateUpdater.createCollection Create collection nodes_used_collection with shards [shard1, shard2]
   [junit4]   2> 757905 T2295 oascc.ZkStateReader$2.process A cluster state change: WatchedEvent state:SyncConnected type:NodeDataChanged path:/clusterstate.json, has occurred - updating... (live nodes size: 5)
   [junit4]   2> 757905 T2309 oascc.ZkStateReader$2.process A cluster state change: WatchedEvent state:SyncConnected type:NodeDataChanged path:/clusterstate.json, has occurred - updating... (live nodes size: 5)
   [junit4]   2> 757905 T2281 oascc.ZkStateReader$2.process A cluster state change: WatchedEvent state:SyncConnected type:NodeDataChanged path:/clusterstate.json, has occurred - updating... (live nodes size: 5)
   [junit4]   2> 757905 T2263 oascc.ZkStateReader$2.process A cluster state change: WatchedEvent state:SyncConnected type:NodeDataChanged path:/clusterstate.json, has occurred - updating... (live nodes size: 5)
   [junit4]   2> 757905 T2323 oascc.ZkStateReader$2.process A cluster state change: WatchedEvent state:SyncConnected type:NodeDataChanged path:/clusterstate.json, has occurred - updating... (live nodes size: 5)
   [junit4]   2> 757906 T2268 oascc.ZkStateReader$2.process A cluster state change: WatchedEvent state:SyncConnected type:NodeDataChanged path:/clusterstate.json, has occurred - updating... (live nodes size: 5)
   [junit4]   2> 757933 T2265 oasc.OverseerCollectionProcessor.createCollection going to create cores replicas shardNames [shard1, shard2] , repFactor : 2
   [junit4]   2> 757934 T2265 oasc.OverseerCollectionProcessor.createCollection Creating shard nodes_used_collection_shard1_replica1 as part of slice shard1 of collection nodes_used_collection on 127.0.0.1:45099_
   [junit4]   2> 757934 T2265 oasc.OverseerCollectionProcessor.createCollection Creating shard nodes_used_collection_shard1_replica2 as part of slice shard1 of collection nodes_used_collection on 127.0.0.1:37275_
   [junit4]   2> 757934 T2265 oasc.OverseerCollectionProcessor.createCollection Creating shard nodes_used_collection_shard2_replica1 as part of slice shard2 of collection nodes_used_collection on 127.0.0.1:54076_
   [junit4]   2> 757935 T2265 oasc.OverseerCollectionProcessor.createCollection Creating shard nodes_used_collection_shard2_replica2 as part of slice shard2 of collection nodes_used_collection on 127.0.0.1:38163_
   [junit4]   2> 757937 T2319 oasc.ZkController.publish publishing core=nodes_used_collection_shard1_replica2 state=down
   [junit4]   2> 757937 T2303 oasc.ZkController.publish publishing core=nodes_used_collection_shard2_replica2 state=down
   [junit4]   2> 757937 T2290 oasc.ZkController.publish publishing core=nodes_used_collection_shard2_replica1 state=down
   [junit4]   2> 757937 T2277 oasc.ZkController.publish publishing core=nodes_used_collection_shard1_replica1 state=down
   [junit4]   2> 757939 T2319 oasc.ZkController.waitForCoreNodeName look for our core node name
   [junit4]   2> 757940 T2277 oasc.ZkController.waitForCoreNodeName look for our core node name
   [junit4]   2> 757940 T2290 oasc.ZkController.waitForCoreNodeName look for our core node name
   [junit4]   2> 757940 T2303 oasc.ZkController.waitForCoreNodeName look for our core node name
   [junit4]   2> 759418 T2264 oascc.ZkStateReader.updateClusterState Updating cloud state from ZooKeeper... 
   [junit4]   2> 759419 T2264 oasc.Overseer$ClusterStateUpdater.updateState WARN Could not find collection node for nodes_used_collection, skipping publish state
   [junit4]   2> 759420 T2264 oasc.Overseer$ClusterStateUpdater.updateState Update state numShards=2 message={
   [junit4]   2> 	  "operation":"state",
   [junit4]   2> 	  "core_node_name":"core_node1",
   [junit4]   2> 	  "numShards":"2",
   [junit4]   2> 	  "shard":"shard1",
   [junit4]   2> 	  "roles":null,
   [junit4]   2> 	  "state":"down",
   [junit4]   2> 	  "shard_state":"active",
   [junit4]   2> 	  "core":"nodes_used_collection_shard1_replica2",
   [junit4]   2> 	  "collection":"nodes_used_collection",
   [junit4]   2> 	  "shard_range":null,
   [junit4]   2> 	  "node_name":"127.0.0.1:37275_",
   [junit4]   2> 	  "base_url":"http://127.0.0.1:37275"}
   [junit4]   2> 759425 T2264 oasc.Overseer$ClusterStateUpdater.updateState WARN Could not find collection node for nodes_used_collection, skipping publish state
   [junit4]   2> 759425 T2264 oasc.Overseer$ClusterStateUpdater.updateState Update state numShards=2 message={
   [junit4]   2> 	  "operation":"state",
   [junit4]   2> 	  "core_node_name":"core_node2",
   [junit4]   2> 	  "numShards":"2",
   [junit4]   2> 	  "shard":"shard2",
   [junit4]   2> 	  "roles":null,
   [junit4]   2> 	  "state":"down",
   [junit4]   2> 	  "shard_state":"active",
   [junit4]   2> 	  "core":"nodes_used_collection_shard2_replica2",
   [junit4]   2> 	  "collection":"nodes_used_collection",
   [junit4]   2> 	  "shard_range":null,
   [junit4]   2> 	  "node_name":"127.0.0.1:38163_",
   [junit4]   2> 	  "base_url":"http://127.0.0.1:38163"}
   [junit4]   2> 759430 T2264 oasc.Overseer$ClusterStateUpdater.updateState WARN Could not find collection node for nodes_used_collection, skipping publish state
   [junit4]   2> 759430 T2264 oasc.Overseer$ClusterStateUpdater.updateState Update state numShards=2 message={
   [junit4]   2> 	  "operation":"state",
   [junit4]   2> 	  "core_node_name":"core_node3",
   [junit4]   2> 	  "numShards":"2",
   [junit4]   2> 	  "shard":"shard2",
   [junit4]   2> 	  "roles":null,
   [junit4]   2> 	  "state":"down",
   [junit4]   2> 	  "shard_state":"active",
   [junit4]   2> 	  "core":"nodes_used_collection_shard2_replica1",
   [junit4]   2> 	  "collection":"nodes_used_collection",
   [junit4]   2> 	  "shard_range":null,
   [junit4]   2> 	  "node_name":"127.0.0.1:54076_",
   [junit4]   2> 	  "base_url":"http://127.0.0.1:54076"}
   [junit4]   2> 759436 T2264 oasc.Overseer$ClusterStateUpdater.updateState WARN Could not find collection node for nodes_used_collection, skipping publish state
   [junit4]   2> 759436 T2264 oasc.Overseer$ClusterStateUpdater.updateState Update state numShards=2 message={
   [junit4]   2> 	  "operation":"state",
   [junit4]   2> 	  "core_node_name":"core_node4",
   [junit4]   2> 	  "numShards":"2",
   [junit4]   2> 	  "shard":"shard1",
   [junit4]   2> 	  "roles":null,
   [junit4]   2> 	  "state":"down",
   [junit4]   2> 	  "shard_state":"active",
   [junit4]   2> 	  "core":"nodes_used_collection_shard1_replica1",
   [junit4]   2> 	  "collection":"nodes_used_collection",
   [junit4]   2> 	  "shard_range":null,
   [junit4]   2> 	  "node_name":"127.0.0.1:45099_",
   [junit4]   2> 	  "base_url":"http://127.0.0.1:45099"}
   [junit4]   2> 759440 T2295 oascc.ZkStateReader$2.process A cluster state change: WatchedEvent state:SyncConnected type:NodeDataChanged path:/clusterstate.json, has occurred - updating... (live nodes size: 5)
   [junit4]   2> 759440 T2268 oascc.ZkStateReader$2.process A cluster state change: WatchedEvent state:SyncConnected type:NodeDataChanged path:/clusterstate.json, has occurred - updating... (live nodes size: 5)
   [junit4]   2> 759441 T2263 oascc.ZkStateReader$2.process A cluster state change: WatchedEvent state:SyncConnected type:NodeDataChanged path:/clusterstate.json, has occurred - updating... (live nodes size: 5)
   [junit4]   2> 759441 T2281 oascc.ZkStateReader$2.process A cluster state change: WatchedEvent state:SyncConnected type:NodeDataChanged path:/clusterstate.json, has occurred - updating... (live nodes size: 5)
   [junit4]   2> 759441 T2309 oascc.ZkStateReader$2.process A cluster state change: WatchedEvent state:SyncConnected type:NodeDataChanged path:/clusterstate.json, has occurred - updating... (live nodes size: 5)
   [junit4]   2> 759441 T2323 oascc.ZkStateReader$2.process A cluster state change: WatchedEvent state:SyncConnected type:NodeDataChanged path:/clusterstate.json, has occurred - updating... (live nodes size: 5)
   [junit4]   2> 759940 T2277 oasc.ZkController.waitForShardId waiting to find shard id in clusterstate for nodes_used_collection_shard1_replica1
   [junit4]   2> 759941 T2290 oasc.ZkController.waitForShardId waiting to find shard id in clusterstate for nodes_used_collection_shard2_replica1
   [junit4]   2> 759942 T2319 oasc.ZkController.waitForShardId waiting to find shard id in clusterstate for nodes_used_collection_shard1_replica2
   [junit4]   2> 759943 T2290 oasc.CorePropertiesLocator.writePropertiesFile ERROR Couldn't persist core properties to /mnt/ssd/jenkins/workspace/Lucene-Solr-4.x-Linux/solr/build/solr-core/test/J0/./org.apache.solr.cloud.CollectionsAPIDistributedZkTest-jetty2-1375500975518/nodes_used_collection_shard2_replica1/core.properties: java.io.FileNotFoundException: /mnt/ssd/jenkins/workspace/Lucene-Solr-4.x-Linux/solr/build/solr-core/test/J0/./org.apache.solr.cloud.CollectionsAPIDistributedZkTest-jetty2-1375500975518/nodes_used_collection_shard2_replica1/core.properties (No such file or directory)
   [junit4]   2> 759942 T2277 oasc.CorePropertiesLocator.writePropertiesFile ERROR Couldn't persist core properties to /mnt/ssd/jenkins/workspace/Lucene-Solr-4.x-Linux/solr/build/solr-core/test/J0/./org.apache.solr.cloud.CollectionsAPIDistributedZkTest-jetty1-1375500974313/nodes_used_collection_shard1_replica1/core.properties: java.io.FileNotFoundException: /mnt/ssd/jenkins/workspace/Lucene-Solr-4.x-Linux/solr/build/solr-core/test/J0/./org.apache.solr.cloud.CollectionsAPIDistributedZkTest-jetty1-1375500974313/nodes_used_collection_shard1_replica1/core.properties (No such file or directory)
   [junit4]   2> 759942 T2303 oasc.ZkController.waitForShardId waiting to find shard id in clusterstate for nodes_used_collection_shard2_replica2
   [junit4]   2> 759944 T2277 oasc.CoreContainer.create Creating SolrCore 'nodes_used_collection_shard1_replica1' using instanceDir: /mnt/ssd/jenkins/workspace/Lucene-Solr-4.x-Linux/solr/build/solr-core/test/J0/./org.apache.solr.cloud.CollectionsAPIDistributedZkTest-jetty1-1375500974313/nodes_used_collection_shard1_replica1
   [junit4]   2> 759945 T2277 oasc.ZkController.createCollectionZkNode Check for collection zkNode:nodes_used_collection
   [junit4]   2> 759943 T2290 oasc.CoreContainer.create Creating SolrCore 'nodes_used_collection_shard2_replica1' using instanceDir: /mnt/ssd/jenkins/workspace/Lucene-Solr-4.x-Linux/solr/build/solr-core/test/J0/./org.apache.solr.cloud.CollectionsAPIDistributedZkTest-jetty2-1375500975518/nodes_used_collection_shard2_replica1
   [junit4]   2> 759946 T2290 oasc.ZkController.createCollectionZkNode Check for collection zkNode:nodes_used_collection
   [junit4]   2> 759943 T2319 oasc.CorePropertiesLocator.writePropertiesFile ERROR Couldn't persist core properties to /mnt/ssd/jenkins/workspace/Lucene-Solr-4.x-Linux/solr/build/solr-core/test/J0/./org.apache.solr.cloud.CollectionsAPIDistributedZkTest-jetty4-1375500977913/nodes_used_collection_shard1_replica2/core.properties: java.io.FileNotFoundException: /mnt/ssd/jenkins/workspace/Lucene-Solr-4.x-Linux/solr/build/solr-core/test/J0/./org.apache.solr.cloud.CollectionsAPIDistributedZkTest-jetty4-1375500977913/nodes_used_collection_shard1_replica2/core.properties (No such file or directory)
   [junit4]   2> 759947 T2277 oasc.ZkController.createCollectionZkNode Creating collection in ZooKeeper:nodes_used_collection
   [junit4]   2> 759948 T2290 oasc.ZkController.createCollectionZkNode Creating collection in ZooKeeper:nodes_used_collection
   [junit4]   2> 759945 T2303 oasc.CorePropertiesLocator.writePropertiesFile ERROR Couldn't persist core properties to /mnt/ssd/jenkins/workspace/Lucene-Solr-4.x-Linux/solr/build/solr-core/test/J0/./org.apache.solr.cloud.CollectionsAPIDistributedZkTest-jetty3-1375500976724/nodes_used_collection_shard2_replica2/core.properties: java.io.FileNotFoundException: /mnt/ssd/jenkins/workspace/Lucene-Solr-4.x-Linux/solr/build/solr-core/test/J0/./org.apache.solr.cloud.CollectionsAPIDistributedZkTest-jetty3-1375500976724/nodes_used_collection_shard2_replica2/core.properties (No such file or directory)
   [junit4]   2> 759949 T2290 oasc.ZkController.getConfName Looking for collection configName
   [junit4]   2> 759948 T2277 oasc.ZkController.getConfName Looking for collection configName
   [junit4]   2> 759947 T2319 oasc.CoreContainer.create Creating SolrCore 'nodes_used_collection_shard1_replica2' using instanceDir: /mnt/ssd/jenkins/workspace/Lucene-Solr-4.x-Linux/solr/build/solr-core/test/J0/./org.apache.solr.cloud.CollectionsAPIDistributedZkTest-jetty4-1375500977913/nodes_used_collection_shard1_replica2
   [junit4]   2> 759949 T2303 oasc.CoreContainer.create Creating SolrCore 'nodes_used_collection_shard2_replica2' using instanceDir: /mnt/ssd/jenkins/workspace/Lucene-Solr-4.x-Linux/solr/build/solr-core/test/J0/./org.apache.solr.cloud.CollectionsAPIDistributedZkTest-jetty3-1375500976724/nodes_used_collection_shard2_replica2
   [junit4]   2> 759951 T2303 oasc.ZkController.createCollectionZkNode Check for collection zkNode:nodes_used_collection
   [junit4]   2> 759950 T2319 oasc.ZkController.createCollectionZkNode Check for collection zkNode:nodes_used_collection
   [junit4]   2> 759952 T2290 oasc.ZkController.getConfName Only one config set found in zk - using it:conf1
   [junit4]   2> 759952 T2303 oasc.ZkController.createCollectionZkNode Creating collection in ZooKeeper:nodes_used_collection
   [junit4]   2> 759953 T2290 oascc.SolrZkClient.makePath makePath: /collections/nodes_used_collection
   [junit4]   2> 759953 T2319 oasc.ZkController.createCollectionZkNode Creating collection in ZooKeeper:nodes_used_collection
   [junit4]   2> 759953 T2303 oasc.ZkController.getConfName Looking for collection configName
   [junit4]   2> 759954 T2319 oasc.ZkController.getConfName Looking for collection configName
   [junit4]   2> 759954 T2277 oasc.ZkController.getConfName Only one config set found in zk - using it:conf1
   [junit4]   2> 759956 T2277 oascc.SolrZkClient.makePath makePath: /collections/nodes_used_collection
   [junit4]   2> 759960 T2303 oasc.ZkController.getConfName Only one config set found in zk - using it:conf1
   [junit4]   2> 759960 T2290 oasc.ZkController.readConfigName Load collection config from:/collections/nodes_used_collection
   [junit4]   2> 759960 T2303 oascc.SolrZkClient.makePath makePath: /collections/nodes_used_collection
   [junit4]   2> 759961 T2277 oasc.ZkController.readConfigName Load collection config from:/collections/nodes_used_collection
   [junit4]   2> 759961 T2319 oasc.ZkController.getConfName Only one config set found in zk - using it:conf1
   [junit4]   2> 759961 T2319 oascc.SolrZkClient.makePath makePath: /collections/nodes_used_collection
   [junit4]   2> 759963 T2290 oasc.SolrResourceLoader.<init> new SolrResourceLoader for directory: '/mnt/ssd/jenkins/workspace/Lucene-Solr-4.x-Linux/solr/build/solr-core/test/J0/./org.apache.solr.cloud.CollectionsAPIDistributedZkTest-jetty2-1375500975518/nodes_used_collection_shard2_replica1/'
   [junit4]   2> 759964 T2277 oasc.SolrResourceLoader.<init> new SolrResourceLoader for directory: '/mnt/ssd/jenkins/workspace/Lucene-Solr-4.x-Linux/solr/build/solr-core/test/J0/./org.apache.solr.cloud.CollectionsAPIDistributedZkTest-jetty1-1375500974313/nodes_used_collection_shard1_replica1/'
   [junit4]   2> 759966 T2303 oasc.ZkController.readConfigName Load collection config from:/collections/nodes_used_collection
   [junit4]   2> 759967 T2319 oasc.ZkController.readConfigName Load collection config from:/collections/nodes_used_collection
   [junit4]   2> 759968 T2303 oasc.SolrResourceLoader.<init> new SolrResourceLoader for directory: '/mnt/ssd/jenkins/workspace/Lucene-Solr-4.x-Linux/solr/build/solr-core/test/J0/./org.apache.solr.cloud.CollectionsAPIDistributedZkTest-jetty3-1375500976724/nodes_used_collection_shard2_replica2/'
   [junit4]   2> 759969 T2319 oasc.SolrResourceLoader.<init> new SolrResourceLoader for directory: '/mnt/ssd/jenkins/workspace/Lucene-Solr-4.x-Linux/solr/build/solr-core/test/J0/./org.apache.solr.cloud.CollectionsAPIDistributedZkTest-jetty4-1375500977913/nodes_used_collection_shard1_replica2/'
   [junit4]   2> 760004 T2290 oasc.SolrConfig.<init> Using Lucene MatchVersion: LUCENE_45
   [junit4]   2> 760019 T2277 oasc.SolrConfig.<init> Using Lucene MatchVersion: LUCENE_45
   [junit4]   2> 760022 T2319 oasc.SolrConfig.<init> Using Lucene MatchVersion: LUCENE_45
   [junit4]   2> 760026 T2303 oasc.SolrConfig.<init> Using Lucene MatchVersion: LUCENE_45
   [junit4]   2> 760042 T2290 oasc.SolrConfig.<init> Loaded SolrConfig: solrconfig.xml
   [junit4]   2> 760044 T2290 oass.IndexSchema.readSchema Reading Solr Schema from schema.xml
   [junit4]   2> 760051 T2290 oass.IndexSchema.readSchema [nodes_used_collection_shard2_replica1] Schema name=test
   [junit4]   2> 760062 T2277 oasc.SolrConfig.<init> Loaded SolrConfig: solrconfig.xml
   [junit4]   2> 760064 T2277 oass.IndexSchema.readSchema Reading Solr Schema from schema.xml
   [junit4]   2> 760071 T2277 oass.IndexSchema.readSchema [nodes_used_collection_shard1_replica1] Schema name=test
   [junit4]   2> 760080 T2319 oasc.SolrConfig.<init> Loaded SolrConfig: solrconfig.xml
   [junit4]   2> 760082 T2319 oass.IndexSchema.readSchema Reading Solr Schema from schema.xml
   [junit4]   2> 760083 T2303 oasc.SolrConfig.<init> Loaded SolrConfig: solrconfig.xml
   [junit4]   2> 760085 T2303 oass.IndexSchema.readSchema Reading Solr Schema from schema.xml
   [junit4]   2> 760091 T2319 oass.IndexSchema.readSchema [nodes_used_collection_shard1_replica2] Schema name=test
   [junit4]   2> 760101 T2303 oass.IndexSchema.readSchema [nodes_used_collection_shard2_replica2] Schema name=test
   [junit4]   2> 760504 T2277 oass.ByteField.init WARN ByteField is deprecated and will be removed in 5.0. You should use TrieIntField instead.
   [junit4]   2> 760504 T2277 oass.ShortField.init WARN ShortField is deprecated and will be removed in 5.0. You should use TrieIntField instead.
   [junit4]   2> 760505 T2277 oass.OpenExchangeRatesOrgProvider.init Initialized with rates=open-exchange-rates.json, refreshInterval=1440.
   [junit4]   2> 760514 T2277 oass.IndexSchema.readSchema default search field in schema is text
   [junit4]   2> 760519 T2277 oass.IndexSchema.readSchema unique key field: id
   [junit4]   2> 760543 T2277 oass.FileExchangeRateProvider.reload Reloading exchange rates from file currency.xml
   [junit4]   2> 760548 T2277 oass.FileExchangeRateProvider.reload Reloading exchange rates from file currency.xml
   [junit4]   2> 760554 T2277 oass.OpenExchangeRatesOrgProvider.reload Reloading exchange rates from open-exchange-rates.json
   [junit4]   2> 760556 T2277 oass.OpenExchangeRatesOrgProvider$OpenExchangeRates.<init> WARN Unknown key IMPORTANT NOTE
   [junit4]   2> 760556 T2277 oass.OpenExchangeRatesOrgProvider$OpenExchangeRates.<init> WARN Expected key, got STRING
   [junit4]   2> 760557 T2277 oass.OpenExchangeRatesOrgProvider.reload Reloading exchange rates from open-exchange-rates.json
   [junit4]   2> 760559 T2277 oass.OpenExchangeRatesOrgProvider$OpenExchangeRates.<init> WARN Unknown key IMPORTANT NOTE
   [junit4]   2> 760559 T2277 oass.OpenExchangeRatesOrgProvider$OpenExchangeRates.<init> WARN Expected key, got STRING
   [junit4]   2> 760559 T2290 oass.ByteField.init WARN ByteField is deprecated and will be removed in 5.0. You should use TrieIntField instead.
   [junit4]   2> 760560 T2277 oasc.SolrCore.initDirectoryFactory org.apache.solr.core.MockDirectoryFactory
   [junit4]   2> 760560 T2290 oass.ShortField.init WARN ShortField is deprecated and will be removed in 5.0. You should use TrieIntField instead.
   [junit4]   2> 760560 T2277 oasc.SolrCore.<init> [nodes_used_collection_shard1_replica1] Opening new SolrCore at /mnt/ssd/jenkins/workspace/Lucene-Solr-4.x-Linux/solr/build/solr-core/test/J0/./org.apache.solr.cloud.CollectionsAPIDistributedZkTest-jetty1-1375500974313/nodes_used_collection_shard1_replica1/, dataDir=/mnt/ssd/jenkins/workspace/Lucene-Solr-4.x-Linux/solr/build/solr-core/test/J0/./org.apache.solr.cloud.CollectionsAPIDistributedZkTest-jetty1-1375500974313//nodes_used_collection_shard1_replica1/data/
   [junit4]   2> 760561 T2290 oass.OpenExchangeRatesOrgProvider.init Initialized with rates=open-exchange-rates.json, refreshInterval=1440.
   [junit4]   2> 760561 T2277 oasc.JmxMonitoredMap.<init> JMX monitoring is enabled. Adding Solr mbeans to JMX Server: com.sun.jmx.mbeanserver.JmxMBeanServer@1aa5882
   [junit4]   2> 760562 T2277 oasc.CachingDirectoryFactory.get return new directory for /mnt/ssd/jenkins/workspace/Lucene-Solr-4.x-Linux/solr/build/solr-core/test/J0/./org.apache.solr.cloud.CollectionsAPIDistributedZkTest-jetty1-1375500974313//nodes_used_collection_shard1_replica1/data
   [junit4]   2> 760563 T2277 oasc.SolrCore.getNewIndexDir New index directory detected: old=null new=/mnt/ssd/jenkins/workspace/Lucene-Solr-4.x-Linux/solr/build/solr-core/test/J0/./org.apache.solr.cloud.CollectionsAPIDistributedZkTest-jetty1-1375500974313//nodes_used_collection_shard1_replica1/data/index/
   [junit4]   2> 760563 T2277 oasc.SolrCore.initIndex WARN [nodes_used_collection_shard1_replica1] Solr index directory '/mnt/ssd/jenkins/workspace/Lucene-Solr-4.x-Linux/solr/build/solr-core/test/J0/./org.apache.solr.cloud.CollectionsAPIDistributedZkTest-jetty1-1375500974313/nodes_used_collection_shard1_replica1/data/index' doesn't exist. Creating new index...
   [junit4]   2> 760564 T2277 oasc.CachingDirectoryFactory.get return new directory for /mnt/ssd/jenkins/workspace/Lucene-Solr-4.x-Linux/solr/build/solr-core/test/J0/./org.apache.solr.cloud.CollectionsAPIDistributedZkTest-jetty1-1375500974313//nodes_used_collection_shard1_replica1/data/index
   [junit4]   2> 760566 T2277 oasc.SolrDeletionPolicy.onCommit SolrDeletionPolicy.onCommit: commits: num=1
   [junit4]   2> 		commit{dir=MockDirWrapper(org.apache.lucene.store.RAMDirectory@1beb8c8 lockFactory=org.apache.lucene.store.NativeFSLockFactory@1766392),segFN=segments_1,generation=1}
   [junit4]   2> 760566 T2277 oasc.SolrDeletionPolicy.updateCommits newest commit generation = 1
   [junit4]   2> 760567 T2290 oass.IndexSchema.readSchema default search field in schema is text
   [junit4]   2> 760570 T2290 oass.IndexSchema.readSchema unique key field: id
   [junit4]   2> 760571 T2277 oasup.UpdateRequestProcessorChain.init inserting DistributedUpdateProcessorFactory into updateRequestProcessorChain "dedupe"
   [junit4]   2> 760571 T2277 oasup.UpdateRequestProcessorChain.init inserting DistributedUpdateProcessorFactory into updateRequestProcessorChain "stored_sig"
   [junit4]   2> 760572 T2277 oasup.UpdateRequestProcessorChain.init inserting DistributedUpdateProcessorFactory into updateRequestProcessorChain "distrib-dup-test-chain-implicit"
   [junit4]   2> 760573 T2277 oasc.RequestHandlers.initHandlersFromConfig created standard: solr.StandardRequestHandler
   [junit4]   2> 760573 T2277 oasc.RequestHandlers.initHandlersFromConfig created /get: solr.RealTimeGetHandler
   [junit4]   2> 760574 T2277 oasc.RequestHandlers.initHandlersFromConfig adding lazy requestHandler: solr.ReplicationHandler
   [junit4]   2> 760574 T2277 oasc.RequestHandlers.initHandlersFromConfig created /replication: solr.ReplicationHandler
   [junit4]   2> 760575 T2277 oasc.RequestHandlers.initHandlersFromConfig created /update: solr.UpdateRequestHandler
   [junit4]   2> 760575 T2277 oasc.RequestHandlers.initHandlersFromConfig created /admin/: org.apache.solr.handler.admin.AdminHandlers
   [junit4]   2> 760578 T2277 oashl.XMLLoader.init xsltCacheLifetimeSeconds=60
   [junit4]   2> 760581 T2277 oass.SolrIndexSearcher.<init> Opening Searcher@b3842 main
   [junit4]   2> 760582 T2277 oasu.CommitTracker.<init> Hard AutoCommit: disabled
   [junit4]   2> 760582 T2277 oasu.CommitTracker.<init> Soft AutoCommit: disabled
   [junit4]   2> 760586 T2290 oass.FileExchangeRateProvider.reload Reloading exchange rates from file currency.xml
   [junit4]   2> 760586 T2329 oasc.SolrCore.registerSearcher [nodes_used_collection_shard1_replica1] Registered new searcher Searcher@b3842 main{StandardDirectoryReader(segments_1:1)}
   [junit4]   2> 760589 T2277 oasc.CoreContainer.registerCore registering core: nodes_used_collection_shard1_replica1
   [junit4]   2> 760589 T2277 oasc.ZkController.register Register replica - core:nodes_used_collection_shard1_replica1 address:http://127.0.0.1:45099 collection:nodes_used_collection shard:shard1
   [junit4]   2> 760590 T2277 oascsi.HttpClientUtil.createClient Creating new http client, config:maxConnections=10000&maxConnectionsPerHost=20&connTimeout=15000&socketTimeout=30000&retry=false
   [junit4]   2> 760591 T2290 oass.FileExchangeRateProvider.reload Reloading exchange rates from file currency.xml
   [junit4]   2> 760594 T2290 oass.OpenExchangeRatesOrgProvider.reload Reloading exchange rates from open-exchange-rates.json
   [junit4]   2> 760596 T2277 oascc.SolrZkClient.makePath makePath: /collections/nodes_used_collection/leader_elect/shard1/election
   [junit4]   2> 760597 T2290 oass.OpenExchangeRatesOrgProvider$OpenExchangeRates.<init> WARN Unknown key IMPORTANT NOTE
   [junit4]   2> 760597 T2290 oass.OpenExchangeRatesOrgProvider$OpenExchangeRates.<init> WARN Expected key, got STRING
   [junit4]   2> 760597 T2290 oass.OpenExchangeRatesOrgProvider.reload Reloading exchange rates from open-exchange-rates.json
   [junit4]   2> 760600 T2290 oass.OpenExchangeRatesOrgProvider$OpenExchangeRates.<init> WARN Unknown key IMPORTANT NOTE
   [junit4]   2> 760600 T2290 oass.OpenExchangeRatesOrgProvider$OpenExchangeRates.<init> WARN Expected key, got STRING
   [junit4]   2> 760601 T2290 oasc.SolrCore.initDirectoryFactory org.apache.solr.core.MockDirectoryFactory
   [junit4]   2> 760601 T2290 oasc.SolrCore.<init> [nodes_used_collection_shard2_replica1] Opening new SolrCore at /mnt/ssd/jenkins/workspace/Lucene-Solr-4.x-Linux/solr/build/solr-core/test/J0/./org.apache.solr.cloud.CollectionsAPIDistributedZkTest-jetty2-1375500975518/nodes_used_collection_shard2_replica1/, dataDir=/mnt/ssd/jenkins/workspace/Lucene-Solr-4.x-Linux/solr/build/solr-core/test/J0/./org.apache.solr.cloud.CollectionsAPIDistributedZkTest-jetty2-1375500975518//nodes_used_collection_shard2_replica1/data/
   [junit4]   2> 760601 T2290 oasc.JmxMonitoredMap.<init> JMX monitoring is enabled. Adding Solr mbeans to JMX Server: com.sun.jmx.mbeanserver.JmxMBeanServer@1aa5882
   [junit4]   2> 760602 T2290 oasc.CachingDirectoryFactory.get return new directory for /mnt/ssd/jenkins/workspace/Lucene-Solr-4.x-Linux/solr/build/solr-core/test/J0/./org.apache.solr.cloud.CollectionsAPIDistributedZkTest-jetty2-1375500975518//nodes_used_collection_shard2_replica1/data
   [junit4]   2> 760603 T2290 oasc.SolrCore.getNewIndexDir New index directory detected: old=null new=/mnt/ssd/jenkins/workspace/Lucene-Solr-4.x-Linux/solr/build/solr-core/test/J0/./org.apache.solr.cloud.CollectionsAPIDistributedZkTest-jetty2-1375500975518//nodes_used_collection_shard2_replica1/data/index/
   [junit4]   2> 760603 T2290 oasc.SolrCore.initIndex WARN [nodes_used_collection_shard2_replica1] Solr index directory '/mnt/ssd/jenkins/workspace/Lucene-Solr-4.x-Linux/solr/build/solr-core/test/J0/./org.apache.solr.cloud.CollectionsAPIDistributedZkTest-jetty2-1375500975518/nodes_used_collection_shard2_replica1/data/index' doesn't exist. Creating new index...
   [junit4]   2> 760604 T2290 oasc.CachingDirectoryFactory.get return new directory for /mnt/ssd/jenkins/workspace/Lucene-Solr-4.x-Linux/solr/build/solr-core/test/J0/./org.apache.solr.cloud.CollectionsAPIDistributedZkTest-jetty2-1375500975518//nodes_used_collection_shard2_replica1/data/index
   [junit4]   2> 760606 T2290 oasc.SolrDeletionPolicy.onCommit SolrDeletionPolicy.onCommit: commits: num=1
   [junit4]   2> 		commit{dir=MockDirWrapper(org.apache.lucene.store.RAMDirectory@78f638 lockFactory=org.apache.lucene.store.NativeFSLockFactory@2cf608),segFN=segments_1,generation=1}
   [junit4]   2> 760606 T2290 oasc.SolrDeletionPolicy.updateCommits newest commit generation = 1
   [junit4]   2> 760610 T2290 oasup.UpdateRequestProcessorChain.init inserting DistributedUpdateProcessorFactory into updateRequestProcessorChain "dedupe"
   [junit4]   2> 760611 T2290 oasup.UpdateRequestProcessorChain.init inserting DistributedUpdateProcessorFactory into updateRequestProcessorChain "stored_sig"
   [junit4]   2> 760612 T2277 oasc.ShardLeaderElectionContext.runLeaderProcess Running the leader process for shard shard1
   [junit4]   2> 760612 T2290 oasup.UpdateRequestProcessorChain.init inserting DistributedUpdateProcessorFactory into updateRequestProcessorChain "distrib-dup-test-chain-implicit"
   [junit4]   2> 760613 T2290 oasc.RequestHandlers.initHandlersFromConfig created standard: solr.StandardRequestHandler
   [junit4]   2> 760613 T2290 oasc.RequestHandlers.initHandlersFromConfig created /get: solr.RealTimeGetHandler
   [junit4]   2> 760614 T2290 oasc.RequestHandlers.initHandlersFromConfig adding lazy requestHandler: solr.ReplicationHandler
   [junit4]   2> 760614 T2290 oasc.RequestHandlers.initHandlersFromConfig created /replication: solr.ReplicationHandler
   [junit4]   2> 760615 T2290 oasc.RequestHandlers.initHandlersFromConfig created /update: solr.UpdateRequestHandler
   [junit4]   2> 760615 T2277 oasc.ShardLeaderElectionContext.waitForReplicasToComeUp Waiting until we see more replicas up for shard shard1: total=2 found=1 timeoutin=180000
   [junit4]   2> 760615 T2290 oasc.RequestHandlers.initHandlersFromConfig created /admin/: org.apache.solr.handler.admin.AdminHandlers
   [junit4]   2> 760618 T2290 oashl.XMLLoader.init xsltCacheLifetimeSeconds=60
   [junit4]   2> 760619 T2290 oass.SolrIndexSearcher.<init> Opening Searcher@1fcd95 main
   [junit4]   2> 760620 T2290 oasu.CommitTracker.<init> Hard AutoCommit: disabled
   [junit4]   2> 760620 T2290 oasu.CommitTracker.<init> Soft AutoCommit: disabled
   [junit4]   2> 760624 T2330 oasc.SolrCore.registerSearcher [nodes_used_collection_shard2_replica1] Registered new searcher Searcher@1fcd95 main{StandardDirectoryReader(segments_1:1)}
   [junit4]   2> 760626 T2290 oasc.CoreContainer.registerCore registering core: nodes_used_collection_shard2_replica1
   [junit4]   2> 760627 T2290 oasc.ZkController.register Register replica - core:nodes_used_collection_shard2_replica1 address:http://127.0.0.1:54076 collection:nodes_used_collection shard:shard2
   [junit4]   2> 760627 T2290 oascsi.HttpClientUtil.createClient Creating new http client, config:maxConnections=10000&maxConnectionsPerHost=20&connTimeout=15000&socketTimeout=30000&retry=false
   [junit4]   2> 760632 T2290 oascc.SolrZkClient.makePath makePath: /collections/nodes_used_collection/leader_elect/shard2/election
   [junit4]   2> 760632 T2319 oass.ByteField.init WARN ByteField is deprecated and will be removed in 5.0. You should use TrieIntField instead.
   [junit4]   2> 760633 T2319 oass.ShortField.init WARN ShortField is deprecated and will be removed in 5.0. You should use TrieIntField instead.
   [junit4]   2> 760634 T2319 oass.OpenExchangeRatesOrgProvider.init Initialized with rates=open-exchange-rates.json, refreshInterval=1440.
   [junit4]   2> 760644 T2319 oass.IndexSchema.readSchema default search field in schema is text
   [junit4]   2> 760647 T2303 oass.ByteField.init WARN ByteField is deprecated and will be removed in 5.0. You should use TrieIntField instead.
   [junit4]   2> 760647 T2290 oasc.ShardLeaderElectionContext.runLeaderProcess Running the leader process for shard shard2
   [junit4]   2> 760647 T2319 oass.IndexSchema.readSchema unique key field: id
   [junit4]   2> 760647 T2303 oass.ShortField.init WARN ShortField is deprecated and will be removed in 5.0. You should use TrieIntField instead.
   [junit4]   2> 760649 T2303 oass.OpenExchangeRatesOrgProvider.init Initialized with rates=open-exchange-rates.json, refreshInterval=1440.
   [junit4]   2> 760652 T2290 oasc.ShardLeaderElectionContext.waitForReplicasToComeUp Waiting until we see more replicas up for shard shard2: total=2 found=1 timeoutin=179999
   [junit4]   2> 760654 T2303 oass.IndexSchema.readSchema default search field in schema is text
   [junit4]   2> 760657 T2303 oass.IndexSchema.readSchema unique key field: id
   [junit4]   2> 760667 T2319 oass.FileExchangeRateProvider.reload Reloading exchange rates from file currency.xml
   [junit4]   2> 760673 T2319 oass.FileExchangeRateProvider.reload Reloading exchange rates from file currency.xml
   [junit4]   2> 760677 T2303 oass.FileExchangeRateProvider.reload Reloading exchange rates from file currency.xml
   [junit4]   2> 760677 T2319 oass.OpenExchangeRatesOrgProvider.reload Reloading exchange rates from open-exchange-rates.json
   [junit4]   2> 760679 T2319 oass.OpenExchangeRatesOrgProvider$OpenExchangeRates.<init> WARN Unknown key IMPORTANT NOTE
   [junit4]   2> 760680 T2319 oass.OpenExchangeRatesOrgProvider$OpenExchangeRates.<init> WARN Expected key, got STRING
   [junit4]   2> 760680 T2319 oass.OpenExchangeRatesOrgProvider.reload Reloading exchange rates from open-exchange-rates.json
   [junit4]   2> 760681 T2303 oass.FileExchangeRateProvider.reload Reloading exchange rates from file currency.xml
   [junit4]   2> 760681 T2319 oass.OpenExchangeRatesOrgProvider$OpenExchangeRates.<init> WARN Unknown key IMPORTANT NOTE
   [junit4]   2> 760681 T2319 oass.OpenExchangeRatesOrgProvider$OpenExchangeRates.<init> WARN Expected key, got STRING
   [junit4]   2> 760682 T2319 oasc.SolrCore.initDirectoryFactory org.apache.solr.core.MockDirectoryFactory
   [junit4]   2> 760682 T2319 oasc.SolrCore.<init> [nodes_used_collection_shard1_replica2] Opening new SolrCore at /mnt/ssd/jenkins/workspace/Lucene-Solr-4.x-Linux/solr/build/solr-core/test/J0/./org.apache.solr.cloud.CollectionsAPIDistributedZkTest-jetty4-1375500977913/nodes_used_collection_shard1_replica2/, dataDir=/mnt/ssd/jenkins/workspace/Lucene-Solr-4.x-Linux/solr/build/solr-core/test/J0/./org.apache.solr.cloud.CollectionsAPIDistributedZkTest-jetty4-1375500977913//nodes_used_collection_shard1_replica2/data/
   [junit4]   2> 760682 T2319 oasc.JmxMonitoredMap.<init> JMX monitoring is enabled. Adding Solr mbeans to JMX Server: com.sun.jmx.mbeanserver.JmxMBeanServer@1aa5882
   [junit4]   2> 760683 T2319 oasc.CachingDirectoryFactory.get return new directory for /mnt/ssd/jenkins/workspace/Lucene-Solr-4.x-Linux/solr/build/solr-core/test/J0/./org.apache.solr.cloud.CollectionsAPIDistributedZkTest-jetty4-1375500977913//nodes_used_collection_shard1_replica2/data
   [junit4]   2> 760684 T2319 oasc.SolrCore.getNewIndexDir New index directory detected: old=null new=/mnt/ssd/jenkins/workspace/Lucene-Solr-4.x-Linux/solr/build/solr-core/test/J0/./org.apache.solr.cloud.CollectionsAPIDistributedZkTest-jetty4-1375500977913//nodes_used_collection_shard1_replica2/data/index/
   [junit4]   2> 760684 T2319 oasc.SolrCore.initIndex WARN [nodes_used_collection_shard1_replica2] Solr index directory '/mnt/ssd/jenkins/workspace/Lucene-Solr-4.x-Linux/solr/build/solr-core/test/J0/./org.apache.solr.cloud.CollectionsAPIDistributedZkTest-jetty4-1375500977913/nodes_used_collection_shard1_replica2/data/index' doesn't exist. Creating new index...
   [junit4]   2> 760684 T2319 oasc.CachingDirectoryFactory.get return new directory for /mnt/ssd/jenkins/workspace/Lucene-Solr-4.x-Linux/solr/build/solr-core/test/J0/./org.apache.solr.cloud.CollectionsAPIDistributedZkTest-jetty4-1375500977913//nodes_used_collection_shard1_replica2/data/index
   [junit4]   2> 760684 T2303 oass.OpenExchangeRatesOrgProvider.reload Reloading exchange rates from open-exchange-rates.json
   [junit4]   2> 760686 T2319 oasc.SolrDeletionPolicy.onCommit SolrDeletionPolicy.onCommit: commits: num=1
   [junit4]   2> 		commit{dir=MockDirWrapper(org.apache.lucene.store.RAMDirectory@e83791 lockFactory=org.apache.lucene.store.NativeFSLockFactory@11df6a6),segFN=segments_1,generation=1}
   [junit4]   2> 760686 T2319 oasc.SolrDeletionPolicy.updateCommits newest commit generation = 1
   [junit4]   2> 760686 T2303 oass.OpenExchangeRatesOrgProvider$OpenExchangeRates.<init> WARN Unknown key IMPORTANT NOTE
   [junit4]   2> 760687 T2303 oass.OpenExchangeRatesOrgProvider$OpenExchangeRates.<init> WARN Expected key, got STRING
   [junit4]   2> 760687 T2303 oass.OpenExchangeRatesOrgProvider.reload Reloading exchange rates from open-exchange-rates.json
   [junit4]   2> 760688 T2303 oass.OpenExchangeRatesOrgProvider$OpenExchangeRates.<init> WARN Unknown key IMPORTANT NOTE
   [junit4]   2> 760689 T2303 oass.OpenExchangeRatesOrgProvider$OpenExchangeRates.<init> WARN Expected key, got STRING
   [junit4]   2> 760689 T2319 oasup.UpdateRequestProcessorChain.init inserting DistributedUpdateProcessorFactory into updateRequestProcessorChain "dedupe"
   [junit4]   2> 760689 T2303 oasc.SolrCore.initDirectoryFactory org.apache.solr.core.MockDirectoryFactory
   [junit4]   2> 760689 T2319 oasup.UpdateRequestProcessorChain.init inserting DistributedUpdateProcessorFactory into updateRequestProcessorChain "stored_sig"
   [junit4]   2> 760690 T2303 oasc.SolrCore.<init> [nodes_used_collection_shard2_replica2] Opening new SolrCore at /mnt/ssd/jenkins/workspace/Lucene-Solr-4.x-Linux/solr/build/solr-core/test/J0/./org.apache.solr.cloud.CollectionsAPIDistributedZkTest-jetty3-1375500976724/nodes_used_collection_shard2_replica2/, dataDir=/mnt/ssd/jenkins/workspace/Lucene-Solr-4.x-Linux/solr/build/solr-core/test/J0/./org.apache.solr.cloud.CollectionsAPIDistributedZkTest-jetty3-1375500976724//nodes_used_collection_shard2_replica2/data/
   [junit4]   2> 760690 T2319 oasup.UpdateRequestProcessorChain.init inserting DistributedUpdateProcessorFactory into updateRequestProcessorChain "distrib-dup-test-chain-implicit"
   [junit4]   2> 760690 T2303 oasc.JmxMonitoredMap.<init> JMX monitoring is enabled. Adding Solr mbeans to JMX Server: com.sun.jmx.mbeanserver.JmxMBeanServer@1aa5882
   [junit4]   2> 760691 T2319 oasc.RequestHandlers.initHandlersFromConfig created standard: solr.StandardRequestHandler
   [junit4]   2> 760691 T2319 oasc.RequestHandlers.initHandlersFromConfig created /get: solr.RealTimeGetHandler
   [junit4]   2> 760692 T2303 oasc.CachingDirectoryFactory.get return new directory for /mnt/ssd/jenkins/workspace/Lucene-Solr-4.x-Linux/solr/build/solr-core/test/J0/./org.apache.solr.cloud.CollectionsAPIDistributedZkTest-jetty3-1375500976724//nodes_used_collection_shard2_replica2/data
   [junit4]   2> 760692 T2319 oasc.RequestHandlers.initHandlersFromConfig adding lazy requestHandler: solr.ReplicationHandler
   [junit4]   2> 760692 T2303 oasc.SolrCore.getNewIndexDir New index directory detected: old=null new=/mnt/ssd/jenkins/workspace/Lucene-Solr-4.x-Linux/solr/build/solr-core/test/J0/./org.apache.solr.cloud.CollectionsAPIDistributedZkTest-jetty3-1375500976724//nodes_used_collection_shard2_replica2/data/index/
   [junit4]   2> 760692 T2319 oasc.RequestHandlers.initHandlersFromConfig created /replication: solr.ReplicationHandler
   [junit4]   2> 760693 T2303 oasc.SolrCore.initIndex WARN [nodes_used_collection_shard2_replica2] Solr index directory '/mnt/ssd/jenkins/workspace/Lucene-Solr-4.x-Linux/solr/build/solr-core/test/J0/./org.apache.solr.cloud.CollectionsAPIDistributedZkTest-jetty3-1375500976724/nodes_used_collection_shard2_replica2/data/index' doesn't exist. Creating new index...
   [junit4]   2> 760693 T2319 oasc.RequestHandlers.initHandlersFromConfig created /update: solr.UpdateRequestHandler
   [junit4]   2> 760694 T2303 oasc.CachingDirectoryFactory.get return new directory for /mnt/ssd/jenkins/workspace/Lucene-Solr-4.x-Linux/solr/build/solr-core/test/J0/./org.apache.solr.cloud.CollectionsAPIDistributedZkTest-jetty3-1375500976724//nodes_used_collection_shard2_replica2/data/index
   [junit4]   2> 760694 T2319 oasc.RequestHandlers.initHandlersFromConfig created /admin/: org.apache.solr.handler.admin.AdminHandlers
   [junit4]   2> 760697 T2303 oasc.SolrDeletionPolicy.onCommit SolrDeletionPolicy.onCommit: commits: num=1
   [junit4]   2> 		commit{dir=MockDirWrapper(org.apache.lucene.store.RAMDirectory@bc1165 lockFactory=org.apache.lucene.store.NativeFSLockFactory@1c0280e),segFN=segments_1,generation=1}
   [junit4]   2> 760697 T2303 oasc.SolrDeletionPolicy.updateCommits newest commit generation = 1
   [junit4]   2> 760697 T2319 oashl.XMLLoader.init xsltCacheLifetimeSeconds=60
   [junit4]   2> 760700 T2319 oass.SolrIndexSearcher.<init> Opening Searcher@1f6cae6 main
   [junit4]   2> 760701 T2319 oasu.CommitTracker.<init> Hard AutoCommit: disabled
   [junit4]   2> 760701 T2319 oasu.CommitTracker.<init> Soft AutoCommit: disabled
   [junit4]   2> 760702 T2303 oasup.UpdateRequestProcessorChain.init inserting DistributedUpdateProcessorFactory into updateRequestProcessorChain "dedupe"
   [junit4]   2> 760702 T2303 oasup.UpdateRequestProcessorChain.init inserting DistributedUpdateProcessorFactory into updateRequestProcessorChain "stored_sig"
   [junit4]   2> 760703 T2303 oasup.UpdateRequestProcessorChain.init inserting DistributedUpdateProcessorFactory into updateRequestProcessorChain "distrib-dup-test-chain-implicit"
   [junit4]   2> 760704 T2303 oasc.RequestHandlers.initHandlersFromConfig created standard: solr.StandardRequestHandler
   [junit4]   2> 760705 T2303 oasc.RequestHandlers.initHandlersFromConfig created /get: solr.RealTimeGetHandler
   [junit4]   2> 760705 T2331 oasc.SolrCore.registerSearcher [nodes_used_collection_shard1_replica2] Registered new searcher Searcher@1f6cae6 main{StandardDirectoryReader(segments_1:1)}
   [junit4]   2> 760705 T2303 oasc.RequestHandlers.initHandlersFromConfig adding lazy requestHandler: solr.ReplicationHandler
   [junit4]   2> 760706 T2303 oasc.RequestHandlers.initHandlersFromConfig created /replication: solr.ReplicationHandler
   [junit4]   2> 760706 T2303 oasc.RequestHandlers.initHandlersFromConfig created /update: solr.UpdateRequestHandler
   [junit4]   2> 760706 T2319 oasc.CoreContainer.registerCore registering core: nodes_used_collection_shard1_replica2
   [junit4]   2> 760707 T2303 oasc.RequestHandlers.initHandlersFromConfig created /admin/: org.apache.solr.handler.admin.AdminHandlers
   [junit4]   2> 760707 T2319 oasc.ZkController.register Register replica - core:nodes_used_collection_shard1_replica2 address:http://127.0.0.1:37275 collection:nodes_used_collection shard:shard1
   [junit4]   2> 760708 T2319 oascsi.HttpClientUtil.createClient Creating new http client, config:maxConnections=10000&maxConnectionsPerHost=20&connTimeout=15000&socketTimeout=30000&retry=false
   [junit4]   2> 760710 T2303 oashl.XMLLoader.init xsltCacheLifetimeSeconds=60
   [junit4]   2> 760713 T2303 oass.SolrIndexSearcher.<init> Opening Searcher@17253aa main
   [junit4]   2> 760714 T2303 oasu.CommitTracker.<init> Hard AutoCommit: disabled
   [junit4]   2> 760715 T2303 oasu.CommitTracker.<init> Soft AutoCommit: disabled
   [junit4]   2> 760719 T2332 oasc.SolrCore.registerSearcher [nodes_used_collection_shard2_replica2] Registered new searcher Searcher@17253aa main{StandardDirectoryReader(segments_1:1)}
   [junit4]   2> 760721 T2303 oasc.CoreContainer.registerCore registering core: nodes_used_collection_shard2_replica2
   [junit4]   2> 760721 T2303 oasc.ZkController.register Register replica - core:nodes_used_collection_shard2_replica2 address:http://127.0.0.1:38163 collection:nodes_used_collection shard:shard2
   [junit4]   2> 760721 T2303 oascsi.HttpClientUtil.createClient Creating new http client, config:maxConnections=10000&maxConnectionsPerHost=20&connTimeout=15000&socketTimeout=30000&retry=false
   [junit4]   2> 760957 T2264 oascc.ZkStateReader.updateClusterState Updating cloud state from ZooKeeper... 
   [junit4]   2> 760967 T2295 oascc.ZkStateReader$2.process A cluster state change: WatchedEvent state:SyncConnected type:NodeDataChanged path:/clusterstate.json, has occurred - updating... (live nodes size: 5)
   [junit4]   2> 760967 T2281 oascc.ZkStateReader$2.process A cluster state change: WatchedEvent state:SyncConnected type:NodeDataChanged path:/clusterstate.json, has occurred - updating... (live nodes size: 5)
   [junit4]   2> 760967 T2263 oascc.ZkStateReader$2.process A cluster state change: WatchedEvent state:SyncConnected type:NodeDataChanged path:/clusterstate.json, has occurred - updating... (live nodes size: 5)
   [junit4]   2> 760968 T2268 oascc.ZkStateReader$2.process A cluster state change: WatchedEvent state:SyncConnected type:NodeDataChanged path:/clusterstate.json, has occurred - updating... (live nodes size: 5)
   [junit4]   2> 760968 T2309 oascc.ZkStateReader$2.process A cluster state change: WatchedEvent state:SyncConnected type:NodeDataChanged path:/clusterstate.json, has occurred - updating... (live nodes size: 5)
   [junit4]   2> 760967 T2323 oascc.ZkStateReader$2.process A cluster state change: WatchedEvent state:SyncConnected type:NodeDataChanged path:/clusterstate.json, has occurred - updating... (live nodes size: 5)
   [junit4]   2> 761117 T2277 oasc.ShardLeaderElectionContext.waitForReplicasToComeUp Enough replicas found to continue.
   [junit4]   2> 761118 T2277 oasc.ShardLeaderElectionContext.runLeaderProcess I may be the new leader - try and sync
   [junit4]   2> 761119 T2277 oasc.SyncStrategy.sync Sync replicas to http://127.0.0.1:45099/nodes_used_collection_shard1_replica1/
   [junit4]   2> 761119 T2277 oasu.PeerSync.sync PeerSync: core=nodes_used_collection_shard1_replica1 url=http://127.0.0.1:45099 START replicas=[http://127.0.0.1:37275/nodes_used_collection_shard1_replica2/] nUpdates=100
   [junit4]   2> 761120 T2277 oasu.PeerSync.sync PeerSync: core=nodes_used_collection_shard1_replica1 url=http://127.0.0.1:45099 DONE.  We have no versions.  sync failed.
   [junit4]   2> 761121 T2277 oasc.SyncStrategy.syncReplicas Leader's attempt to sync with shard failed, moving to the next candidate
   [junit4]   2> 761121 T2277 oasc.ShardLeaderElectionContext.runLeaderProcess We failed sync, but we have no versions - we can't sync in that case - we were active before, so become leader anyway
   [junit4]   2> 761122 T2277 oasc.ShardLeaderElectionContext.runLeaderProcess I am the new leader: http://127.0.0.1:45099/nodes_used_collection_shard1_

[...truncated too long message...]

0,rollbacks=0,expungeDeletes=0,docsPending=0,adds=0,deletesById=0,deletesByQuery=0,errors=0,cumulative_adds=0,cumulative_deletesById=0,cumulative_deletesByQuery=0,cumulative_errors=0}
   [junit4]   2> 884228 T2241 oasu.SolrCoreState.decrefSolrCoreState Closing SolrCoreState
   [junit4]   2> 884228 T2241 oasu.DefaultSolrCoreState.closeIndexWriter SolrCoreState ref count has reached 0 - closing IndexWriter
   [junit4]   2> 884229 T2241 oasu.DefaultSolrCoreState.closeIndexWriter closing IndexWriter with IndexWriterCloser
   [junit4]   2> 884229 T2241 oasc.SolrCore.closeSearcher [new_implicit_coll_1_b_replica2] Closing main searcher on request.
   [junit4]   2> 884229 T2241 oasc.CachingDirectoryFactory.close Closing MockDirectoryFactory - 2 directories currently being tracked
   [junit4]   2> 884230 T2241 oasc.CachingDirectoryFactory.closeCacheValue looking to close /mnt/ssd/jenkins/workspace/Lucene-Solr-4.x-Linux/solr/build/solr-core/test/J0/./org.apache.solr.cloud.CollectionsAPIDistributedZkTest-jetty4-1375500977913//new_implicit_coll_1_b_replica2/data/index [CachedDir<<refCount=0;path=/mnt/ssd/jenkins/workspace/Lucene-Solr-4.x-Linux/solr/build/solr-core/test/J0/./org.apache.solr.cloud.CollectionsAPIDistributedZkTest-jetty4-1375500977913//new_implicit_coll_1_b_replica2/data/index;done=false>>]
   [junit4]   2> 884230 T2241 oasc.CachingDirectoryFactory.close Closing directory: /mnt/ssd/jenkins/workspace/Lucene-Solr-4.x-Linux/solr/build/solr-core/test/J0/./org.apache.solr.cloud.CollectionsAPIDistributedZkTest-jetty4-1375500977913//new_implicit_coll_1_b_replica2/data/index
   [junit4]   2> 884230 T2241 oasc.CachingDirectoryFactory.closeCacheValue looking to close /mnt/ssd/jenkins/workspace/Lucene-Solr-4.x-Linux/solr/build/solr-core/test/J0/./org.apache.solr.cloud.CollectionsAPIDistributedZkTest-jetty4-1375500977913//new_implicit_coll_1_b_replica2/data [CachedDir<<refCount=0;path=/mnt/ssd/jenkins/workspace/Lucene-Solr-4.x-Linux/solr/build/solr-core/test/J0/./org.apache.solr.cloud.CollectionsAPIDistributedZkTest-jetty4-1375500977913//new_implicit_coll_1_b_replica2/data;done=false>>]
   [junit4]   2> 884231 T2241 oasc.CachingDirectoryFactory.close Closing directory: /mnt/ssd/jenkins/workspace/Lucene-Solr-4.x-Linux/solr/build/solr-core/test/J0/./org.apache.solr.cloud.CollectionsAPIDistributedZkTest-jetty4-1375500977913//new_implicit_coll_1_b_replica2/data
   [junit4]   2> 884232 T2758 oasc.Overseer$ClusterStateUpdater.amILeader According to ZK I (id=90144831822037004-127.0.0.1:37275_-n_0000000004) am no longer a leader.
   [junit4]   2> 884256 T2241 oejsh.ContextHandler.doStop stopped o.e.j.s.ServletContextHandler{/,null}
   [junit4]   2> 884309 T2241 oas.SolrTestCaseJ4.tearDown ###Ending testDistribSearch
   [junit4]   2> 884311 T2241 oasc.ZkTestServer.send4LetterWord connecting to 127.0.0.1:41165 41165
   [junit4]   1> client port:0.0.0.0/0.0.0.0:0
   [junit4]   2> NOTE: reproduce with: ant test  -Dtestcase=CollectionsAPIDistributedZkTest -Dtests.method=testDistribSearch -Dtests.seed=28BC2E40482BEFCE -Dtests.multiplier=3 -Dtests.slow=true -Dtests.locale=ar_LY -Dtests.timezone=Africa/Dakar -Dtests.file.encoding=UTF-8
   [junit4] ERROR    133s J0 | CollectionsAPIDistributedZkTest.testDistribSearch <<<
   [junit4]    > Throwable #1: org.apache.solr.client.solrj.SolrServerException: Server refused connection at: http://127.0.0.1:54076
   [junit4]    > 	at __randomizedtesting.SeedInfo.seed([28BC2E40482BEFCE:A95AA0583F748FF2]:0)
   [junit4]    > 	at org.apache.solr.client.solrj.impl.HttpSolrServer.request(HttpSolrServer.java:428)
   [junit4]    > 	at org.apache.solr.client.solrj.impl.HttpSolrServer.request(HttpSolrServer.java:180)
   [junit4]    > 	at org.apache.solr.cloud.AbstractFullDistribZkTestBase.createCollection(AbstractFullDistribZkTestBase.java:1535)
   [junit4]    > 	at org.apache.solr.cloud.CollectionsAPIDistributedZkTest.testCustomCollectionsAPI(CollectionsAPIDistributedZkTest.java:677)
   [junit4]    > 	at org.apache.solr.cloud.CollectionsAPIDistributedZkTest.doTest(CollectionsAPIDistributedZkTest.java:159)
   [junit4]    > 	at org.apache.solr.BaseDistributedSearchTestCase.testDistribSearch(BaseDistributedSearchTestCase.java:835)
   [junit4]    > 	at java.lang.Thread.run(Thread.java:662)
   [junit4]    > Caused by: org.apache.http.conn.HttpHostConnectException: Connection to http://127.0.0.1:54076 refused
   [junit4]    > 	at org.apache.http.impl.conn.DefaultClientConnectionOperator.openConnection(DefaultClientConnectionOperator.java:190)
   [junit4]    > 	at org.apache.http.impl.conn.ManagedClientConnectionImpl.open(ManagedClientConnectionImpl.java:294)
   [junit4]    > 	at org.apache.http.impl.client.DefaultRequestDirector.tryConnect(DefaultRequestDirector.java:645)
   [junit4]    > 	at org.apache.http.impl.client.DefaultRequestDirector.execute(DefaultRequestDirector.java:480)
   [junit4]    > 	at org.apache.http.impl.client.AbstractHttpClient.execute(AbstractHttpClient.java:906)
   [junit4]    > 	at org.apache.http.impl.client.AbstractHttpClient.execute(AbstractHttpClient.java:805)
   [junit4]    > 	at org.apache.http.impl.client.AbstractHttpClient.execute(AbstractHttpClient.java:784)
   [junit4]    > 	at org.apache.solr.client.solrj.impl.HttpSolrServer.request(HttpSolrServer.java:365)
   [junit4]    > 	... 45 more
   [junit4]    > Caused by: java.net.ConnectException: Connection refused
   [junit4]    > 	at java.net.PlainSocketImpl.socketConnect(Native Method)
   [junit4]    > 	at java.net.PlainSocketImpl.doConnect(PlainSocketImpl.java:351)
   [junit4]    > 	at java.net.PlainSocketImpl.connectToAddress(PlainSocketImpl.java:213)
   [junit4]    > 	at java.net.PlainSocketImpl.connect(PlainSocketImpl.java:200)
   [junit4]    > 	at java.net.SocksSocketImpl.connect(SocksSocketImpl.java:366)
   [junit4]    > 	at java.net.Socket.connect(Socket.java:529)
   [junit4]    > 	at org.apache.http.conn.scheme.PlainSocketFactory.connectSocket(PlainSocketFactory.java:127)
   [junit4]    > 	at org.apache.http.impl.conn.DefaultClientConnectionOperator.openConnection(DefaultClientConnectionOperator.java:180)
   [junit4]    > 	... 52 more
   [junit4]   2> 884333 T2241 oas.SolrTestCaseJ4.deleteCore ###deleteCore
   [junit4]   2> 132885 T2240 ccr.ThreadLeakControl.checkThreadLeaks WARNING Will linger awaiting termination of 2 leaked thread(s).
   [junit4]   2> 885534 T2323 oascc.ZkStateReader$3.process WARN ZooKeeper watch triggered, but Solr cannot talk to ZK
   [junit4]   2> 885534 T2323 oascc.ZkStateReader$2.process A cluster state change: WatchedEvent state:SyncConnected type:NodeChildrenChanged path:/live_nodes, has occurred - updating... (live nodes size: 1)
   [junit4]   2> 885534 T2323 oascc.ZkStateReader$2.process WARN ZooKeeper watch triggered, but Solr cannot talk to ZK
   [junit4]   2> NOTE: test params are: codec=Lucene40, sim=DefaultSimilarity, locale=ar_LY, timezone=Africa/Dakar
   [junit4]   2> NOTE: Linux 3.2.0-51-generic i386/Sun Microsystems Inc. 1.6.0_45 (32-bit)/cpus=8,threads=1,free=183341648,total=351731712
   [junit4]   2> NOTE: All tests run in this JVM: [UpdateRequestProcessorFactoryTest, TestXIncludeConfig, TestPerFieldSimilarity, TestSearchPerf, TestFuzzyAnalyzedSuggestions, TestCoreContainer, SuggesterTest, SolrCoreTest, PrimUtilsTest, SearchHandlerTest, CSVRequestHandlerTest, MBeansHandlerTest, TestTrie, QueryParsingTest, LeaderElectionTest, TestFastLRUCache, TestJoin, SolrInfoMBeanTest, TestConfig, TestRemoteStreaming, TestStressVersions, SliceStateTest, BasicDistributedZkTest, TestSweetSpotSimilarityFactory, BadComponentTest, DocumentBuilderTest, TestFastWriter, TestFieldTypeResource, SyncSliceTest, DistributedSpellCheckComponentTest, SystemInfoHandlerTest, TestSolrXml, MinimalSchemaTest, TestSolrQueryParser, ShardRoutingTest, ScriptEngineTest, TestDynamicFieldCollectionResource, SolrIndexSplitterTest, TestDefaultSearchFieldResource, BlockDirectoryTest, QueryEqualityTest, LegacyHTMLStripCharFilterTest, UUIDFieldTest, TestSolrIndexConfig, TestCharFilters, IndexSchemaTest, CoreMergeIndexesAdminHandlerTest, FieldMutatingUpdateProcessorTest, SoftAutoCommitTest, RegexBoostProcessorTest, TestLRUCache, ZkCLITest, TestDocSet, SliceStateUpdateTest, PeerSyncTest, TestPHPSerializedResponseWriter, TestSort, TestFieldTypeCollectionResource, ShowFileRequestHandlerTest, CoreAdminHandlerTest, TestLFUCache, DistributedQueryElevationComponentTest, TestExtendedDismaxParser, SimpleFacetsTest, MoreLikeThisHandlerTest, BinaryUpdateRequestHandlerTest, TestIBSimilarityFactory, RecoveryZkTest, TestStressRecovery, JsonLoaderTest, DistributedTermsComponentTest, DocValuesTest, ResourceLoaderTest, AutoCommitTest, DateFieldTest, CollectionsAPIDistributedZkTest]
   [junit4] Completed on J0 in 134.16s, 1 test, 1 error <<< FAILURES!

[...truncated 487 lines...]
BUILD FAILED
/mnt/ssd/jenkins/workspace/Lucene-Solr-4.x-Linux/build.xml:395: The following error occurred while executing this line:
/mnt/ssd/jenkins/workspace/Lucene-Solr-4.x-Linux/build.xml:375: The following error occurred while executing this line:
/mnt/ssd/jenkins/workspace/Lucene-Solr-4.x-Linux/build.xml:39: The following error occurred while executing this line:
/mnt/ssd/jenkins/workspace/Lucene-Solr-4.x-Linux/solr/build.xml:181: The following error occurred while executing this line:
/mnt/ssd/jenkins/workspace/Lucene-Solr-4.x-Linux/solr/common-build.xml:449: The following error occurred while executing this line:
/mnt/ssd/jenkins/workspace/Lucene-Solr-4.x-Linux/lucene/common-build.xml:1233: The following error occurred while executing this line:
/mnt/ssd/jenkins/workspace/Lucene-Solr-4.x-Linux/lucene/common-build.xml:876: There were test failures: 321 suites, 1352 tests, 1 error, 34 ignored (6 assumptions)

Total time: 40 minutes 15 seconds
Build step 'Invoke Ant' marked build as failure
Description set: Java: 32bit/jdk1.6.0_45 -server -XX:+UseParallelGC
Archiving artifacts
Recording test results
Email was triggered for: Failure
Sending email for trigger: Failure



Mime
View raw message