lucene-dev mailing list archives

Site index · List index
Message view « Date » · « Thread »
Top « Date » · « Thread »
From Policeman Jenkins Server <jenk...@thetaphi.de>
Subject [JENKINS] Lucene-Solr-trunk-MacOSX (64bit/jdk1.7.0) - Build # 697 - Still Failing!
Date Thu, 01 Aug 2013 15:05:49 GMT
Build: http://jenkins.thetaphi.de/job/Lucene-Solr-trunk-MacOSX/697/
Java: 64bit/jdk1.7.0 -XX:-UseCompressedOops -XX:+UseSerialGC

1 tests failed.
FAILED:  org.apache.solr.cloud.CollectionsAPIDistributedZkTest.testDistribSearch

Error Message:
Server refused connection at: http://127.0.0.1:50457/kb/d

Stack Trace:
org.apache.solr.client.solrj.SolrServerException: Server refused connection at: http://127.0.0.1:50457/kb/d
	at __randomizedtesting.SeedInfo.seed([7F9707FA8D68D3E9:FE7189E2FA37B3D5]:0)
	at org.apache.solr.client.solrj.impl.HttpSolrServer.request(HttpSolrServer.java:428)
	at org.apache.solr.client.solrj.impl.HttpSolrServer.request(HttpSolrServer.java:180)
	at org.apache.solr.cloud.CollectionsAPIDistributedZkTest.testCustomCollectionsAPI(CollectionsAPIDistributedZkTest.java:764)
	at org.apache.solr.cloud.CollectionsAPIDistributedZkTest.doTest(CollectionsAPIDistributedZkTest.java:159)
	at org.apache.solr.BaseDistributedSearchTestCase.testDistribSearch(BaseDistributedSearchTestCase.java:835)
	at sun.reflect.NativeMethodAccessorImpl.invoke0(Native Method)
	at sun.reflect.NativeMethodAccessorImpl.invoke(NativeMethodAccessorImpl.java:57)
	at sun.reflect.DelegatingMethodAccessorImpl.invoke(DelegatingMethodAccessorImpl.java:43)
	at java.lang.reflect.Method.invoke(Method.java:606)
	at com.carrotsearch.randomizedtesting.RandomizedRunner.invoke(RandomizedRunner.java:1559)
	at com.carrotsearch.randomizedtesting.RandomizedRunner.access$600(RandomizedRunner.java:79)
	at com.carrotsearch.randomizedtesting.RandomizedRunner$6.evaluate(RandomizedRunner.java:737)
	at com.carrotsearch.randomizedtesting.RandomizedRunner$7.evaluate(RandomizedRunner.java:773)
	at com.carrotsearch.randomizedtesting.RandomizedRunner$8.evaluate(RandomizedRunner.java:787)
	at com.carrotsearch.randomizedtesting.rules.SystemPropertiesRestoreRule$1.evaluate(SystemPropertiesRestoreRule.java:53)
	at org.apache.lucene.util.TestRuleSetupTeardownChained$1.evaluate(TestRuleSetupTeardownChained.java:50)
	at org.apache.lucene.util.TestRuleFieldCacheSanity$1.evaluate(TestRuleFieldCacheSanity.java:51)
	at org.apache.lucene.util.AbstractBeforeAfterRule$1.evaluate(AbstractBeforeAfterRule.java:46)
	at com.carrotsearch.randomizedtesting.rules.SystemPropertiesInvariantRule$1.evaluate(SystemPropertiesInvariantRule.java:55)
	at org.apache.lucene.util.TestRuleThreadAndTestName$1.evaluate(TestRuleThreadAndTestName.java:49)
	at org.apache.lucene.util.TestRuleIgnoreAfterMaxFailures$1.evaluate(TestRuleIgnoreAfterMaxFailures.java:70)
	at org.apache.lucene.util.TestRuleMarkFailure$1.evaluate(TestRuleMarkFailure.java:48)
	at com.carrotsearch.randomizedtesting.rules.StatementAdapter.evaluate(StatementAdapter.java:36)
	at com.carrotsearch.randomizedtesting.ThreadLeakControl$StatementRunner.run(ThreadLeakControl.java:358)
	at com.carrotsearch.randomizedtesting.ThreadLeakControl.forkTimeoutingTask(ThreadLeakControl.java:782)
	at com.carrotsearch.randomizedtesting.ThreadLeakControl$3.evaluate(ThreadLeakControl.java:442)
	at com.carrotsearch.randomizedtesting.RandomizedRunner.runSingleTest(RandomizedRunner.java:746)
	at com.carrotsearch.randomizedtesting.RandomizedRunner$3.evaluate(RandomizedRunner.java:648)
	at com.carrotsearch.randomizedtesting.RandomizedRunner$4.evaluate(RandomizedRunner.java:682)
	at com.carrotsearch.randomizedtesting.RandomizedRunner$5.evaluate(RandomizedRunner.java:693)
	at com.carrotsearch.randomizedtesting.rules.StatementAdapter.evaluate(StatementAdapter.java:36)
	at com.carrotsearch.randomizedtesting.rules.SystemPropertiesRestoreRule$1.evaluate(SystemPropertiesRestoreRule.java:53)
	at org.apache.lucene.util.AbstractBeforeAfterRule$1.evaluate(AbstractBeforeAfterRule.java:46)
	at org.apache.lucene.util.TestRuleStoreClassName$1.evaluate(TestRuleStoreClassName.java:42)
	at com.carrotsearch.randomizedtesting.rules.SystemPropertiesInvariantRule$1.evaluate(SystemPropertiesInvariantRule.java:55)
	at com.carrotsearch.randomizedtesting.rules.NoShadowingOrOverridesOnMethodsRule$1.evaluate(NoShadowingOrOverridesOnMethodsRule.java:39)
	at com.carrotsearch.randomizedtesting.rules.NoShadowingOrOverridesOnMethodsRule$1.evaluate(NoShadowingOrOverridesOnMethodsRule.java:39)
	at com.carrotsearch.randomizedtesting.rules.StatementAdapter.evaluate(StatementAdapter.java:36)
	at org.apache.lucene.util.TestRuleAssertionsRequired$1.evaluate(TestRuleAssertionsRequired.java:43)
	at org.apache.lucene.util.TestRuleMarkFailure$1.evaluate(TestRuleMarkFailure.java:48)
	at org.apache.lucene.util.TestRuleIgnoreAfterMaxFailures$1.evaluate(TestRuleIgnoreAfterMaxFailures.java:70)
	at org.apache.lucene.util.TestRuleIgnoreTestSuites$1.evaluate(TestRuleIgnoreTestSuites.java:55)
	at com.carrotsearch.randomizedtesting.rules.StatementAdapter.evaluate(StatementAdapter.java:36)
	at com.carrotsearch.randomizedtesting.ThreadLeakControl$StatementRunner.run(ThreadLeakControl.java:358)
	at java.lang.Thread.run(Thread.java:724)
Caused by: org.apache.http.conn.HttpHostConnectException: Connection to http://127.0.0.1:50457 refused
	at org.apache.http.impl.conn.DefaultClientConnectionOperator.openConnection(DefaultClientConnectionOperator.java:190)
	at org.apache.http.impl.conn.ManagedClientConnectionImpl.open(ManagedClientConnectionImpl.java:294)
	at org.apache.http.impl.client.DefaultRequestDirector.tryConnect(DefaultRequestDirector.java:645)
	at org.apache.http.impl.client.DefaultRequestDirector.execute(DefaultRequestDirector.java:480)
	at org.apache.http.impl.client.AbstractHttpClient.execute(AbstractHttpClient.java:906)
	at org.apache.http.impl.client.AbstractHttpClient.execute(AbstractHttpClient.java:805)
	at org.apache.http.impl.client.AbstractHttpClient.execute(AbstractHttpClient.java:784)
	at org.apache.solr.client.solrj.impl.HttpSolrServer.request(HttpSolrServer.java:365)
	... 44 more
Caused by: java.net.ConnectException: Connection refused
	at java.net.PlainSocketImpl.socketConnect(Native Method)
	at java.net.AbstractPlainSocketImpl.doConnect(AbstractPlainSocketImpl.java:339)
	at java.net.AbstractPlainSocketImpl.connectToAddress(AbstractPlainSocketImpl.java:200)
	at java.net.AbstractPlainSocketImpl.connect(AbstractPlainSocketImpl.java:182)
	at java.net.SocksSocketImpl.connect(SocksSocketImpl.java:392)
	at java.net.Socket.connect(Socket.java:579)
	at org.apache.http.conn.scheme.PlainSocketFactory.connectSocket(PlainSocketFactory.java:127)
	at org.apache.http.impl.conn.DefaultClientConnectionOperator.openConnection(DefaultClientConnectionOperator.java:180)
	... 51 more




Build Log:
[...truncated 9782 lines...]
   [junit4] Suite: org.apache.solr.cloud.CollectionsAPIDistributedZkTest
   [junit4]   2> 2212081 T4727 oas.BaseDistributedSearchTestCase.initHostContext Setting hostContext system property: /kb/d
   [junit4]   2> 2212088 T4727 oas.SolrTestCaseJ4.setUp ###Starting testDistribSearch
   [junit4]   2> Creating dataDir: /Users/jenkins/jenkins-slave/workspace/Lucene-Solr-trunk-MacOSX/solr/build/solr-core/test/J0/./solrtest-CollectionsAPIDistributedZkTest-1375367605140
   [junit4]   2> 2212091 T4727 oasc.ZkTestServer.run STARTING ZK TEST SERVER
   [junit4]   2> 2212092 T4728 oasc.ZkTestServer$ZKServerMain.runFromConfig Starting server
   [junit4]   2> 2212193 T4727 oasc.ZkTestServer.run start zk server on port:50450
   [junit4]   2> 2212196 T4727 oascc.ConnectionManager.waitForConnected Waiting for client to connect to ZooKeeper
   [junit4]   2> 2212212 T4734 oascc.ConnectionManager.process Watcher org.apache.solr.common.cloud.ConnectionManager@7d7161f0 name:ZooKeeperConnection Watcher:127.0.0.1:50450 got event WatchedEvent state:SyncConnected type:None path:null path:null type:None
   [junit4]   2> 2212215 T4727 oascc.ConnectionManager.waitForConnected Client is connected to ZooKeeper
   [junit4]   2> 2212215 T4727 oascc.SolrZkClient.makePath makePath: /solr
   [junit4]   2> 2212230 T4727 oascc.ConnectionManager.waitForConnected Waiting for client to connect to ZooKeeper
   [junit4]   2> 2212241 T4736 oascc.ConnectionManager.process Watcher org.apache.solr.common.cloud.ConnectionManager@4b01fc27 name:ZooKeeperConnection Watcher:127.0.0.1:50450/solr got event WatchedEvent state:SyncConnected type:None path:null path:null type:None
   [junit4]   2> 2212241 T4727 oascc.ConnectionManager.waitForConnected Client is connected to ZooKeeper
   [junit4]   2> 2212242 T4727 oascc.SolrZkClient.makePath makePath: /collections/collection1
   [junit4]   2> 2212253 T4727 oascc.SolrZkClient.makePath makePath: /collections/collection1/shards
   [junit4]   2> 2212264 T4727 oascc.SolrZkClient.makePath makePath: /collections/control_collection
   [junit4]   2> 2212272 T4727 oascc.SolrZkClient.makePath makePath: /collections/control_collection/shards
   [junit4]   2> 2212283 T4727 oasc.AbstractZkTestCase.putConfig put /Users/jenkins/jenkins-slave/workspace/Lucene-Solr-trunk-MacOSX/solr/build/solr-core/test-files/solr/collection1/conf/solrconfig-tlog.xml to /configs/conf1/solrconfig.xml
   [junit4]   2> 2212286 T4727 oascc.SolrZkClient.makePath makePath: /configs/conf1/solrconfig.xml
   [junit4]   2> 2212303 T4727 oasc.AbstractZkTestCase.putConfig put /Users/jenkins/jenkins-slave/workspace/Lucene-Solr-trunk-MacOSX/solr/build/solr-core/test-files/solr/collection1/conf/schema.xml to /configs/conf1/schema.xml
   [junit4]   2> 2212304 T4727 oascc.SolrZkClient.makePath makePath: /configs/conf1/schema.xml
   [junit4]   2> 2212318 T4727 oasc.AbstractZkTestCase.putConfig put /Users/jenkins/jenkins-slave/workspace/Lucene-Solr-trunk-MacOSX/solr/build/solr-core/test-files/solr/collection1/conf/stopwords.txt to /configs/conf1/stopwords.txt
   [junit4]   2> 2212319 T4727 oascc.SolrZkClient.makePath makePath: /configs/conf1/stopwords.txt
   [junit4]   2> 2212327 T4727 oasc.AbstractZkTestCase.putConfig put /Users/jenkins/jenkins-slave/workspace/Lucene-Solr-trunk-MacOSX/solr/build/solr-core/test-files/solr/collection1/conf/protwords.txt to /configs/conf1/protwords.txt
   [junit4]   2> 2212328 T4727 oascc.SolrZkClient.makePath makePath: /configs/conf1/protwords.txt
   [junit4]   2> 2212337 T4727 oasc.AbstractZkTestCase.putConfig put /Users/jenkins/jenkins-slave/workspace/Lucene-Solr-trunk-MacOSX/solr/build/solr-core/test-files/solr/collection1/conf/currency.xml to /configs/conf1/currency.xml
   [junit4]   2> 2212337 T4727 oascc.SolrZkClient.makePath makePath: /configs/conf1/currency.xml
   [junit4]   2> 2212344 T4727 oasc.AbstractZkTestCase.putConfig put /Users/jenkins/jenkins-slave/workspace/Lucene-Solr-trunk-MacOSX/solr/build/solr-core/test-files/solr/collection1/conf/open-exchange-rates.json to /configs/conf1/open-exchange-rates.json
   [junit4]   2> 2212345 T4727 oascc.SolrZkClient.makePath makePath: /configs/conf1/open-exchange-rates.json
   [junit4]   2> 2212352 T4727 oasc.AbstractZkTestCase.putConfig put /Users/jenkins/jenkins-slave/workspace/Lucene-Solr-trunk-MacOSX/solr/build/solr-core/test-files/solr/collection1/conf/mapping-ISOLatin1Accent.txt to /configs/conf1/mapping-ISOLatin1Accent.txt
   [junit4]   2> 2212353 T4727 oascc.SolrZkClient.makePath makePath: /configs/conf1/mapping-ISOLatin1Accent.txt
   [junit4]   2> 2212360 T4727 oasc.AbstractZkTestCase.putConfig put /Users/jenkins/jenkins-slave/workspace/Lucene-Solr-trunk-MacOSX/solr/build/solr-core/test-files/solr/collection1/conf/old_synonyms.txt to /configs/conf1/old_synonyms.txt
   [junit4]   2> 2212360 T4727 oascc.SolrZkClient.makePath makePath: /configs/conf1/old_synonyms.txt
   [junit4]   2> 2212367 T4727 oasc.AbstractZkTestCase.putConfig put /Users/jenkins/jenkins-slave/workspace/Lucene-Solr-trunk-MacOSX/solr/build/solr-core/test-files/solr/collection1/conf/synonyms.txt to /configs/conf1/synonyms.txt
   [junit4]   2> 2212368 T4727 oascc.SolrZkClient.makePath makePath: /configs/conf1/synonyms.txt
   [junit4]   2> 2212910 T4727 oejs.Server.doStart jetty-8.1.10.v20130312
   [junit4]   2> 2212917 T4727 oejs.AbstractConnector.doStart Started SelectChannelConnector@127.0.0.1:50453
   [junit4]   2> 2212918 T4727 oass.SolrDispatchFilter.init SolrDispatchFilter.init()
   [junit4]   2> 2212919 T4727 oasc.SolrResourceLoader.locateSolrHome JNDI not configured for solr (NoInitialContextEx)
   [junit4]   2> 2212919 T4727 oasc.SolrResourceLoader.locateSolrHome using system property solr.solr.home: /Users/jenkins/jenkins-slave/workspace/Lucene-Solr-trunk-MacOSX/solr/build/solr-core/test/J0/./org.apache.solr.cloud.CollectionsAPIDistributedZkTest-controljetty-1375367605428
   [junit4]   2> 2212920 T4727 oasc.SolrResourceLoader.<init> new SolrResourceLoader for directory: '/Users/jenkins/jenkins-slave/workspace/Lucene-Solr-trunk-MacOSX/solr/build/solr-core/test/J0/./org.apache.solr.cloud.CollectionsAPIDistributedZkTest-controljetty-1375367605428/'
   [junit4]   2> 2212979 T4727 oasc.ConfigSolr.fromFile Loading container configuration from /Users/jenkins/jenkins-slave/workspace/Lucene-Solr-trunk-MacOSX/solr/build/solr-core/test/J0/./org.apache.solr.cloud.CollectionsAPIDistributedZkTest-controljetty-1375367605428/solr.xml
   [junit4]   2> 2213096 T4727 oasc.ConfigSolrXml.<init> Config-defined core root directory: 
   [junit4]   2> 2213097 T4727 oasc.CoreContainer.<init> New CoreContainer 742536774
   [junit4]   2> 2213098 T4727 oasc.CoreContainer.load Loading cores into CoreContainer [instanceDir=/Users/jenkins/jenkins-slave/workspace/Lucene-Solr-trunk-MacOSX/solr/build/solr-core/test/J0/./org.apache.solr.cloud.CollectionsAPIDistributedZkTest-controljetty-1375367605428/]
   [junit4]   2> 2213100 T4727 oashc.HttpShardHandlerFactory.getParameter Setting socketTimeout to: 120000
   [junit4]   2> 2213101 T4727 oashc.HttpShardHandlerFactory.getParameter Setting urlScheme to: http://
   [junit4]   2> 2213101 T4727 oashc.HttpShardHandlerFactory.getParameter Setting connTimeout to: 15000
   [junit4]   2> 2213102 T4727 oashc.HttpShardHandlerFactory.getParameter Setting maxConnectionsPerHost to: 20
   [junit4]   2> 2213102 T4727 oashc.HttpShardHandlerFactory.getParameter Setting corePoolSize to: 0
   [junit4]   2> 2213103 T4727 oashc.HttpShardHandlerFactory.getParameter Setting maximumPoolSize to: 2147483647
   [junit4]   2> 2213103 T4727 oashc.HttpShardHandlerFactory.getParameter Setting maxThreadIdleTime to: 5
   [junit4]   2> 2213103 T4727 oashc.HttpShardHandlerFactory.getParameter Setting sizeOfQueue to: -1
   [junit4]   2> 2213105 T4727 oashc.HttpShardHandlerFactory.getParameter Setting fairnessPolicy to: false
   [junit4]   2> 2213105 T4727 oascsi.HttpClientUtil.createClient Creating new http client, config:maxConnectionsPerHost=20&maxConnections=10000&socketTimeout=120000&connTimeout=15000&retry=false
   [junit4]   2> 2213126 T4727 oasc.ZkContainer.initZooKeeper Zookeeper client=127.0.0.1:50450/solr
   [junit4]   2> 2213129 T4727 oasc.ZkController.checkChrootPath zkHost includes chroot
   [junit4]   2> 2213136 T4727 oascc.ConnectionManager.waitForConnected Waiting for client to connect to ZooKeeper
   [junit4]   2> 2213141 T4747 oascc.ConnectionManager.process Watcher org.apache.solr.common.cloud.ConnectionManager@2e123478 name:ZooKeeperConnection Watcher:127.0.0.1:50450 got event WatchedEvent state:SyncConnected type:None path:null path:null type:None
   [junit4]   2> 2213142 T4727 oascc.ConnectionManager.waitForConnected Client is connected to ZooKeeper
   [junit4]   2> 2213147 T4727 oascsi.HttpClientUtil.createClient Creating new http client, config:maxConnections=500&maxConnectionsPerHost=16&socketTimeout=120000&connTimeout=15000
   [junit4]   2> 2213174 T4727 oascc.ConnectionManager.waitForConnected Waiting for client to connect to ZooKeeper
   [junit4]   2> 2213177 T4749 oascc.ConnectionManager.process Watcher org.apache.solr.common.cloud.ConnectionManager@343b9dbf name:ZooKeeperConnection Watcher:127.0.0.1:50450/solr got event WatchedEvent state:SyncConnected type:None path:null path:null type:None
   [junit4]   2> 2213178 T4727 oascc.ConnectionManager.waitForConnected Client is connected to ZooKeeper
   [junit4]   2> 2213181 T4727 oascc.SolrZkClient.makePath makePath: /overseer/queue
   [junit4]   2> 2213189 T4727 oascc.SolrZkClient.makePath makePath: /overseer/collection-queue-work
   [junit4]   2> 2213196 T4727 oascc.SolrZkClient.makePath makePath: /live_nodes
   [junit4]   2> 2213201 T4727 oasc.ZkController.createEphemeralLiveNode Register node as live in ZooKeeper:/live_nodes/127.0.0.1:50453_kb%2Fd
   [junit4]   2> 2213207 T4727 oascc.SolrZkClient.makePath makePath: /live_nodes/127.0.0.1:50453_kb%2Fd
   [junit4]   2> 2213217 T4727 oascc.SolrZkClient.makePath makePath: /overseer_elect/election
   [junit4]   2> 2213234 T4727 oascc.SolrZkClient.makePath makePath: /overseer_elect/leader
   [junit4]   2> 2213239 T4727 oasc.Overseer.start Overseer (id=90136091371110403-127.0.0.1:50453_kb%2Fd-n_0000000000) starting
   [junit4]   2> 2213252 T4727 oascc.SolrZkClient.makePath makePath: /overseer/queue-work
   [junit4]   2> 2213263 T4751 oasc.OverseerCollectionProcessor.run Process current queue of collection creations
   [junit4]   2> 2213265 T4727 oascc.SolrZkClient.makePath makePath: /clusterstate.json
   [junit4]   2> 2213271 T4727 oascc.SolrZkClient.makePath makePath: /aliases.json
   [junit4]   2> 2213275 T4727 oascc.ZkStateReader.createClusterStateWatchersAndUpdate Updating cluster state from ZooKeeper... 
   [junit4]   2> 2213282 T4750 oasc.Overseer$ClusterStateUpdater.run Starting to work on the main queue
   [junit4]   2> 2213289 T4727 oasc.CorePropertiesLocator.discover Looking for core definitions underneath /Users/jenkins/jenkins-slave/workspace/Lucene-Solr-trunk-MacOSX/solr/build/solr-core/test/J0/./org.apache.solr.cloud.CollectionsAPIDistributedZkTest-controljetty-1375367605428
   [junit4]   2> 2213439 T4727 oasc.CorePropertiesLocator.discoverUnder Found core conf in /Users/jenkins/jenkins-slave/workspace/Lucene-Solr-trunk-MacOSX/solr/build/solr-core/test/J0/./org.apache.solr.cloud.CollectionsAPIDistributedZkTest-controljetty-1375367605428/conf/
   [junit4]   2> 2213452 T4727 oasc.CorePropertiesLocator.discover Found 1 core definitions
   [junit4]   2> 2213453 T4727 oass.SolrDispatchFilter.init user.dir=/Users/jenkins/jenkins-slave/workspace/Lucene-Solr-trunk-MacOSX/solr/build/solr-core/test/J0
   [junit4]   2> 2213453 T4727 oass.SolrDispatchFilter.init SolrDispatchFilter.init() done
   [junit4]   2> 2213454 T4727 oascsi.HttpClientUtil.createClient Creating new http client, config:maxConnections=128&maxConnectionsPerHost=32&followRedirects=false
   [junit4]   2> 2213473 T4727 oascsi.HttpClientUtil.createClient Creating new http client, config:
   [junit4]   2> 2213476 T4727 oascc.ConnectionManager.waitForConnected Waiting for client to connect to ZooKeeper
   [junit4]   2> 2213480 T4754 oascc.ConnectionManager.process Watcher org.apache.solr.common.cloud.ConnectionManager@44c20975 name:ZooKeeperConnection Watcher:127.0.0.1:50450/solr got event WatchedEvent state:SyncConnected type:None path:null path:null type:None
   [junit4]   2> 2213481 T4727 oascc.ConnectionManager.waitForConnected Client is connected to ZooKeeper
   [junit4]   2> 2213483 T4727 oascc.ZkStateReader.createClusterStateWatchersAndUpdate Updating cluster state from ZooKeeper... 
   [junit4]   2> 2213488 T4727 oasc.ChaosMonkey.monkeyLog monkey: init - expire sessions:true cause connection loss:true
   [junit4]   2> 2213973 T4727 oejs.Server.doStart jetty-8.1.10.v20130312
   [junit4]   2> 2213997 T4727 oejs.AbstractConnector.doStart Started SelectChannelConnector@127.0.0.1:50457
   [junit4]   2> 2213998 T4727 oass.SolrDispatchFilter.init SolrDispatchFilter.init()
   [junit4]   2> 2213999 T4727 oasc.SolrResourceLoader.locateSolrHome JNDI not configured for solr (NoInitialContextEx)
   [junit4]   2> 2214000 T4727 oasc.SolrResourceLoader.locateSolrHome using system property solr.solr.home: /Users/jenkins/jenkins-slave/workspace/Lucene-Solr-trunk-MacOSX/solr/build/solr-core/test/J0/./org.apache.solr.cloud.CollectionsAPIDistributedZkTest-jetty1-1375367606538
   [junit4]   2> 2214000 T4727 oasc.SolrResourceLoader.<init> new SolrResourceLoader for directory: '/Users/jenkins/jenkins-slave/workspace/Lucene-Solr-trunk-MacOSX/solr/build/solr-core/test/J0/./org.apache.solr.cloud.CollectionsAPIDistributedZkTest-jetty1-1375367606538/'
   [junit4]   2> 2214070 T4727 oasc.ConfigSolr.fromFile Loading container configuration from /Users/jenkins/jenkins-slave/workspace/Lucene-Solr-trunk-MacOSX/solr/build/solr-core/test/J0/./org.apache.solr.cloud.CollectionsAPIDistributedZkTest-jetty1-1375367606538/solr.xml
   [junit4]   2> 2214190 T4727 oasc.ConfigSolrXml.<init> Config-defined core root directory: 
   [junit4]   2> 2214191 T4727 oasc.CoreContainer.<init> New CoreContainer 1284180029
   [junit4]   2> 2214192 T4727 oasc.CoreContainer.load Loading cores into CoreContainer [instanceDir=/Users/jenkins/jenkins-slave/workspace/Lucene-Solr-trunk-MacOSX/solr/build/solr-core/test/J0/./org.apache.solr.cloud.CollectionsAPIDistributedZkTest-jetty1-1375367606538/]
   [junit4]   2> 2214194 T4727 oashc.HttpShardHandlerFactory.getParameter Setting socketTimeout to: 120000
   [junit4]   2> 2214194 T4727 oashc.HttpShardHandlerFactory.getParameter Setting urlScheme to: http://
   [junit4]   2> 2214195 T4727 oashc.HttpShardHandlerFactory.getParameter Setting connTimeout to: 15000
   [junit4]   2> 2214195 T4727 oashc.HttpShardHandlerFactory.getParameter Setting maxConnectionsPerHost to: 20
   [junit4]   2> 2214196 T4727 oashc.HttpShardHandlerFactory.getParameter Setting corePoolSize to: 0
   [junit4]   2> 2214196 T4727 oashc.HttpShardHandlerFactory.getParameter Setting maximumPoolSize to: 2147483647
   [junit4]   2> 2214197 T4727 oashc.HttpShardHandlerFactory.getParameter Setting maxThreadIdleTime to: 5
   [junit4]   2> 2214198 T4727 oashc.HttpShardHandlerFactory.getParameter Setting sizeOfQueue to: -1
   [junit4]   2> 2214198 T4727 oashc.HttpShardHandlerFactory.getParameter Setting fairnessPolicy to: false
   [junit4]   2> 2214199 T4727 oascsi.HttpClientUtil.createClient Creating new http client, config:maxConnectionsPerHost=20&maxConnections=10000&socketTimeout=120000&connTimeout=15000&retry=false
   [junit4]   2> 2214220 T4727 oasc.ZkContainer.initZooKeeper Zookeeper client=127.0.0.1:50450/solr
   [junit4]   2> 2214223 T4727 oasc.ZkController.checkChrootPath zkHost includes chroot
   [junit4]   2> 2214225 T4727 oascc.ConnectionManager.waitForConnected Waiting for client to connect to ZooKeeper
   [junit4]   2> 2214234 T4765 oascc.ConnectionManager.process Watcher org.apache.solr.common.cloud.ConnectionManager@48d41405 name:ZooKeeperConnection Watcher:127.0.0.1:50450 got event WatchedEvent state:SyncConnected type:None path:null path:null type:None
   [junit4]   2> 2214235 T4727 oascc.ConnectionManager.waitForConnected Client is connected to ZooKeeper
   [junit4]   2> 2214238 T4727 oascsi.HttpClientUtil.createClient Creating new http client, config:maxConnections=500&maxConnectionsPerHost=16&socketTimeout=120000&connTimeout=15000
   [junit4]   2> 2214262 T4727 oascc.ConnectionManager.waitForConnected Waiting for client to connect to ZooKeeper
   [junit4]   2> 2214263 T4767 oascc.ConnectionManager.process Watcher org.apache.solr.common.cloud.ConnectionManager@2260964a name:ZooKeeperConnection Watcher:127.0.0.1:50450/solr got event WatchedEvent state:SyncConnected type:None path:null path:null type:None
   [junit4]   2> 2214264 T4727 oascc.ConnectionManager.waitForConnected Client is connected to ZooKeeper
   [junit4]   2> 2214282 T4727 oascc.ZkStateReader.createClusterStateWatchersAndUpdate Updating cluster state from ZooKeeper... 
   [junit4]   2> 2215292 T4727 oasc.ZkController.createEphemeralLiveNode Register node as live in ZooKeeper:/live_nodes/127.0.0.1:50457_kb%2Fd
   [junit4]   2> 2215294 T4727 oascc.SolrZkClient.makePath makePath: /live_nodes/127.0.0.1:50457_kb%2Fd
   [junit4]   2> 2215300 T4767 oascc.ZkStateReader$3.process Updating live nodes... (2)
   [junit4]   2> 2215300 T4754 oascc.ZkStateReader$3.process Updating live nodes... (2)
   [junit4]   2> 2215301 T4749 oascc.ZkStateReader$3.process Updating live nodes... (2)
   [junit4]   2> 2215312 T4727 oasc.CorePropertiesLocator.discover Looking for core definitions underneath /Users/jenkins/jenkins-slave/workspace/Lucene-Solr-trunk-MacOSX/solr/build/solr-core/test/J0/./org.apache.solr.cloud.CollectionsAPIDistributedZkTest-jetty1-1375367606538
   [junit4]   2> 2215471 T4727 oasc.CorePropertiesLocator.discoverUnder Found core conf in /Users/jenkins/jenkins-slave/workspace/Lucene-Solr-trunk-MacOSX/solr/build/solr-core/test/J0/./org.apache.solr.cloud.CollectionsAPIDistributedZkTest-jetty1-1375367606538/conf/
   [junit4]   2> 2215478 T4727 oasc.CorePropertiesLocator.discover Found 1 core definitions
   [junit4]   2> 2215479 T4727 oass.SolrDispatchFilter.init user.dir=/Users/jenkins/jenkins-slave/workspace/Lucene-Solr-trunk-MacOSX/solr/build/solr-core/test/J0
   [junit4]   2> 2215480 T4727 oass.SolrDispatchFilter.init SolrDispatchFilter.init() done
   [junit4]   2> 2215480 T4727 oascsi.HttpClientUtil.createClient Creating new http client, config:maxConnections=128&maxConnectionsPerHost=32&followRedirects=false
   [junit4]   2> 2215971 T4727 oejs.Server.doStart jetty-8.1.10.v20130312
   [junit4]   2> 2215979 T4727 oejs.AbstractConnector.doStart Started SelectChannelConnector@127.0.0.1:50460
   [junit4]   2> 2215981 T4727 oass.SolrDispatchFilter.init SolrDispatchFilter.init()
   [junit4]   2> 2215982 T4727 oasc.SolrResourceLoader.locateSolrHome JNDI not configured for solr (NoInitialContextEx)
   [junit4]   2> 2215982 T4727 oasc.SolrResourceLoader.locateSolrHome using system property solr.solr.home: /Users/jenkins/jenkins-slave/workspace/Lucene-Solr-trunk-MacOSX/solr/build/solr-core/test/J0/./org.apache.solr.cloud.CollectionsAPIDistributedZkTest-jetty2-1375367608554
   [junit4]   2> 2215983 T4727 oasc.SolrResourceLoader.<init> new SolrResourceLoader for directory: '/Users/jenkins/jenkins-slave/workspace/Lucene-Solr-trunk-MacOSX/solr/build/solr-core/test/J0/./org.apache.solr.cloud.CollectionsAPIDistributedZkTest-jetty2-1375367608554/'
   [junit4]   2> 2216021 T4727 oasc.ConfigSolr.fromFile Loading container configuration from /Users/jenkins/jenkins-slave/workspace/Lucene-Solr-trunk-MacOSX/solr/build/solr-core/test/J0/./org.apache.solr.cloud.CollectionsAPIDistributedZkTest-jetty2-1375367608554/solr.xml
   [junit4]   2> 2216149 T4727 oasc.ConfigSolrXml.<init> Config-defined core root directory: 
   [junit4]   2> 2216150 T4727 oasc.CoreContainer.<init> New CoreContainer 1360531739
   [junit4]   2> 2216150 T4727 oasc.CoreContainer.load Loading cores into CoreContainer [instanceDir=/Users/jenkins/jenkins-slave/workspace/Lucene-Solr-trunk-MacOSX/solr/build/solr-core/test/J0/./org.apache.solr.cloud.CollectionsAPIDistributedZkTest-jetty2-1375367608554/]
   [junit4]   2> 2216152 T4727 oashc.HttpShardHandlerFactory.getParameter Setting socketTimeout to: 120000
   [junit4]   2> 2216153 T4727 oashc.HttpShardHandlerFactory.getParameter Setting urlScheme to: http://
   [junit4]   2> 2216154 T4727 oashc.HttpShardHandlerFactory.getParameter Setting connTimeout to: 15000
   [junit4]   2> 2216157 T4727 oashc.HttpShardHandlerFactory.getParameter Setting maxConnectionsPerHost to: 20
   [junit4]   2> 2216159 T4727 oashc.HttpShardHandlerFactory.getParameter Setting corePoolSize to: 0
   [junit4]   2> 2216160 T4727 oashc.HttpShardHandlerFactory.getParameter Setting maximumPoolSize to: 2147483647
   [junit4]   2> 2216160 T4727 oashc.HttpShardHandlerFactory.getParameter Setting maxThreadIdleTime to: 5
   [junit4]   2> 2216161 T4727 oashc.HttpShardHandlerFactory.getParameter Setting sizeOfQueue to: -1
   [junit4]   2> 2216161 T4727 oashc.HttpShardHandlerFactory.getParameter Setting fairnessPolicy to: false
   [junit4]   2> 2216162 T4727 oascsi.HttpClientUtil.createClient Creating new http client, config:maxConnectionsPerHost=20&maxConnections=10000&socketTimeout=120000&connTimeout=15000&retry=false
   [junit4]   2> 2216181 T4727 oasc.ZkContainer.initZooKeeper Zookeeper client=127.0.0.1:50450/solr
   [junit4]   2> 2216182 T4727 oasc.ZkController.checkChrootPath zkHost includes chroot
   [junit4]   2> 2216184 T4727 oascc.ConnectionManager.waitForConnected Waiting for client to connect to ZooKeeper
   [junit4]   2> 2216189 T4779 oascc.ConnectionManager.process Watcher org.apache.solr.common.cloud.ConnectionManager@780ea2 name:ZooKeeperConnection Watcher:127.0.0.1:50450 got event WatchedEvent state:SyncConnected type:None path:null path:null type:None
   [junit4]   2> 2216189 T4727 oascc.ConnectionManager.waitForConnected Client is connected to ZooKeeper
   [junit4]   2> 2216193 T4727 oascsi.HttpClientUtil.createClient Creating new http client, config:maxConnections=500&maxConnectionsPerHost=16&socketTimeout=120000&connTimeout=15000
   [junit4]   2> 2216208 T4727 oascc.ConnectionManager.waitForConnected Waiting for client to connect to ZooKeeper
   [junit4]   2> 2216212 T4781 oascc.ConnectionManager.process Watcher org.apache.solr.common.cloud.ConnectionManager@328f262b name:ZooKeeperConnection Watcher:127.0.0.1:50450/solr got event WatchedEvent state:SyncConnected type:None path:null path:null type:None
   [junit4]   2> 2216212 T4727 oascc.ConnectionManager.waitForConnected Client is connected to ZooKeeper
   [junit4]   2> 2216221 T4727 oascc.ZkStateReader.createClusterStateWatchersAndUpdate Updating cluster state from ZooKeeper... 
   [junit4]   2> 2217231 T4727 oasc.ZkController.createEphemeralLiveNode Register node as live in ZooKeeper:/live_nodes/127.0.0.1:50460_kb%2Fd
   [junit4]   2> 2217233 T4727 oascc.SolrZkClient.makePath makePath: /live_nodes/127.0.0.1:50460_kb%2Fd
   [junit4]   2> 2217240 T4754 oascc.ZkStateReader$3.process Updating live nodes... (3)
   [junit4]   2> 2217240 T4781 oascc.ZkStateReader$3.process Updating live nodes... (3)
   [junit4]   2> 2217241 T4749 oascc.ZkStateReader$3.process Updating live nodes... (3)
   [junit4]   2> 2217241 T4767 oascc.ZkStateReader$3.process Updating live nodes... (3)
   [junit4]   2> 2217254 T4727 oasc.CorePropertiesLocator.discover Looking for core definitions underneath /Users/jenkins/jenkins-slave/workspace/Lucene-Solr-trunk-MacOSX/solr/build/solr-core/test/J0/./org.apache.solr.cloud.CollectionsAPIDistributedZkTest-jetty2-1375367608554
   [junit4]   2> 2217411 T4727 oasc.CorePropertiesLocator.discoverUnder Found core conf in /Users/jenkins/jenkins-slave/workspace/Lucene-Solr-trunk-MacOSX/solr/build/solr-core/test/J0/./org.apache.solr.cloud.CollectionsAPIDistributedZkTest-jetty2-1375367608554/conf/
   [junit4]   2> 2217419 T4727 oasc.CorePropertiesLocator.discover Found 1 core definitions
   [junit4]   2> 2217420 T4727 oass.SolrDispatchFilter.init user.dir=/Users/jenkins/jenkins-slave/workspace/Lucene-Solr-trunk-MacOSX/solr/build/solr-core/test/J0
   [junit4]   2> 2217420 T4727 oass.SolrDispatchFilter.init SolrDispatchFilter.init() done
   [junit4]   2> 2217421 T4727 oascsi.HttpClientUtil.createClient Creating new http client, config:maxConnections=128&maxConnectionsPerHost=32&followRedirects=false
   [junit4]   2> 2217917 T4727 oejs.Server.doStart jetty-8.1.10.v20130312
   [junit4]   2> 2217926 T4727 oejs.AbstractConnector.doStart Started SelectChannelConnector@127.0.0.1:50463
   [junit4]   2> 2217928 T4727 oass.SolrDispatchFilter.init SolrDispatchFilter.init()
   [junit4]   2> 2217928 T4727 oasc.SolrResourceLoader.locateSolrHome JNDI not configured for solr (NoInitialContextEx)
   [junit4]   2> 2217929 T4727 oasc.SolrResourceLoader.locateSolrHome using system property solr.solr.home: /Users/jenkins/jenkins-slave/workspace/Lucene-Solr-trunk-MacOSX/solr/build/solr-core/test/J0/./org.apache.solr.cloud.CollectionsAPIDistributedZkTest-jetty3-1375367610494
   [junit4]   2> 2217929 T4727 oasc.SolrResourceLoader.<init> new SolrResourceLoader for directory: '/Users/jenkins/jenkins-slave/workspace/Lucene-Solr-trunk-MacOSX/solr/build/solr-core/test/J0/./org.apache.solr.cloud.CollectionsAPIDistributedZkTest-jetty3-1375367610494/'
   [junit4]   2> 2217973 T4727 oasc.ConfigSolr.fromFile Loading container configuration from /Users/jenkins/jenkins-slave/workspace/Lucene-Solr-trunk-MacOSX/solr/build/solr-core/test/J0/./org.apache.solr.cloud.CollectionsAPIDistributedZkTest-jetty3-1375367610494/solr.xml
   [junit4]   2> 2218076 T4727 oasc.ConfigSolrXml.<init> Config-defined core root directory: 
   [junit4]   2> 2218077 T4727 oasc.CoreContainer.<init> New CoreContainer 271420570
   [junit4]   2> 2218077 T4727 oasc.CoreContainer.load Loading cores into CoreContainer [instanceDir=/Users/jenkins/jenkins-slave/workspace/Lucene-Solr-trunk-MacOSX/solr/build/solr-core/test/J0/./org.apache.solr.cloud.CollectionsAPIDistributedZkTest-jetty3-1375367610494/]
   [junit4]   2> 2218080 T4727 oashc.HttpShardHandlerFactory.getParameter Setting socketTimeout to: 120000
   [junit4]   2> 2218080 T4727 oashc.HttpShardHandlerFactory.getParameter Setting urlScheme to: http://
   [junit4]   2> 2218081 T4727 oashc.HttpShardHandlerFactory.getParameter Setting connTimeout to: 15000
   [junit4]   2> 2218081 T4727 oashc.HttpShardHandlerFactory.getParameter Setting maxConnectionsPerHost to: 20
   [junit4]   2> 2218082 T4727 oashc.HttpShardHandlerFactory.getParameter Setting corePoolSize to: 0
   [junit4]   2> 2218082 T4727 oashc.HttpShardHandlerFactory.getParameter Setting maximumPoolSize to: 2147483647
   [junit4]   2> 2218082 T4727 oashc.HttpShardHandlerFactory.getParameter Setting maxThreadIdleTime to: 5
   [junit4]   2> 2218083 T4727 oashc.HttpShardHandlerFactory.getParameter Setting sizeOfQueue to: -1
   [junit4]   2> 2218083 T4727 oashc.HttpShardHandlerFactory.getParameter Setting fairnessPolicy to: false
   [junit4]   2> 2218084 T4727 oascsi.HttpClientUtil.createClient Creating new http client, config:maxConnectionsPerHost=20&maxConnections=10000&socketTimeout=120000&connTimeout=15000&retry=false
   [junit4]   2> 2218103 T4727 oasc.ZkContainer.initZooKeeper Zookeeper client=127.0.0.1:50450/solr
   [junit4]   2> 2218103 T4727 oasc.ZkController.checkChrootPath zkHost includes chroot
   [junit4]   2> 2218107 T4727 oascc.ConnectionManager.waitForConnected Waiting for client to connect to ZooKeeper
   [junit4]   2> 2218111 T4793 oascc.ConnectionManager.process Watcher org.apache.solr.common.cloud.ConnectionManager@1f6306f5 name:ZooKeeperConnection Watcher:127.0.0.1:50450 got event WatchedEvent state:SyncConnected type:None path:null path:null type:None
   [junit4]   2> 2218111 T4727 oascc.ConnectionManager.waitForConnected Client is connected to ZooKeeper
   [junit4]   2> 2218118 T4727 oascsi.HttpClientUtil.createClient Creating new http client, config:maxConnections=500&maxConnectionsPerHost=16&socketTimeout=120000&connTimeout=15000
   [junit4]   2> 2218136 T4727 oascc.ConnectionManager.waitForConnected Waiting for client to connect to ZooKeeper
   [junit4]   2> 2218140 T4795 oascc.ConnectionManager.process Watcher org.apache.solr.common.cloud.ConnectionManager@722f3417 name:ZooKeeperConnection Watcher:127.0.0.1:50450/solr got event WatchedEvent state:SyncConnected type:None path:null path:null type:None
   [junit4]   2> 2218140 T4727 oascc.ConnectionManager.waitForConnected Client is connected to ZooKeeper
   [junit4]   2> 2218150 T4727 oascc.ZkStateReader.createClusterStateWatchersAndUpdate Updating cluster state from ZooKeeper... 
   [junit4]   2> 2219163 T4727 oasc.ZkController.createEphemeralLiveNode Register node as live in ZooKeeper:/live_nodes/127.0.0.1:50463_kb%2Fd
   [junit4]   2> 2219166 T4727 oascc.SolrZkClient.makePath makePath: /live_nodes/127.0.0.1:50463_kb%2Fd
   [junit4]   2> 2219172 T4795 oascc.ZkStateReader$3.process Updating live nodes... (4)
   [junit4]   2> 2219187 T4754 oascc.ZkStateReader$3.process Updating live nodes... (4)
   [junit4]   2> 2219188 T4727 oasc.CorePropertiesLocator.discover Looking for core definitions underneath /Users/jenkins/jenkins-slave/workspace/Lucene-Solr-trunk-MacOSX/solr/build/solr-core/test/J0/./org.apache.solr.cloud.CollectionsAPIDistributedZkTest-jetty3-1375367610494
   [junit4]   2> 2219189 T4767 oascc.ZkStateReader$3.process Updating live nodes... (4)
   [junit4]   2> 2219189 T4781 oascc.ZkStateReader$3.process Updating live nodes... (4)
   [junit4]   2> 2219188 T4749 oascc.ZkStateReader$3.process Updating live nodes... (4)
   [junit4]   2> 2219341 T4727 oasc.CorePropertiesLocator.discoverUnder Found core conf in /Users/jenkins/jenkins-slave/workspace/Lucene-Solr-trunk-MacOSX/solr/build/solr-core/test/J0/./org.apache.solr.cloud.CollectionsAPIDistributedZkTest-jetty3-1375367610494/conf/
   [junit4]   2> 2219351 T4727 oasc.CorePropertiesLocator.discover Found 1 core definitions
   [junit4]   2> 2219352 T4727 oass.SolrDispatchFilter.init user.dir=/Users/jenkins/jenkins-slave/workspace/Lucene-Solr-trunk-MacOSX/solr/build/solr-core/test/J0
   [junit4]   2> 2219352 T4727 oass.SolrDispatchFilter.init SolrDispatchFilter.init() done
   [junit4]   2> 2219353 T4727 oascsi.HttpClientUtil.createClient Creating new http client, config:maxConnections=128&maxConnectionsPerHost=32&followRedirects=false
   [junit4]   2> 2219848 T4727 oejs.Server.doStart jetty-8.1.10.v20130312
   [junit4]   2> 2219854 T4727 oejs.AbstractConnector.doStart Started SelectChannelConnector@127.0.0.1:50466
   [junit4]   2> 2219857 T4727 oass.SolrDispatchFilter.init SolrDispatchFilter.init()
   [junit4]   2> 2219857 T4727 oasc.SolrResourceLoader.locateSolrHome JNDI not configured for solr (NoInitialContextEx)
   [junit4]   2> 2219858 T4727 oasc.SolrResourceLoader.locateSolrHome using system property solr.solr.home: /Users/jenkins/jenkins-slave/workspace/Lucene-Solr-trunk-MacOSX/solr/build/solr-core/test/J0/./org.apache.solr.cloud.CollectionsAPIDistributedZkTest-jetty4-1375367612427
   [junit4]   2> 2219858 T4727 oasc.SolrResourceLoader.<init> new SolrResourceLoader for directory: '/Users/jenkins/jenkins-slave/workspace/Lucene-Solr-trunk-MacOSX/solr/build/solr-core/test/J0/./org.apache.solr.cloud.CollectionsAPIDistributedZkTest-jetty4-1375367612427/'
   [junit4]   2> 2219898 T4727 oasc.ConfigSolr.fromFile Loading container configuration from /Users/jenkins/jenkins-slave/workspace/Lucene-Solr-trunk-MacOSX/solr/build/solr-core/test/J0/./org.apache.solr.cloud.CollectionsAPIDistributedZkTest-jetty4-1375367612427/solr.xml
   [junit4]   2> 2220024 T4727 oasc.ConfigSolrXml.<init> Config-defined core root directory: 
   [junit4]   2> 2220025 T4727 oasc.CoreContainer.<init> New CoreContainer 1586997686
   [junit4]   2> 2220026 T4727 oasc.CoreContainer.load Loading cores into CoreContainer [instanceDir=/Users/jenkins/jenkins-slave/workspace/Lucene-Solr-trunk-MacOSX/solr/build/solr-core/test/J0/./org.apache.solr.cloud.CollectionsAPIDistributedZkTest-jetty4-1375367612427/]
   [junit4]   2> 2220028 T4727 oashc.HttpShardHandlerFactory.getParameter Setting socketTimeout to: 120000
   [junit4]   2> 2220028 T4727 oashc.HttpShardHandlerFactory.getParameter Setting urlScheme to: http://
   [junit4]   2> 2220029 T4727 oashc.HttpShardHandlerFactory.getParameter Setting connTimeout to: 15000
   [junit4]   2> 2220029 T4727 oashc.HttpShardHandlerFactory.getParameter Setting maxConnectionsPerHost to: 20
   [junit4]   2> 2220030 T4727 oashc.HttpShardHandlerFactory.getParameter Setting corePoolSize to: 0
   [junit4]   2> 2220030 T4727 oashc.HttpShardHandlerFactory.getParameter Setting maximumPoolSize to: 2147483647
   [junit4]   2> 2220032 T4727 oashc.HttpShardHandlerFactory.getParameter Setting maxThreadIdleTime to: 5
   [junit4]   2> 2220035 T4727 oashc.HttpShardHandlerFactory.getParameter Setting sizeOfQueue to: -1
   [junit4]   2> 2220037 T4727 oashc.HttpShardHandlerFactory.getParameter Setting fairnessPolicy to: false
   [junit4]   2> 2220038 T4727 oascsi.HttpClientUtil.createClient Creating new http client, config:maxConnectionsPerHost=20&maxConnections=10000&socketTimeout=120000&connTimeout=15000&retry=false
   [junit4]   2> 2220058 T4727 oasc.ZkContainer.initZooKeeper Zookeeper client=127.0.0.1:50450/solr
   [junit4]   2> 2220058 T4727 oasc.ZkController.checkChrootPath zkHost includes chroot
   [junit4]   2> 2220060 T4727 oascc.ConnectionManager.waitForConnected Waiting for client to connect to ZooKeeper
   [junit4]   2> 2220065 T4807 oascc.ConnectionManager.process Watcher org.apache.solr.common.cloud.ConnectionManager@6d289f1f name:ZooKeeperConnection Watcher:127.0.0.1:50450 got event WatchedEvent state:SyncConnected type:None path:null path:null type:None
   [junit4]   2> 2220065 T4727 oascc.ConnectionManager.waitForConnected Client is connected to ZooKeeper
   [junit4]   2> 2220068 T4727 oascsi.HttpClientUtil.createClient Creating new http client, config:maxConnections=500&maxConnectionsPerHost=16&socketTimeout=120000&connTimeout=15000
   [junit4]   2> 2220088 T4727 oascc.ConnectionManager.waitForConnected Waiting for client to connect to ZooKeeper
   [junit4]   2> 2220091 T4809 oascc.ConnectionManager.process Watcher org.apache.solr.common.cloud.ConnectionManager@3697fbf9 name:ZooKeeperConnection Watcher:127.0.0.1:50450/solr got event WatchedEvent state:SyncConnected type:None path:null path:null type:None
   [junit4]   2> 2220092 T4727 oascc.ConnectionManager.waitForConnected Client is connected to ZooKeeper
   [junit4]   2> 2220100 T4727 oascc.ZkStateReader.createClusterStateWatchersAndUpdate Updating cluster state from ZooKeeper... 
   [junit4]   2> 2221112 T4727 oasc.ZkController.createEphemeralLiveNode Register node as live in ZooKeeper:/live_nodes/127.0.0.1:50466_kb%2Fd
   [junit4]   2> 2221116 T4727 oascc.SolrZkClient.makePath makePath: /live_nodes/127.0.0.1:50466_kb%2Fd
   [junit4]   2> 2221123 T4795 oascc.ZkStateReader$3.process Updating live nodes... (5)
   [junit4]   2> 2221137 T4727 oasc.CorePropertiesLocator.discover Looking for core definitions underneath /Users/jenkins/jenkins-slave/workspace/Lucene-Solr-trunk-MacOSX/solr/build/solr-core/test/J0/./org.apache.solr.cloud.CollectionsAPIDistributedZkTest-jetty4-1375367612427
   [junit4]   2> 2221161 T4749 oascc.ZkStateReader$3.process Updating live nodes... (5)
   [junit4]   2> 2221161 T4809 oascc.ZkStateReader$3.process Updating live nodes... (5)
   [junit4]   2> 2221162 T4781 oascc.ZkStateReader$3.process Updating live nodes... (5)
   [junit4]   2> 2221162 T4754 oascc.ZkStateReader$3.process Updating live nodes... (5)
   [junit4]   2> 2221178 T4767 oascc.ZkStateReader$3.process Updating live nodes... (5)
   [junit4]   2> 2221310 T4727 oasc.CorePropertiesLocator.discoverUnder Found core conf in /Users/jenkins/jenkins-slave/workspace/Lucene-Solr-trunk-MacOSX/solr/build/solr-core/test/J0/./org.apache.solr.cloud.CollectionsAPIDistributedZkTest-jetty4-1375367612427/conf/
   [junit4]   2> 2221318 T4727 oasc.CorePropertiesLocator.discover Found 1 core definitions
   [junit4]   2> 2221319 T4727 oass.SolrDispatchFilter.init user.dir=/Users/jenkins/jenkins-slave/workspace/Lucene-Solr-trunk-MacOSX/solr/build/solr-core/test/J0
   [junit4]   2> 2221320 T4727 oass.SolrDispatchFilter.init SolrDispatchFilter.init() done
   [junit4]   2> 2221321 T4727 oascsi.HttpClientUtil.createClient Creating new http client, config:maxConnections=128&maxConnectionsPerHost=32&followRedirects=false
   [junit4]   2> 2221340 T4727 oascsi.HttpClientUtil.createClient Creating new http client, config:maxConnections=128&maxConnectionsPerHost=32&followRedirects=false
   [junit4]   2> 2221359 T4763 oasha.CollectionsHandler.handleCreateAction Creating Collection : numShards=2&name=nodes_used_collection&replicationFactor=2&action=CREATE&wt=javabin&version=2
   [junit4]   2> 2221362 T4749 oasc.DistributedQueue$LatchChildWatcher.process Watcher fired on path: /overseer/collection-queue-work state: SyncConnected type NodeChildrenChanged
   [junit4]   2> 2221366 T4751 oasc.OverseerCollectionProcessor.run Overseer Collection Processor: Get the message id:/overseer/collection-queue-work/qn-0000000000 message:{
   [junit4]   2> 	  "operation":"createcollection",
   [junit4]   2> 	  "numShards":"2",
   [junit4]   2> 	  "name":"nodes_used_collection",
   [junit4]   2> 	  "replicationFactor":"2"}
   [junit4]   2> 2221366 T4751 oasc.OverseerCollectionProcessor.processMessage WARN OverseerCollectionProcessor.processMessage : createcollection , {
   [junit4]   2> 	  "operation":"createcollection",
   [junit4]   2> 	  "numShards":"2",
   [junit4]   2> 	  "name":"nodes_used_collection",
   [junit4]   2> 	  "replicationFactor":"2"}
   [junit4]   2> 2222312 T4750 oascc.ZkStateReader.updateClusterState Updating cloud state from ZooKeeper... 
   [junit4]   2> 2222314 T4750 oasc.Overseer$ClusterStateUpdater.buildCollection building a new collection: nodes_used_collection
   [junit4]   2> 2222315 T4750 oasc.Overseer$ClusterStateUpdater.createCollection Create collection nodes_used_collection with shards [shard1, shard2]
   [junit4]   2> 2222327 T4795 oascc.ZkStateReader$2.process A cluster state change: WatchedEvent state:SyncConnected type:NodeDataChanged path:/clusterstate.json, has occurred - updating... (live nodes size: 5)
   [junit4]   2> 2222327 T4767 oascc.ZkStateReader$2.process A cluster state change: WatchedEvent state:SyncConnected type:NodeDataChanged path:/clusterstate.json, has occurred - updating... (live nodes size: 5)
   [junit4]   2> 2222333 T4749 oascc.ZkStateReader$2.process A cluster state change: WatchedEvent state:SyncConnected type:NodeDataChanged path:/clusterstate.json, has occurred - updating... (live nodes size: 5)
   [junit4]   2> 2222335 T4809 oascc.ZkStateReader$2.process A cluster state change: WatchedEvent state:SyncConnected type:NodeDataChanged path:/clusterstate.json, has occurred - updating... (live nodes size: 5)
   [junit4]   2> 2222336 T4754 oascc.ZkStateReader$2.process A cluster state change: WatchedEvent state:SyncConnected type:NodeDataChanged path:/clusterstate.json, has occurred - updating... (live nodes size: 5)
   [junit4]   2> 2222335 T4781 oascc.ZkStateReader$2.process A cluster state change: WatchedEvent state:SyncConnected type:NodeDataChanged path:/clusterstate.json, has occurred - updating... (live nodes size: 5)
   [junit4]   2> 2222386 T4751 oasc.OverseerCollectionProcessor.createCollection going to create cores replicas shardNames [shard1, shard2] , repFactor : 2
   [junit4]   2> 2222387 T4751 oasc.OverseerCollectionProcessor.createCollection Creating shard nodes_used_collection_shard1_replica1 as part of slice shard1 of collection nodes_used_collection on 127.0.0.1:50457_kb%2Fd
   [junit4]   2> 2222388 T4751 oasc.OverseerCollectionProcessor.createCollection Creating shard nodes_used_collection_shard1_replica2 as part of slice shard1 of collection nodes_used_collection on 127.0.0.1:50460_kb%2Fd
   [junit4]   2> 2222388 T4751 oasc.OverseerCollectionProcessor.createCollection Creating shard nodes_used_collection_shard2_replica1 as part of slice shard2 of collection nodes_used_collection on 127.0.0.1:50453_kb%2Fd
   [junit4]   2> 2222393 T4751 oasc.OverseerCollectionProcessor.createCollection Creating shard nodes_used_collection_shard2_replica2 as part of slice shard2 of collection nodes_used_collection on 127.0.0.1:50466_kb%2Fd
   [junit4]   2> 2222400 T4759 oasc.ZkController.publish publishing core=nodes_used_collection_shard1_replica1 state=down
   [junit4]   2> 2222410 T4774 oasc.ZkController.publish publishing core=nodes_used_collection_shard1_replica2 state=down
   [junit4]   2> 2222411 T4800 oasc.ZkController.publish publishing core=nodes_used_collection_shard2_replica2 state=down
   [junit4]   2> 2222412 T4759 oasc.ZkController.waitForCoreNodeName look for our core node name
   [junit4]   2> 2222413 T4744 oasc.ZkController.publish publishing core=nodes_used_collection_shard2_replica1 state=down
   [junit4]   2> 2222415 T4774 oasc.ZkController.waitForCoreNodeName look for our core node name
   [junit4]   2> 2222415 T4800 oasc.ZkController.waitForCoreNodeName look for our core node name
   [junit4]   2> 2222418 T4744 oasc.ZkController.waitForCoreNodeName look for our core node name
   [junit4]   2> 2223850 T4750 oascc.ZkStateReader.updateClusterState Updating cloud state from ZooKeeper... 
   [junit4]   2> 2223853 T4750 oasc.Overseer$ClusterStateUpdater.updateState WARN Could not find collection node for nodes_used_collection, skipping publish state
   [junit4]   2> 2223853 T4750 oasc.Overseer$ClusterStateUpdater.updateState Update state numShards=2 message={
   [junit4]   2> 	  "operation":"state",
   [junit4]   2> 	  "core_node_name":"core_node1",
   [junit4]   2> 	  "numShards":"2",
   [junit4]   2> 	  "shard":"shard1",
   [junit4]   2> 	  "roles":null,
   [junit4]   2> 	  "state":"down",
   [junit4]   2> 	  "shard_state":"active",
   [junit4]   2> 	  "core":"nodes_used_collection_shard1_replica1",
   [junit4]   2> 	  "collection":"nodes_used_collection",
   [junit4]   2> 	  "shard_range":null,
   [junit4]   2> 	  "node_name":"127.0.0.1:50457_kb%2Fd",
   [junit4]   2> 	  "base_url":"http://127.0.0.1:50457/kb/d"}
   [junit4]   2> 2223864 T4750 oasc.Overseer$ClusterStateUpdater.updateState WARN Could not find collection node for nodes_used_collection, skipping publish state
   [junit4]   2> 2223865 T4750 oasc.Overseer$ClusterStateUpdater.updateState Update state numShards=2 message={
   [junit4]   2> 	  "operation":"state",
   [junit4]   2> 	  "core_node_name":"core_node2",
   [junit4]   2> 	  "numShards":"2",
   [junit4]   2> 	  "shard":"shard1",
   [junit4]   2> 	  "roles":null,
   [junit4]   2> 	  "state":"down",
   [junit4]   2> 	  "shard_state":"active",
   [junit4]   2> 	  "core":"nodes_used_collection_shard1_replica2",
   [junit4]   2> 	  "collection":"nodes_used_collection",
   [junit4]   2> 	  "shard_range":null,
   [junit4]   2> 	  "node_name":"127.0.0.1:50460_kb%2Fd",
   [junit4]   2> 	  "base_url":"http://127.0.0.1:50460/kb/d"}
   [junit4]   2> 2223874 T4750 oasc.Overseer$ClusterStateUpdater.updateState WARN Could not find collection node for nodes_used_collection, skipping publish state
   [junit4]   2> 2223875 T4750 oasc.Overseer$ClusterStateUpdater.updateState Update state numShards=2 message={
   [junit4]   2> 	  "operation":"state",
   [junit4]   2> 	  "core_node_name":"core_node3",
   [junit4]   2> 	  "numShards":"2",
   [junit4]   2> 	  "shard":"shard2",
   [junit4]   2> 	  "roles":null,
   [junit4]   2> 	  "state":"down",
   [junit4]   2> 	  "shard_state":"active",
   [junit4]   2> 	  "core":"nodes_used_collection_shard2_replica2",
   [junit4]   2> 	  "collection":"nodes_used_collection",
   [junit4]   2> 	  "shard_range":null,
   [junit4]   2> 	  "node_name":"127.0.0.1:50466_kb%2Fd",
   [junit4]   2> 	  "base_url":"http://127.0.0.1:50466/kb/d"}
   [junit4]   2> 2223886 T4750 oasc.Overseer$ClusterStateUpdater.updateState WARN Could not find collection node for nodes_used_collection, skipping publish state
   [junit4]   2> 2223886 T4750 oasc.Overseer$ClusterStateUpdater.updateState Update state numShards=2 message={
   [junit4]   2> 	  "operation":"state",
   [junit4]   2> 	  "core_node_name":"core_node4",
   [junit4]   2> 	  "numShards":"2",
   [junit4]   2> 	  "shard":"shard2",
   [junit4]   2> 	  "roles":null,
   [junit4]   2> 	  "state":"down",
   [junit4]   2> 	  "shard_state":"active",
   [junit4]   2> 	  "core":"nodes_used_collection_shard2_replica1",
   [junit4]   2> 	  "collection":"nodes_used_collection",
   [junit4]   2> 	  "shard_range":null,
   [junit4]   2> 	  "node_name":"127.0.0.1:50453_kb%2Fd",
   [junit4]   2> 	  "base_url":"http://127.0.0.1:50453/kb/d"}
   [junit4]   2> 2223901 T4781 oascc.ZkStateReader$2.process A cluster state change: WatchedEvent state:SyncConnected type:NodeDataChanged path:/clusterstate.json, has occurred - updating... (live nodes size: 5)
   [junit4]   2> 2223901 T4749 oascc.ZkStateReader$2.process A cluster state change: WatchedEvent state:SyncConnected type:NodeDataChanged path:/clusterstate.json, has occurred - updating... (live nodes size: 5)
   [junit4]   2> 2223902 T4795 oascc.ZkStateReader$2.process A cluster state change: WatchedEvent state:SyncConnected type:NodeDataChanged path:/clusterstate.json, has occurred - updating... (live nodes size: 5)
   [junit4]   2> 2223903 T4809 oascc.ZkStateReader$2.process A cluster state change: WatchedEvent state:SyncConnected type:NodeDataChanged path:/clusterstate.json, has occurred - updating... (live nodes size: 5)
   [junit4]   2> 2223904 T4754 oascc.ZkStateReader$2.process A cluster state change: WatchedEvent state:SyncConnected type:NodeDataChanged path:/clusterstate.json, has occurred - updating... (live nodes size: 5)
   [junit4]   2> 2223904 T4767 oascc.ZkStateReader$2.process A cluster state change: WatchedEvent state:SyncConnected type:NodeDataChanged path:/clusterstate.json, has occurred - updating... (live nodes size: 5)
   [junit4]   2> 2224415 T4759 oasc.ZkController.waitForShardId waiting to find shard id in clusterstate for nodes_used_collection_shard1_replica1
   [junit4]   2> 2224417 T4759 oasc.CorePropertiesLocator.writePropertiesFile ERROR Couldn't persist core properties to /Users/jenkins/jenkins-slave/workspace/Lucene-Solr-trunk-MacOSX/solr/build/solr-core/test/J0/./org.apache.solr.cloud.CollectionsAPIDistributedZkTest-jetty1-1375367606538/nodes_used_collection_shard1_replica1/core.properties: java.io.FileNotFoundException: /Users/jenkins/jenkins-slave/workspace/Lucene-Solr-trunk-MacOSX/solr/build/solr-core/test/J0/./org.apache.solr.cloud.CollectionsAPIDistributedZkTest-jetty1-1375367606538/nodes_used_collection_shard1_replica1/core.properties (No such file or directory)
   [junit4]   2> 2224417 T4759 oasc.CoreContainer.create Creating SolrCore 'nodes_used_collection_shard1_replica1' using instanceDir: /Users/jenkins/jenkins-slave/workspace/Lucene-Solr-trunk-MacOSX/solr/build/solr-core/test/J0/./org.apache.solr.cloud.CollectionsAPIDistributedZkTest-jetty1-1375367606538/nodes_used_collection_shard1_replica1
   [junit4]   2> 2224418 T4759 oasc.ZkController.createCollectionZkNode Check for collection zkNode:nodes_used_collection
   [junit4]   2> 2224419 T4800 oasc.ZkController.waitForShardId waiting to find shard id in clusterstate for nodes_used_collection_shard2_replica2
   [junit4]   2> 2224420 T4800 oasc.CorePropertiesLocator.writePropertiesFile ERROR Couldn't persist core properties to /Users/jenkins/jenkins-slave/workspace/Lucene-Solr-trunk-MacOSX/solr/build/solr-core/test/J0/./org.apache.solr.cloud.CollectionsAPIDistributedZkTest-jetty4-1375367612427/nodes_used_collection_shard2_replica2/core.properties: java.io.FileNotFoundException: /Users/jenkins/jenkins-slave/workspace/Lucene-Solr-trunk-MacOSX/solr/build/solr-core/test/J0/./org.apache.solr.cloud.CollectionsAPIDistributedZkTest-jetty4-1375367612427/nodes_used_collection_shard2_replica2/core.properties (No such file or directory)
   [junit4]   2> 2224421 T4800 oasc.CoreContainer.create Creating SolrCore 'nodes_used_collection_shard2_replica2' using instanceDir: /Users/jenkins/jenkins-slave/workspace/Lucene-Solr-trunk-MacOSX/solr/build/solr-core/test/J0/./org.apache.solr.cloud.CollectionsAPIDistributedZkTest-jetty4-1375367612427/nodes_used_collection_shard2_replica2
   [junit4]   2> 2224421 T4800 oasc.ZkController.createCollectionZkNode Check for collection zkNode:nodes_used_collection
   [junit4]   2> 2224421 T4774 oasc.ZkController.waitForShardId waiting to find shard id in clusterstate for nodes_used_collection_shard1_replica2
   [junit4]   2> 2224422 T4759 oasc.ZkController.createCollectionZkNode Creating collection in ZooKeeper:nodes_used_collection
   [junit4]   2> 2224422 T4759 oasc.ZkController.getConfName Looking for collection configName
   [junit4]   2> 2224428 T4744 oasc.ZkController.waitForShardId waiting to find shard id in clusterstate for nodes_used_collection_shard2_replica1
   [junit4]   2> 2224430 T4744 oasc.CorePropertiesLocator.writePropertiesFile ERROR Couldn't persist core properties to /Users/jenkins/jenkins-slave/workspace/Lucene-Solr-trunk-MacOSX/solr/build/solr-core/test/J0/./org.apache.solr.cloud.CollectionsAPIDistributedZkTest-controljetty-1375367605428/nodes_used_collection_shard2_replica1/core.properties: java.io.FileNotFoundException: /Users/jenkins/jenkins-slave/workspace/Lucene-Solr-trunk-MacOSX/solr/build/solr-core/test/J0/./org.apache.solr.cloud.CollectionsAPIDistributedZkTest-controljetty-1375367605428/nodes_used_collection_shard2_replica1/core.properties (No such file or directory)
   [junit4]   2> 2224430 T4744 oasc.CoreContainer.create Creating SolrCore 'nodes_used_collection_shard2_replica1' using instanceDir: /Users/jenkins/jenkins-slave/workspace/Lucene-Solr-trunk-MacOSX/solr/build/solr-core/test/J0/./org.apache.solr.cloud.CollectionsAPIDistributedZkTest-controljetty-1375367605428/nodes_used_collection_shard2_replica1
   [junit4]   2> 2224430 T4744 oasc.ZkController.createCollectionZkNode Check for collection zkNode:nodes_used_collection
   [junit4]   2> 2224431 T4800 oasc.ZkController.createCollectionZkNode Creating collection in ZooKeeper:nodes_used_collection
   [junit4]   2> 2224431 T4800 oasc.ZkController.getConfName Looking for collection configName
   [junit4]   2> 2224422 T4774 oasc.CorePropertiesLocator.writePropertiesFile ERROR Couldn't persist core properties to /Users/jenkins/jenkins-slave/workspace/Lucene-Solr-trunk-MacOSX/solr/build/solr-core/test/J0/./org.apache.solr.cloud.CollectionsAPIDistributedZkTest-jetty2-1375367608554/nodes_used_collection_shard1_replica2/core.properties: java.io.FileNotFoundException: /Users/jenkins/jenkins-slave/workspace/Lucene-Solr-trunk-MacOSX/solr/build/solr-core/test/J0/./org.apache.solr.cloud.CollectionsAPIDistributedZkTest-jetty2-1375367608554/nodes_used_collection_shard1_replica2/core.properties (No such file or directory)
   [junit4]   2> 2224433 T4774 oasc.CoreContainer.create Creating SolrCore 'nodes_used_collection_shard1_replica2' using instanceDir: /Users/jenkins/jenkins-slave/workspace/Lucene-Solr-trunk-MacOSX/solr/build/solr-core/test/J0/./org.apache.solr.cloud.CollectionsAPIDistributedZkTest-jetty2-1375367608554/nodes_used_collection_shard1_replica2
   [junit4]   2> 2224433 T4774 oasc.ZkController.createCollectionZkNode Check for collection zkNode:nodes_used_collection
   [junit4]   2> 2224432 T4744 oasc.ZkController.createCollectionZkNode Creating collection in ZooKeeper:nodes_used_collection
   [junit4]   2> 2224434 T4744 oasc.ZkController.getConfName Looking for collection configName
   [junit4]   2> 2224430 T4759 oasc.ZkController.getConfName Only one config set found in zk - using it:conf1
   [junit4]   2> 2224437 T4759 oascc.SolrZkClient.makePath makePath: /collections/nodes_used_collection
   [junit4]   2> 2224434 T4774 oasc.ZkController.createCollectionZkNode Creating collection in ZooKeeper:nodes_used_collection
   [junit4]   2> 2224438 T4774 oasc.ZkController.getConfName Looking for collection configName
   [junit4]   2> 2224434 T4800 oasc.ZkController.getConfName Only one config set found in zk - using it:conf1
   [junit4]   2> 2224438 T4800 oascc.SolrZkClient.makePath makePath: /collections/nodes_used_collection
   [junit4]   2> 2224439 T4744 oasc.ZkController.getConfName Only one config set found in zk - using it:conf1
   [junit4]   2> 2224440 T4744 oascc.SolrZkClient.makePath makePath: /collections/nodes_used_collection
   [junit4]   2> 2224443 T4774 oasc.ZkController.getConfName Only one config set found in zk - using it:conf1
   [junit4]   2> 2224444 T4774 oascc.SolrZkClient.makePath makePath: /collections/nodes_used_collection
   [junit4]   2> 2224444 T4759 oasc.ZkController.readConfigName Load collection config from:/collections/nodes_used_collection
   [junit4]   2> 2224446 T4800 oasc.ZkController.readConfigName Load collection config from:/collections/nodes_used_collection
   [junit4]   2> 2224449 T4759 oasc.SolrResourceLoader.<init> new SolrResourceLoader for directory: '/Users/jenkins/jenkins-slave/workspace/Lucene-Solr-trunk-MacOSX/solr/build/solr-core/test/J0/./org.apache.solr.cloud.CollectionsAPIDistributedZkTest-jetty1-1375367606538/nodes_used_collection_shard1_replica1/'
   [junit4]   2> 2224451 T4744 oasc.ZkController.readConfigName Load collection config from:/collections/nodes_used_collection
   [junit4]   2> 2224462 T4800 oasc.SolrResourceLoader.<init> new SolrResourceLoader for directory: '/Users/jenkins/jenkins-slave/workspace/Lucene-Solr-trunk-MacOSX/solr/build/solr-core/test/J0/./org.apache.solr.cloud.CollectionsAPIDistributedZkTest-jetty4-1375367612427/nodes_used_collection_shard2_replica2/'
   [junit4]   2> 2224463 T4774 oasc.ZkController.readConfigName Load collection config from:/collections/nodes_used_collection
   [junit4]   2> 2224466 T4744 oasc.SolrResourceLoader.<init> new SolrResourceLoader for directory: '/Users/jenkins/jenkins-slave/workspace/Lucene-Solr-trunk-MacOSX/solr/build/solr-core/test/J0/./org.apache.solr.cloud.CollectionsAPIDistributedZkTest-controljetty-1375367605428/nodes_used_collection_shard2_replica1/'
   [junit4]   2> 2224471 T4774 oasc.SolrResourceLoader.<init> new SolrResourceLoader for directory: '/Users/jenkins/jenkins-slave/workspace/Lucene-Solr-trunk-MacOSX/solr/build/solr-core/test/J0/./org.apache.solr.cloud.CollectionsAPIDistributedZkTest-jetty2-1375367608554/nodes_used_collection_shard1_replica2/'
   [junit4]   2> 2224724 T4800 oasc.SolrConfig.<init> Using Lucene MatchVersion: LUCENE_50
   [junit4]   2> 2224742 T4774 oasc.SolrConfig.<init> Using Lucene MatchVersion: LUCENE_50
   [junit4]   2> 2224747 T4744 oasc.SolrConfig.<init> Using Lucene MatchVersion: LUCENE_50
   [junit4]   2> 2224824 T4759 oasc.SolrConfig.<init> Using Lucene MatchVersion: LUCENE_50
   [junit4]   2> 2224960 T4774 oasc.SolrConfig.<init> Loaded SolrConfig: solrconfig.xml
   [junit4]   2> 2225005 T4774 oass.IndexSchema.readSchema Reading Solr Schema from schema.xml
   [junit4]   2> 2225023 T4774 oass.IndexSchema.readSchema [nodes_used_collection_shard1_replica2] Schema name=test
   [junit4]   2> 2225050 T4744 oasc.SolrConfig.<init> Loaded SolrConfig: solrconfig.xml
   [junit4]   2> 2225060 T4744 oass.IndexSchema.readSchema Reading Solr Schema from schema.xml
   [junit4]   2> 2225085 T4759 oasc.SolrConfig.<init> Loaded SolrConfig: solrconfig.xml
   [junit4]   2> 2225098 T4744 oass.IndexSchema.readSchema [nodes_used_collection_shard2_replica1] Schema name=test
   [junit4]   2> 2225101 T4759 oass.IndexSchema.readSchema Reading Solr Schema from schema.xml
   [junit4]   2> 2225136 T4759 oass.IndexSchema.readSchema [nodes_used_collection_shard1_replica1] Schema name=test
   [junit4]   2> 2225137 T4800 oasc.SolrConfig.<init> Loaded SolrConfig: solrconfig.xml
   [junit4]   2> 2225172 T4800 oass.IndexSchema.readSchema Reading Solr Schema from schema.xml
   [junit4]   2> 2225213 T4800 oass.IndexSchema.readSchema [nodes_used_collection_shard2_replica2] Schema name=test
   [junit4]   2> 2228002 T4744 oass.OpenExchangeRatesOrgProvider.init Initialized with rates=open-exchange-rates.json, refreshInterval=1440.
   [junit4]   2> 2228096 T4744 oass.IndexSchema.readSchema default search field in schema is text
   [junit4]   2> 2228109 T4744 oass.IndexSchema.readSchema unique key field: id
   [junit4]   2> 2228215 T4774 oass.OpenExchangeRatesOrgProvider.init Initialized with rates=open-exchange-rates.json, refreshInterval=1440.
   [junit4]   2> 2228237 T4800 oass.OpenExchangeRatesOrgProvider.init Initialized with rates=open-exchange-rates.json, refreshInterval=1440.
   [junit4]   2> 2228255 T4800 oass.IndexSchema.readSchema default search field in schema is text
   [junit4]   2> 2228280 T4774 oass.IndexSchema.readSchema default search field in schema is text
   [junit4]   2> 2228295 T4800 oass.IndexSchema.readSchema unique key field: id
   [junit4]   2> 2228297 T4774 oass.IndexSchema.readSchema unique key field: id
   [junit4]   2> 2228348 T4744 oass.FileExchangeRateProvider.reload Reloading exchange rates from file currency.xml
   [junit4]   2> 2228387 T4744 oass.FileExchangeRateProvider.reload Reloading exchange rates from file currency.xml
   [junit4]   2> 2228394 T4774 oass.FileExchangeRateProvider.reload Reloading exchange rates from file currency.xml
   [junit4]   2> 2228405 T4744 oass.OpenExchangeRatesOrgProvider.reload Reloading exchange rates from open-exchange-rates.json
   [junit4]   2> 2228417 T4774 oass.FileExchangeRateProvider.reload Reloading exchange rates from file currency.xml
   [junit4]   2> 2228418 T4759 oass.OpenExchangeRatesOrgProvider.init Initialized with rates=open-exchange-rates.json, refreshInterval=1440.
   [junit4]   2> 2228420 T4744 oass.OpenExchangeRatesOrgProvider$OpenExchangeRates.<init> WARN Unknown key IMPORTANT NOTE
   [junit4]   2> 2228425 T4744 oass.OpenExchangeRatesOrgProvider$OpenExchangeRates.<init> WARN Expected key, got STRING
   [junit4]   2> 2228425 T4744 oass.OpenExchangeRatesOrgProvider.reload Reloading exchange rates from open-exchange-rates.json
   [junit4]   2> 2228430 T4774 oass.OpenExchangeRatesOrgProvider.reload Reloading exchange rates from open-exchange-rates.json
   [junit4]   2> 2228433 T4800 oass.FileExchangeRateProvider.reload Reloading exchange rates from file currency.xml
   [junit4]   2> 2228435 T4774 oass.OpenExchangeRatesOrgProvider$OpenExchangeRates.<init> WARN Unknown key IMPORTANT NOTE
   [junit4]   2> 2228435 T4774 oass.OpenExchangeRatesOrgProvider$OpenExchangeRates.<init> WARN Expected key, got STRING
   [junit4]   2> 2228436 T4774 oass.OpenExchangeRatesOrgProvider.reload Reloading exchange rates from open-exchange-rates.json
   [junit4]   2> 2228442 T4774 oass.OpenExchangeRatesOrgProvider$OpenExchangeRates.<init> WARN Unknown key IMPORTANT NOTE
   [junit4]   2> 2228443 T4774 oass.OpenExchangeRatesOrgProvider$OpenExchangeRates.<init> WARN Expected key, got STRING
   [junit4]   2> 2228443 T4744 oass.OpenExchangeRatesOrgProvider$OpenExchangeRates.<init> WARN Unknown key IMPORTANT NOTE
   [junit4]   2> 2228444 T4744 oass.OpenExchangeRatesOrgProvider$OpenExchangeRates.<init> WARN Expected key, got STRING
   [junit4]   2> 2228453 T4744 oasc.SolrCore.initDirectoryFactory org.apache.solr.core.MockDirectoryFactory
   [junit4]   2> 2228454 T4744 oasc.SolrCore.<init> [nodes_used_collection_shard2_replica1] Opening new SolrCore at /Users/jenkins/jenkins-slave/workspace/Lucene-Solr-trunk-MacOSX/solr/build/solr-core/test/J0/./org.apache.solr.cloud.CollectionsAPIDistributedZkTest-controljetty-1375367605428/nodes_used_collection_shard2_replica1/, dataDir=/Users/jenkins/jenkins-slave/workspace/Lucene-Solr-trunk-MacOSX/solr/build/solr-core/test/J0/./org.apache.solr.cloud.CollectionsAPIDistributedZkTest-controljetty-1375367605428//nodes_used_collection_shard2_replica1/data/
   [junit4]   2> 2228455 T4744 oasc.JmxMonitoredMap.<init> JMX monitoring is enabled. Adding Solr mbeans to JMX Server: com.sun.jmx.mbeanserver.JmxMBeanServer@747faa2b
   [junit4]   2> 2228450 T4800 oass.FileExchangeRateProvider.reload Reloading exchange rates from file currency.xml
   [junit4]   2> 2228451 T4774 oasc.SolrCore.initDirectoryFactory org.apache.solr.core.MockDirectoryFactory
   [junit4]   2> 2228458 T4774 oasc.SolrCore.<init> [nodes_used_collection_shard1_replica2] Opening new SolrCore at /Users/jenkins/jenkins-slave/workspace/Lucene-Solr-trunk-MacOSX/solr/build/solr-core/test/J0/./org.apache.solr.cloud.CollectionsAPIDistributedZkTest-jetty2-1375367608554/nodes_used_collection_shard1_replica2/, dataDir=/Users/jenkins/jenkins-slave/workspace/Lucene-Solr-trunk-MacOSX/solr/build/solr-core/test/J0/./org.apache.solr.cloud.CollectionsAPIDistributedZkTest-jetty2-1375367608554//nodes_used_collection_shard1_replica2/data/
   [junit4]   2> 2228459 T4774 oasc.JmxMonitoredMap.<init> JMX monitoring is enabled. Adding Solr mbeans to JMX Server: com.sun.jmx.mbeanserver.JmxMBeanServer@747faa2b
   [junit4]   2> 2228464 T4774 oasc.CachingDirectoryFactory.get return new directory for /Users/jenkins/jenkins-slave/workspace/Lucene-Solr-trunk-MacOSX/solr/build/solr-core/test/J0/./org.apache.solr.cloud.CollectionsAPIDistributedZkTest-jetty2-1375367608554//nodes_used_collection_shard1_replica2/data
   [junit4]   2> 2228465 T4774 oasc.SolrCore.getNewIndexDir New index directory detected: old=null new=/Users/jenkins/jenkins-slave/workspace/Lucene-Solr-trunk-MacOSX/solr/build/solr-core/test/J0/./org.apache.solr.cloud.CollectionsAPIDistributedZkTest-jetty2-1375367608554//nodes_used_collection_shard1_replica2/data/index/
   [junit4]   2> 2228466 T4774 oasc.SolrCore.initIndex WARN [nodes_used_collection_shard1_replica2] Solr index directory '/Users/jenkins/jenkins-slave/workspace/Lucene-Solr-trunk-MacOSX/solr/build/solr-core/test/J0/./org.apache.solr.cloud.CollectionsAPIDistributedZkTest-jetty2-1375367608554/nodes_used_collection_shard1_replica2/data/index' doesn't exist. Creating new index...
   [junit4]   2> 2228467 T4774 oasc.CachingDirectoryFactory.get return new directory for /Users/jenkins/jenkins-slave/workspace/Lucene-Solr-trunk-MacOSX/solr/build/solr-core/test/J0/./org.apache.solr.cloud.CollectionsAPIDistributedZkTest-jetty2-1375367608554//nodes_used_collection_shard1_replica2/data/index
   [junit4]   2> 2228477 T4774 oasc.SolrDeletionPolicy.onCommit SolrDeletionPolicy.onCommit: commits: num=1
   [junit4]   2> 		commit{dir=MockDirWrapper(org.apache.lucene.store.RAMDirectory@b810f93 lockFactory=org.apache.lucene.store.NativeFSLockFactory@41a34556),segFN=segments_1,generation=1}
   [junit4]   2> 2228478 T4774 oasc.SolrDeletionPolicy.updateCommits newest commit generation = 1
   [junit4]   2> 2228489 T4774 oasup.UpdateRequestProcessorChain.init inserting DistributedUpdateProcessorFactory into updateRequestProcessorChain "dedupe"
   [junit4]   2> 2228490 T4774 oasup.UpdateRequestProcessorChain.init inserting DistributedUpdateProcessorFactory into updateRequestProcessorChain "stored_sig"
   [junit4]   2> 2228492 T4774 oasup.UpdateRequestProcessorChain.init inserting DistributedUpdateProcessorFactory into updateRequestProcessorChain "distrib-dup-test-chain-implicit"
   [junit4]   2> 2228494 T4774 oasc.RequestHandlers.initHandlersFromConfig created standard: solr.StandardRequestHandler
   [junit4]   2> 2228495 T4774 oasc.RequestHandlers.initHandlersFromConfig created /get: solr.RealTimeGetHandler
   [junit4]   2> 2228496 T4774 oasc.RequestHandlers.initHandlersFromConfig adding lazy requestHandler: solr.ReplicationHandler
   [junit4]   2> 2228497 T4774 oasc.RequestHandlers.initHandlersFromConfig created /replication: solr.ReplicationHandler
   [junit4]   2> 2228498 T4774 oasc.RequestHandlers.initHandlersFromConfig created /update: solr.UpdateRequestHandler
   [junit4]   2> 2228500 T4774 oasc.RequestHandlers.initHandlersFromConfig created /admin/: org.apache.solr.handler.admin.AdminHandlers
   [junit4]   2> 2228450 T4759 oass.IndexSchema.readSchema default search field in schema is text
   [junit4]   2> 2228560 T4759 oass.IndexSchema.readSchema unique key field: id
   [junit4]   2> 2228555 T4774 oashl.XMLLoader.init xsltCacheLifetimeSeconds=60
   [junit4]   2> 2228552 T4800 oass.OpenExchangeRatesOrgProvider.reload Reloading exchange rates from open-exchange-rates.json
   [junit4]   2> 2228457 T4744 oasc.CachingDirectoryFactory.get return new directory for /Users/jenkins/jenkins-slave/workspace/Lucene-Solr-trunk-MacOSX/solr/build/solr-core/test/J0/./org.apache.solr.cloud.CollectionsAPIDistributedZkTest-controljetty-1375367605428//nodes_used_collection_shard2_replica1/data
   [junit4]   2> 2228573 T4744 oasc.SolrCore.getNewIndexDir New index directory detected: old=null new=/Users/jenkins/jenkins-slave/workspace/Lucene-Solr-trunk-MacOSX/solr/build/solr-core/test/J0/./org.apache.solr.cloud.CollectionsAPIDistributedZkTest-controljetty-1375367605428//nodes_used_collection_shard2_replica1/data/index/
   [junit4]   2> 2228573 T4744 oasc.SolrCore.initIndex WARN [nodes_used_collection_shard2_replica1] Solr index directory '/Users/jenkins/jenkins-slave/workspace/Lucene-Solr-trunk-MacOSX/solr/build/solr-core/test/J0/./org.apache.solr.cloud.CollectionsAPIDistributedZkTest-controljetty-1375367605428/nodes_used_collection_shard2_replica1/data/index' doesn't exist. Creating new index...
   [junit4]   2> 2228575 T4744 oasc.CachingDirectoryFactory.get return new directory for /Users/jenkins/jenkins-slave/workspace/Lucene-Solr-trunk-MacOSX/solr/build/solr-core/test/J0/./org.apache.solr.cloud.CollectionsAPIDistributedZkTest-controljetty-1375367605428//nodes_used_collection_shard2_replica1/data/index
   [junit4]   2> 2228578 T4800 oass.OpenExchangeRatesOrgProvider$OpenExchangeRates.<init> WARN Unknown key IMPORTANT NOTE
   [junit4]   2> 2228578 T4800 oass.OpenExchangeRatesOrgProvider$OpenExchangeRates.<init> WARN Expected key, got STRING
   [junit4]   2> 2228579 T4800 oass.OpenExchangeRatesOrgProvider.reload Reloading exchange rates from open-exchange-rates.json
   [junit4]   2> 2228585 T4774 oass.SolrIndexSearcher.<init> Opening Searcher@5d3e5008 main
   [junit4]   2> 2228587 T4774 oasu.CommitTracker.<init> Hard AutoCommit: disabled
   [junit4]   2> 2228588 T4774 oasu.CommitTracker.<init> Soft AutoCommit: disabled
   [junit4]   2> 2228593 T4800 oass.OpenExchangeRatesOrgProvider$OpenExchangeRates.<init> WARN Unknown key IMPORTANT NOTE
   [junit4]   2> 2228594 T4800 oass.OpenExchangeRatesOrgProvider$OpenExchangeRates.<init> WARN Expected key, got STRING
   [junit4]   2> 2228594 T4815 oasc.SolrCore.registerSearcher [nodes_used_collection_shard1_replica2] Registered new searcher Searcher@5d3e5008 main{StandardDirectoryReader(segments_1:1)}
   [junit4]   2> 2228594 T4800 oasc.SolrCore.initDirectoryFactory org.apache.solr.core.MockDirectoryFactory
   [junit4]   2> 2228595 T4800 oasc.SolrCore.<init> [nodes_used_collection_shard2_replica2] Opening new SolrCore at /Users/jenkins/jenkins-slave/workspace/Lucene-Solr-trunk-MacOSX/solr/build/solr-core/test/J0/./org.apache.solr.cloud.CollectionsAPIDistributedZkTest-jetty4-1375367612427/nodes_used_collection_shard2_replica2/, dataDir=/Users/jenkins/jenkins-slave/workspace/Lucene-Solr-trunk-MacOSX/solr/build/solr-core/test/J0/./org.apache.solr.cloud.CollectionsAPIDistributedZkTest-jetty4-1375367612427//nodes_used_collection_shard2_replica2/data/
   [junit4]   2> 2228596 T4800 oasc.JmxMonitoredMap.<init> JMX monitoring is enabled. Adding Solr mbeans to JMX Server: com.sun.jmx.mbeanserver.JmxMBeanServer@747faa2b
   [junit4]   2> 2228597 T4774 oasc.CoreContainer.registerCore registering core: nodes_used_collection_shard1_replica2
   [junit4]   2> 2228597 T4774 oasc.ZkController.register Register replica - core:nodes_used_collection_shard1_replica2 address:http://127.0.0.1:50460/kb/d collection:nodes_used_collection shard:shard1
   [junit4]   2> 2228599 T4774 oascsi.HttpClientUtil.createClient Creating new http client, config:maxConnections=10000&maxConnectionsPerHost=20&connTimeout=15000&socketTimeout=30000&retry=false
   [junit4]   2> 2228597 T4800 oasc.CachingDirectoryFactory.get return new directory for /Users/jenkins/jenkins-slave/workspace/Lucene-Solr-trunk-MacOSX/solr/build/solr-core/test/J0/./org.apache.solr.cloud.CollectionsAPIDistributedZkTest-jetty4-1375367612427//nodes_used_collection_shard2_replica2/data
   [junit4]   2> 2228602 T4800 oasc.SolrCore.getNewIndexDir New index directory detected: old=null new=/Users/jenkins/jenkins-slave/workspace/Lucene-Solr-trunk-MacOSX/solr/build/solr-core/test/J0/./org.apache.solr.cloud.CollectionsAPIDistributedZkTest-jetty4-1375367612427//nodes_used_collection_shard2_replica2/data/index/
   [junit4]   2> 2228603 T4800 oasc.SolrCore.initIndex WARN [nodes_used_collection_shard2_replica2] Solr index directory '/Users/jenkins/jenkins-slave/workspace/Lucene-Solr-trunk-MacOSX/solr/build/solr-core/test/J0/./org.apache.solr.cloud.CollectionsAPIDistributedZkTest-jetty4-1375367612427/nodes_used_collection_shard2_replica2/data/index' doesn't exist. Creating new index...
   [junit4]   2> 2228616 T4800 oasc.CachingDirectoryFactory.get return new directory for /Users/jenkins/jenkins-slave/workspace/Lucene-Solr-trunk-MacOSX/solr/build/solr-core/test/J0/./org.apache.solr.cloud.CollectionsAPIDistributedZkTest-jetty4-1375367612427//nodes_used_collection_shard2_replica2/data/index
   [junit4]   2> 2228634 T4744 oasc.SolrDeletionPolicy.onCommit SolrDeletionPolicy.onCommit: commits: num=1
   [junit4]   2> 		commit{dir=MockDirWrapper(org.apache.lucene.store.RAMDirectory@5d5107b2 lockFactory=org.apache.lucene.store.NativeFSLockFactory@119bcb84),segFN=segments_1,generation=1}
   [junit4]   2> 2228635 T4744 oasc.SolrDeletionPolicy.updateCommits newest commit generation = 1
   [junit4]   2> 2228649 T4774 oascc.SolrZkClient.makePath makePath: /collections/nodes_used_collection/leader_elect/shard1/election
   [junit4]   2> 2228650 T4800 oasc.SolrDeletionPolicy.onCommit SolrDeletionPolicy.onCommit: commits: num=1
   [junit4]   2> 		commit{dir=MockDirWrapper(org.apache.lucene.store.RAMDirectory@388cbaf4 lockFactory=org.apache.lucene.store.NativeFSLockFactory@4c0d1a9b),segFN=segments_1,generation=1}
   [junit4]   2> 2228651 T4800 oasc.SolrDeletionPolicy.updateCommits newest commit generation = 1
   [junit4]   2> 2228664 T4744 oasup.UpdateRequestProcessorChain.init inserting DistributedUpdateProcessorFactory into updateRequestProcessorChain "dedupe"
   [junit4]   2> 2228670 T4744 oasup.UpdateRequestProcessorChain.init inserting DistributedUpdateProcessorFactory into updateRequestProcessorChain "stored_sig"
   [junit4]   2> 2228669 T4800 oasup.UpdateRequestProcessorChain.init inserting DistributedUpdateProcessorFactory into updateRequestProcessorChain "dedupe"
   [junit4]   2> 2228672 T4744 oasup.UpdateRequestProcessorChain.init inserting DistributedUpdateProcessorFactory into updateRequestProcessorChain "distrib-dup-test-chain-implicit"
   [junit4]   2> 2228675 T4744 oasc.RequestHandlers.initHandlersFromConfig created standard: solr.StandardRequestHandler
   [junit4]   2> 2228677 T4744 oasc.RequestHandlers.initHandlersFromConfig created /get: solr.RealTimeGetHandler
   [junit4]   2> 2228677 T4744 oasc.RequestHandlers.initHandlersFromConfig adding lazy requestHandler: solr.ReplicationHandler
   [junit4]   2> 2228678 T4744 oasc.RequestHandlers.initHandlersFromConfig created /replication: solr.ReplicationHandler
   [junit4]   2> 2228681 T4744 oasc.RequestHandlers.initHandlersFromConfig created /update: solr.UpdateRequestHandler
   [junit4]   2> 2228682 T4744 oasc.RequestHandlers.initHandlersFromConfig created /admin/: org.apache.solr.handler.admin.AdminHandlers
   [junit4]   2> 2228697 T4800 oasup.UpdateRequestProcessorChain.init inserting DistributedUpdateProcessorFactory into updateRequestProcessorChain "stored_sig"
   [junit4]   2> 2228699 T4800 oasup.UpdateRequestProcessorChain.init inserting DistributedUpdateProcessorFactory into updateRequestProcessorChain "distrib-dup-test-chain-implicit"
   [junit4]   2> 2228705 T4800 oasc.RequestHandlers.initHandlersFromConfig created standard: solr.StandardRequestHandler
   [junit4]   2> 2228708 T4800 oasc.RequestHandlers.initHandlersFromConfig created /get: solr.RealTimeGetHandler
   [junit4]   2> 2228709 T4800 oasc.RequestHandlers.initHandlersFromConfig adding lazy requestHandler: solr.ReplicationHandler
   [junit4]   2> 2228710 T4800 oasc.RequestHandlers.initHandlersFromConfig created /replication: solr.ReplicationHandler
   [junit4]   2> 2228715 T4800 oasc.RequestHandlers.initHandlersFromConfig created /update: solr.UpdateRequestHandler
   [junit4]   2> 2228716 T4800 oasc.RequestHandlers.initHandlersFromConfig created /admin/: org.apache.solr.handler.admin.AdminHandlers
   [junit4]   2> 2228713 T4774 oasc.ShardLeaderElectionContext.runLeaderProcess Running the leader process for shard shard1
   [junit4]   2> 2228727 T4800 oashl.XMLLoader.init xsltCacheLifetimeSeconds=60
   [junit4]   2> 2228728 T4744 oashl.XMLLoader.init xsltCacheLifetimeSeconds=60
   [junit4]   2> 2228757 T4744 oass.SolrIndexSearcher.<init> Opening Searcher@411c51d4 main
   [junit4]   2> 2228760 T4800 oass.SolrIndexSearcher.<init> Opening Searcher@25082424 main
   [junit4]   2> 2228762 T4744 oasu.CommitTracker.<init> Hard AutoCommit: disabled
   [junit4]   2> 2228764 T4744 oasu.CommitTracker.<init> Soft AutoCommit: disabled
   [junit4]   2> 2228766 T4800 oasu.CommitTracker.<init> Hard AutoCommit: disabled
   [junit4]   2> 2228767 T4800 oasu.CommitTracker.<init> Soft AutoCommit: disabled
   [junit4]   2> 2228763 T4774 oasc.ShardLeaderElectionContext.waitForReplicasToComeUp Waiting until we see more replicas up for shard shard1: total=2 found=1 timeoutin=179997
   [junit4]   2> 2228779 T4816 oasc.SolrCore.registerSearcher [nodes_used_collection_shard2_replica1] Registered new searcher Searcher@411c51d4 main{StandardDirectoryReader(segments_1:1)}
   [junit4]   2> 2228782 T4744 oasc.CoreContainer.registerCore registering core: nodes_used_collection_shard2_replica1
   [junit4]   2> 2228783 T4744 oasc.ZkController.register Register replica - core:nodes_used_collection_shard2_replica1 address:http://127.0.0.1:50453/kb/d collection:nodes_used_collection shard:shard2
   [junit4]   2> 2228783 T4744 oascsi.HttpClientUtil.createClient Creating new http client, config:maxConnections=10000&maxConnectionsPerHost=20&connTimeout=15000&socketTimeout=30000&retry=false
   [junit4]   2> 2228790 T4817 oasc.SolrCore.registerSearcher [nodes_used_collection_shard2_replica2] Registered new searcher Searcher@25082424 main{StandardDirectoryReader(segments_1:1)}
   [junit4]   2> 2228790 T4759 oass.FileExchangeRateProvider.reload Reloading exchange rates from file currency.xml
   [junit4]   2> 2228802 T4800 oasc.CoreContainer.registerCore registering core: nodes_used_collection_shard2_replica2
   [junit4]   2> 2228802 T4800 oasc.ZkController.register Register replica - core:nodes_used_collection_shard2_replica2 address:http://127.0.0.1:50466/kb/d collection:nodes_used_collection shard:shard2
   [junit4]   2> 2228803 T4800 oascsi.HttpClientUtil.createClient Creating new http client, config:maxConnections=10000&maxConnectionsPerHost=20&connTimeout=15000&socketTimeout=30000&retry=false
   [junit4]   2> 2228829 T4744 oascc.SolrZkClient.makePath makePath: /collections/nodes_used_collection/leader_elect/shard2/election
   [junit4]   2> 2228838 T4800 oascc.SolrZkClient.makePath makePath: /collections/nodes_used_collection/leader_elect/shard2/election
   [junit4]   2> 2228865 T4800 oasc.ShardLeaderElectionContext.runLeaderProcess Running the leader process for shard shard2
   [junit4]   2> 2228877 T4759 oass.FileExchangeRateProvider.reload Reloading exchange rates from file currency.xml
   [junit4]   2> 2228877 T4800 oasc.ShardLeaderElectionContext.waitForReplicasToComeUp Enough replicas found to continue.
   [junit4]   2> 2228878 T4800 oasc.ShardLeaderElectionContext.runLeaderProcess I may be the new leader - try and sync
   [junit4]   2> 2228879 T4800 oasc.SyncStrategy.sync Sync replicas to http://127.0.0.1:50466/kb/d/nodes_used_collection_shard2_replica2/
   [junit4]   2> 2228879 T4800 oasu.PeerSync.sync PeerSync: core=nodes_used_collection_shard2_replica2 url=http://127.0.0.1:50466/kb/d START replicas=[http://127.0.0.1:50453/kb/d/nodes_used_collection_shard2_replica1/] nUpdates=100
   [junit4]   2> 2228885 T4759 oass.OpenExchangeRatesOrgProvider.reload Reloading exchange rates from open-exchange-rates.json
   [junit4]   2> 2228886 T4800 oasu.PeerSync.sync PeerSync: core=nodes_used_collection_shard2_replica2 url=http://127.0.0.1:50466/kb/d DONE.  We have no versions.  sync failed.
   [junit4]   2> 2228888 T4800 oasc.SyncStrategy.syncReplicas Leader's attempt to sync with shard failed, moving to the next candidate
   [junit4]   2> 2228893 T4800 oasc.ShardLeaderElectionContext.runLeaderProcess We failed sync, but we have no versions - we can't sync in that case - we were active before, so become leader anyway
   [junit4]   2> 2228894 T4800 oasc.ShardLeaderElectionContext.runLeaderProcess I am the new leader: http://127.0.0.1:50466/kb/d/nodes_used_collection_shard2_replica2/ shard2
   [junit4]   2> 2228894 T4800 oascc.SolrZkClient.makePath makePath: /collections/nodes_used_collection/leaders/shard2
   [junit4]   2> ASYNC  NEW_CORE C2227 name=nodes_used_collection_shard2_replica1 org.apache.solr.core.SolrCore@27e60358 url=http://127.0.0.1:50453/kb/d/nodes_used_collection_shard2_replica1 node=127.0.0.1:50453_kb%2Fd C2227_STATE=coll:nodes_used_collection core:nodes_used_collection_shard2_replica1 props:{state=down, core=nodes_used_collection_shard2_replica1, node_name=127.0.0.1:50453_kb%2Fd, base_url=http://127.0.0.1:50453/kb/d}
   [junit4]   2> 2228901 T4740 C2227 P50453 oasc.SolrCore.execute [nodes_used_collection_shard2_replica1] webapp=/kb/d path=/get params={getVersions=100&distrib=false&wt=javabin&qt=/get&version=2} status=0 QTime=2 
   [junit4]   2> 2228902 T4759 oass.OpenExchangeRatesOrgProvider$OpenExchangeRates.<init> WARN Unknown key IMPORTANT NOTE
   [junit4]   2> 2228904 T4759 oass.OpenExchangeRatesOrgProvider$OpenExchangeRates.<init> WARN Expected key, got STRING
   [junit4]   2> 2228905 T4759 oass.OpenExchangeRatesOrgProvider.reload Reloading exchange rates from open-exchange-rates.json
   [junit4]   2> 2228910 T4759 oass.OpenExchangeRatesOrgProvider$OpenExchangeRates.<init> WARN Unknown key IMPORTANT NOTE
   [junit4]   2> 2228912 T4759 oass.OpenExchangeRatesOrgProvider$OpenExchangeRates.<init> WARN Expected key, got STRING
   [junit4]   2> 2228913 T4759 oasc.SolrCore.initDirectoryFactory org.apache.solr.core.MockDirectoryFactory
   [junit4]   2> 2228914 T4759 oasc.SolrCore.<init> [nodes_used_collection_shard1_replica1] Opening new SolrCore at /Users/jenkins/jenkins-slave/workspace/Lucene-Solr-trunk-MacOSX/solr/build/solr-core/test/J0/./org.apache.solr.cloud.CollectionsAPIDistributedZkTest-jetty1-1375367606538/nodes_used_collection_shard1_replica1/, dataDir=/Users/jenkins/jenkins-slave/workspace/Lucene-Solr-trunk-MacOSX/solr/build/solr-core/test/J0/./org.apache.solr.cloud.CollectionsAPIDistributedZkTest-jetty1-1375367606538//nodes_used_collection_shard1_replica1/data/
   [junit4]   2> 2228914 T4759 oasc.JmxMonitoredMap.<init> JMX monitoring is enabled. Adding Solr mbeans to JMX Server: com.sun.jmx.mbeanserver.JmxMBeanServer@747faa2b
   [junit4]   2> 2228915 T4759 oasc.CachingDirectoryFactory.get return new directory for /Users/jenkins/jenkins-slave/workspace/Lucene-Solr-trunk-MacOSX/solr/build/solr-core/test/J0/./org.apache.solr.cloud.CollectionsAPIDistributedZkTest-jetty1-1375367606538//nodes_used_collection_shard1_replica1/data
   [junit4]   2> 2228916 T4759 oasc.SolrCore.getNewIndexDir New index directory detected: old=null new=/Users/jenkins/jenkins-slave/workspace/Lucene-Solr-trunk-MacOSX/solr/build/solr-core/test/J0/./org.apache.solr.cloud.CollectionsAPIDistributedZkTest-jetty1-1375367606538//nodes_used_collection_shard1_replica1/data/index/
   [junit4]   2> 2228916 T4759 oasc.SolrCore.initIndex WARN [nodes_used_collection_shard1_replica1] Solr index directory '/Users/jenkins/jenkins-slave/workspace/Lucene-Solr-trunk-MacOSX/solr/build/solr-core/test/J0/./org.apache.solr.cloud.CollectionsAPIDistributedZkTest-jetty1-1375367606538/nodes_used_collection_shard1_replica1/data/index' doesn't exist. Creating new index...
   [junit4]   2> 2228918 T4759 oasc.CachingDirectoryFactory.get return new directory for /Users/jenkins/jenkins-slave/workspace/Lucene-Solr-trunk-MacOSX/solr/build/solr-core/test/J0/./org.apache.solr.cloud.CollectionsAPIDistributedZkTest-jetty1-1375367606538//nodes_used_collection_shard1_replica1/data/index
   [junit4]   2> 2228925 T4759 oasc.SolrDeletionPolicy.onCommit SolrDeletionPolicy.onCommit: commits: num=1
   [junit4]   2> 		commit{dir=MockDirWrapper(org.apache.lucene.store.RAMDirectory@7c7c8f90 lockFactory=org.apache.lucene.store.NativeFSLockFactory@340a7eec),segFN=segments_1,generation=1}
   [junit4]   2> 2228926 T4759 oasc.SolrDeletionPolicy.updateCommits newest commit generation = 1
   [junit4]   2> 2228933 T4759 oasup.UpdateRequestProcessorChain.init inserting DistributedUpdateProcessorFactory into updateRequestProcessorChain "dedupe"
   [junit4]   2> 2228935 T4759 oasup.UpdateRequestProcessorChain.init inserting DistributedUpdateProcessorFactory into updateRequestProcessorChain "stored_sig"
   [junit4]   2> 2228944 T4759 oasup.UpdateRequestProcessorChain.init inserting DistributedUpdateProcessorFactory into updateRequestProcessorChain "distrib-dup-test-chain-implicit"
   [junit4]   2> 2228947 T4759 oasc.RequestHandlers.initHandlersFromConfig created standard: solr.StandardRequestHandler
   [junit4]   2> 2228948 T4759 oasc.RequestHandlers.initHandlersFromConfig created /get: solr.RealTimeGetHandler
   [junit4]   2> 2228949 T4759 oasc.RequestHandlers.initHandlersFromConfig adding lazy requestHandler: solr.ReplicationHandler
   [junit4]   2> 2228950 T4759 oasc.RequestHandlers.initHandlersFromConfig created /replication: solr.ReplicationHandler
   [junit4]   2> 2228952 T4759 oasc.RequestHandlers.initHandlersFromConfig created /update: solr.UpdateRequestHandler
   [junit4]   2> 2228953 T4759 oasc.RequestHandlers.initHandlersFromConfig created /admin/: org.apache.solr.handler.admin.AdminHandlers
   [junit4]   2> 2228971 T4759 oashl.XMLLoader.init xsltCacheLifetimeSeconds=60
   [junit4]   2> 2228979 T4759 oass.SolrIndexSearcher.<init> Opening Searcher@80155b9 main
   [junit4]   2> 2228981 T4759 oasu.CommitTracker.<init> Hard AutoCommit: disabled
   [junit4]   2> 2228981 T4759 oasu.CommitTracker.<init> Soft AutoCommit: disabled
   [junit4]   2> 2228989 T4819 oasc.SolrCore.registerSearcher [nodes_used_collection_shard1_replica1] Registered new searcher Searcher@80155b9 main{StandardDirectoryReader(segments_1:1)}
   [junit4]   2> 2228996 T4759 oasc.CoreContainer.registerCore registering core: nodes_used_collection_shard1_replica1
   [junit4]   2> 2228996 T4759 oasc.ZkController.register Register replica - core:nodes_used_collection_shard1_replica1 address:http://127.0.0.1:50457/kb/d collection:nodes_used_collection shard:shard1
   [junit4]   2> 2228997 T4759 oascsi.HttpClientUtil.createClient Creating new http client, config:maxConnections=10

[...truncated too long message...]

uce with: ant test  -Dtestcase=CollectionsAPIDistributedZkTest -Dtests.method=testDistribSearch -Dtests.seed=7F9707FA8D68D3E9 -Dtests.slow=true -Dtests.locale=de -Dtests.timezone=Indian/Kerguelen -Dtests.file.encoding=US-ASCII
   [junit4] ERROR    162s | CollectionsAPIDistributedZkTest.testDistribSearch <<<
   [junit4]    > Throwable #1: org.apache.solr.client.solrj.SolrServerException: Server refused connection at: http://127.0.0.1:50457/kb/d
   [junit4]    > 	at __randomizedtesting.SeedInfo.seed([7F9707FA8D68D3E9:FE7189E2FA37B3D5]:0)
   [junit4]    > 	at org.apache.solr.client.solrj.impl.HttpSolrServer.request(HttpSolrServer.java:428)
   [junit4]    > 	at org.apache.solr.client.solrj.impl.HttpSolrServer.request(HttpSolrServer.java:180)
   [junit4]    > 	at org.apache.solr.cloud.CollectionsAPIDistributedZkTest.testCustomCollectionsAPI(CollectionsAPIDistributedZkTest.java:764)
   [junit4]    > 	at org.apache.solr.cloud.CollectionsAPIDistributedZkTest.doTest(CollectionsAPIDistributedZkTest.java:159)
   [junit4]    > 	at org.apache.solr.BaseDistributedSearchTestCase.testDistribSearch(BaseDistributedSearchTestCase.java:835)
   [junit4]    > 	at java.lang.Thread.run(Thread.java:724)
   [junit4]    > Caused by: org.apache.http.conn.HttpHostConnectException: Connection to http://127.0.0.1:50457 refused
   [junit4]    > 	at org.apache.http.impl.conn.DefaultClientConnectionOperator.openConnection(DefaultClientConnectionOperator.java:190)
   [junit4]    > 	at org.apache.http.impl.conn.ManagedClientConnectionImpl.open(ManagedClientConnectionImpl.java:294)
   [junit4]    > 	at org.apache.http.impl.client.DefaultRequestDirector.tryConnect(DefaultRequestDirector.java:645)
   [junit4]    > 	at org.apache.http.impl.client.DefaultRequestDirector.execute(DefaultRequestDirector.java:480)
   [junit4]    > 	at org.apache.http.impl.client.AbstractHttpClient.execute(AbstractHttpClient.java:906)
   [junit4]    > 	at org.apache.http.impl.client.AbstractHttpClient.execute(AbstractHttpClient.java:805)
   [junit4]    > 	at org.apache.http.impl.client.AbstractHttpClient.execute(AbstractHttpClient.java:784)
   [junit4]    > 	at org.apache.solr.client.solrj.impl.HttpSolrServer.request(HttpSolrServer.java:365)
   [junit4]    > 	... 44 more
   [junit4]    > Caused by: java.net.ConnectException: Connection refused
   [junit4]    > 	at java.net.PlainSocketImpl.socketConnect(Native Method)
   [junit4]    > 	at java.net.AbstractPlainSocketImpl.doConnect(AbstractPlainSocketImpl.java:339)
   [junit4]    > 	at java.net.AbstractPlainSocketImpl.connectToAddress(AbstractPlainSocketImpl.java:200)
   [junit4]    > 	at java.net.AbstractPlainSocketImpl.connect(AbstractPlainSocketImpl.java:182)
   [junit4]    > 	at java.net.SocksSocketImpl.connect(SocksSocketImpl.java:392)
   [junit4]    > 	at java.net.Socket.connect(Socket.java:579)
   [junit4]    > 	at org.apache.http.conn.scheme.PlainSocketFactory.connectSocket(PlainSocketFactory.java:127)
   [junit4]    > 	at org.apache.http.impl.conn.DefaultClientConnectionOperator.openConnection(DefaultClientConnectionOperator.java:180)
   [junit4]    > 	... 51 more
   [junit4]   2> 2374126 T4727 oas.SolrTestCaseJ4.deleteCore ###deleteCore
   [junit4]   2> 162077 T4726 ccr.ThreadLeakControl.checkThreadLeaks WARNING Will linger awaiting termination of 1 leaked thread(s).
   [junit4]   2> 2375090 T4809 oascc.ZkStateReader$3.process WARN ZooKeeper watch triggered, but Solr cannot talk to ZK
   [junit4]   2> 2375091 T4809 oascc.ZkStateReader$2.process A cluster state change: WatchedEvent state:SyncConnected type:NodeChildrenChanged path:/live_nodes, has occurred - updating... (live nodes size: 1)
   [junit4]   2> 2375091 T4809 oascc.ZkStateReader$2.process WARN ZooKeeper watch triggered, but Solr cannot talk to ZK
   [junit4]   2> NOTE: test params are: codec=Lucene42: {_route_=Pulsing41(freqCutoff=18 minBlockSize=74 maxBlockSize=207), range_facet_l=PostingsFormat(name=Lucene41VarGapFixedInterval), text=Pulsing41(freqCutoff=18 minBlockSize=74 maxBlockSize=207), _version_=PostingsFormat(name=Memory doPackFST= false), intDefault=PostingsFormat(name=Memory doPackFST= false), id=PostingsFormat(name=Lucene41WithOrds), timestamp=PostingsFormat(name=Lucene41VarGapFixedInterval), a_t=PostingsFormat(name=Lucene41VarGapFixedInterval), range_facet_sl=PostingsFormat(name=Lucene41WithOrds), range_facet_si=PostingsFormat(name=Lucene41VarGapFixedInterval), other_tl1=PostingsFormat(name=Memory doPackFST= false), multiDefault=PostingsFormat(name=Lucene41VarGapFixedInterval), a_si=PostingsFormat(name=Memory doPackFST= false)}, docValues:{timestamp=DocValuesFormat(name=SimpleText)}, sim=DefaultSimilarity, locale=de, timezone=Indian/Kerguelen
   [junit4]   2> NOTE: Mac OS X 10.8.4 x86_64/Oracle Corporation 1.7.0_25 (64-bit)/cpus=2,threads=1,free=16949672,total=254627840
   [junit4]   2> NOTE: All tests run in this JVM: [TestMergePolicyConfig, TestUniqueKeyFieldResource, PrimUtilsTest, ResponseLogComponentTest, NumericFieldsTest, OverseerTest, TestSchemaVersionResource, TimeZoneUtilsTest, TestWordDelimiterFilterFactory, ShowFileRequestHandlerTest, TestDefaultSearchFieldResource, TestFastWriter, SuggesterTSTTest, SuggesterWFSTTest, WordBreakSolrSpellCheckerTest, ExternalFileFieldSortTest, ScriptEngineTest, DOMUtilTest, TestUpdate, PreAnalyzedUpdateProcessorTest, TestFieldCollectionResource, TestSweetSpotSimilarityFactory, TestBadConfig, TestJoin, IndexSchemaRuntimeFieldTest, TestSolrIndexConfig, LegacyHTMLStripCharFilterTest, TestCSVLoader, DistributedQueryElevationComponentTest, FullSolrCloudDistribCmdsTest, TestCodecSupport, TestLMDirichletSimilarityFactory, TestSerializedLuceneMatchVersion, TestOmitPositions, TestSolr4Spatial, TestSolrXmlPersistence, CircularListTest, TestSolrDeletionPolicy2, TestSolrCoreProperties, CurrencyFieldXmlFileTest, TestPartialUpdateDeduplication, AddSchemaFieldsUpdateProcessorFactoryTest, SuggesterFSTTest, TestIndexingPerformance, SolrRequestParserTest, HdfsBasicDistributedZkTest, DateMathParserTest, StatsComponentTest, UpdateRequestProcessorFactoryTest, BinaryUpdateRequestHandlerTest, TestSolrXMLSerializer, TestElisionMultitermQuery, SynonymTokenizerTest, TestJmxIntegration, TestDistributedGrouping, TestDocumentBuilder, TestValueSourceCache, HdfsLockFactoryTest, TestCoreContainer, QueryResultKeyTest, SystemInfoHandlerTest, TestDynamicFieldCollectionResource, ZkControllerTest, TestRandomMergePolicy, TestJmxMonitoredMap, RegexBoostProcessorTest, TestSchemaNameResource, SignatureUpdateProcessorFactoryTest, TestSolrJ, TestAddFieldRealTimeGet, TermVectorComponentTest, ClusterStateTest, TestInfoStreamLogging, DirectSolrConnectionTest, SolrInfoMBeanTest, MoreLikeThisHandlerTest, TestXIncludeConfig, UnloadDistributedZkTest, SpellCheckCollatorTest, TestFoldingMultitermQuery, SolrTestCaseJ4Test, PrimitiveFieldTypeTest, SolrCoreCheckLockOnStartupTest, TestPHPSerializedResponseWriter, AlternateDirectoryTest, UUIDFieldTest, AutoCommitTest, ClusterStateUpdateTest, TestPerFieldSimilarity, UniqFieldsUpdateProcessorFactoryTest, HdfsBasicDistributedZk2Test, TestLFUCache, TestBinaryField, TestReplicationHandler, SimplePostToolTest, DocValuesTest, TestClassNameShortening, TestRecoveryHdfs, DirectUpdateHandlerTest, BasicFunctionalityTest, QueryEqualityTest, TestSearchPerf, TestSolrDeletionPolicy1, SuggesterTest, TestDynamicFieldResource, TestZkChroot, TestFaceting, TestDFRSimilarityFactory, TestGroupingSearch, CoreContainerCoreInitFailuresTest, TestFiltering, SliceStateTest, NoCacheHeaderTest, DefaultValueUpdateProcessorTest, PolyFieldTest, TestCopyFieldCollectionResource, TestLRUCache, OutputWriterTest, TestExtendedDismaxParser, LukeRequestHandlerTest, BadCopyFieldTest, ShardSplitTest, OverseerCollectionProcessorTest, TestFastOutputStream, TestManagedSchema, FileBasedSpellCheckerTest, FieldMutatingUpdateProcessorTest, DebugComponentTest, TestSystemIdResolver, StandardRequestHandlerTest, PathHierarchyTokenizerFactoryTest, RecoveryZkTest, SpellCheckComponentTest, DirectUpdateHandlerOptimizeTest, TestRecovery, CoreAdminCreateDiscoverTest, TestReloadAndDeleteDocs, TestDefaultSimilarityFactory, CSVRequestHandlerTest, TestMultiCoreConfBootstrap, HardAutoCommitTest, HighlighterTest, TestPseudoReturnFields, TestCloudManagedSchemaAddField, TestSolrQueryParser, TestPostingsSolrHighlighter, TermsComponentTest, TestSchemaSimilarityResource, LeaderElectionTest, TestSolrQueryParserResource, LeaderElectionIntegrationTest, TestArbitraryIndexDir, ConvertedLegacyTest, BasicDistributedZkTest, ChaosMonkeySafeLeaderTest, BasicDistributedZk2Test, CollectionsAPIDistributedZkTest]
   [junit4] Completed in 163.16s, 1 test, 1 error <<< FAILURES!

[...truncated 494 lines...]
BUILD FAILED
/Users/jenkins/jenkins-slave/workspace/Lucene-Solr-trunk-MacOSX/build.xml:389: The following error occurred while executing this line:
/Users/jenkins/jenkins-slave/workspace/Lucene-Solr-trunk-MacOSX/build.xml:369: The following error occurred while executing this line:
/Users/jenkins/jenkins-slave/workspace/Lucene-Solr-trunk-MacOSX/build.xml:39: The following error occurred while executing this line:
/Users/jenkins/jenkins-slave/workspace/Lucene-Solr-trunk-MacOSX/solr/build.xml:181: The following error occurred while executing this line:
/Users/jenkins/jenkins-slave/workspace/Lucene-Solr-trunk-MacOSX/solr/common-build.xml:449: The following error occurred while executing this line:
/Users/jenkins/jenkins-slave/workspace/Lucene-Solr-trunk-MacOSX/lucene/common-build.xml:1230: The following error occurred while executing this line:
/Users/jenkins/jenkins-slave/workspace/Lucene-Solr-trunk-MacOSX/lucene/common-build.xml:873: There were test failures: 320 suites, 1345 tests, 1 error, 39 ignored (5 assumptions)

Total time: 108 minutes 54 seconds
Build step 'Invoke Ant' marked build as failure
Description set: Java: 64bit/jdk1.7.0 -XX:-UseCompressedOops -XX:+UseSerialGC
Archiving artifacts
Recording test results
Email was triggered for: Failure
Sending email for trigger: Failure



Mime
View raw message