lucene-dev mailing list archives

Site index · List index
Message view « Date » · « Thread »
Top « Date » · « Thread »
From Policeman Jenkins Server <jenk...@thetaphi.de>
Subject [JENKINS] Lucene-Solr-4.x-MacOSX (64bit/jdk1.7.0) - Build # 680 - Still Failing!
Date Fri, 02 Aug 2013 02:59:37 GMT
Build: http://jenkins.thetaphi.de/job/Lucene-Solr-4.x-MacOSX/680/
Java: 64bit/jdk1.7.0 -XX:+UseCompressedOops -XX:+UseConcMarkSweepGC

1 tests failed.
FAILED:  org.apache.solr.cloud.CollectionsAPIDistributedZkTest.testDistribSearch

Error Message:
collection already exists: new_implicit_coll_0

Stack Trace:
org.apache.solr.client.solrj.impl.HttpSolrServer$RemoteSolrException: collection already exists: new_implicit_coll_0
	at __randomizedtesting.SeedInfo.seed([6A256956B885ED3B:EBC3E74ECFDA8D07]:0)
	at org.apache.solr.client.solrj.impl.HttpSolrServer.request(HttpSolrServer.java:424)
	at org.apache.solr.client.solrj.impl.HttpSolrServer.request(HttpSolrServer.java:180)
	at org.apache.solr.client.solrj.impl.LBHttpSolrServer.request(LBHttpSolrServer.java:264)
	at org.apache.solr.client.solrj.impl.CloudSolrServer.request(CloudSolrServer.java:318)
	at org.apache.solr.cloud.AbstractFullDistribZkTestBase.createCollection(AbstractFullDistribZkTestBase.java:1537)
	at org.apache.solr.cloud.CollectionsAPIDistributedZkTest.testCustomCollectionsAPI(CollectionsAPIDistributedZkTest.java:677)
	at org.apache.solr.cloud.CollectionsAPIDistributedZkTest.doTest(CollectionsAPIDistributedZkTest.java:159)
	at org.apache.solr.BaseDistributedSearchTestCase.testDistribSearch(BaseDistributedSearchTestCase.java:835)
	at sun.reflect.GeneratedMethodAccessor39.invoke(Unknown Source)
	at sun.reflect.DelegatingMethodAccessorImpl.invoke(DelegatingMethodAccessorImpl.java:43)
	at java.lang.reflect.Method.invoke(Method.java:606)
	at com.carrotsearch.randomizedtesting.RandomizedRunner.invoke(RandomizedRunner.java:1559)
	at com.carrotsearch.randomizedtesting.RandomizedRunner.access$600(RandomizedRunner.java:79)
	at com.carrotsearch.randomizedtesting.RandomizedRunner$6.evaluate(RandomizedRunner.java:737)
	at com.carrotsearch.randomizedtesting.RandomizedRunner$7.evaluate(RandomizedRunner.java:773)
	at com.carrotsearch.randomizedtesting.RandomizedRunner$8.evaluate(RandomizedRunner.java:787)
	at com.carrotsearch.randomizedtesting.rules.SystemPropertiesRestoreRule$1.evaluate(SystemPropertiesRestoreRule.java:53)
	at org.apache.lucene.util.TestRuleSetupTeardownChained$1.evaluate(TestRuleSetupTeardownChained.java:50)
	at org.apache.lucene.util.TestRuleFieldCacheSanity$1.evaluate(TestRuleFieldCacheSanity.java:51)
	at org.apache.lucene.util.AbstractBeforeAfterRule$1.evaluate(AbstractBeforeAfterRule.java:46)
	at com.carrotsearch.randomizedtesting.rules.SystemPropertiesInvariantRule$1.evaluate(SystemPropertiesInvariantRule.java:55)
	at org.apache.lucene.util.TestRuleThreadAndTestName$1.evaluate(TestRuleThreadAndTestName.java:49)
	at org.apache.lucene.util.TestRuleIgnoreAfterMaxFailures$1.evaluate(TestRuleIgnoreAfterMaxFailures.java:70)
	at org.apache.lucene.util.TestRuleMarkFailure$1.evaluate(TestRuleMarkFailure.java:48)
	at com.carrotsearch.randomizedtesting.rules.StatementAdapter.evaluate(StatementAdapter.java:36)
	at com.carrotsearch.randomizedtesting.ThreadLeakControl$StatementRunner.run(ThreadLeakControl.java:358)
	at com.carrotsearch.randomizedtesting.ThreadLeakControl.forkTimeoutingTask(ThreadLeakControl.java:782)
	at com.carrotsearch.randomizedtesting.ThreadLeakControl$3.evaluate(ThreadLeakControl.java:442)
	at com.carrotsearch.randomizedtesting.RandomizedRunner.runSingleTest(RandomizedRunner.java:746)
	at com.carrotsearch.randomizedtesting.RandomizedRunner$3.evaluate(RandomizedRunner.java:648)
	at com.carrotsearch.randomizedtesting.RandomizedRunner$4.evaluate(RandomizedRunner.java:682)
	at com.carrotsearch.randomizedtesting.RandomizedRunner$5.evaluate(RandomizedRunner.java:693)
	at com.carrotsearch.randomizedtesting.rules.StatementAdapter.evaluate(StatementAdapter.java:36)
	at com.carrotsearch.randomizedtesting.rules.SystemPropertiesRestoreRule$1.evaluate(SystemPropertiesRestoreRule.java:53)
	at org.apache.lucene.util.AbstractBeforeAfterRule$1.evaluate(AbstractBeforeAfterRule.java:46)
	at org.apache.lucene.util.TestRuleStoreClassName$1.evaluate(TestRuleStoreClassName.java:42)
	at com.carrotsearch.randomizedtesting.rules.SystemPropertiesInvariantRule$1.evaluate(SystemPropertiesInvariantRule.java:55)
	at com.carrotsearch.randomizedtesting.rules.NoShadowingOrOverridesOnMethodsRule$1.evaluate(NoShadowingOrOverridesOnMethodsRule.java:39)
	at com.carrotsearch.randomizedtesting.rules.NoShadowingOrOverridesOnMethodsRule$1.evaluate(NoShadowingOrOverridesOnMethodsRule.java:39)
	at com.carrotsearch.randomizedtesting.rules.StatementAdapter.evaluate(StatementAdapter.java:36)
	at org.apache.lucene.util.TestRuleAssertionsRequired$1.evaluate(TestRuleAssertionsRequired.java:43)
	at org.apache.lucene.util.TestRuleMarkFailure$1.evaluate(TestRuleMarkFailure.java:48)
	at org.apache.lucene.util.TestRuleIgnoreAfterMaxFailures$1.evaluate(TestRuleIgnoreAfterMaxFailures.java:70)
	at org.apache.lucene.util.TestRuleIgnoreTestSuites$1.evaluate(TestRuleIgnoreTestSuites.java:55)
	at com.carrotsearch.randomizedtesting.rules.StatementAdapter.evaluate(StatementAdapter.java:36)
	at com.carrotsearch.randomizedtesting.ThreadLeakControl$StatementRunner.run(ThreadLeakControl.java:358)
	at java.lang.Thread.run(Thread.java:724)




Build Log:
[...truncated 9962 lines...]
   [junit4] Suite: org.apache.solr.cloud.CollectionsAPIDistributedZkTest
   [junit4]   2> 2652305 T5724 oas.BaseDistributedSearchTestCase.initHostContext Setting hostContext system property: /
   [junit4]   2> 2652324 T5724 oas.SolrTestCaseJ4.setUp ###Starting testDistribSearch
   [junit4]   2> Creating dataDir: /Users/jenkins/jenkins-slave/workspace/Lucene-Solr-4.x-MacOSX/solr/build/solr-core/test/J0/./solrtest-CollectionsAPIDistributedZkTest-1375411056601
   [junit4]   2> 2652326 T5724 oasc.ZkTestServer.run STARTING ZK TEST SERVER
   [junit4]   2> 2652327 T5725 oasc.ZkTestServer$ZKServerMain.runFromConfig Starting server
   [junit4]   2> 2652428 T5724 oasc.ZkTestServer.run start zk server on port:53426
   [junit4]   2> 2652434 T5724 oascc.ConnectionManager.waitForConnected Waiting for client to connect to ZooKeeper
   [junit4]   2> 2652440 T5731 oascc.ConnectionManager.process Watcher org.apache.solr.common.cloud.ConnectionManager@69e1b18e name:ZooKeeperConnection Watcher:127.0.0.1:53426 got event WatchedEvent state:SyncConnected type:None path:null path:null type:None
   [junit4]   2> 2652441 T5724 oascc.ConnectionManager.waitForConnected Client is connected to ZooKeeper
   [junit4]   2> 2652441 T5724 oascc.SolrZkClient.makePath makePath: /solr
   [junit4]   2> 2652451 T5724 oascc.ConnectionManager.waitForConnected Waiting for client to connect to ZooKeeper
   [junit4]   2> 2652456 T5733 oascc.ConnectionManager.process Watcher org.apache.solr.common.cloud.ConnectionManager@2fb45339 name:ZooKeeperConnection Watcher:127.0.0.1:53426/solr got event WatchedEvent state:SyncConnected type:None path:null path:null type:None
   [junit4]   2> 2652457 T5724 oascc.ConnectionManager.waitForConnected Client is connected to ZooKeeper
   [junit4]   2> 2652457 T5724 oascc.SolrZkClient.makePath makePath: /collections/collection1
   [junit4]   2> 2652463 T5724 oascc.SolrZkClient.makePath makePath: /collections/collection1/shards
   [junit4]   2> 2652468 T5724 oascc.SolrZkClient.makePath makePath: /collections/control_collection
   [junit4]   2> 2652472 T5724 oascc.SolrZkClient.makePath makePath: /collections/control_collection/shards
   [junit4]   2> 2652480 T5724 oasc.AbstractZkTestCase.putConfig put /Users/jenkins/jenkins-slave/workspace/Lucene-Solr-4.x-MacOSX/solr/build/solr-core/test-files/solr/collection1/conf/solrconfig-tlog.xml to /configs/conf1/solrconfig.xml
   [junit4]   2> 2652481 T5724 oascc.SolrZkClient.makePath makePath: /configs/conf1/solrconfig.xml
   [junit4]   2> 2652495 T5724 oasc.AbstractZkTestCase.putConfig put /Users/jenkins/jenkins-slave/workspace/Lucene-Solr-4.x-MacOSX/solr/build/solr-core/test-files/solr/collection1/conf/schema.xml to /configs/conf1/schema.xml
   [junit4]   2> 2652496 T5724 oascc.SolrZkClient.makePath makePath: /configs/conf1/schema.xml
   [junit4]   2> 2652504 T5724 oasc.AbstractZkTestCase.putConfig put /Users/jenkins/jenkins-slave/workspace/Lucene-Solr-4.x-MacOSX/solr/build/solr-core/test-files/solr/collection1/conf/stopwords.txt to /configs/conf1/stopwords.txt
   [junit4]   2> 2652505 T5724 oascc.SolrZkClient.makePath makePath: /configs/conf1/stopwords.txt
   [junit4]   2> 2652513 T5724 oasc.AbstractZkTestCase.putConfig put /Users/jenkins/jenkins-slave/workspace/Lucene-Solr-4.x-MacOSX/solr/build/solr-core/test-files/solr/collection1/conf/protwords.txt to /configs/conf1/protwords.txt
   [junit4]   2> 2652514 T5724 oascc.SolrZkClient.makePath makePath: /configs/conf1/protwords.txt
   [junit4]   2> 2652520 T5724 oasc.AbstractZkTestCase.putConfig put /Users/jenkins/jenkins-slave/workspace/Lucene-Solr-4.x-MacOSX/solr/build/solr-core/test-files/solr/collection1/conf/currency.xml to /configs/conf1/currency.xml
   [junit4]   2> 2652521 T5724 oascc.SolrZkClient.makePath makePath: /configs/conf1/currency.xml
   [junit4]   2> 2652527 T5724 oasc.AbstractZkTestCase.putConfig put /Users/jenkins/jenkins-slave/workspace/Lucene-Solr-4.x-MacOSX/solr/build/solr-core/test-files/solr/collection1/conf/open-exchange-rates.json to /configs/conf1/open-exchange-rates.json
   [junit4]   2> 2652528 T5724 oascc.SolrZkClient.makePath makePath: /configs/conf1/open-exchange-rates.json
   [junit4]   2> 2652535 T5724 oasc.AbstractZkTestCase.putConfig put /Users/jenkins/jenkins-slave/workspace/Lucene-Solr-4.x-MacOSX/solr/build/solr-core/test-files/solr/collection1/conf/mapping-ISOLatin1Accent.txt to /configs/conf1/mapping-ISOLatin1Accent.txt
   [junit4]   2> 2652535 T5724 oascc.SolrZkClient.makePath makePath: /configs/conf1/mapping-ISOLatin1Accent.txt
   [junit4]   2> 2652544 T5724 oasc.AbstractZkTestCase.putConfig put /Users/jenkins/jenkins-slave/workspace/Lucene-Solr-4.x-MacOSX/solr/build/solr-core/test-files/solr/collection1/conf/old_synonyms.txt to /configs/conf1/old_synonyms.txt
   [junit4]   2> 2652545 T5724 oascc.SolrZkClient.makePath makePath: /configs/conf1/old_synonyms.txt
   [junit4]   2> 2652554 T5724 oasc.AbstractZkTestCase.putConfig put /Users/jenkins/jenkins-slave/workspace/Lucene-Solr-4.x-MacOSX/solr/build/solr-core/test-files/solr/collection1/conf/synonyms.txt to /configs/conf1/synonyms.txt
   [junit4]   2> 2652555 T5724 oascc.SolrZkClient.makePath makePath: /configs/conf1/synonyms.txt
   [junit4]   2> 2653044 T5724 oejs.Server.doStart jetty-8.1.10.v20130312
   [junit4]   2> 2653057 T5724 oejs.AbstractConnector.doStart Started SelectChannelConnector@127.0.0.1:53429
   [junit4]   2> 2653058 T5724 oass.SolrDispatchFilter.init SolrDispatchFilter.init()
   [junit4]   2> 2653059 T5724 oasc.SolrResourceLoader.locateSolrHome JNDI not configured for solr (NoInitialContextEx)
   [junit4]   2> 2653059 T5724 oasc.SolrResourceLoader.locateSolrHome using system property solr.solr.home: /Users/jenkins/jenkins-slave/workspace/Lucene-Solr-4.x-MacOSX/solr/build/solr-core/test/J0/./org.apache.solr.cloud.CollectionsAPIDistributedZkTest-controljetty-1375411056849
   [junit4]   2> 2653060 T5724 oasc.SolrResourceLoader.<init> new SolrResourceLoader for directory: '/Users/jenkins/jenkins-slave/workspace/Lucene-Solr-4.x-MacOSX/solr/build/solr-core/test/J0/./org.apache.solr.cloud.CollectionsAPIDistributedZkTest-controljetty-1375411056849/'
   [junit4]   2> 2653109 T5724 oasc.ConfigSolr.fromFile Loading container configuration from /Users/jenkins/jenkins-slave/workspace/Lucene-Solr-4.x-MacOSX/solr/build/solr-core/test/J0/./org.apache.solr.cloud.CollectionsAPIDistributedZkTest-controljetty-1375411056849/solr.xml
   [junit4]   2> 2653214 T5724 oasc.ConfigSolrXml.<init> Config-defined core root directory: 
   [junit4]   2> 2653215 T5724 oasc.CoreContainer.<init> New CoreContainer 822907554
   [junit4]   2> 2653215 T5724 oasc.CoreContainer.load Loading cores into CoreContainer [instanceDir=/Users/jenkins/jenkins-slave/workspace/Lucene-Solr-4.x-MacOSX/solr/build/solr-core/test/J0/./org.apache.solr.cloud.CollectionsAPIDistributedZkTest-controljetty-1375411056849/]
   [junit4]   2> 2653217 T5724 oashc.HttpShardHandlerFactory.getParameter Setting socketTimeout to: 120000
   [junit4]   2> 2653217 T5724 oashc.HttpShardHandlerFactory.getParameter Setting urlScheme to: http://
   [junit4]   2> 2653218 T5724 oashc.HttpShardHandlerFactory.getParameter Setting connTimeout to: 15000
   [junit4]   2> 2653218 T5724 oashc.HttpShardHandlerFactory.getParameter Setting maxConnectionsPerHost to: 20
   [junit4]   2> 2653218 T5724 oashc.HttpShardHandlerFactory.getParameter Setting corePoolSize to: 0
   [junit4]   2> 2653219 T5724 oashc.HttpShardHandlerFactory.getParameter Setting maximumPoolSize to: 2147483647
   [junit4]   2> 2653219 T5724 oashc.HttpShardHandlerFactory.getParameter Setting maxThreadIdleTime to: 5
   [junit4]   2> 2653220 T5724 oashc.HttpShardHandlerFactory.getParameter Setting sizeOfQueue to: -1
   [junit4]   2> 2653220 T5724 oashc.HttpShardHandlerFactory.getParameter Setting fairnessPolicy to: false
   [junit4]   2> 2653221 T5724 oascsi.HttpClientUtil.createClient Creating new http client, config:maxConnectionsPerHost=20&maxConnections=10000&socketTimeout=120000&connTimeout=15000&retry=false
   [junit4]   2> 2653247 T5724 oasc.ZkContainer.initZooKeeper Zookeeper client=127.0.0.1:53426/solr
   [junit4]   2> 2653248 T5724 oasc.ZkController.checkChrootPath zkHost includes chroot
   [junit4]   2> 2653252 T5724 oascc.ConnectionManager.waitForConnected Waiting for client to connect to ZooKeeper
   [junit4]   2> 2653256 T5744 oascc.ConnectionManager.process Watcher org.apache.solr.common.cloud.ConnectionManager@3d0af381 name:ZooKeeperConnection Watcher:127.0.0.1:53426 got event WatchedEvent state:SyncConnected type:None path:null path:null type:None
   [junit4]   2> 2653256 T5724 oascc.ConnectionManager.waitForConnected Client is connected to ZooKeeper
   [junit4]   2> 2653261 T5724 oascsi.HttpClientUtil.createClient Creating new http client, config:maxConnections=500&maxConnectionsPerHost=16&socketTimeout=120000&connTimeout=15000
   [junit4]   2> 2653261 T5726 oazs.NIOServerCnxn.doIO WARN caught end of stream exception EndOfStreamException: Unable to read additional data from client sessionid 0x1403ce32fe10002, likely client has closed socket
   [junit4]   2> 	at org.apache.zookeeper.server.NIOServerCnxn.doIO(NIOServerCnxn.java:220)
   [junit4]   2> 	at org.apache.zookeeper.server.NIOServerCnxnFactory.run(NIOServerCnxnFactory.java:208)
   [junit4]   2> 	at java.lang.Thread.run(Thread.java:724)
   [junit4]   2> 
   [junit4]   2> 2653279 T5724 oascc.ConnectionManager.waitForConnected Waiting for client to connect to ZooKeeper
   [junit4]   2> 2653284 T5746 oascc.ConnectionManager.process Watcher org.apache.solr.common.cloud.ConnectionManager@74942476 name:ZooKeeperConnection Watcher:127.0.0.1:53426/solr got event WatchedEvent state:SyncConnected type:None path:null path:null type:None
   [junit4]   2> 2653285 T5724 oascc.ConnectionManager.waitForConnected Client is connected to ZooKeeper
   [junit4]   2> 2653289 T5724 oascc.SolrZkClient.makePath makePath: /overseer/queue
   [junit4]   2> 2653302 T5724 oascc.SolrZkClient.makePath makePath: /overseer/collection-queue-work
   [junit4]   2> 2653311 T5724 oascc.SolrZkClient.makePath makePath: /live_nodes
   [junit4]   2> 2653316 T5724 oasc.ZkController.createEphemeralLiveNode Register node as live in ZooKeeper:/live_nodes/127.0.0.1:53429_
   [junit4]   2> 2653319 T5724 oascc.SolrZkClient.makePath makePath: /live_nodes/127.0.0.1:53429_
   [junit4]   2> 2653328 T5724 oascc.SolrZkClient.makePath makePath: /overseer_elect/election
   [junit4]   2> 2653341 T5724 oascc.SolrZkClient.makePath makePath: /overseer_elect/leader
   [junit4]   2> 2653347 T5724 oasc.Overseer.start Overseer (id=90138939005927427-127.0.0.1:53429_-n_0000000000) starting
   [junit4]   2> 2653360 T5724 oascc.SolrZkClient.makePath makePath: /overseer/queue-work
   [junit4]   2> 2653370 T5748 oasc.OverseerCollectionProcessor.run Process current queue of collection creations
   [junit4]   2> 2653373 T5724 oascc.SolrZkClient.makePath makePath: /clusterstate.json
   [junit4]   2> 2653378 T5724 oascc.SolrZkClient.makePath makePath: /aliases.json
   [junit4]   2> 2653382 T5724 oascc.ZkStateReader.createClusterStateWatchersAndUpdate Updating cluster state from ZooKeeper... 
   [junit4]   2> 2653392 T5724 oasc.CorePropertiesLocator.discover Looking for core definitions underneath /Users/jenkins/jenkins-slave/workspace/Lucene-Solr-4.x-MacOSX/solr/build/solr-core/test/J0/./org.apache.solr.cloud.CollectionsAPIDistributedZkTest-controljetty-1375411056849
   [junit4]   2> 2653446 T5747 oasc.Overseer$ClusterStateUpdater.run Starting to work on the main queue
   [junit4]   2> 2653589 T5724 oasc.CorePropertiesLocator.discoverUnder Found core conf in /Users/jenkins/jenkins-slave/workspace/Lucene-Solr-4.x-MacOSX/solr/build/solr-core/test/J0/./org.apache.solr.cloud.CollectionsAPIDistributedZkTest-controljetty-1375411056849/conf/
   [junit4]   2> 2653598 T5724 oasc.CorePropertiesLocator.discover Found 1 core definitions
   [junit4]   2> 2653600 T5724 oass.SolrDispatchFilter.init user.dir=/Users/jenkins/jenkins-slave/workspace/Lucene-Solr-4.x-MacOSX/solr/build/solr-core/test/J0
   [junit4]   2> 2653600 T5724 oass.SolrDispatchFilter.init SolrDispatchFilter.init() done
   [junit4]   2> 2653601 T5724 oascsi.HttpClientUtil.createClient Creating new http client, config:maxConnections=128&maxConnectionsPerHost=32&followRedirects=false
   [junit4]   2> 2653620 T5724 oascsi.HttpClientUtil.createClient Creating new http client, config:
   [junit4]   2> 2653623 T5724 oascc.ConnectionManager.waitForConnected Waiting for client to connect to ZooKeeper
   [junit4]   2> 2653633 T5751 oascc.ConnectionManager.process Watcher org.apache.solr.common.cloud.ConnectionManager@70407620 name:ZooKeeperConnection Watcher:127.0.0.1:53426/solr got event WatchedEvent state:SyncConnected type:None path:null path:null type:None
   [junit4]   2> 2653634 T5724 oascc.ConnectionManager.waitForConnected Client is connected to ZooKeeper
   [junit4]   2> 2653637 T5724 oascc.ZkStateReader.createClusterStateWatchersAndUpdate Updating cluster state from ZooKeeper... 
   [junit4]   2> 2653645 T5724 oasc.ChaosMonkey.monkeyLog monkey: init - expire sessions:true cause connection loss:true
   [junit4]   2> 2654115 T5724 oejs.Server.doStart jetty-8.1.10.v20130312
   [junit4]   2> 2654127 T5724 oejs.AbstractConnector.doStart Started SelectChannelConnector@127.0.0.1:53433
   [junit4]   2> 2654128 T5724 oass.SolrDispatchFilter.init SolrDispatchFilter.init()
   [junit4]   2> 2654129 T5724 oasc.SolrResourceLoader.locateSolrHome JNDI not configured for solr (NoInitialContextEx)
   [junit4]   2> 2654129 T5724 oasc.SolrResourceLoader.locateSolrHome using system property solr.solr.home: /Users/jenkins/jenkins-slave/workspace/Lucene-Solr-4.x-MacOSX/solr/build/solr-core/test/J0/./org.apache.solr.cloud.CollectionsAPIDistributedZkTest-jetty1-1375411057921
   [junit4]   2> 2654130 T5724 oasc.SolrResourceLoader.<init> new SolrResourceLoader for directory: '/Users/jenkins/jenkins-slave/workspace/Lucene-Solr-4.x-MacOSX/solr/build/solr-core/test/J0/./org.apache.solr.cloud.CollectionsAPIDistributedZkTest-jetty1-1375411057921/'
   [junit4]   2> 2654200 T5724 oasc.ConfigSolr.fromFile Loading container configuration from /Users/jenkins/jenkins-slave/workspace/Lucene-Solr-4.x-MacOSX/solr/build/solr-core/test/J0/./org.apache.solr.cloud.CollectionsAPIDistributedZkTest-jetty1-1375411057921/solr.xml
   [junit4]   2> 2654314 T5724 oasc.ConfigSolrXml.<init> Config-defined core root directory: 
   [junit4]   2> 2654315 T5724 oasc.CoreContainer.<init> New CoreContainer 1394351693
   [junit4]   2> 2654315 T5724 oasc.CoreContainer.load Loading cores into CoreContainer [instanceDir=/Users/jenkins/jenkins-slave/workspace/Lucene-Solr-4.x-MacOSX/solr/build/solr-core/test/J0/./org.apache.solr.cloud.CollectionsAPIDistributedZkTest-jetty1-1375411057921/]
   [junit4]   2> 2654318 T5724 oashc.HttpShardHandlerFactory.getParameter Setting socketTimeout to: 120000
   [junit4]   2> 2654318 T5724 oashc.HttpShardHandlerFactory.getParameter Setting urlScheme to: http://
   [junit4]   2> 2654319 T5724 oashc.HttpShardHandlerFactory.getParameter Setting connTimeout to: 15000
   [junit4]   2> 2654319 T5724 oashc.HttpShardHandlerFactory.getParameter Setting maxConnectionsPerHost to: 20
   [junit4]   2> 2654320 T5724 oashc.HttpShardHandlerFactory.getParameter Setting corePoolSize to: 0
   [junit4]   2> 2654321 T5724 oashc.HttpShardHandlerFactory.getParameter Setting maximumPoolSize to: 2147483647
   [junit4]   2> 2654321 T5724 oashc.HttpShardHandlerFactory.getParameter Setting maxThreadIdleTime to: 5
   [junit4]   2> 2654322 T5724 oashc.HttpShardHandlerFactory.getParameter Setting sizeOfQueue to: -1
   [junit4]   2> 2654322 T5724 oashc.HttpShardHandlerFactory.getParameter Setting fairnessPolicy to: false
   [junit4]   2> 2654322 T5724 oascsi.HttpClientUtil.createClient Creating new http client, config:maxConnectionsPerHost=20&maxConnections=10000&socketTimeout=120000&connTimeout=15000&retry=false
   [junit4]   2> 2654342 T5724 oasc.ZkContainer.initZooKeeper Zookeeper client=127.0.0.1:53426/solr
   [junit4]   2> 2654343 T5724 oasc.ZkController.checkChrootPath zkHost includes chroot
   [junit4]   2> 2654353 T5724 oascc.ConnectionManager.waitForConnected Waiting for client to connect to ZooKeeper
   [junit4]   2> 2654354 T5762 oascc.ConnectionManager.process Watcher org.apache.solr.common.cloud.ConnectionManager@1f08c46d name:ZooKeeperConnection Watcher:127.0.0.1:53426 got event WatchedEvent state:SyncConnected type:None path:null path:null type:None
   [junit4]   2> 2654355 T5724 oascc.ConnectionManager.waitForConnected Client is connected to ZooKeeper
   [junit4]   2> 2654358 T5724 oascsi.HttpClientUtil.createClient Creating new http client, config:maxConnections=500&maxConnectionsPerHost=16&socketTimeout=120000&connTimeout=15000
   [junit4]   2> 2654374 T5724 oascc.ConnectionManager.waitForConnected Waiting for client to connect to ZooKeeper
   [junit4]   2> 2654378 T5764 oascc.ConnectionManager.process Watcher org.apache.solr.common.cloud.ConnectionManager@168ab3ad name:ZooKeeperConnection Watcher:127.0.0.1:53426/solr got event WatchedEvent state:SyncConnected type:None path:null path:null type:None
   [junit4]   2> 2654379 T5724 oascc.ConnectionManager.waitForConnected Client is connected to ZooKeeper
   [junit4]   2> 2654389 T5724 oascc.ZkStateReader.createClusterStateWatchersAndUpdate Updating cluster state from ZooKeeper... 
   [junit4]   2> 2655399 T5724 oasc.ZkController.createEphemeralLiveNode Register node as live in ZooKeeper:/live_nodes/127.0.0.1:53433_
   [junit4]   2> 2655401 T5724 oascc.SolrZkClient.makePath makePath: /live_nodes/127.0.0.1:53433_
   [junit4]   2> 2655406 T5751 oascc.ZkStateReader$3.process Updating live nodes... (2)
   [junit4]   2> 2655408 T5764 oascc.ZkStateReader$3.process Updating live nodes... (2)
   [junit4]   2> 2655411 T5746 oascc.ZkStateReader$3.process Updating live nodes... (2)
   [junit4]   2> 2655425 T5724 oasc.CorePropertiesLocator.discover Looking for core definitions underneath /Users/jenkins/jenkins-slave/workspace/Lucene-Solr-4.x-MacOSX/solr/build/solr-core/test/J0/./org.apache.solr.cloud.CollectionsAPIDistributedZkTest-jetty1-1375411057921
   [junit4]   2> 2655581 T5724 oasc.CorePropertiesLocator.discoverUnder Found core conf in /Users/jenkins/jenkins-slave/workspace/Lucene-Solr-4.x-MacOSX/solr/build/solr-core/test/J0/./org.apache.solr.cloud.CollectionsAPIDistributedZkTest-jetty1-1375411057921/conf/
   [junit4]   2> 2655588 T5724 oasc.CorePropertiesLocator.discover Found 1 core definitions
   [junit4]   2> 2655589 T5724 oass.SolrDispatchFilter.init user.dir=/Users/jenkins/jenkins-slave/workspace/Lucene-Solr-4.x-MacOSX/solr/build/solr-core/test/J0
   [junit4]   2> 2655590 T5724 oass.SolrDispatchFilter.init SolrDispatchFilter.init() done
   [junit4]   2> 2655590 T5724 oascsi.HttpClientUtil.createClient Creating new http client, config:maxConnections=128&maxConnectionsPerHost=32&followRedirects=false
   [junit4]   2> 2656072 T5724 oejs.Server.doStart jetty-8.1.10.v20130312
   [junit4]   2> 2656078 T5724 oejs.AbstractConnector.doStart Started SelectChannelConnector@127.0.0.1:53436
   [junit4]   2> 2656079 T5724 oass.SolrDispatchFilter.init SolrDispatchFilter.init()
   [junit4]   2> 2656080 T5724 oasc.SolrResourceLoader.locateSolrHome JNDI not configured for solr (NoInitialContextEx)
   [junit4]   2> 2656080 T5724 oasc.SolrResourceLoader.locateSolrHome using system property solr.solr.home: /Users/jenkins/jenkins-slave/workspace/Lucene-Solr-4.x-MacOSX/solr/build/solr-core/test/J0/./org.apache.solr.cloud.CollectionsAPIDistributedZkTest-jetty2-1375411059886
   [junit4]   2> 2656081 T5724 oasc.SolrResourceLoader.<init> new SolrResourceLoader for directory: '/Users/jenkins/jenkins-slave/workspace/Lucene-Solr-4.x-MacOSX/solr/build/solr-core/test/J0/./org.apache.solr.cloud.CollectionsAPIDistributedZkTest-jetty2-1375411059886/'
   [junit4]   2> 2656135 T5724 oasc.ConfigSolr.fromFile Loading container configuration from /Users/jenkins/jenkins-slave/workspace/Lucene-Solr-4.x-MacOSX/solr/build/solr-core/test/J0/./org.apache.solr.cloud.CollectionsAPIDistributedZkTest-jetty2-1375411059886/solr.xml
   [junit4]   2> 2656246 T5724 oasc.ConfigSolrXml.<init> Config-defined core root directory: 
   [junit4]   2> 2656247 T5724 oasc.CoreContainer.<init> New CoreContainer 1261329726
   [junit4]   2> 2656248 T5724 oasc.CoreContainer.load Loading cores into CoreContainer [instanceDir=/Users/jenkins/jenkins-slave/workspace/Lucene-Solr-4.x-MacOSX/solr/build/solr-core/test/J0/./org.apache.solr.cloud.CollectionsAPIDistributedZkTest-jetty2-1375411059886/]
   [junit4]   2> 2656250 T5724 oashc.HttpShardHandlerFactory.getParameter Setting socketTimeout to: 120000
   [junit4]   2> 2656250 T5724 oashc.HttpShardHandlerFactory.getParameter Setting urlScheme to: http://
   [junit4]   2> 2656251 T5724 oashc.HttpShardHandlerFactory.getParameter Setting connTimeout to: 15000
   [junit4]   2> 2656251 T5724 oashc.HttpShardHandlerFactory.getParameter Setting maxConnectionsPerHost to: 20
   [junit4]   2> 2656252 T5724 oashc.HttpShardHandlerFactory.getParameter Setting corePoolSize to: 0
   [junit4]   2> 2656252 T5724 oashc.HttpShardHandlerFactory.getParameter Setting maximumPoolSize to: 2147483647
   [junit4]   2> 2656253 T5724 oashc.HttpShardHandlerFactory.getParameter Setting maxThreadIdleTime to: 5
   [junit4]   2> 2656253 T5724 oashc.HttpShardHandlerFactory.getParameter Setting sizeOfQueue to: -1
   [junit4]   2> 2656254 T5724 oashc.HttpShardHandlerFactory.getParameter Setting fairnessPolicy to: false
   [junit4]   2> 2656254 T5724 oascsi.HttpClientUtil.createClient Creating new http client, config:maxConnectionsPerHost=20&maxConnections=10000&socketTimeout=120000&connTimeout=15000&retry=false
   [junit4]   2> 2656274 T5724 oasc.ZkContainer.initZooKeeper Zookeeper client=127.0.0.1:53426/solr
   [junit4]   2> 2656274 T5724 oasc.ZkController.checkChrootPath zkHost includes chroot
   [junit4]   2> 2656277 T5724 oascc.ConnectionManager.waitForConnected Waiting for client to connect to ZooKeeper
   [junit4]   2> 2656289 T5776 oascc.ConnectionManager.process Watcher org.apache.solr.common.cloud.ConnectionManager@113594c name:ZooKeeperConnection Watcher:127.0.0.1:53426 got event WatchedEvent state:SyncConnected type:None path:null path:null type:None
   [junit4]   2> 2656293 T5724 oascc.ConnectionManager.waitForConnected Client is connected to ZooKeeper
   [junit4]   2> 2656297 T5724 oascsi.HttpClientUtil.createClient Creating new http client, config:maxConnections=500&maxConnectionsPerHost=16&socketTimeout=120000&connTimeout=15000
   [junit4]   2> 2656312 T5724 oascc.ConnectionManager.waitForConnected Waiting for client to connect to ZooKeeper
   [junit4]   2> 2656318 T5778 oascc.ConnectionManager.process Watcher org.apache.solr.common.cloud.ConnectionManager@29e869b4 name:ZooKeeperConnection Watcher:127.0.0.1:53426/solr got event WatchedEvent state:SyncConnected type:None path:null path:null type:None
   [junit4]   2> 2656319 T5724 oascc.ConnectionManager.waitForConnected Client is connected to ZooKeeper
   [junit4]   2> 2656330 T5724 oascc.ZkStateReader.createClusterStateWatchersAndUpdate Updating cluster state from ZooKeeper... 
   [junit4]   2> 2657338 T5724 oasc.ZkController.createEphemeralLiveNode Register node as live in ZooKeeper:/live_nodes/127.0.0.1:53436_
   [junit4]   2> 2657344 T5724 oascc.SolrZkClient.makePath makePath: /live_nodes/127.0.0.1:53436_
   [junit4]   2> 2657352 T5764 oascc.ZkStateReader$3.process Updating live nodes... (3)
   [junit4]   2> 2657353 T5778 oascc.ZkStateReader$3.process Updating live nodes... (3)
   [junit4]   2> 2657353 T5751 oascc.ZkStateReader$3.process Updating live nodes... (3)
   [junit4]   2> 2657353 T5746 oascc.ZkStateReader$3.process Updating live nodes... (3)
   [junit4]   2> 2657362 T5724 oasc.CorePropertiesLocator.discover Looking for core definitions underneath /Users/jenkins/jenkins-slave/workspace/Lucene-Solr-4.x-MacOSX/solr/build/solr-core/test/J0/./org.apache.solr.cloud.CollectionsAPIDistributedZkTest-jetty2-1375411059886
   [junit4]   2> 2657516 T5724 oasc.CorePropertiesLocator.discoverUnder Found core conf in /Users/jenkins/jenkins-slave/workspace/Lucene-Solr-4.x-MacOSX/solr/build/solr-core/test/J0/./org.apache.solr.cloud.CollectionsAPIDistributedZkTest-jetty2-1375411059886/conf/
   [junit4]   2> 2657528 T5724 oasc.CorePropertiesLocator.discover Found 1 core definitions
   [junit4]   2> 2657532 T5724 oass.SolrDispatchFilter.init user.dir=/Users/jenkins/jenkins-slave/workspace/Lucene-Solr-4.x-MacOSX/solr/build/solr-core/test/J0
   [junit4]   2> 2657533 T5724 oass.SolrDispatchFilter.init SolrDispatchFilter.init() done
   [junit4]   2> 2657533 T5724 oascsi.HttpClientUtil.createClient Creating new http client, config:maxConnections=128&maxConnectionsPerHost=32&followRedirects=false
   [junit4]   2> 2658025 T5724 oejs.Server.doStart jetty-8.1.10.v20130312
   [junit4]   2> 2658030 T5724 oejs.AbstractConnector.doStart Started SelectChannelConnector@127.0.0.1:53439
   [junit4]   2> 2658030 T5724 oass.SolrDispatchFilter.init SolrDispatchFilter.init()
   [junit4]   2> 2658031 T5724 oasc.SolrResourceLoader.locateSolrHome JNDI not configured for solr (NoInitialContextEx)
   [junit4]   2> 2658035 T5724 oasc.SolrResourceLoader.locateSolrHome using system property solr.solr.home: /Users/jenkins/jenkins-slave/workspace/Lucene-Solr-4.x-MacOSX/solr/build/solr-core/test/J0/./org.apache.solr.cloud.CollectionsAPIDistributedZkTest-jetty3-1375411061828
   [junit4]   2> 2658036 T5724 oasc.SolrResourceLoader.<init> new SolrResourceLoader for directory: '/Users/jenkins/jenkins-slave/workspace/Lucene-Solr-4.x-MacOSX/solr/build/solr-core/test/J0/./org.apache.solr.cloud.CollectionsAPIDistributedZkTest-jetty3-1375411061828/'
   [junit4]   2> 2658093 T5724 oasc.ConfigSolr.fromFile Loading container configuration from /Users/jenkins/jenkins-slave/workspace/Lucene-Solr-4.x-MacOSX/solr/build/solr-core/test/J0/./org.apache.solr.cloud.CollectionsAPIDistributedZkTest-jetty3-1375411061828/solr.xml
   [junit4]   2> 2658211 T5724 oasc.ConfigSolrXml.<init> Config-defined core root directory: 
   [junit4]   2> 2658212 T5724 oasc.CoreContainer.<init> New CoreContainer 80147127
   [junit4]   2> 2658213 T5724 oasc.CoreContainer.load Loading cores into CoreContainer [instanceDir=/Users/jenkins/jenkins-slave/workspace/Lucene-Solr-4.x-MacOSX/solr/build/solr-core/test/J0/./org.apache.solr.cloud.CollectionsAPIDistributedZkTest-jetty3-1375411061828/]
   [junit4]   2> 2658216 T5724 oashc.HttpShardHandlerFactory.getParameter Setting socketTimeout to: 120000
   [junit4]   2> 2658216 T5724 oashc.HttpShardHandlerFactory.getParameter Setting urlScheme to: http://
   [junit4]   2> 2658217 T5724 oashc.HttpShardHandlerFactory.getParameter Setting connTimeout to: 15000
   [junit4]   2> 2658217 T5724 oashc.HttpShardHandlerFactory.getParameter Setting maxConnectionsPerHost to: 20
   [junit4]   2> 2658218 T5724 oashc.HttpShardHandlerFactory.getParameter Setting corePoolSize to: 0
   [junit4]   2> 2658218 T5724 oashc.HttpShardHandlerFactory.getParameter Setting maximumPoolSize to: 2147483647
   [junit4]   2> 2658219 T5724 oashc.HttpShardHandlerFactory.getParameter Setting maxThreadIdleTime to: 5
   [junit4]   2> 2658219 T5724 oashc.HttpShardHandlerFactory.getParameter Setting sizeOfQueue to: -1
   [junit4]   2> 2658220 T5724 oashc.HttpShardHandlerFactory.getParameter Setting fairnessPolicy to: false
   [junit4]   2> 2658220 T5724 oascsi.HttpClientUtil.createClient Creating new http client, config:maxConnectionsPerHost=20&maxConnections=10000&socketTimeout=120000&connTimeout=15000&retry=false
   [junit4]   2> 2658241 T5724 oasc.ZkContainer.initZooKeeper Zookeeper client=127.0.0.1:53426/solr
   [junit4]   2> 2658242 T5724 oasc.ZkController.checkChrootPath zkHost includes chroot
   [junit4]   2> 2658246 T5724 oascc.ConnectionManager.waitForConnected Waiting for client to connect to ZooKeeper
   [junit4]   2> 2658250 T5790 oascc.ConnectionManager.process Watcher org.apache.solr.common.cloud.ConnectionManager@5c23c20a name:ZooKeeperConnection Watcher:127.0.0.1:53426 got event WatchedEvent state:SyncConnected type:None path:null path:null type:None
   [junit4]   2> 2658255 T5724 oascc.ConnectionManager.waitForConnected Client is connected to ZooKeeper
   [junit4]   2> 2658260 T5724 oascsi.HttpClientUtil.createClient Creating new http client, config:maxConnections=500&maxConnectionsPerHost=16&socketTimeout=120000&connTimeout=15000
   [junit4]   2> 2658279 T5724 oascc.ConnectionManager.waitForConnected Waiting for client to connect to ZooKeeper
   [junit4]   2> 2658284 T5792 oascc.ConnectionManager.process Watcher org.apache.solr.common.cloud.ConnectionManager@1050d451 name:ZooKeeperConnection Watcher:127.0.0.1:53426/solr got event WatchedEvent state:SyncConnected type:None path:null path:null type:None
   [junit4]   2> 2658284 T5724 oascc.ConnectionManager.waitForConnected Client is connected to ZooKeeper
   [junit4]   2> 2658293 T5724 oascc.ZkStateReader.createClusterStateWatchersAndUpdate Updating cluster state from ZooKeeper... 
   [junit4]   2> 2659302 T5724 oasc.ZkController.createEphemeralLiveNode Register node as live in ZooKeeper:/live_nodes/127.0.0.1:53439_
   [junit4]   2> 2659306 T5724 oascc.SolrZkClient.makePath makePath: /live_nodes/127.0.0.1:53439_
   [junit4]   2> 2659314 T5792 oascc.ZkStateReader$3.process Updating live nodes... (4)
   [junit4]   2> 2659314 T5764 oascc.ZkStateReader$3.process Updating live nodes... (4)
   [junit4]   2> 2659315 T5778 oascc.ZkStateReader$3.process Updating live nodes... (4)
   [junit4]   2> 2659317 T5746 oascc.ZkStateReader$3.process Updating live nodes... (4)
   [junit4]   2> 2659318 T5751 oascc.ZkStateReader$3.process Updating live nodes... (4)
   [junit4]   2> 2659327 T5724 oasc.CorePropertiesLocator.discover Looking for core definitions underneath /Users/jenkins/jenkins-slave/workspace/Lucene-Solr-4.x-MacOSX/solr/build/solr-core/test/J0/./org.apache.solr.cloud.CollectionsAPIDistributedZkTest-jetty3-1375411061828
   [junit4]   2> 2659493 T5724 oasc.CorePropertiesLocator.discoverUnder Found core conf in /Users/jenkins/jenkins-slave/workspace/Lucene-Solr-4.x-MacOSX/solr/build/solr-core/test/J0/./org.apache.solr.cloud.CollectionsAPIDistributedZkTest-jetty3-1375411061828/conf/
   [junit4]   2> 2659501 T5724 oasc.CorePropertiesLocator.discover Found 1 core definitions
   [junit4]   2> 2659502 T5724 oass.SolrDispatchFilter.init user.dir=/Users/jenkins/jenkins-slave/workspace/Lucene-Solr-4.x-MacOSX/solr/build/solr-core/test/J0
   [junit4]   2> 2659502 T5724 oass.SolrDispatchFilter.init SolrDispatchFilter.init() done
   [junit4]   2> 2659503 T5724 oascsi.HttpClientUtil.createClient Creating new http client, config:maxConnections=128&maxConnectionsPerHost=32&followRedirects=false
   [junit4]   2> 2659975 T5724 oejs.Server.doStart jetty-8.1.10.v20130312
   [junit4]   2> 2659983 T5724 oejs.AbstractConnector.doStart Started SelectChannelConnector@127.0.0.1:53442
   [junit4]   2> 2659990 T5724 oass.SolrDispatchFilter.init SolrDispatchFilter.init()
   [junit4]   2> 2659991 T5724 oasc.SolrResourceLoader.locateSolrHome JNDI not configured for solr (NoInitialContextEx)
   [junit4]   2> 2659991 T5724 oasc.SolrResourceLoader.locateSolrHome using system property solr.solr.home: /Users/jenkins/jenkins-slave/workspace/Lucene-Solr-4.x-MacOSX/solr/build/solr-core/test/J0/./org.apache.solr.cloud.CollectionsAPIDistributedZkTest-jetty4-1375411063802
   [junit4]   2> 2659992 T5724 oasc.SolrResourceLoader.<init> new SolrResourceLoader for directory: '/Users/jenkins/jenkins-slave/workspace/Lucene-Solr-4.x-MacOSX/solr/build/solr-core/test/J0/./org.apache.solr.cloud.CollectionsAPIDistributedZkTest-jetty4-1375411063802/'
   [junit4]   2> 2660040 T5724 oasc.ConfigSolr.fromFile Loading container configuration from /Users/jenkins/jenkins-slave/workspace/Lucene-Solr-4.x-MacOSX/solr/build/solr-core/test/J0/./org.apache.solr.cloud.CollectionsAPIDistributedZkTest-jetty4-1375411063802/solr.xml
   [junit4]   2> 2660153 T5724 oasc.ConfigSolrXml.<init> Config-defined core root directory: 
   [junit4]   2> 2660154 T5724 oasc.CoreContainer.<init> New CoreContainer 1243699624
   [junit4]   2> 2660154 T5724 oasc.CoreContainer.load Loading cores into CoreContainer [instanceDir=/Users/jenkins/jenkins-slave/workspace/Lucene-Solr-4.x-MacOSX/solr/build/solr-core/test/J0/./org.apache.solr.cloud.CollectionsAPIDistributedZkTest-jetty4-1375411063802/]
   [junit4]   2> 2660156 T5724 oashc.HttpShardHandlerFactory.getParameter Setting socketTimeout to: 120000
   [junit4]   2> 2660157 T5724 oashc.HttpShardHandlerFactory.getParameter Setting urlScheme to: http://
   [junit4]   2> 2660157 T5724 oashc.HttpShardHandlerFactory.getParameter Setting connTimeout to: 15000
   [junit4]   2> 2660158 T5724 oashc.HttpShardHandlerFactory.getParameter Setting maxConnectionsPerHost to: 20
   [junit4]   2> 2660158 T5724 oashc.HttpShardHandlerFactory.getParameter Setting corePoolSize to: 0
   [junit4]   2> 2660158 T5724 oashc.HttpShardHandlerFactory.getParameter Setting maximumPoolSize to: 2147483647
   [junit4]   2> 2660159 T5724 oashc.HttpShardHandlerFactory.getParameter Setting maxThreadIdleTime to: 5
   [junit4]   2> 2660159 T5724 oashc.HttpShardHandlerFactory.getParameter Setting sizeOfQueue to: -1
   [junit4]   2> 2660160 T5724 oashc.HttpShardHandlerFactory.getParameter Setting fairnessPolicy to: false
   [junit4]   2> 2660160 T5724 oascsi.HttpClientUtil.createClient Creating new http client, config:maxConnectionsPerHost=20&maxConnections=10000&socketTimeout=120000&connTimeout=15000&retry=false
   [junit4]   2> 2660180 T5724 oasc.ZkContainer.initZooKeeper Zookeeper client=127.0.0.1:53426/solr
   [junit4]   2> 2660181 T5724 oasc.ZkController.checkChrootPath zkHost includes chroot
   [junit4]   2> 2660189 T5724 oascc.ConnectionManager.waitForConnected Waiting for client to connect to ZooKeeper
   [junit4]   2> 2660193 T5804 oascc.ConnectionManager.process Watcher org.apache.solr.common.cloud.ConnectionManager@d9d426f name:ZooKeeperConnection Watcher:127.0.0.1:53426 got event WatchedEvent state:SyncConnected type:None path:null path:null type:None
   [junit4]   2> 2660193 T5724 oascc.ConnectionManager.waitForConnected Client is connected to ZooKeeper
   [junit4]   2> 2660196 T5724 oascsi.HttpClientUtil.createClient Creating new http client, config:maxConnections=500&maxConnectionsPerHost=16&socketTimeout=120000&connTimeout=15000
   [junit4]   2> 2660211 T5724 oascc.ConnectionManager.waitForConnected Waiting for client to connect to ZooKeeper
   [junit4]   2> 2660215 T5806 oascc.ConnectionManager.process Watcher org.apache.solr.common.cloud.ConnectionManager@422c5d18 name:ZooKeeperConnection Watcher:127.0.0.1:53426/solr got event WatchedEvent state:SyncConnected type:None path:null path:null type:None
   [junit4]   2> 2660216 T5724 oascc.ConnectionManager.waitForConnected Client is connected to ZooKeeper
   [junit4]   2> 2660224 T5724 oascc.ZkStateReader.createClusterStateWatchersAndUpdate Updating cluster state from ZooKeeper... 
   [junit4]   2> 2661234 T5724 oasc.ZkController.createEphemeralLiveNode Register node as live in ZooKeeper:/live_nodes/127.0.0.1:53442_
   [junit4]   2> 2661238 T5724 oascc.SolrZkClient.makePath makePath: /live_nodes/127.0.0.1:53442_
   [junit4]   2> 2661245 T5806 oascc.ZkStateReader$3.process Updating live nodes... (5)
   [junit4]   2> 2661245 T5792 oascc.ZkStateReader$3.process Updating live nodes... (5)
   [junit4]   2> 2661245 T5746 oascc.ZkStateReader$3.process Updating live nodes... (5)
   [junit4]   2> 2661245 T5778 oascc.ZkStateReader$3.process Updating live nodes... (5)
   [junit4]   2> 2661249 T5764 oascc.ZkStateReader$3.process Updating live nodes... (5)
   [junit4]   2> 2661249 T5751 oascc.ZkStateReader$3.process Updating live nodes... (5)
   [junit4]   2> 2661257 T5724 oasc.CorePropertiesLocator.discover Looking for core definitions underneath /Users/jenkins/jenkins-slave/workspace/Lucene-Solr-4.x-MacOSX/solr/build/solr-core/test/J0/./org.apache.solr.cloud.CollectionsAPIDistributedZkTest-jetty4-1375411063802
   [junit4]   2> 2661420 T5724 oasc.CorePropertiesLocator.discoverUnder Found core conf in /Users/jenkins/jenkins-slave/workspace/Lucene-Solr-4.x-MacOSX/solr/build/solr-core/test/J0/./org.apache.solr.cloud.CollectionsAPIDistributedZkTest-jetty4-1375411063802/conf/
   [junit4]   2> 2661428 T5724 oasc.CorePropertiesLocator.discover Found 1 core definitions
   [junit4]   2> 2661429 T5724 oass.SolrDispatchFilter.init user.dir=/Users/jenkins/jenkins-slave/workspace/Lucene-Solr-4.x-MacOSX/solr/build/solr-core/test/J0
   [junit4]   2> 2661430 T5724 oass.SolrDispatchFilter.init SolrDispatchFilter.init() done
   [junit4]   2> 2661430 T5724 oascsi.HttpClientUtil.createClient Creating new http client, config:maxConnections=128&maxConnectionsPerHost=32&followRedirects=false
   [junit4]   2> 2661452 T5724 oascsi.HttpClientUtil.createClient Creating new http client, config:maxConnections=128&maxConnectionsPerHost=32&followRedirects=false
   [junit4]   2> 2661469 T5756 oasha.CollectionsHandler.handleCreateAction Creating Collection : numShards=2&name=nodes_used_collection&replicationFactor=2&action=CREATE&wt=javabin&version=2
   [junit4]   2> 2661474 T5746 oasc.DistributedQueue$LatchChildWatcher.process Watcher fired on path: /overseer/collection-queue-work state: SyncConnected type NodeChildrenChanged
   [junit4]   2> 2661477 T5748 oasc.OverseerCollectionProcessor.run Overseer Collection Processor: Get the message id:/overseer/collection-queue-work/qn-0000000000 message:{
   [junit4]   2> 	  "operation":"createcollection",
   [junit4]   2> 	  "numShards":"2",
   [junit4]   2> 	  "name":"nodes_used_collection",
   [junit4]   2> 	  "replicationFactor":"2"}
   [junit4]   2> 2661477 T5748 oasc.OverseerCollectionProcessor.processMessage WARN OverseerCollectionProcessor.processMessage : createcollection , {
   [junit4]   2> 	  "operation":"createcollection",
   [junit4]   2> 	  "numShards":"2",
   [junit4]   2> 	  "name":"nodes_used_collection",
   [junit4]   2> 	  "replicationFactor":"2"}
   [junit4]   2> 2662509 T5747 oascc.ZkStateReader.updateClusterState Updating cloud state from ZooKeeper... 
   [junit4]   2> 2662512 T5747 oasc.Overseer$ClusterStateUpdater.buildCollection building a new collection: nodes_used_collection
   [junit4]   2> 2662512 T5747 oasc.Overseer$ClusterStateUpdater.createCollection Create collection nodes_used_collection with shards [shard1, shard2]
   [junit4]   2> 2662533 T5778 oascc.ZkStateReader$2.process A cluster state change: WatchedEvent state:SyncConnected type:NodeDataChanged path:/clusterstate.json, has occurred - updating... (live nodes size: 5)
   [junit4]   2> 2662533 T5746 oascc.ZkStateReader$2.process A cluster state change: WatchedEvent state:SyncConnected type:NodeDataChanged path:/clusterstate.json, has occurred - updating... (live nodes size: 5)
   [junit4]   2> 2662534 T5751 oascc.ZkStateReader$2.process A cluster state change: WatchedEvent state:SyncConnected type:NodeDataChanged path:/clusterstate.json, has occurred - updating... (live nodes size: 5)
   [junit4]   2> 2662538 T5806 oascc.ZkStateReader$2.process A cluster state change: WatchedEvent state:SyncConnected type:NodeDataChanged path:/clusterstate.json, has occurred - updating... (live nodes size: 5)
   [junit4]   2> 2662541 T5792 oascc.ZkStateReader$2.process A cluster state change: WatchedEvent state:SyncConnected type:NodeDataChanged path:/clusterstate.json, has occurred - updating... (live nodes size: 5)
   [junit4]   2> 2662543 T5764 oascc.ZkStateReader$2.process A cluster state change: WatchedEvent state:SyncConnected type:NodeDataChanged path:/clusterstate.json, has occurred - updating... (live nodes size: 5)
   [junit4]   2> 2662597 T5748 oasc.OverseerCollectionProcessor.createCollection going to create cores replicas shardNames [shard1, shard2] , repFactor : 2
   [junit4]   2> 2662597 T5748 oasc.OverseerCollectionProcessor.createCollection Creating shard nodes_used_collection_shard1_replica1 as part of slice shard1 of collection nodes_used_collection on 127.0.0.1:53439_
   [junit4]   2> 2662598 T5748 oasc.OverseerCollectionProcessor.createCollection Creating shard nodes_used_collection_shard1_replica2 as part of slice shard1 of collection nodes_used_collection on 127.0.0.1:53429_
   [junit4]   2> 2662599 T5748 oasc.OverseerCollectionProcessor.createCollection Creating shard nodes_used_collection_shard2_replica1 as part of slice shard2 of collection nodes_used_collection on 127.0.0.1:53433_
   [junit4]   2> 2662600 T5748 oasc.OverseerCollectionProcessor.createCollection Creating shard nodes_used_collection_shard2_replica2 as part of slice shard2 of collection nodes_used_collection on 127.0.0.1:53442_
   [junit4]   2> 2662615 T5797 oasc.ZkController.publish publishing core=nodes_used_collection_shard2_replica2 state=down
   [junit4]   2> 2662625 T5788 oasc.ZkController.publish publishing core=nodes_used_collection_shard1_replica1 state=down
   [junit4]   2> 2662619 T5741 oasc.ZkController.publish publishing core=nodes_used_collection_shard1_replica2 state=down
   [junit4]   2> 2662628 T5759 oasc.ZkController.publish publishing core=nodes_used_collection_shard2_replica1 state=down
   [junit4]   2> 2662630 T5797 oasc.ZkController.waitForCoreNodeName look for our core node name
   [junit4]   2> 2662630 T5741 oasc.ZkController.waitForCoreNodeName look for our core node name
   [junit4]   2> 2662631 T5788 oasc.ZkController.waitForCoreNodeName look for our core node name
   [junit4]   2> 2662631 T5759 oasc.ZkController.waitForCoreNodeName look for our core node name
   [junit4]   2> 2664061 T5747 oascc.ZkStateReader.updateClusterState Updating cloud state from ZooKeeper... 
   [junit4]   2> 2664067 T5747 oasc.Overseer$ClusterStateUpdater.updateState WARN Could not find collection node for nodes_used_collection, skipping publish state
   [junit4]   2> 2664069 T5747 oasc.Overseer$ClusterStateUpdater.updateState Update state numShards=2 message={
   [junit4]   2> 	  "operation":"state",
   [junit4]   2> 	  "core_node_name":"core_node1",
   [junit4]   2> 	  "numShards":"2",
   [junit4]   2> 	  "shard":"shard2",
   [junit4]   2> 	  "roles":null,
   [junit4]   2> 	  "state":"down",
   [junit4]   2> 	  "shard_state":"active",
   [junit4]   2> 	  "core":"nodes_used_collection_shard2_replica2",
   [junit4]   2> 	  "collection":"nodes_used_collection",
   [junit4]   2> 	  "shard_range":null,
   [junit4]   2> 	  "node_name":"127.0.0.1:53442_",
   [junit4]   2> 	  "base_url":"http://127.0.0.1:53442"}
   [junit4]   2> 2664082 T5747 oasc.Overseer$ClusterStateUpdater.updateState WARN Could not find collection node for nodes_used_collection, skipping publish state
   [junit4]   2> 2664083 T5747 oasc.Overseer$ClusterStateUpdater.updateState Update state numShards=2 message={
   [junit4]   2> 	  "operation":"state",
   [junit4]   2> 	  "core_node_name":"core_node2",
   [junit4]   2> 	  "numShards":"2",
   [junit4]   2> 	  "shard":"shard1",
   [junit4]   2> 	  "roles":null,
   [junit4]   2> 	  "state":"down",
   [junit4]   2> 	  "shard_state":"active",
   [junit4]   2> 	  "core":"nodes_used_collection_shard1_replica1",
   [junit4]   2> 	  "collection":"nodes_used_collection",
   [junit4]   2> 	  "shard_range":null,
   [junit4]   2> 	  "node_name":"127.0.0.1:53439_",
   [junit4]   2> 	  "base_url":"http://127.0.0.1:53439"}
   [junit4]   2> 2664092 T5747 oasc.Overseer$ClusterStateUpdater.updateState WARN Could not find collection node for nodes_used_collection, skipping publish state
   [junit4]   2> 2664092 T5747 oasc.Overseer$ClusterStateUpdater.updateState Update state numShards=2 message={
   [junit4]   2> 	  "operation":"state",
   [junit4]   2> 	  "core_node_name":"core_node3",
   [junit4]   2> 	  "numShards":"2",
   [junit4]   2> 	  "shard":"shard1",
   [junit4]   2> 	  "roles":null,
   [junit4]   2> 	  "state":"down",
   [junit4]   2> 	  "shard_state":"active",
   [junit4]   2> 	  "core":"nodes_used_collection_shard1_replica2",
   [junit4]   2> 	  "collection":"nodes_used_collection",
   [junit4]   2> 	  "shard_range":null,
   [junit4]   2> 	  "node_name":"127.0.0.1:53429_",
   [junit4]   2> 	  "base_url":"http://127.0.0.1:53429"}
   [junit4]   2> 2664100 T5747 oasc.Overseer$ClusterStateUpdater.updateState WARN Could not find collection node for nodes_used_collection, skipping publish state
   [junit4]   2> 2664101 T5747 oasc.Overseer$ClusterStateUpdater.updateState Update state numShards=2 message={
   [junit4]   2> 	  "operation":"state",
   [junit4]   2> 	  "core_node_name":"core_node4",
   [junit4]   2> 	  "numShards":"2",
   [junit4]   2> 	  "shard":"shard2",
   [junit4]   2> 	  "roles":null,
   [junit4]   2> 	  "state":"down",
   [junit4]   2> 	  "shard_state":"active",
   [junit4]   2> 	  "core":"nodes_used_collection_shard2_replica1",
   [junit4]   2> 	  "collection":"nodes_used_collection",
   [junit4]   2> 	  "shard_range":null,
   [junit4]   2> 	  "node_name":"127.0.0.1:53433_",
   [junit4]   2> 	  "base_url":"http://127.0.0.1:53433"}
   [junit4]   2> 2664117 T5792 oascc.ZkStateReader$2.process A cluster state change: WatchedEvent state:SyncConnected type:NodeDataChanged path:/clusterstate.json, has occurred - updating... (live nodes size: 5)
   [junit4]   2> 2664118 T5746 oascc.ZkStateReader$2.process A cluster state change: WatchedEvent state:SyncConnected type:NodeDataChanged path:/clusterstate.json, has occurred - updating... (live nodes size: 5)
   [junit4]   2> 2664118 T5751 oascc.ZkStateReader$2.process A cluster state change: WatchedEvent state:SyncConnected type:NodeDataChanged path:/clusterstate.json, has occurred - updating... (live nodes size: 5)
   [junit4]   2> 2664120 T5778 oascc.ZkStateReader$2.process A cluster state change: WatchedEvent state:SyncConnected type:NodeDataChanged path:/clusterstate.json, has occurred - updating... (live nodes size: 5)
   [junit4]   2> 2664121 T5806 oascc.ZkStateReader$2.process A cluster state change: WatchedEvent state:SyncConnected type:NodeDataChanged path:/clusterstate.json, has occurred - updating... (live nodes size: 5)
   [junit4]   2> 2664121 T5764 oascc.ZkStateReader$2.process A cluster state change: WatchedEvent state:SyncConnected type:NodeDataChanged path:/clusterstate.json, has occurred - updating... (live nodes size: 5)
   [junit4]   2> 2664633 T5797 oasc.ZkController.waitForShardId waiting to find shard id in clusterstate for nodes_used_collection_shard2_replica2
   [junit4]   2> 2664634 T5797 oasc.CorePropertiesLocator.writePropertiesFile ERROR Couldn't persist core properties to /Users/jenkins/jenkins-slave/workspace/Lucene-Solr-4.x-MacOSX/solr/build/solr-core/test/J0/./org.apache.solr.cloud.CollectionsAPIDistributedZkTest-jetty4-1375411063802/nodes_used_collection_shard2_replica2/core.properties: java.io.FileNotFoundException: /Users/jenkins/jenkins-slave/workspace/Lucene-Solr-4.x-MacOSX/solr/build/solr-core/test/J0/./org.apache.solr.cloud.CollectionsAPIDistributedZkTest-jetty4-1375411063802/nodes_used_collection_shard2_replica2/core.properties (No such file or directory)
   [junit4]   2> 2664635 T5797 oasc.CoreContainer.create Creating SolrCore 'nodes_used_collection_shard2_replica2' using instanceDir: /Users/jenkins/jenkins-slave/workspace/Lucene-Solr-4.x-MacOSX/solr/build/solr-core/test/J0/./org.apache.solr.cloud.CollectionsAPIDistributedZkTest-jetty4-1375411063802/nodes_used_collection_shard2_replica2
   [junit4]   2> 2664635 T5797 oasc.ZkController.createCollectionZkNode Check for collection zkNode:nodes_used_collection
   [junit4]   2> 2664636 T5788 oasc.ZkController.waitForShardId waiting to find shard id in clusterstate for nodes_used_collection_shard1_replica1
   [junit4]   2> 2664637 T5788 oasc.CorePropertiesLocator.writePropertiesFile ERROR Couldn't persist core properties to /Users/jenkins/jenkins-slave/workspace/Lucene-Solr-4.x-MacOSX/solr/build/solr-core/test/J0/./org.apache.solr.cloud.CollectionsAPIDistributedZkTest-jetty3-1375411061828/nodes_used_collection_shard1_replica1/core.properties: java.io.FileNotFoundException: /Users/jenkins/jenkins-slave/workspace/Lucene-Solr-4.x-MacOSX/solr/build/solr-core/test/J0/./org.apache.solr.cloud.CollectionsAPIDistributedZkTest-jetty3-1375411061828/nodes_used_collection_shard1_replica1/core.properties (No such file or directory)
   [junit4]   2> 2664637 T5788 oasc.CoreContainer.create Creating SolrCore 'nodes_used_collection_shard1_replica1' using instanceDir: /Users/jenkins/jenkins-slave/workspace/Lucene-Solr-4.x-MacOSX/solr/build/solr-core/test/J0/./org.apache.solr.cloud.CollectionsAPIDistributedZkTest-jetty3-1375411061828/nodes_used_collection_shard1_replica1
   [junit4]   2> 2664638 T5788 oasc.ZkController.createCollectionZkNode Check for collection zkNode:nodes_used_collection
   [junit4]   2> 2664639 T5759 oasc.ZkController.waitForShardId waiting to find shard id in clusterstate for nodes_used_collection_shard2_replica1
   [junit4]   2> 2664640 T5759 oasc.CorePropertiesLocator.writePropertiesFile ERROR Couldn't persist core properties to /Users/jenkins/jenkins-slave/workspace/Lucene-Solr-4.x-MacOSX/solr/build/solr-core/test/J0/./org.apache.solr.cloud.CollectionsAPIDistributedZkTest-jetty1-1375411057921/nodes_used_collection_shard2_replica1/core.properties: java.io.FileNotFoundException: /Users/jenkins/jenkins-slave/workspace/Lucene-Solr-4.x-MacOSX/solr/build/solr-core/test/J0/./org.apache.solr.cloud.CollectionsAPIDistributedZkTest-jetty1-1375411057921/nodes_used_collection_shard2_replica1/core.properties (No such file or directory)
   [junit4]   2> 2664640 T5759 oasc.CoreContainer.create Creating SolrCore 'nodes_used_collection_shard2_replica1' using instanceDir: /Users/jenkins/jenkins-slave/workspace/Lucene-Solr-4.x-MacOSX/solr/build/solr-core/test/J0/./org.apache.solr.cloud.CollectionsAPIDistributedZkTest-jetty1-1375411057921/nodes_used_collection_shard2_replica1
   [junit4]   2> 2664641 T5759 oasc.ZkController.createCollectionZkNode Check for collection zkNode:nodes_used_collection
   [junit4]   2> 2664644 T5797 oasc.ZkController.createCollectionZkNode Creating collection in ZooKeeper:nodes_used_collection
   [junit4]   2> 2664644 T5797 oasc.ZkController.getConfName Looking for collection configName
   [junit4]   2> 2664645 T5788 oasc.ZkController.createCollectionZkNode Creating collection in ZooKeeper:nodes_used_collection
   [junit4]   2> 2664645 T5788 oasc.ZkController.getConfName Looking for collection configName
   [junit4]   2> 2664650 T5797 oasc.ZkController.getConfName Only one config set found in zk - using it:conf1
   [junit4]   2> 2664650 T5797 oascc.SolrZkClient.makePath makePath: /collections/nodes_used_collection
   [junit4]   2> 2664651 T5788 oasc.ZkController.getConfName Only one config set found in zk - using it:conf1
   [junit4]   2> 2664651 T5788 oascc.SolrZkClient.makePath makePath: /collections/nodes_used_collection
   [junit4]   2> 2664652 T5741 oasc.ZkController.waitForShardId waiting to find shard id in clusterstate for nodes_used_collection_shard1_replica2
   [junit4]   2> 2664663 T5741 oasc.CorePropertiesLocator.writePropertiesFile ERROR Couldn't persist core properties to /Users/jenkins/jenkins-slave/workspace/Lucene-Solr-4.x-MacOSX/solr/build/solr-core/test/J0/./org.apache.solr.cloud.CollectionsAPIDistributedZkTest-controljetty-1375411056849/nodes_used_collection_shard1_replica2/core.properties: java.io.FileNotFoundException: /Users/jenkins/jenkins-slave/workspace/Lucene-Solr-4.x-MacOSX/solr/build/solr-core/test/J0/./org.apache.solr.cloud.CollectionsAPIDistributedZkTest-controljetty-1375411056849/nodes_used_collection_shard1_replica2/core.properties (No such file or directory)
   [junit4]   2> 2664664 T5759 oasc.ZkController.createCollectionZkNode Creating collection in ZooKeeper:nodes_used_collection
   [junit4]   2> 2664664 T5759 oasc.ZkController.getConfName Looking for collection configName
   [junit4]   2> 2664664 T5741 oasc.CoreContainer.create Creating SolrCore 'nodes_used_collection_shard1_replica2' using instanceDir: /Users/jenkins/jenkins-slave/workspace/Lucene-Solr-4.x-MacOSX/solr/build/solr-core/test/J0/./org.apache.solr.cloud.CollectionsAPIDistributedZkTest-controljetty-1375411056849/nodes_used_collection_shard1_replica2
   [junit4]   2> 2664665 T5741 oasc.ZkController.createCollectionZkNode Check for collection zkNode:nodes_used_collection
   [junit4]   2> 2664670 T5741 oasc.ZkController.createCollectionZkNode Collection zkNode exists
   [junit4]   2> 2664671 T5741 oasc.ZkController.readConfigName Load collection config from:/collections/nodes_used_collection
   [junit4]   2> 2664671 T5788 oasc.ZkController.readConfigName Load collection config from:/collections/nodes_used_collection
   [junit4]   2> 2664671 T5759 oasc.ZkController.getConfName Only one config set found in zk - using it:conf1
   [junit4]   2> 2664717 T5759 oascc.SolrZkClient.makePath makePath: /collections/nodes_used_collection
   [junit4]   2> 2664718 T5797 oasc.ZkController.readConfigName Load collection config from:/collections/nodes_used_collection
   [junit4]   2> 2664721 T5741 oasc.SolrResourceLoader.<init> new SolrResourceLoader for directory: '/Users/jenkins/jenkins-slave/workspace/Lucene-Solr-4.x-MacOSX/solr/build/solr-core/test/J0/./org.apache.solr.cloud.CollectionsAPIDistributedZkTest-controljetty-1375411056849/nodes_used_collection_shard1_replica2/'
   [junit4]   2> 2664737 T5797 oasc.SolrResourceLoader.<init> new SolrResourceLoader for directory: '/Users/jenkins/jenkins-slave/workspace/Lucene-Solr-4.x-MacOSX/solr/build/solr-core/test/J0/./org.apache.solr.cloud.CollectionsAPIDistributedZkTest-jetty4-1375411063802/nodes_used_collection_shard2_replica2/'
   [junit4]   2> 2664737 T5788 oasc.SolrResourceLoader.<init> new SolrResourceLoader for directory: '/Users/jenkins/jenkins-slave/workspace/Lucene-Solr-4.x-MacOSX/solr/build/solr-core/test/J0/./org.apache.solr.cloud.CollectionsAPIDistributedZkTest-jetty3-1375411061828/nodes_used_collection_shard1_replica1/'
   [junit4]   2> 2664739 T5759 oasc.ZkController.readConfigName Load collection config from:/collections/nodes_used_collection
   [junit4]   2> 2664742 T5759 oasc.SolrResourceLoader.<init> new SolrResourceLoader for directory: '/Users/jenkins/jenkins-slave/workspace/Lucene-Solr-4.x-MacOSX/solr/build/solr-core/test/J0/./org.apache.solr.cloud.CollectionsAPIDistributedZkTest-jetty1-1375411057921/nodes_used_collection_shard2_replica1/'
   [junit4]   2> 2664975 T5788 oasc.SolrConfig.<init> Using Lucene MatchVersion: LUCENE_45
   [junit4]   2> 2664998 T5759 oasc.SolrConfig.<init> Using Lucene MatchVersion: LUCENE_45
   [junit4]   2> 2665016 T5797 oasc.SolrConfig.<init> Using Lucene MatchVersion: LUCENE_45
   [junit4]   2> 2665075 T5741 oasc.SolrConfig.<init> Using Lucene MatchVersion: LUCENE_45
   [junit4]   2> 2665242 T5788 oasc.SolrConfig.<init> Loaded SolrConfig: solrconfig.xml
   [junit4]   2> 2665256 T5788 oass.IndexSchema.readSchema Reading Solr Schema from schema.xml
   [junit4]   2> 2665320 T5788 oass.IndexSchema.readSchema [nodes_used_collection_shard1_replica1] Schema name=test
   [junit4]   2> 2665325 T5741 oasc.SolrConfig.<init> Loaded SolrConfig: solrconfig.xml
   [junit4]   2> 2665328 T5741 oass.IndexSchema.readSchema Reading Solr Schema from schema.xml
   [junit4]   2> 2665340 T5741 oass.IndexSchema.readSchema [nodes_used_collection_shard1_replica2] Schema name=test
   [junit4]   2> 2665342 T5797 oasc.SolrConfig.<init> Loaded SolrConfig: solrconfig.xml
   [junit4]   2> 2665349 T5797 oass.IndexSchema.readSchema Reading Solr Schema from schema.xml
   [junit4]   2> 2665355 T5759 oasc.SolrConfig.<init> Loaded SolrConfig: solrconfig.xml
   [junit4]   2> 2665361 T5797 oass.IndexSchema.readSchema [nodes_used_collection_shard2_replica2] Schema name=test
   [junit4]   2> 2665385 T5759 oass.IndexSchema.readSchema Reading Solr Schema from schema.xml
   [junit4]   2> 2665400 T5759 oass.IndexSchema.readSchema [nodes_used_collection_shard2_replica1] Schema name=test
   [junit4]   2> 2667859 T5741 oass.ByteField.init WARN ByteField is deprecated and will be removed in 5.0. You should use TrieIntField instead.
   [junit4]   2> 2667859 T5741 oass.ShortField.init WARN ShortField is deprecated and will be removed in 5.0. You should use TrieIntField instead.
   [junit4]   2> 2667862 T5741 oass.OpenExchangeRatesOrgProvider.init Initialized with rates=open-exchange-rates.json, refreshInterval=1440.
   [junit4]   2> 2667917 T5741 oass.IndexSchema.readSchema default search field in schema is text
   [junit4]   2> 2667977 T5741 oass.IndexSchema.readSchema unique key field: id
   [junit4]   2> 2668096 T5741 oass.FileExchangeRateProvider.reload Reloading exchange rates from file currency.xml
   [junit4]   2> 2668108 T5741 oass.FileExchangeRateProvider.reload Reloading exchange rates from file currency.xml
   [junit4]   2> 2668132 T5741 oass.OpenExchangeRatesOrgProvider.reload Reloading exchange rates from open-exchange-rates.json
   [junit4]   2> 2668133 T5788 oass.ByteField.init WARN ByteField is deprecated and will be removed in 5.0. You should use TrieIntField instead.
   [junit4]   2> 2668134 T5788 oass.ShortField.init WARN ShortField is deprecated and will be removed in 5.0. You should use TrieIntField instead.
   [junit4]   2> 2668135 T5788 oass.OpenExchangeRatesOrgProvider.init Initialized with rates=open-exchange-rates.json, refreshInterval=1440.
   [junit4]   2> 2668144 T5788 oass.IndexSchema.readSchema default search field in schema is text
   [junit4]   2> 2668146 T5741 oass.OpenExchangeRatesOrgProvider$OpenExchangeRates.<init> WARN Unknown key IMPORTANT NOTE
   [junit4]   2> 2668146 T5741 oass.OpenExchangeRatesOrgProvider$OpenExchangeRates.<init> WARN Expected key, got STRING
   [junit4]   2> 2668146 T5741 oass.OpenExchangeRatesOrgProvider.reload Reloading exchange rates from open-exchange-rates.json
   [junit4]   2> 2668155 T5788 oass.IndexSchema.readSchema unique key field: id
   [junit4]   2> 2668159 T5741 oass.OpenExchangeRatesOrgProvider$OpenExchangeRates.<init> WARN Unknown key IMPORTANT NOTE
   [junit4]   2> 2668159 T5741 oass.OpenExchangeRatesOrgProvider$OpenExchangeRates.<init> WARN Expected key, got STRING
   [junit4]   2> 2668159 T5741 oasc.SolrCore.initDirectoryFactory org.apache.solr.core.MockDirectoryFactory
   [junit4]   2> 2668160 T5741 oasc.SolrCore.<init> [nodes_used_collection_shard1_replica2] Opening new SolrCore at /Users/jenkins/jenkins-slave/workspace/Lucene-Solr-4.x-MacOSX/solr/build/solr-core/test/J0/./org.apache.solr.cloud.CollectionsAPIDistributedZkTest-controljetty-1375411056849/nodes_used_collection_shard1_replica2/, dataDir=/Users/jenkins/jenkins-slave/workspace/Lucene-Solr-4.x-MacOSX/solr/build/solr-core/test/J0/./org.apache.solr.cloud.CollectionsAPIDistributedZkTest-controljetty-1375411056849//nodes_used_collection_shard1_replica2/data/
   [junit4]   2> 2668160 T5741 oasc.JmxMonitoredMap.<init> JMX monitoring is enabled. Adding Solr mbeans to JMX Server: com.sun.jmx.mbeanserver.JmxMBeanServer@1ed4bf22
   [junit4]   2> 2668162 T5741 oasc.CachingDirectoryFactory.get return new directory for /Users/jenkins/jenkins-slave/workspace/Lucene-Solr-4.x-MacOSX/solr/build/solr-core/test/J0/./org.apache.solr.cloud.CollectionsAPIDistributedZkTest-controljetty-1375411056849//nodes_used_collection_shard1_replica2/data
   [junit4]   2> 2668163 T5741 oasc.SolrCore.getNewIndexDir New index directory detected: old=null new=/Users/jenkins/jenkins-slave/workspace/Lucene-Solr-4.x-MacOSX/solr/build/solr-core/test/J0/./org.apache.solr.cloud.CollectionsAPIDistributedZkTest-controljetty-1375411056849//nodes_used_collection_shard1_replica2/data/index/
   [junit4]   2> 2668163 T5741 oasc.SolrCore.initIndex WARN [nodes_used_collection_shard1_replica2] Solr index directory '/Users/jenkins/jenkins-slave/workspace/Lucene-Solr-4.x-MacOSX/solr/build/solr-core/test/J0/./org.apache.solr.cloud.CollectionsAPIDistributedZkTest-controljetty-1375411056849/nodes_used_collection_shard1_replica2/data/index' doesn't exist. Creating new index...
   [junit4]   2> 2668163 T5759 oass.ByteField.init WARN ByteField is deprecated and will be removed in 5.0. You should use TrieIntField instead.
   [junit4]   2> 2668166 T5759 oass.ShortField.init WARN ShortField is deprecated and will be removed in 5.0. You should use TrieIntField instead.
   [junit4]   2> 2668166 T5759 oass.OpenExchangeRatesOrgProvider.init Initialized with rates=open-exchange-rates.json, refreshInterval=1440.
   [junit4]   2> 2668164 T5741 oasc.CachingDirectoryFactory.get return new directory for /Users/jenkins/jenkins-slave/workspace/Lucene-Solr-4.x-MacOSX/solr/build/solr-core/test/J0/./org.apache.solr.cloud.CollectionsAPIDistributedZkTest-controljetty-1375411056849//nodes_used_collection_shard1_replica2/data/index
   [junit4]   2> 2668175 T5741 oasc.SolrDeletionPolicy.onCommit SolrDeletionPolicy.onCommit: commits: num=1
   [junit4]   2> 		commit{dir=MockDirWrapper(org.apache.lucene.store.RAMDirectory@74a04da3 lockFactory=org.apache.lucene.store.NativeFSLockFactory@7afe812),segFN=segments_1,generation=1}
   [junit4]   2> 2668176 T5741 oasc.SolrDeletionPolicy.updateCommits newest commit generation = 1
   [junit4]   2> 2668183 T5741 oasup.UpdateRequestProcessorChain.init inserting DistributedUpdateProcessorFactory into updateRequestProcessorChain "dedupe"
   [junit4]   2> 2668183 T5741 oasup.UpdateRequestProcessorChain.init inserting DistributedUpdateProcessorFactory into updateRequestProcessorChain "stored_sig"
   [junit4]   2> 2668184 T5741 oasup.UpdateRequestProcessorChain.init inserting DistributedUpdateProcessorFactory into updateRequestProcessorChain "distrib-dup-test-chain-implicit"
   [junit4]   2> 2668186 T5741 oasc.RequestHandlers.initHandlersFromConfig created standard: solr.StandardRequestHandler
   [junit4]   2> 2668187 T5741 oasc.RequestHandlers.initHandlersFromConfig created /get: solr.RealTimeGetHandler
   [junit4]   2> 2668187 T5741 oasc.RequestHandlers.initHandlersFromConfig adding lazy requestHandler: solr.ReplicationHandler
   [junit4]   2> 2668187 T5741 oasc.RequestHandlers.initHandlersFromConfig created /replication: solr.ReplicationHandler
   [junit4]   2> 2668188 T5741 oasc.RequestHandlers.initHandlersFromConfig created /update: solr.UpdateRequestHandler
   [junit4]   2> 2668189 T5741 oasc.RequestHandlers.initHandlersFromConfig created /admin/: org.apache.solr.handler.admin.AdminHandlers
   [junit4]   2> 2668205 T5797 oass.ByteField.init WARN ByteField is deprecated and will be removed in 5.0. You should use TrieIntField instead.
   [junit4]   2> 2668208 T5797 oass.ShortField.init WARN ShortField is deprecated and will be removed in 5.0. You should use TrieIntField instead.
   [junit4]   2> 2668209 T5797 oass.OpenExchangeRatesOrgProvider.init Initialized with rates=open-exchange-rates.json, refreshInterval=1440.
   [junit4]   2> 2668207 T5741 oashl.XMLLoader.init xsltCacheLifetimeSeconds=60
   [junit4]   2> 2668225 T5797 oass.IndexSchema.readSchema default search field in schema is text
   [junit4]   2> 2668230 T5797 oass.IndexSchema.readSchema unique key field: id
   [junit4]   2> 2668236 T5741 oass.SolrIndexSearcher.<init> Opening Searcher@1e62216b main
   [junit4]   2> 2668246 T5741 oasu.CommitTracker.<init> Hard AutoCommit: disabled
   [junit4]   2> 2668248 T5741 oasu.CommitTracker.<init> Soft AutoCommit: disabled
   [junit4]   2> 2668252 T5759 oass.IndexSchema.readSchema default search field in schema is text
   [junit4]   2> 2668256 T5812 oasc.SolrCore.registerSearcher [nodes_used_collection_shard1_replica2] Registered new searcher Searcher@1e62216b main{StandardDirectoryReader(segments_1:1)}
   [junit4]   2> 2668257 T5759 oass.IndexSchema.readSchema unique key field: id
   [junit4]   2> 2668261 T5741 oasc.CoreContainer.registerCore registering core: nodes_used_collection_shard1_replica2
   [junit4]   2> 2668262 T5741 oasc.ZkController.register Register replica - core:nodes_used_collection_shard1_replica2 address:http://127.0.0.1:53429 collection:nodes_used_collection shard:shard1
   [junit4]   2> 2668263 T5741 oascsi.HttpClientUtil.createClient Creating new http client, config:maxConnections=10000&maxConnectionsPerHost=20&connTimeout=15000&socketTimeout=30000&retry=false
   [junit4]   2> 2668276 T5788 oass.FileExchangeRateProvider.reload Reloading exchange rates from file currency.xml
   [junit4]   2> 2668320 T5788 oass.FileExchangeRateProvider.reload Reloading exchange rates from file currency.xml
   [junit4]   2> 2668333 T5741 oascc.SolrZkClient.makePath makePath: /collections/nodes_used_collection/leader_elect/shard1/election
   [junit4]   2> 2668338 T5788 oass.OpenExchangeRatesOrgProvider.reload Reloading exchange rates from open-exchange-rates.json
   [junit4]   2> 2668361 T5788 oass.OpenExchangeRatesOrgProvider$OpenExchangeRates.<init> WARN Unknown key IMPORTANT NOTE
   [junit4]   2> 2668362 T5788 oass.OpenExchangeRatesOrgProvider$OpenExchangeRates.<init> WARN Expected key, got STRING
   [junit4]   2> 2668362 T5788 oass.OpenExchangeRatesOrgProvider.reload Reloading exchange rates from open-exchange-rates.json
   [junit4]   2> 2668361 T5759 oass.FileExchangeRateProvider.reload Reloading exchange rates from file currency.xml
   [junit4]   2> 2668372 T5759 oass.FileExchangeRateProvider.reload Reloading exchange rates from file currency.xml
   [junit4]   2> 2668376 T5788 oass.OpenExchangeRatesOrgProvider$OpenExchangeRates.<init> WARN Unknown key IMPORTANT NOTE
   [junit4]   2> 2668376 T5788 oass.OpenExchangeRatesOrgProvider$OpenExchangeRates.<init> WARN Expected key, got STRING
   [junit4]   2> 2668377 T5788 oasc.SolrCore.initDirectoryFactory org.apache.solr.core.MockDirectoryFactory
   [junit4]   2> 2668378 T5788 oasc.SolrCore.<init> [nodes_used_collection_shard1_replica1] Opening new SolrCore at /Users/jenkins/jenkins-slave/workspace/Lucene-Solr-4.x-MacOSX/solr/build/solr-core/test/J0/./org.apache.solr.cloud.CollectionsAPIDistributedZkTest-jetty3-1375411061828/nodes_used_collection_shard1_replica1/, dataDir=/Users/jenkins/jenkins-slave/workspace/Lucene-Solr-4.x-MacOSX/solr/build/solr-core/test/J0/./org.apache.solr.cloud.CollectionsAPIDistributedZkTest-jetty3-1375411061828//nodes_used_collection_shard1_replica1/data/
   [junit4]   2> 2668379 T5788 oasc.JmxMonitoredMap.<init> JMX monitoring is enabled. Adding Solr mbeans to JMX Server: com.sun.jmx.mbeanserver.JmxMBeanServer@1ed4bf22
   [junit4]   2> 2668380 T5788 oasc.CachingDirectoryFactory.get return new directory for /Users/jenkins/jenkins-slave/workspace/Lucene-Solr-4.x-MacOSX/solr/build/solr-core/test/J0/./org.apache.solr.cloud.CollectionsAPIDistributedZkTest-jetty3-1375411061828//nodes_used_collection_shard1_replica1/data
   [junit4]   2> 2668381 T5788 oasc.SolrCore.getNewIndexDir New index directory detected: old=null new=/Users/jenkins/jenkins-slave/workspace/Lucene-Solr-4.x-MacOSX/solr/build/solr-core/test/J0/./org.apache.solr.cloud.CollectionsAPIDistributedZkTest-jetty3-1375411061828//nodes_used_collection_shard1_replica1/data/index/
   [junit4]   2> 2668382 T5788 oasc.SolrCore.initIndex WARN [nodes_used_collection_shard1_replica1] Solr index directory '/Users/jenkins/jenkins-slave/workspace/Lucene-Solr-4.x-MacOSX/solr/build/solr-core/test/J0/./org.apache.solr.cloud.CollectionsAPIDistributedZkTest-jetty3-1375411061828/nodes_used_collection_shard1_replica1/data/index' doesn't exist. Creating new index...
   [junit4]   2> 2668383 T5788 oasc.CachingDirectoryFactory.get return new directory for /Users/jenkins/jenkins-slave/workspace/Lucene-Solr-4.x-MacOSX/solr/build/solr-core/test/J0/./org.apache.solr.cloud.CollectionsAPIDistributedZkTest-jetty3-1375411061828//nodes_used_collection_shard1_replica1/data/index
   [junit4]   2> 2668380 T5759 oass.OpenExchangeRatesOrgProvider.reload Reloading exchange rates from open-exchange-rates.json
   [junit4]   2> 2668391 T5797 oass.FileExchangeRateProvider.reload Reloading exchange rates from file currency.xml
   [junit4]   2> 2668402 T5797 oass.FileExchangeRateProvider.reload Reloading exchange rates from file currency.xml
   [junit4]   2> 2668404 T5741 oasc.ShardLeaderElectionContext.runLeaderProcess Running the leader process for shard shard1
   [junit4]   2> 2668409 T5759 oass.OpenExchangeRatesOrgProvider$OpenExchangeRates.<init> WARN Unknown key IMPORTANT NOTE
   [junit4]   2> 2668414 T5759 oass.OpenExchangeRatesOrgProvider$OpenExchangeRates.<init> WARN Expected key, got STRING
   [junit4]   2> 2668415 T5759 oass.OpenExchangeRatesOrgProvider.reload Reloading exchange rates from open-exchange-rates.json
   [junit4]   2> 2668417 T5788 oasc.SolrDeletionPolicy.onCommit SolrDeletionPolicy.onCommit: commits: num=1
   [junit4]   2> 		commit{dir=MockDirWrapper(org.apache.lucene.store.RAMDirectory@549043be lockFactory=org.apache.lucene.store.NativeFSLockFactory@8849f4f),segFN=segments_1,generation=1}
   [junit4]   2> 2668421 T5788 oasc.SolrDeletionPolicy.updateCommits newest commit generation = 1
   [junit4]   2> 2668431 T5788 oasup.UpdateRequestProcessorChain.init inserting DistributedUpdateProcessorFactory into updateRequestProcessorChain "dedupe"
   [junit4]   2> 2668432 T5788 oasup.UpdateRequestProcessorChain.init inserting DistributedUpdateProcessorFactory into updateRequestProcessorChain "stored_sig"
   [junit4]   2> 2668439 T5788 oasup.UpdateRequestProcessorChain.init inserting DistributedUpdateProcessorFactory into updateRequestProcessorChain "distrib-dup-test-chain-implicit"
   [junit4]   2> 2668440 T5788 oasc.RequestHandlers.initHandlersFromConfig created standard: solr.StandardRequestHandler
   [junit4]   2> 2668441 T5788 oasc.RequestHandlers.initHandlersFromConfig created /get: solr.RealTimeGetHandler
   [junit4]   2> 2668441 T5788 oasc.RequestHandlers.initHandlersFromConfig adding lazy requestHandler: solr.ReplicationHandler
   [junit4]   2> 2668442 T5788 oasc.RequestHandlers.initHandlersFromConfig created /replication: solr.ReplicationHandler
   [junit4]   2> 2668443 T5788 oasc.RequestHandlers.initHandlersFromConfig created /update: solr.UpdateRequestHandler
   [junit4]   2> 2668443 T5788 oasc.RequestHandlers.initHandlersFromConfig created /admin/: org.apache.solr.handler.admin.AdminHandlers
   [junit4]   2> 2668433 T5759 oass.OpenExchangeRatesOrgProvider$OpenExchangeRates.<init> WARN Unknown key IMPORTANT NOTE
   [junit4]   2> 2668446 T5759 oass.OpenExchangeRatesOrgProvider$OpenExchangeRates.<init> WARN Expected key, got STRING
   [junit4]   2> 2668446 T5759 oasc.SolrCore.initDirectoryFactory org.apache.solr.core.MockDirectoryFactory
   [junit4]   2> 2668447 T5759 oasc.SolrCore.<init> [nodes_used_collection_shard2_replica1] Opening new SolrCore at /Users/jenkins/jenkins-slave/workspace/Lucene-Solr-4.x-MacOSX/solr/build/solr-core/test/J0/./org.apache.solr.cloud.CollectionsAPIDistributedZkTest-jetty1-1375411057921/nodes_used_collection_shard2_replica1/, dataDir=/Users/jenkins/jenkins-slave/workspace/Lucene-Solr-4.x-MacOSX/solr/build/solr-core/test/J0/./org.apache.solr.cloud.CollectionsAPIDistributedZkTest-jetty1-1375411057921//nodes_used_collection_shard2_replica1/data/
   [junit4]   2> 2668447 T5759 oasc.JmxMonitoredMap.<init> JMX monitoring is enabled. Adding Solr mbeans to JMX Server: com.sun.jmx.mbeanserver.JmxMBeanServer@1ed4bf22
   [junit4]   2> 2668449 T5759 oasc.CachingDirectoryFactory.get return new directory for /Users/jenkins/jenkins-slave/workspace/Lucene-Solr-4.x-MacOSX/solr/build/solr-core/test/J0/./org.apache.solr.cloud.CollectionsAPIDistributedZkTest-jetty1-1375411057921//nodes_used_collection_shard2_replica1/data
   [junit4]   2> 2668449 T5759 oasc.SolrCore.getNewIndexDir New index directory detected: old=null new=/Users/jenkins/jenkins-slave/workspace/Lucene-Solr-4.x-MacOSX/solr/build/solr-core/test/J0/./org.apache.solr.cloud.CollectionsAPIDistributedZkTest-jetty1-1375411057921//nodes_used_collection_shard2_replica1/data/index/
   [junit4]   2> 2668449 T5759 oasc.SolrCore.initIndex WARN [nodes_used_collection_shard2_replica1] Solr index directory '/Users/jenkins/jenkins-slave/workspace/Lucene-Solr-4.x-MacOSX/solr/build/solr-core/test/J0/./org.apache.solr.cloud.CollectionsAPIDistributedZkTest-jetty1-1375411057921/nodes_used_collection_shard2_replica1/data/index' doesn't exist. Creating new index...
   [junit4]   2> 2668451 T5759 oasc.CachingDirectoryFactory.get return new directory for /Users/jenkins/jenkins-slave/workspace/Lucene-Solr-4.x-MacOSX/solr/build/solr-core/test/J0/./org.apache.solr.cloud.CollectionsAPIDistributedZkTest-jetty1-1375411057921//nodes_used_collection_shard2_replica1/data/index
   [junit4]   2> 2668461 T5741 oasc.ShardLeaderElectionContext.waitForReplicasToComeUp Waiting until we see more replicas up for shard shard1: total=2 found=1 timeoutin=179988
   [junit4]   2> 2668462 T5797 oass.OpenExchangeRatesOrgProvider.reload Reloading exchange rates from open-exchange-rates.json
   [junit4]   2> 2668465 T5797 oass.OpenExchangeRatesOrgProvider$OpenExchangeRates.<init> WARN Unknown key IMPORTANT NOTE
   [junit4]   2> 2668465 T5797 oass.OpenExchangeRatesOrgProvider$OpenExchangeRates.<init> WARN Expected key, got STRING
   [junit4]   2> 2668466 T5797 oass.OpenExchangeRatesOrgProvider.reload Reloading exchange rates from open-exchange-rates.json
   [junit4]   2> 2668472 T5759 oasc.SolrDeletionPolicy.onCommit SolrDeletionPolicy.onCommit: commits: num=1
   [junit4]   2> 		commit{dir=MockDirWrapper(org.apache.lucene.store.RAMDirectory@f166cad lockFactory=org.apache.lucene.store.NativeFSLockFactory@7617d295),segFN=segments_1,generation=1}
   [junit4]   2> 2668473 T5759 oasc.SolrDeletionPolicy.updateCommits newest commit generation = 1
   [junit4]   2> 2668480 T5797 oass.OpenExchangeRatesOrgProvider$OpenExchangeRates.<init> WARN Unknown key IMPORTANT NOTE
   [junit4]   2> 2668480 T5797 oass.OpenExchangeRatesOrgProvider$OpenExchangeRates.<init> WARN Expected key, got STRING
   [junit4]   2> 2668481 T5797 oasc.SolrCore.initDirectoryFactory org.apache.solr.core.MockDirectoryFactory
   [junit4]   2> 2668482 T5797 oasc.SolrCore.<init> [nodes_used_collection_shard2_replica2] Opening new SolrCore at /Users/jenkins/jenkins-slave/workspace/Lucene-Solr-4.x-MacOSX/solr/build/solr-core/test/J0/./org.apache.solr.cloud.CollectionsAPIDistributedZkTest-jetty4-1375411063802/nodes_used_collection_shard2_replica2/, dataDir=/Users/jenkins/jenkins-slave/workspace/Lucene-Solr-4.x-MacOSX/solr/build/solr-core/test/J0/./org.apache.solr.cloud.CollectionsAPIDistributedZkTest-jetty4-1375411063802//nodes_used_collection_shard2_replica2/data/
   [junit4]   2> 2668482 T5797 oasc.JmxMonitoredMap.<init> JMX monitoring is enabled. Adding Solr mbeans to JMX Server: com.sun.jmx.mbeanserver.JmxMBeanServer@1ed4bf22
   [junit4]   2> 2668484 T5797 oasc.CachingDirectoryFactory.get return new directory for /Users/jenkins/jenkins-slave/workspace/Lucene-Solr-4.x-MacOSX/solr/build/solr-core/test/J0/./org.apache.solr.cloud.CollectionsAPIDistributedZkTest-jetty4-1375411063802//nodes_used_collection_shard2_replica2/data
   [junit4]   2> 2668484 T5797 oasc.SolrCore.getNewIndexDir New index directory detected: old=null new=/Users/jenkins/jenkins-slave/workspace/Lucene-Solr-4.x-MacOSX/solr/build/solr-core/test/J0/./org.apache.solr.cloud.CollectionsAPIDistributedZkTest-jetty4-1375411063802//nodes_used_collection_shard2_replica2/data/index/
   [junit4]   2> 2668484 T5797 oasc.SolrCore.initIndex WARN [nodes_used_collection_shard2_replica2] Solr index directory '/Users/jenkins/jenkins-slave/workspace/Lucene-Solr-4.x-MacOSX/solr/build/solr-core/test/J0/./org.apache.solr.cloud.CollectionsAPIDistributedZkTest-jetty4-1375411063802/nodes_used_collection_shard2_replica2/data/index' doesn't exist. Creating new index...
   [junit4]   2> 2668485 T5797 oasc.CachingDirectoryFactory.get return new directory for /Users/jenkins/jenkins-slave/workspace/Lucene-Solr-4.x-MacOSX/solr/build/solr-core/test/J0/./org.apache.solr.cloud.CollectionsAPIDistributedZkTest-jetty4-1375411063802//nodes_used_collection_shard2_replica2/data/index
   [junit4]   2> 2668489 T5759 oasup.UpdateRequestProcessorChain.init inserting DistributedUpdateProcessorFactory into updateRequestProcessorChain "dedupe"
   [junit4]   2> 2668489 T5759 oasup.UpdateRequestProcessorChain.init inserting DistributedUpdateProcessorFactory into updateRequestProcessorChain "stored_sig"
   [junit4]   2> 2668490 T5759 oasup.UpdateRequestProcessorChain.init inserting DistributedUpdateProcessorFactory into updateRequestProcessorChain "distrib-dup-test-chain-implicit"
   [junit4]   2> 2668491 T5759 oasc.RequestHandlers.initHandlersFromConfig created standard: solr.StandardRequestHandler
   [junit4]   2> 2668492 T5759 oasc.RequestHandlers.initHandlersFromConfig created /get: solr.RealTimeGetHandler
   [junit4]   2> 2668493 T5759 oasc.RequestHandlers.initHandlersFromConfig adding lazy requestHandler: solr.ReplicationHandler
   [junit4]   2> 2668493 T5759 oasc.RequestHandlers.initHandlersFromConfig created /replication: solr.ReplicationHandler
   [junit4]   2> 2668494 T5759 oasc.RequestHandlers.initHandlersFromConfig created /update: solr.UpdateRequestHandler
   [junit4]   2> 2668495 T5759 oasc.RequestHandlers.initHandlersFromConfig created /admin/: org.apache.solr.handler.admin.AdminHandlers
   [junit4]   2> 2668512 T5759 oashl.XMLLoader.init xsltCacheLifetimeSeconds=60
   [junit4]   2> 2668513 T5788 oashl.XMLLoader.init xsltCacheLifetimeSeconds=60
   [junit4]   2> 2668519 T5797 oasc.SolrDeletionPolicy.onCommit SolrDeletionPolicy.onCommit: commits: num=1
   [junit4]   2> 		commit{dir=MockDirWrapper(org.apache.lucene.store.RAMDirectory@7d4a2315 lockFactory=org.apache.lucene.store.NativeFSLockFactory@56183c4b),segFN=segments_1,generation=1}
   [junit4]   2> 2668521 T5797 oasc.SolrDeletionPolicy.updateCommits newest commit generation = 1
   [junit4]   2> 2668521 T5759 oass.SolrIndexSearcher.<init> Opening Searcher@524cba44 main
   [junit4]   2> 2668523 T5759 oasu.CommitTracker.<init> Hard AutoCommit: disabled
   [junit4]   2> 2668523 T5759 oasu.CommitTracker.<init> Soft AutoCommit: disabled
   [junit4]   2> 2668527 T5814 oasc.SolrCore.registerSearcher [nodes_used_collection_shard2_replica1] Registered new searcher Searcher@524cba44 main{StandardDirectoryReader(segments_1:1)}
   [junit4]   2> 2668521 T5788 oass.SolrIndexSearcher.<init> Opening Searcher@9e47fc5 main
   [junit4]   2> 2668536 T5788 oasu.CommitTracker.<init> Hard AutoCommit: disabled
   [junit4]   2> 2668537 T5788 oasu.CommitTracker.<init> Soft AutoCommit: disabled
   [junit4]   2> 2668527 T5797 oasup.UpdateRequestProcessorChain.init inserting DistributedUpdateProcessorFactory into updateRequestProcessorChain "dedupe"
   [junit4]   2> 2668540 T5797 oasup.UpdateRequestProcessorChain.init inserting DistributedUpdateProcessorFactory into updateRequestProcessorChain "stored_sig"
   [junit4]   2> 2668541 T5797 oasup.UpdateRequestProcessorChain.init inserting DistributedUpdateProcessorFactory into updateRequestProcessorChain "distrib-dup-test-chain-implicit"
   [junit4]   2> 2668542 T5797 oasc.RequestHandlers.initHandlersFromConfig created standard: solr.StandardRequestHandler
   [junit4]   2> 2668543 T5797 oasc.RequestHandlers.initHandlersFromConfig created /get: solr.RealTimeGetHandler
   [junit4]   2> 2668543 T5797 oasc.RequestHandlers.initHandlersFromConfig adding lazy requestHandler: solr.ReplicationHandler
   [junit4]   2> 2668544 T5813 oasc.SolrCore.registerSearcher [nodes_used_collection_shard1_replica1] Registered new searcher Searcher@9e47fc5 main{StandardDirectoryReader(segments_1:1)}
   [junit4]   2> 2668544 T5759 oasc.CoreContainer.registerCore registering core: nodes_used_collection_shard2_replica1
   [junit4]   2> 2668545 T5759 oasc.ZkController.register Register replica - core:nodes_used_collection_shard2_replica1 address:http://127.0.0.1:53433 collection:nodes_used_collection shard:shard2
   [junit4]   2> 2668545 T5759 oascsi.HttpClientUtil.createClient Creating new http client, config:maxConnections=10000&maxConnectionsPerHost=20&connTimeout=15000&socketTimeout=30000&retry=false
   [junit4]   2> 2668544 T5797 oasc.RequestHandlers.initHandlersFromConfig created /replication: solr.ReplicationHandler
   [junit4]   2> 2668547 T5788 oasc.CoreContainer.registerCore registering core: nodes_used_collection_shard1_replica1
   [junit4]   2> 2668548 T5788 oasc.ZkController.register Register replica - core:nodes_used_collection_shard1_replica1 address:http://127.0.0.1:53439 collection:nodes_used_collection shard:shard1
   [junit4]   2> 2668548 T5788 oascsi.HttpClientUtil.createClient Creating new http client, config:maxConnections=10000&maxConnectionsPerHost=20&connTimeout=15000&socketTimeout=30000&retry=false
   [junit4]   2> 2668548 T5797 oasc.RequestHandlers.initHandlersFromConfig created /update: solr.UpdateRequestHandler
   [junit4]   2> 2668551 T5797 oasc.RequestHandlers.initHandlersFromConfig created /admin/: org.apache.solr.handler.admin.AdminHandlers
   [junit4]   2> 2668575 T5797 oashl.XMLLoader.init xsltCacheLifetimeSeconds=60
   [junit4]   2> 2668584 T5797 oass.SolrIndexSearcher.<init> Opening Searcher@59bca668 main
   [junit4]   2> 2668596 T5797 oasu.CommitTracker.<init> Hard AutoCommit: disabled
   [junit4]   2> 2668597 T5797 oasu.CommitTracker.<init> Soft AutoCommit: disabled
   [junit4]   2> 2668602 T5759 oascc.SolrZkClient.makePath makePath: /collections/nodes_used_collection/leader_elect/shard2/election
   [junit4]   2> 2668604 T5815 oasc.SolrCore.registerSearcher [nodes_used_collection_shard2_replica2] Registered new searcher Searcher@59bca668 main{StandardDirectoryReader(segments_1:1)}
   [junit4]   2> 2668609 T5797 oasc.CoreContainer.registerCore registering core: nodes_used_collection_shard2_replica2
   [junit4]   2> 2668609 T5797 oasc.ZkController.register Register replica - core:nodes_used_collection_shard2_replica2 address:http://127.0.0.1:53442 collection:nodes_used_collection shard:shard2
   [junit4]   2> 2668610 T5797 oascsi.HttpClientUtil.createClient Creating new http client, config:maxConnections=10000&maxConnectionsPerHost=20&connTimeout=15000&socketTimeout=30000&retry=false
   [junit4]   2> 2668633 T5759 oasc.ShardLeaderElectionContext.runLeaderProcess Running the leader process for shard shard2
   [junit4]   2> 2668643 T5759 oasc.ShardLeaderElectionContext.waitForReplicasToComeUp Enough replicas found to continue.
   [junit4]   2> 2668643 T5759 oasc.ShardLeaderElectionContext.runLeaderProcess I may be the new leader - try and sync
   [junit4]   2> 2668644 T5759 oasc.SyncStrategy.sync Sync replicas to http://127.0.0.1:53433/nodes_used_collection_shard2_replica1/
   [junit4]   2> 2668644 T5759 oasu.PeerSync.sync PeerSync: core=nodes_used_collection_shard2_replica1 url=http://127.0.0.1:53433 START replicas=[http://127.0.0.1:53442/nodes_used_collection_shard2_replica2/] nUpdates=100
   [junit4]   2> 2668647 T5759 oasu.PeerSync.sync PeerSync: core=nodes_used_collection_shard2_replica1 url=http://127.0.0.1:53433 DONE.  We have no versions.  sync failed.
   [junit4]   2> 2668648 T5759 oasc.SyncStrategy.syncReplicas Leader's attempt to sync with shard failed, moving to the next candidate
   [junit4]   2> 2668648 T5759 oasc.ShardLeaderElectionContext.runLeaderProcess We failed sync, but we have no versions - we can't sync in that case - we were active before, so become leader anyway
   [junit4]   2> 2668648 T5759 oasc.ShardLeaderElectionContext.runLeaderProcess I am the new leader: http://127.0.0.1:53433/nodes_used_collection_shard2_replica1/ shard2
   [junit4]   2> 2668649 T5759 oascc.SolrZkClient.makePath makePath: /collections/nodes_used_collection/leaders/shard2
   [junit4]   2> 2668662 T5747 oascc.ZkStateReader.updateClusterState Updating cloud state from ZooKeeper... 
   [junit4]   2> ASYNC  NEW_CORE C3279 name=nodes_used_collection_shard2_replica2 org.apache.solr.core.SolrCore@594a5cc6 url=http://127.0.0.1:53442/nodes_used_collection_shard2_replica2 node=127.0.0.1:53442_ C3279_STATE=coll:nodes_used_collection core:nodes_used_collection_shard2_replica2 props:{state=down, core=nodes_used_collection_shard2_replica2, node_name=127.0.0.1:53442_, base_url=http://127.0.0.1:53442}
   [junit4]   2> 2668668 T5798 C3279 P53442 oasc.SolrCore.execute [nodes_used_collection_shard2_replica2] webapp= path=/get params={getVersions=100&distrib=false&wt=javabin&qt=/get&version=2} status=0 QTime=1 
   [junit4]   2> 2668700 T5751 oascc.ZkStateReader$2.process A cluster state change: WatchedEvent state:SyncConnected type:NodeDataChanged path:/clusterstate.json, has occurred - updating... (live nodes size: 5)
   [junit4]   2> 2668700 T5778 oascc.ZkStateReader$2.process A cluster state change: WatchedEvent state:SyncConnected type:NodeDataChanged path:/clusterstate.j

[...truncated too long message...]

$6.execute(SolrZkClient.java:235)
   [junit4]   2> 	at org.apache.solr.common.cloud.SolrZkClient$6.execute(SolrZkClient.java:232)
   [junit4]   2> 	at org.apache.solr.common.cloud.ZkCmdExecutor.retryOperation(ZkCmdExecutor.java:65)
   [junit4]   2> 	at org.apache.solr.common.cloud.SolrZkClient.getChildren(SolrZkClient.java:232)
   [junit4]   2> 	at org.apache.solr.cloud.LeaderElector.checkIfIamLeader(LeaderElector.java:84)
   [junit4]   2> 	at org.apache.solr.cloud.LeaderElector.access$000(LeaderElector.java:55)
   [junit4]   2> 	at org.apache.solr.cloud.LeaderElector$1.process(LeaderElector.java:129)
   [junit4]   2> 	at org.apache.zookeeper.ClientCnxn$EventThread.processEvent(ClientCnxn.java:519)
   [junit4]   2> 	at org.apache.zookeeper.ClientCnxn$EventThread.run(ClientCnxn.java:495)
   [junit4]   2> 
   [junit4]   2> 2814878 T5806 oasc.LeaderElector$1.process WARN  org.apache.zookeeper.KeeperException$SessionExpiredException: KeeperErrorCode = Session expired for /collections/new_implicit_coll_0/leader_elect/a/election
   [junit4]   2> 	at org.apache.zookeeper.KeeperException.create(KeeperException.java:127)
   [junit4]   2> 	at org.apache.zookeeper.KeeperException.create(KeeperException.java:51)
   [junit4]   2> 	at org.apache.zookeeper.ZooKeeper.getChildren(ZooKeeper.java:1468)
   [junit4]   2> 	at org.apache.solr.common.cloud.SolrZkClient$6.execute(SolrZkClient.java:235)
   [junit4]   2> 	at org.apache.solr.common.cloud.SolrZkClient$6.execute(SolrZkClient.java:232)
   [junit4]   2> 	at org.apache.solr.common.cloud.ZkCmdExecutor.retryOperation(ZkCmdExecutor.java:65)
   [junit4]   2> 	at org.apache.solr.common.cloud.SolrZkClient.getChildren(SolrZkClient.java:232)
   [junit4]   2> 	at org.apache.solr.cloud.LeaderElector.checkIfIamLeader(LeaderElector.java:84)
   [junit4]   2> 	at org.apache.solr.cloud.LeaderElector.access$000(LeaderElector.java:55)
   [junit4]   2> 	at org.apache.solr.cloud.LeaderElector$1.process(LeaderElector.java:129)
   [junit4]   2> 	at org.apache.zookeeper.ClientCnxn$EventThread.processEvent(ClientCnxn.java:519)
   [junit4]   2> 	at org.apache.zookeeper.ClientCnxn$EventThread.run(ClientCnxn.java:495)
   [junit4]   2> 
   [junit4]   2> 2814878 T5806 oascc.ZkStateReader$3.process WARN ZooKeeper watch triggered, but Solr cannot talk to ZK
   [junit4]   2> 2814878 T5806 oascc.ZkStateReader$2.process A cluster state change: WatchedEvent state:SyncConnected type:NodeChildrenChanged path:/live_nodes, has occurred - updating... (live nodes size: 1)
   [junit4]   2> 2814879 T5806 oascc.ZkStateReader$2.process WARN ZooKeeper watch triggered, but Solr cannot talk to ZK
   [junit4]   2> 2814879 T5806 oasc.LeaderElector$1.process WARN  org.apache.zookeeper.KeeperException$SessionExpiredException: KeeperErrorCode = Session expired for /collections/new_implicit_coll_0/leader_elect/d/election
   [junit4]   2> 	at org.apache.zookeeper.KeeperException.create(KeeperException.java:127)
   [junit4]   2> 	at org.apache.zookeeper.KeeperException.create(KeeperException.java:51)
   [junit4]   2> 	at org.apache.zookeeper.ZooKeeper.getChildren(ZooKeeper.java:1468)
   [junit4]   2> 	at org.apache.solr.common.cloud.SolrZkClient$6.execute(SolrZkClient.java:235)
   [junit4]   2> 	at org.apache.solr.common.cloud.SolrZkClient$6.execute(SolrZkClient.java:232)
   [junit4]   2> 	at org.apache.solr.common.cloud.ZkCmdExecutor.retryOperation(ZkCmdExecutor.java:65)
   [junit4]   2> 	at org.apache.solr.common.cloud.SolrZkClient.getChildren(SolrZkClient.java:232)
   [junit4]   2> 	at org.apache.solr.cloud.LeaderElector.checkIfIamLeader(LeaderElector.java:84)
   [junit4]   2> 	at org.apache.solr.cloud.LeaderElector.access$000(LeaderElector.java:55)
   [junit4]   2> 	at org.apache.solr.cloud.LeaderElector$1.process(LeaderElector.java:129)
   [junit4]   2> 	at org.apache.zookeeper.ClientCnxn$EventThread.processEvent(ClientCnxn.java:519)
   [junit4]   2> 	at org.apache.zookeeper.ClientCnxn$EventThread.run(ClientCnxn.java:495)
   [junit4]   2> 
   [junit4]   2> NOTE: test params are: codec=Lucene42: {timestamp=PostingsFormat(name=MockRandom), range_facet_l=PostingsFormat(name=MockRandom), id=PostingsFormat(name=NestedPulsing), range_facet_sl=Pulsing41(freqCutoff=17 minBlockSize=39 maxBlockSize=175), a_t=PostingsFormat(name=MockRandom), text=Pulsing41(freqCutoff=17 minBlockSize=39 maxBlockSize=175), range_facet_si=PostingsFormat(name=SimpleText), _version_=PostingsFormat(name=MockRandom), other_tl1=PostingsFormat(name=MockRandom), multiDefault=PostingsFormat(name=SimpleText), a_si=PostingsFormat(name=SimpleText), intDefault=PostingsFormat(name=MockRandom)}, docValues:{}, sim=DefaultSimilarity, locale=zh_TW, timezone=Europe/Vilnius
   [junit4]   2> NOTE: Mac OS X 10.8.4 x86_64/Oracle Corporation 1.7.0_25 (64-bit)/cpus=2,threads=4,free=146351560,total=519438336
   [junit4]   2> NOTE: All tests run in this JVM: [TestSolrJ, TestCollationKeyRangeQueries, TestStressReorder, TestIBSimilarityFactory, TestPerFieldSimilarity, ResponseLogComponentTest, ZkControllerTest, FullSolrCloudDistribCmdsTest, TestDefaultSearchFieldResource, TestQuerySenderNoQuery, TestOmitPositions, TestCloudManagedSchema, ChaosMonkeyNothingIsSafeTest, SimpleFacetsTest, ExternalFileFieldSortTest, HdfsRecoveryZkTest, PolyFieldTest, TermsComponentTest, SolrIndexConfigTest, ShowFileRequestHandlerTest, TestSort, TestStressVersions, RAMDirectoryFactoryTest, EchoParamsTest, OverseerTest, ShardSplitTest, RequestHandlersTest, ShardRoutingCustomTest, HdfsDirectoryTest, DocumentAnalysisRequestHandlerTest, RequiredFieldsTest, BasicDistributedZkTest, UUIDFieldTest, DisMaxRequestHandlerTest, ScriptEngineTest, SpellPossibilityIteratorTest, BasicFunctionalityTest, BadCopyFieldTest, TestSuggestSpellingConverter, TestClassNameShortening, SyncSliceTest, DocValuesTest, TestUniqueKeyFieldResource, AutoCommitTest, TestReversedWildcardFilterFactory, TestCloudManagedSchemaAddField, SuggesterWFSTTest, TestStressLucene, FieldAnalysisRequestHandlerTest, TestSolrQueryParserDefaultOperatorResource, IndexBasedSpellCheckerTest, AssignTest, ShardRoutingTest, CacheHeaderTest, SpellingQueryConverterTest, TestQueryTypes, SimplePostToolTest, TestGroupingSearch, UpdateRequestProcessorFactoryTest, TestZkChroot, PathHierarchyTokenizerFactoryTest, URLClassifyProcessorTest, FieldMutatingUpdateProcessorTest, TestFieldCollectionResource, ResourceLoaderTest, TestRandomDVFaceting, TestDistributedSearch, WordBreakSolrSpellCheckerTest, LukeRequestHandlerTest, TestElisionMultitermQuery, DirectUpdateHandlerOptimizeTest, UniqFieldsUpdateProcessorFactoryTest, DirectSolrConnectionTest, ChaosMonkeySafeLeaderTest, TestRecovery, TestQuerySenderListener, TestXIncludeConfig, PrimitiveFieldTypeTest, SolrCoreCheckLockOnStartupTest, DOMUtilTest, TestSolrXmlPersistence, MultiTermTest, SpatialFilterTest, TestCoreDiscovery, MoreLikeThisHandlerTest, AliasIntegrationTest, UpdateParamsTest, TestFaceting, TestLazyCores, TestReplicationHandler, TimeZoneUtilsTest, DistanceFunctionTest, ConvertedLegacyTest, SolrTestCaseJ4Test, TestJmxMonitoredMap, DirectUpdateHandlerTest, TestDynamicFieldCollectionResource, TestLRUCache, QueryResultKeyTest, SuggesterFSTTest, SliceStateTest, TestDynamicFieldResource, TestArbitraryIndexDir, SampleTest, SchemaVersionSpecificBehaviorTest, SignatureUpdateProcessorFactoryTest, OpenExchangeRatesOrgProviderTest, CoreMergeIndexesAdminHandlerTest, HdfsBasicDistributedZk2Test, TestFuzzyAnalyzedSuggestions, TestLFUCache, LeaderElectionIntegrationTest, TestSurroundQueryParser, BinaryUpdateRequestHandlerTest, DistributedTermsComponentTest, BlockDirectoryTest, CachingDirectoryFactoryTest, CircularListTest, TestExtendedDismaxParser, StandardRequestHandlerTest, TestDFRSimilarityFactory, TestAnalyzedSuggestions, AlternateDirectoryTest, HdfsUnloadDistributedZkTest, TestRandomMergePolicy, IndexSchemaRuntimeFieldTest, XsltUpdateRequestHandlerTest, SolrInfoMBeanTest, TestWordDelimiterFilterFactory, TestPseudoReturnFields, AnalysisAfterCoreReloadTest, JsonLoaderTest, ZkNodePropsTest, TestSystemIdResolver, HdfsChaosMonkeySafeLeaderTest, SearchHandlerTest, TestAtomicUpdateErrorCases, SuggesterTSTTest, AddSchemaFieldsUpdateProcessorFactoryTest, TestRTGBase, TestManagedSchema, BadComponentTest, TestMergePolicyConfig, TestLMJelinekMercerSimilarityFactory, FileUtilsTest, TestRecoveryHdfs, SOLR749Test, TestPropInjectDefaults, TermVectorComponentDistributedTest, QueryElevationComponentTest, ClusterStateUpdateTest, TestJoin, DateFieldTest, CurrencyFieldXmlFileTest, TestStressRecovery, BasicDistributedZk2Test, UnloadDistributedZkTest, CollectionsAPIDistributedZkTest]
   [junit4] Completed in 162.67s, 1 test, 1 error <<< FAILURES!

[...truncated 491 lines...]
BUILD FAILED
/Users/jenkins/jenkins-slave/workspace/Lucene-Solr-4.x-MacOSX/build.xml:395: The following error occurred while executing this line:
/Users/jenkins/jenkins-slave/workspace/Lucene-Solr-4.x-MacOSX/build.xml:375: The following error occurred while executing this line:
/Users/jenkins/jenkins-slave/workspace/Lucene-Solr-4.x-MacOSX/build.xml:39: The following error occurred while executing this line:
/Users/jenkins/jenkins-slave/workspace/Lucene-Solr-4.x-MacOSX/solr/build.xml:181: The following error occurred while executing this line:
/Users/jenkins/jenkins-slave/workspace/Lucene-Solr-4.x-MacOSX/solr/common-build.xml:449: The following error occurred while executing this line:
/Users/jenkins/jenkins-slave/workspace/Lucene-Solr-4.x-MacOSX/lucene/common-build.xml:1233: The following error occurred while executing this line:
/Users/jenkins/jenkins-slave/workspace/Lucene-Solr-4.x-MacOSX/lucene/common-build.xml:876: There were test failures: 321 suites, 1352 tests, 1 error, 39 ignored (5 assumptions)

Total time: 113 minutes 28 seconds
Build step 'Invoke Ant' marked build as failure
Description set: Java: 64bit/jdk1.7.0 -XX:+UseCompressedOops -XX:+UseConcMarkSweepGC
Archiving artifacts
Recording test results
Email was triggered for: Failure
Sending email for trigger: Failure



Mime
View raw message