lucene-dev mailing list archives

Site index · List index
Message view « Date » · « Thread »
Top « Date » · « Thread »
From Apache Jenkins Server <jenk...@builds.apache.org>
Subject [JENKINS] Lucene-Solr-NightlyTests-4.x - Build # 347 - Still Failing
Date Fri, 16 Aug 2013 23:17:11 GMT
Build: https://builds.apache.org/job/Lucene-Solr-NightlyTests-4.x/347/

7 tests failed.
REGRESSION:  org.apache.solr.search.join.BJQParserTest.testIntersectBqBjq

Error Message:
Exception during query

Stack Trace:
java.lang.RuntimeException: Exception during query
	at __randomizedtesting.SeedInfo.seed([FEB2479FD4A26817:804EB6071E172156]:0)
	at org.apache.solr.SolrTestCaseJ4.assertQ(SolrTestCaseJ4.java:636)
	at org.apache.solr.SolrTestCaseJ4.assertQ(SolrTestCaseJ4.java:603)
	at org.apache.solr.search.join.BJQParserTest.testIntersectBqBjq(BJQParserTest.java:149)
	at sun.reflect.NativeMethodAccessorImpl.invoke0(Native Method)
	at sun.reflect.NativeMethodAccessorImpl.invoke(NativeMethodAccessorImpl.java:57)
	at sun.reflect.DelegatingMethodAccessorImpl.invoke(DelegatingMethodAccessorImpl.java:43)
	at java.lang.reflect.Method.invoke(Method.java:616)
	at com.carrotsearch.randomizedtesting.RandomizedRunner.invoke(RandomizedRunner.java:1559)
	at com.carrotsearch.randomizedtesting.RandomizedRunner.access$600(RandomizedRunner.java:79)
	at com.carrotsearch.randomizedtesting.RandomizedRunner$6.evaluate(RandomizedRunner.java:737)
	at com.carrotsearch.randomizedtesting.RandomizedRunner$7.evaluate(RandomizedRunner.java:773)
	at com.carrotsearch.randomizedtesting.RandomizedRunner$8.evaluate(RandomizedRunner.java:787)
	at com.carrotsearch.randomizedtesting.rules.SystemPropertiesRestoreRule$1.evaluate(SystemPropertiesRestoreRule.java:53)
	at org.apache.lucene.util.TestRuleSetupTeardownChained$1.evaluate(TestRuleSetupTeardownChained.java:50)
	at org.apache.lucene.util.TestRuleFieldCacheSanity$1.evaluate(TestRuleFieldCacheSanity.java:51)
	at org.apache.lucene.util.AbstractBeforeAfterRule$1.evaluate(AbstractBeforeAfterRule.java:46)
	at com.carrotsearch.randomizedtesting.rules.SystemPropertiesInvariantRule$1.evaluate(SystemPropertiesInvariantRule.java:55)
	at org.apache.lucene.util.TestRuleThreadAndTestName$1.evaluate(TestRuleThreadAndTestName.java:49)
	at org.apache.lucene.util.TestRuleIgnoreAfterMaxFailures$1.evaluate(TestRuleIgnoreAfterMaxFailures.java:70)
	at org.apache.lucene.util.TestRuleMarkFailure$1.evaluate(TestRuleMarkFailure.java:48)
	at com.carrotsearch.randomizedtesting.rules.StatementAdapter.evaluate(StatementAdapter.java:36)
	at com.carrotsearch.randomizedtesting.ThreadLeakControl$StatementRunner.run(ThreadLeakControl.java:358)
	at com.carrotsearch.randomizedtesting.ThreadLeakControl.forkTimeoutingTask(ThreadLeakControl.java:782)
	at com.carrotsearch.randomizedtesting.ThreadLeakControl$3.evaluate(ThreadLeakControl.java:442)
	at com.carrotsearch.randomizedtesting.RandomizedRunner.runSingleTest(RandomizedRunner.java:746)
	at com.carrotsearch.randomizedtesting.RandomizedRunner$3.evaluate(RandomizedRunner.java:648)
	at com.carrotsearch.randomizedtesting.RandomizedRunner$4.evaluate(RandomizedRunner.java:682)
	at com.carrotsearch.randomizedtesting.RandomizedRunner$5.evaluate(RandomizedRunner.java:693)
	at com.carrotsearch.randomizedtesting.rules.StatementAdapter.evaluate(StatementAdapter.java:36)
	at com.carrotsearch.randomizedtesting.rules.SystemPropertiesRestoreRule$1.evaluate(SystemPropertiesRestoreRule.java:53)
	at org.apache.lucene.util.AbstractBeforeAfterRule$1.evaluate(AbstractBeforeAfterRule.java:46)
	at org.apache.lucene.util.TestRuleStoreClassName$1.evaluate(TestRuleStoreClassName.java:42)
	at com.carrotsearch.randomizedtesting.rules.SystemPropertiesInvariantRule$1.evaluate(SystemPropertiesInvariantRule.java:55)
	at com.carrotsearch.randomizedtesting.rules.NoShadowingOrOverridesOnMethodsRule$1.evaluate(NoShadowingOrOverridesOnMethodsRule.java:39)
	at com.carrotsearch.randomizedtesting.rules.NoShadowingOrOverridesOnMethodsRule$1.evaluate(NoShadowingOrOverridesOnMethodsRule.java:39)
	at com.carrotsearch.randomizedtesting.rules.StatementAdapter.evaluate(StatementAdapter.java:36)
	at org.apache.lucene.util.TestRuleAssertionsRequired$1.evaluate(TestRuleAssertionsRequired.java:43)
	at org.apache.lucene.util.TestRuleMarkFailure$1.evaluate(TestRuleMarkFailure.java:48)
	at org.apache.lucene.util.TestRuleIgnoreAfterMaxFailures$1.evaluate(TestRuleIgnoreAfterMaxFailures.java:70)
	at org.apache.lucene.util.TestRuleIgnoreTestSuites$1.evaluate(TestRuleIgnoreTestSuites.java:55)
	at com.carrotsearch.randomizedtesting.rules.StatementAdapter.evaluate(StatementAdapter.java:36)
	at com.carrotsearch.randomizedtesting.ThreadLeakControl$StatementRunner.run(ThreadLeakControl.java:358)
	at java.lang.Thread.run(Thread.java:679)
Caused by: java.lang.RuntimeException: REQUEST FAILED: xpath=//*[@numFound='2']
	xml response was: <?xml version="1.0" encoding="UTF-8"?>
<response>
<lst name="responseHeader"><int name="status">0</int><int name="QTime">54</int></lst><result name="response" numFound="1" start="0"><doc><arr name="parent_s"><str>e</str></arr><str name="id">27</str></doc></result>
</response>

	request was:q=%2Bparent_s:(e+b)+%2B_query_:"{!parent+which%3D$pq+v%3D$chq}"&pq=parent_s:[*+TO+*]&chq=child_s:l
	at org.apache.solr.SolrTestCaseJ4.assertQ(SolrTestCaseJ4.java:629)
	... 42 more


REGRESSION:  org.apache.solr.search.join.BJQParserTest.testIntersectParentBqChildBq

Error Message:
Exception during query

Stack Trace:
java.lang.RuntimeException: Exception during query
	at __randomizedtesting.SeedInfo.seed([FEB2479FD4A26817:29FC0D2AE2066E11]:0)
	at org.apache.solr.SolrTestCaseJ4.assertQ(SolrTestCaseJ4.java:636)
	at org.apache.solr.SolrTestCaseJ4.assertQ(SolrTestCaseJ4.java:603)
	at org.apache.solr.search.join.BJQParserTest.testIntersectParentBqChildBq(BJQParserTest.java:180)
	at sun.reflect.NativeMethodAccessorImpl.invoke0(Native Method)
	at sun.reflect.NativeMethodAccessorImpl.invoke(NativeMethodAccessorImpl.java:57)
	at sun.reflect.DelegatingMethodAccessorImpl.invoke(DelegatingMethodAccessorImpl.java:43)
	at java.lang.reflect.Method.invoke(Method.java:616)
	at com.carrotsearch.randomizedtesting.RandomizedRunner.invoke(RandomizedRunner.java:1559)
	at com.carrotsearch.randomizedtesting.RandomizedRunner.access$600(RandomizedRunner.java:79)
	at com.carrotsearch.randomizedtesting.RandomizedRunner$6.evaluate(RandomizedRunner.java:737)
	at com.carrotsearch.randomizedtesting.RandomizedRunner$7.evaluate(RandomizedRunner.java:773)
	at com.carrotsearch.randomizedtesting.RandomizedRunner$8.evaluate(RandomizedRunner.java:787)
	at com.carrotsearch.randomizedtesting.rules.SystemPropertiesRestoreRule$1.evaluate(SystemPropertiesRestoreRule.java:53)
	at org.apache.lucene.util.TestRuleSetupTeardownChained$1.evaluate(TestRuleSetupTeardownChained.java:50)
	at org.apache.lucene.util.TestRuleFieldCacheSanity$1.evaluate(TestRuleFieldCacheSanity.java:51)
	at org.apache.lucene.util.AbstractBeforeAfterRule$1.evaluate(AbstractBeforeAfterRule.java:46)
	at com.carrotsearch.randomizedtesting.rules.SystemPropertiesInvariantRule$1.evaluate(SystemPropertiesInvariantRule.java:55)
	at org.apache.lucene.util.TestRuleThreadAndTestName$1.evaluate(TestRuleThreadAndTestName.java:49)
	at org.apache.lucene.util.TestRuleIgnoreAfterMaxFailures$1.evaluate(TestRuleIgnoreAfterMaxFailures.java:70)
	at org.apache.lucene.util.TestRuleMarkFailure$1.evaluate(TestRuleMarkFailure.java:48)
	at com.carrotsearch.randomizedtesting.rules.StatementAdapter.evaluate(StatementAdapter.java:36)
	at com.carrotsearch.randomizedtesting.ThreadLeakControl$StatementRunner.run(ThreadLeakControl.java:358)
	at com.carrotsearch.randomizedtesting.ThreadLeakControl.forkTimeoutingTask(ThreadLeakControl.java:782)
	at com.carrotsearch.randomizedtesting.ThreadLeakControl$3.evaluate(ThreadLeakControl.java:442)
	at com.carrotsearch.randomizedtesting.RandomizedRunner.runSingleTest(RandomizedRunner.java:746)
	at com.carrotsearch.randomizedtesting.RandomizedRunner$3.evaluate(RandomizedRunner.java:648)
	at com.carrotsearch.randomizedtesting.RandomizedRunner$4.evaluate(RandomizedRunner.java:682)
	at com.carrotsearch.randomizedtesting.RandomizedRunner$5.evaluate(RandomizedRunner.java:693)
	at com.carrotsearch.randomizedtesting.rules.StatementAdapter.evaluate(StatementAdapter.java:36)
	at com.carrotsearch.randomizedtesting.rules.SystemPropertiesRestoreRule$1.evaluate(SystemPropertiesRestoreRule.java:53)
	at org.apache.lucene.util.AbstractBeforeAfterRule$1.evaluate(AbstractBeforeAfterRule.java:46)
	at org.apache.lucene.util.TestRuleStoreClassName$1.evaluate(TestRuleStoreClassName.java:42)
	at com.carrotsearch.randomizedtesting.rules.SystemPropertiesInvariantRule$1.evaluate(SystemPropertiesInvariantRule.java:55)
	at com.carrotsearch.randomizedtesting.rules.NoShadowingOrOverridesOnMethodsRule$1.evaluate(NoShadowingOrOverridesOnMethodsRule.java:39)
	at com.carrotsearch.randomizedtesting.rules.NoShadowingOrOverridesOnMethodsRule$1.evaluate(NoShadowingOrOverridesOnMethodsRule.java:39)
	at com.carrotsearch.randomizedtesting.rules.StatementAdapter.evaluate(StatementAdapter.java:36)
	at org.apache.lucene.util.TestRuleAssertionsRequired$1.evaluate(TestRuleAssertionsRequired.java:43)
	at org.apache.lucene.util.TestRuleMarkFailure$1.evaluate(TestRuleMarkFailure.java:48)
	at org.apache.lucene.util.TestRuleIgnoreAfterMaxFailures$1.evaluate(TestRuleIgnoreAfterMaxFailures.java:70)
	at org.apache.lucene.util.TestRuleIgnoreTestSuites$1.evaluate(TestRuleIgnoreTestSuites.java:55)
	at com.carrotsearch.randomizedtesting.rules.StatementAdapter.evaluate(StatementAdapter.java:36)
	at com.carrotsearch.randomizedtesting.ThreadLeakControl$StatementRunner.run(ThreadLeakControl.java:358)
	at java.lang.Thread.run(Thread.java:679)
Caused by: java.lang.RuntimeException: REQUEST FAILED: xpath=//*[@numFound='2']
	xml response was: <?xml version="1.0" encoding="UTF-8"?>
<response>
<lst name="responseHeader"><int name="status">0</int><int name="QTime">1</int></lst><result name="response" numFound="1" start="0"><doc><arr name="parent_s"><str>b</str></arr><str name="id">34</str></doc></result>
</response>

	request was:q=%2Bparent_s:(a+e+b)+%2B_query_:"{!parent+which%3D$pq+v%3D$chq}"&pq=parent_s:[*+TO+*]&chq=parentchild_s:(bm+ek+cl)
	at org.apache.solr.SolrTestCaseJ4.assertQ(SolrTestCaseJ4.java:629)
	... 42 more


REGRESSION:  org.apache.solr.search.join.BJQParserTest.testChildrenParser

Error Message:
Exception during query

Stack Trace:
java.lang.RuntimeException: Exception during query
	at __randomizedtesting.SeedInfo.seed([FEB2479FD4A26817:2D8946309882BB7A]:0)
	at org.apache.solr.SolrTestCaseJ4.assertQ(SolrTestCaseJ4.java:636)
	at org.apache.solr.SolrTestCaseJ4.assertQ(SolrTestCaseJ4.java:603)
	at org.apache.solr.search.join.BJQParserTest.testChildrenParser(BJQParserTest.java:206)
	at sun.reflect.NativeMethodAccessorImpl.invoke0(Native Method)
	at sun.reflect.NativeMethodAccessorImpl.invoke(NativeMethodAccessorImpl.java:57)
	at sun.reflect.DelegatingMethodAccessorImpl.invoke(DelegatingMethodAccessorImpl.java:43)
	at java.lang.reflect.Method.invoke(Method.java:616)
	at com.carrotsearch.randomizedtesting.RandomizedRunner.invoke(RandomizedRunner.java:1559)
	at com.carrotsearch.randomizedtesting.RandomizedRunner.access$600(RandomizedRunner.java:79)
	at com.carrotsearch.randomizedtesting.RandomizedRunner$6.evaluate(RandomizedRunner.java:737)
	at com.carrotsearch.randomizedtesting.RandomizedRunner$7.evaluate(RandomizedRunner.java:773)
	at com.carrotsearch.randomizedtesting.RandomizedRunner$8.evaluate(RandomizedRunner.java:787)
	at com.carrotsearch.randomizedtesting.rules.SystemPropertiesRestoreRule$1.evaluate(SystemPropertiesRestoreRule.java:53)
	at org.apache.lucene.util.TestRuleSetupTeardownChained$1.evaluate(TestRuleSetupTeardownChained.java:50)
	at org.apache.lucene.util.TestRuleFieldCacheSanity$1.evaluate(TestRuleFieldCacheSanity.java:51)
	at org.apache.lucene.util.AbstractBeforeAfterRule$1.evaluate(AbstractBeforeAfterRule.java:46)
	at com.carrotsearch.randomizedtesting.rules.SystemPropertiesInvariantRule$1.evaluate(SystemPropertiesInvariantRule.java:55)
	at org.apache.lucene.util.TestRuleThreadAndTestName$1.evaluate(TestRuleThreadAndTestName.java:49)
	at org.apache.lucene.util.TestRuleIgnoreAfterMaxFailures$1.evaluate(TestRuleIgnoreAfterMaxFailures.java:70)
	at org.apache.lucene.util.TestRuleMarkFailure$1.evaluate(TestRuleMarkFailure.java:48)
	at com.carrotsearch.randomizedtesting.rules.StatementAdapter.evaluate(StatementAdapter.java:36)
	at com.carrotsearch.randomizedtesting.ThreadLeakControl$StatementRunner.run(ThreadLeakControl.java:358)
	at com.carrotsearch.randomizedtesting.ThreadLeakControl.forkTimeoutingTask(ThreadLeakControl.java:782)
	at com.carrotsearch.randomizedtesting.ThreadLeakControl$3.evaluate(ThreadLeakControl.java:442)
	at com.carrotsearch.randomizedtesting.RandomizedRunner.runSingleTest(RandomizedRunner.java:746)
	at com.carrotsearch.randomizedtesting.RandomizedRunner$3.evaluate(RandomizedRunner.java:648)
	at com.carrotsearch.randomizedtesting.RandomizedRunner$4.evaluate(RandomizedRunner.java:682)
	at com.carrotsearch.randomizedtesting.RandomizedRunner$5.evaluate(RandomizedRunner.java:693)
	at com.carrotsearch.randomizedtesting.rules.StatementAdapter.evaluate(StatementAdapter.java:36)
	at com.carrotsearch.randomizedtesting.rules.SystemPropertiesRestoreRule$1.evaluate(SystemPropertiesRestoreRule.java:53)
	at org.apache.lucene.util.AbstractBeforeAfterRule$1.evaluate(AbstractBeforeAfterRule.java:46)
	at org.apache.lucene.util.TestRuleStoreClassName$1.evaluate(TestRuleStoreClassName.java:42)
	at com.carrotsearch.randomizedtesting.rules.SystemPropertiesInvariantRule$1.evaluate(SystemPropertiesInvariantRule.java:55)
	at com.carrotsearch.randomizedtesting.rules.NoShadowingOrOverridesOnMethodsRule$1.evaluate(NoShadowingOrOverridesOnMethodsRule.java:39)
	at com.carrotsearch.randomizedtesting.rules.NoShadowingOrOverridesOnMethodsRule$1.evaluate(NoShadowingOrOverridesOnMethodsRule.java:39)
	at com.carrotsearch.randomizedtesting.rules.StatementAdapter.evaluate(StatementAdapter.java:36)
	at org.apache.lucene.util.TestRuleAssertionsRequired$1.evaluate(TestRuleAssertionsRequired.java:43)
	at org.apache.lucene.util.TestRuleMarkFailure$1.evaluate(TestRuleMarkFailure.java:48)
	at org.apache.lucene.util.TestRuleIgnoreAfterMaxFailures$1.evaluate(TestRuleIgnoreAfterMaxFailures.java:70)
	at org.apache.lucene.util.TestRuleIgnoreTestSuites$1.evaluate(TestRuleIgnoreTestSuites.java:55)
	at com.carrotsearch.randomizedtesting.rules.StatementAdapter.evaluate(StatementAdapter.java:36)
	at com.carrotsearch.randomizedtesting.ThreadLeakControl$StatementRunner.run(ThreadLeakControl.java:358)
	at java.lang.Thread.run(Thread.java:679)
Caused by: java.lang.RuntimeException: REQUEST FAILED: xpath=//*[@numFound='3']
	xml response was: <?xml version="1.0" encoding="UTF-8"?>
<response>
<lst name="responseHeader"><int name="status">0</int><int name="QTime">21</int></lst><result name="response" numFound="2" start="0"><doc><arr name="child_s"><str>k</str></arr><arr name="parentchild_s"><str>ak</str></arr><str name="id">4</str></doc><doc><arr name="child_s"><str>m</str></arr><arr name="parentchild_s"><str>am</str></arr><str name="id">5</str></doc></result>
</response>

	request was:q={!child+of%3D"parent_s:[*+TO+*]"}parent_s:a&fq=NOT+grand_s:[*+TO+*]
	at org.apache.solr.SolrTestCaseJ4.assertQ(SolrTestCaseJ4.java:629)
	... 42 more


REGRESSION:  org.apache.solr.search.join.BJQParserTest.testGrandChildren

Error Message:


Stack Trace:
java.lang.AssertionError
	at __randomizedtesting.SeedInfo.seed([FEB2479FD4A26817:F360D14412CF0773]:0)
	at org.apache.lucene.search.join.ToParentBlockJoinQuery$BlockJoinScorer.nextDoc(ToParentBlockJoinQuery.java:296)
	at org.apache.lucene.search.join.ToParentBlockJoinQuery$BlockJoinWeight.scorer(ToParentBlockJoinQuery.java:171)
	at org.apache.lucene.search.IndexSearcher.search(IndexSearcher.java:624)
	at org.apache.lucene.search.IndexSearcher.search(IndexSearcher.java:297)
	at org.apache.solr.search.SolrIndexSearcher.getDocListNC(SolrIndexSearcher.java:1501)
	at org.apache.solr.search.SolrIndexSearcher.getDocListC(SolrIndexSearcher.java:1367)
	at org.apache.solr.search.SolrIndexSearcher.search(SolrIndexSearcher.java:474)
	at org.apache.solr.handler.component.QueryComponent.process(QueryComponent.java:434)
	at org.apache.solr.handler.component.SearchHandler.handleRequestBody(SearchHandler.java:208)
	at org.apache.solr.handler.RequestHandlerBase.handleRequest(RequestHandlerBase.java:135)
	at org.apache.solr.core.SolrCore.execute(SolrCore.java:1850)
	at org.apache.solr.util.TestHarness.query(TestHarness.java:292)
	at org.apache.solr.util.TestHarness.query(TestHarness.java:274)
	at org.apache.solr.SolrTestCaseJ4.assertQ(SolrTestCaseJ4.java:610)
	at org.apache.solr.SolrTestCaseJ4.assertQ(SolrTestCaseJ4.java:603)
	at org.apache.solr.search.join.BJQParserTest.testGrandChildren(BJQParserTest.java:188)
	at sun.reflect.NativeMethodAccessorImpl.invoke0(Native Method)
	at sun.reflect.NativeMethodAccessorImpl.invoke(NativeMethodAccessorImpl.java:57)
	at sun.reflect.DelegatingMethodAccessorImpl.invoke(DelegatingMethodAccessorImpl.java:43)
	at java.lang.reflect.Method.invoke(Method.java:616)
	at com.carrotsearch.randomizedtesting.RandomizedRunner.invoke(RandomizedRunner.java:1559)
	at com.carrotsearch.randomizedtesting.RandomizedRunner.access$600(RandomizedRunner.java:79)
	at com.carrotsearch.randomizedtesting.RandomizedRunner$6.evaluate(RandomizedRunner.java:737)
	at com.carrotsearch.randomizedtesting.RandomizedRunner$7.evaluate(RandomizedRunner.java:773)
	at com.carrotsearch.randomizedtesting.RandomizedRunner$8.evaluate(RandomizedRunner.java:787)
	at com.carrotsearch.randomizedtesting.rules.SystemPropertiesRestoreRule$1.evaluate(SystemPropertiesRestoreRule.java:53)
	at org.apache.lucene.util.TestRuleSetupTeardownChained$1.evaluate(TestRuleSetupTeardownChained.java:50)
	at org.apache.lucene.util.TestRuleFieldCacheSanity$1.evaluate(TestRuleFieldCacheSanity.java:51)
	at org.apache.lucene.util.AbstractBeforeAfterRule$1.evaluate(AbstractBeforeAfterRule.java:46)
	at com.carrotsearch.randomizedtesting.rules.SystemPropertiesInvariantRule$1.evaluate(SystemPropertiesInvariantRule.java:55)
	at org.apache.lucene.util.TestRuleThreadAndTestName$1.evaluate(TestRuleThreadAndTestName.java:49)
	at org.apache.lucene.util.TestRuleIgnoreAfterMaxFailures$1.evaluate(TestRuleIgnoreAfterMaxFailures.java:70)
	at org.apache.lucene.util.TestRuleMarkFailure$1.evaluate(TestRuleMarkFailure.java:48)
	at com.carrotsearch.randomizedtesting.rules.StatementAdapter.evaluate(StatementAdapter.java:36)
	at com.carrotsearch.randomizedtesting.ThreadLeakControl$StatementRunner.run(ThreadLeakControl.java:358)
	at com.carrotsearch.randomizedtesting.ThreadLeakControl.forkTimeoutingTask(ThreadLeakControl.java:782)
	at com.carrotsearch.randomizedtesting.ThreadLeakControl$3.evaluate(ThreadLeakControl.java:442)
	at com.carrotsearch.randomizedtesting.RandomizedRunner.runSingleTest(RandomizedRunner.java:746)
	at com.carrotsearch.randomizedtesting.RandomizedRunner$3.evaluate(RandomizedRunner.java:648)
	at com.carrotsearch.randomizedtesting.RandomizedRunner$4.evaluate(RandomizedRunner.java:682)
	at com.carrotsearch.randomizedtesting.RandomizedRunner$5.evaluate(RandomizedRunner.java:693)
	at com.carrotsearch.randomizedtesting.rules.StatementAdapter.evaluate(StatementAdapter.java:36)
	at com.carrotsearch.randomizedtesting.rules.SystemPropertiesRestoreRule$1.evaluate(SystemPropertiesRestoreRule.java:53)
	at org.apache.lucene.util.AbstractBeforeAfterRule$1.evaluate(AbstractBeforeAfterRule.java:46)
	at org.apache.lucene.util.TestRuleStoreClassName$1.evaluate(TestRuleStoreClassName.java:42)
	at com.carrotsearch.randomizedtesting.rules.SystemPropertiesInvariantRule$1.evaluate(SystemPropertiesInvariantRule.java:55)
	at com.carrotsearch.randomizedtesting.rules.NoShadowingOrOverridesOnMethodsRule$1.evaluate(NoShadowingOrOverridesOnMethodsRule.java:39)
	at com.carrotsearch.randomizedtesting.rules.NoShadowingOrOverridesOnMethodsRule$1.evaluate(NoShadowingOrOverridesOnMethodsRule.java:39)
	at com.carrotsearch.randomizedtesting.rules.StatementAdapter.evaluate(StatementAdapter.java:36)
	at org.apache.lucene.util.TestRuleAssertionsRequired$1.evaluate(TestRuleAssertionsRequired.java:43)
	at org.apache.lucene.util.TestRuleMarkFailure$1.evaluate(TestRuleMarkFailure.java:48)
	at org.apache.lucene.util.TestRuleIgnoreAfterMaxFailures$1.evaluate(TestRuleIgnoreAfterMaxFailures.java:70)
	at org.apache.lucene.util.TestRuleIgnoreTestSuites$1.evaluate(TestRuleIgnoreTestSuites.java:55)
	at com.carrotsearch.randomizedtesting.rules.StatementAdapter.evaluate(StatementAdapter.java:36)
	at com.carrotsearch.randomizedtesting.ThreadLeakControl$StatementRunner.run(ThreadLeakControl.java:358)
	at java.lang.Thread.run(Thread.java:679)


REGRESSION:  org.apache.solr.search.join.BJQParserTest.testCacheHit

Error Message:
Exception during query

Stack Trace:
java.lang.RuntimeException: Exception during query
	at __randomizedtesting.SeedInfo.seed([FEB2479FD4A26817:6096DA8277A64DF1]:0)
	at org.apache.solr.SolrTestCaseJ4.assertQ(SolrTestCaseJ4.java:636)
	at org.apache.solr.search.join.BJQParserTest.testCacheHit(BJQParserTest.java:246)
	at sun.reflect.NativeMethodAccessorImpl.invoke0(Native Method)
	at sun.reflect.NativeMethodAccessorImpl.invoke(NativeMethodAccessorImpl.java:57)
	at sun.reflect.DelegatingMethodAccessorImpl.invoke(DelegatingMethodAccessorImpl.java:43)
	at java.lang.reflect.Method.invoke(Method.java:616)
	at com.carrotsearch.randomizedtesting.RandomizedRunner.invoke(RandomizedRunner.java:1559)
	at com.carrotsearch.randomizedtesting.RandomizedRunner.access$600(RandomizedRunner.java:79)
	at com.carrotsearch.randomizedtesting.RandomizedRunner$6.evaluate(RandomizedRunner.java:737)
	at com.carrotsearch.randomizedtesting.RandomizedRunner$7.evaluate(RandomizedRunner.java:773)
	at com.carrotsearch.randomizedtesting.RandomizedRunner$8.evaluate(RandomizedRunner.java:787)
	at com.carrotsearch.randomizedtesting.rules.SystemPropertiesRestoreRule$1.evaluate(SystemPropertiesRestoreRule.java:53)
	at org.apache.lucene.util.TestRuleSetupTeardownChained$1.evaluate(TestRuleSetupTeardownChained.java:50)
	at org.apache.lucene.util.TestRuleFieldCacheSanity$1.evaluate(TestRuleFieldCacheSanity.java:51)
	at org.apache.lucene.util.AbstractBeforeAfterRule$1.evaluate(AbstractBeforeAfterRule.java:46)
	at com.carrotsearch.randomizedtesting.rules.SystemPropertiesInvariantRule$1.evaluate(SystemPropertiesInvariantRule.java:55)
	at org.apache.lucene.util.TestRuleThreadAndTestName$1.evaluate(TestRuleThreadAndTestName.java:49)
	at org.apache.lucene.util.TestRuleIgnoreAfterMaxFailures$1.evaluate(TestRuleIgnoreAfterMaxFailures.java:70)
	at org.apache.lucene.util.TestRuleMarkFailure$1.evaluate(TestRuleMarkFailure.java:48)
	at com.carrotsearch.randomizedtesting.rules.StatementAdapter.evaluate(StatementAdapter.java:36)
	at com.carrotsearch.randomizedtesting.ThreadLeakControl$StatementRunner.run(ThreadLeakControl.java:358)
	at com.carrotsearch.randomizedtesting.ThreadLeakControl.forkTimeoutingTask(ThreadLeakControl.java:782)
	at com.carrotsearch.randomizedtesting.ThreadLeakControl$3.evaluate(ThreadLeakControl.java:442)
	at com.carrotsearch.randomizedtesting.RandomizedRunner.runSingleTest(RandomizedRunner.java:746)
	at com.carrotsearch.randomizedtesting.RandomizedRunner$3.evaluate(RandomizedRunner.java:648)
	at com.carrotsearch.randomizedtesting.RandomizedRunner$4.evaluate(RandomizedRunner.java:682)
	at com.carrotsearch.randomizedtesting.RandomizedRunner$5.evaluate(RandomizedRunner.java:693)
	at com.carrotsearch.randomizedtesting.rules.StatementAdapter.evaluate(StatementAdapter.java:36)
	at com.carrotsearch.randomizedtesting.rules.SystemPropertiesRestoreRule$1.evaluate(SystemPropertiesRestoreRule.java:53)
	at org.apache.lucene.util.AbstractBeforeAfterRule$1.evaluate(AbstractBeforeAfterRule.java:46)
	at org.apache.lucene.util.TestRuleStoreClassName$1.evaluate(TestRuleStoreClassName.java:42)
	at com.carrotsearch.randomizedtesting.rules.SystemPropertiesInvariantRule$1.evaluate(SystemPropertiesInvariantRule.java:55)
	at com.carrotsearch.randomizedtesting.rules.NoShadowingOrOverridesOnMethodsRule$1.evaluate(NoShadowingOrOverridesOnMethodsRule.java:39)
	at com.carrotsearch.randomizedtesting.rules.NoShadowingOrOverridesOnMethodsRule$1.evaluate(NoShadowingOrOverridesOnMethodsRule.java:39)
	at com.carrotsearch.randomizedtesting.rules.StatementAdapter.evaluate(StatementAdapter.java:36)
	at org.apache.lucene.util.TestRuleAssertionsRequired$1.evaluate(TestRuleAssertionsRequired.java:43)
	at org.apache.lucene.util.TestRuleMarkFailure$1.evaluate(TestRuleMarkFailure.java:48)
	at org.apache.lucene.util.TestRuleIgnoreAfterMaxFailures$1.evaluate(TestRuleIgnoreAfterMaxFailures.java:70)
	at org.apache.lucene.util.TestRuleIgnoreTestSuites$1.evaluate(TestRuleIgnoreTestSuites.java:55)
	at com.carrotsearch.randomizedtesting.rules.StatementAdapter.evaluate(StatementAdapter.java:36)
	at com.carrotsearch.randomizedtesting.ThreadLeakControl$StatementRunner.run(ThreadLeakControl.java:358)
	at java.lang.Thread.run(Thread.java:679)
Caused by: java.lang.RuntimeException: REQUEST FAILED: xpath=//*[@numFound='6']
	xml response was: <?xml version="1.0" encoding="UTF-8"?>
<response>
<lst name="responseHeader"><int name="status">0</int><int name="QTime">0</int></lst><result name="response" numFound="2" start="0"><doc><arr name="parent_s"><str>f</str></arr><str name="id">13</str></doc><doc><arr name="parent_s"><str>e</str></arr><str name="id">27</str></doc></result>
</response>

	request was:q=*:*&fq={!parent+which%3D"parent_s:([a+TO+c]+[d+TO+f])"}child_s:l
	at org.apache.solr.SolrTestCaseJ4.assertQ(SolrTestCaseJ4.java:629)
	... 41 more


REGRESSION:  org.apache.solr.search.join.BJQParserTest.testFq

Error Message:
Exception during query

Stack Trace:
java.lang.RuntimeException: Exception during query
	at __randomizedtesting.SeedInfo.seed([FEB2479FD4A26817:7DAF783A8C1C664D]:0)
	at org.apache.solr.SolrTestCaseJ4.assertQ(SolrTestCaseJ4.java:636)
	at org.apache.solr.SolrTestCaseJ4.assertQ(SolrTestCaseJ4.java:603)
	at org.apache.solr.search.join.BJQParserTest.testFq(BJQParserTest.java:164)
	at sun.reflect.NativeMethodAccessorImpl.invoke0(Native Method)
	at sun.reflect.NativeMethodAccessorImpl.invoke(NativeMethodAccessorImpl.java:57)
	at sun.reflect.DelegatingMethodAccessorImpl.invoke(DelegatingMethodAccessorImpl.java:43)
	at java.lang.reflect.Method.invoke(Method.java:616)
	at com.carrotsearch.randomizedtesting.RandomizedRunner.invoke(RandomizedRunner.java:1559)
	at com.carrotsearch.randomizedtesting.RandomizedRunner.access$600(RandomizedRunner.java:79)
	at com.carrotsearch.randomizedtesting.RandomizedRunner$6.evaluate(RandomizedRunner.java:737)
	at com.carrotsearch.randomizedtesting.RandomizedRunner$7.evaluate(RandomizedRunner.java:773)
	at com.carrotsearch.randomizedtesting.RandomizedRunner$8.evaluate(RandomizedRunner.java:787)
	at com.carrotsearch.randomizedtesting.rules.SystemPropertiesRestoreRule$1.evaluate(SystemPropertiesRestoreRule.java:53)
	at org.apache.lucene.util.TestRuleSetupTeardownChained$1.evaluate(TestRuleSetupTeardownChained.java:50)
	at org.apache.lucene.util.TestRuleFieldCacheSanity$1.evaluate(TestRuleFieldCacheSanity.java:51)
	at org.apache.lucene.util.AbstractBeforeAfterRule$1.evaluate(AbstractBeforeAfterRule.java:46)
	at com.carrotsearch.randomizedtesting.rules.SystemPropertiesInvariantRule$1.evaluate(SystemPropertiesInvariantRule.java:55)
	at org.apache.lucene.util.TestRuleThreadAndTestName$1.evaluate(TestRuleThreadAndTestName.java:49)
	at org.apache.lucene.util.TestRuleIgnoreAfterMaxFailures$1.evaluate(TestRuleIgnoreAfterMaxFailures.java:70)
	at org.apache.lucene.util.TestRuleMarkFailure$1.evaluate(TestRuleMarkFailure.java:48)
	at com.carrotsearch.randomizedtesting.rules.StatementAdapter.evaluate(StatementAdapter.java:36)
	at com.carrotsearch.randomizedtesting.ThreadLeakControl$StatementRunner.run(ThreadLeakControl.java:358)
	at com.carrotsearch.randomizedtesting.ThreadLeakControl.forkTimeoutingTask(ThreadLeakControl.java:782)
	at com.carrotsearch.randomizedtesting.ThreadLeakControl$3.evaluate(ThreadLeakControl.java:442)
	at com.carrotsearch.randomizedtesting.RandomizedRunner.runSingleTest(RandomizedRunner.java:746)
	at com.carrotsearch.randomizedtesting.RandomizedRunner$3.evaluate(RandomizedRunner.java:648)
	at com.carrotsearch.randomizedtesting.RandomizedRunner$4.evaluate(RandomizedRunner.java:682)
	at com.carrotsearch.randomizedtesting.RandomizedRunner$5.evaluate(RandomizedRunner.java:693)
	at com.carrotsearch.randomizedtesting.rules.StatementAdapter.evaluate(StatementAdapter.java:36)
	at com.carrotsearch.randomizedtesting.rules.SystemPropertiesRestoreRule$1.evaluate(SystemPropertiesRestoreRule.java:53)
	at org.apache.lucene.util.AbstractBeforeAfterRule$1.evaluate(AbstractBeforeAfterRule.java:46)
	at org.apache.lucene.util.TestRuleStoreClassName$1.evaluate(TestRuleStoreClassName.java:42)
	at com.carrotsearch.randomizedtesting.rules.SystemPropertiesInvariantRule$1.evaluate(SystemPropertiesInvariantRule.java:55)
	at com.carrotsearch.randomizedtesting.rules.NoShadowingOrOverridesOnMethodsRule$1.evaluate(NoShadowingOrOverridesOnMethodsRule.java:39)
	at com.carrotsearch.randomizedtesting.rules.NoShadowingOrOverridesOnMethodsRule$1.evaluate(NoShadowingOrOverridesOnMethodsRule.java:39)
	at com.carrotsearch.randomizedtesting.rules.StatementAdapter.evaluate(StatementAdapter.java:36)
	at org.apache.lucene.util.TestRuleAssertionsRequired$1.evaluate(TestRuleAssertionsRequired.java:43)
	at org.apache.lucene.util.TestRuleMarkFailure$1.evaluate(TestRuleMarkFailure.java:48)
	at org.apache.lucene.util.TestRuleIgnoreAfterMaxFailures$1.evaluate(TestRuleIgnoreAfterMaxFailures.java:70)
	at org.apache.lucene.util.TestRuleIgnoreTestSuites$1.evaluate(TestRuleIgnoreTestSuites.java:55)
	at com.carrotsearch.randomizedtesting.rules.StatementAdapter.evaluate(StatementAdapter.java:36)
	at com.carrotsearch.randomizedtesting.ThreadLeakControl$StatementRunner.run(ThreadLeakControl.java:358)
	at java.lang.Thread.run(Thread.java:679)
Caused by: java.lang.RuntimeException: REQUEST FAILED: xpath=//*[@numFound='2']
	xml response was: <?xml version="1.0" encoding="UTF-8"?>
<response>
<lst name="responseHeader"><int name="status">0</int><int name="QTime">1</int></lst><result name="response" numFound="1" start="0"><doc><arr name="parent_s"><str>e</str></arr><str name="id">27</str></doc></result>
</response>

	request was:q={!parent+which%3D$pq+v%3D$chq}&pq=parent_s:[*+TO+*]&chq=child_s:l&fq=parent_s:(e+b)
	at org.apache.solr.SolrTestCaseJ4.assertQ(SolrTestCaseJ4.java:629)
	... 42 more


REGRESSION:  org.apache.solr.search.join.BJQParserTest.testFull

Error Message:
Exception during query

Stack Trace:
java.lang.RuntimeException: Exception during query
	at __randomizedtesting.SeedInfo.seed([FEB2479FD4A26817:F79031AF9A5965FC]:0)
	at org.apache.solr.SolrTestCaseJ4.assertQ(SolrTestCaseJ4.java:636)
	at org.apache.solr.SolrTestCaseJ4.assertQ(SolrTestCaseJ4.java:603)
	at org.apache.solr.search.join.BJQParserTest.testFull(BJQParserTest.java:126)
	at sun.reflect.NativeMethodAccessorImpl.invoke0(Native Method)
	at sun.reflect.NativeMethodAccessorImpl.invoke(NativeMethodAccessorImpl.java:57)
	at sun.reflect.DelegatingMethodAccessorImpl.invoke(DelegatingMethodAccessorImpl.java:43)
	at java.lang.reflect.Method.invoke(Method.java:616)
	at com.carrotsearch.randomizedtesting.RandomizedRunner.invoke(RandomizedRunner.java:1559)
	at com.carrotsearch.randomizedtesting.RandomizedRunner.access$600(RandomizedRunner.java:79)
	at com.carrotsearch.randomizedtesting.RandomizedRunner$6.evaluate(RandomizedRunner.java:737)
	at com.carrotsearch.randomizedtesting.RandomizedRunner$7.evaluate(RandomizedRunner.java:773)
	at com.carrotsearch.randomizedtesting.RandomizedRunner$8.evaluate(RandomizedRunner.java:787)
	at com.carrotsearch.randomizedtesting.rules.SystemPropertiesRestoreRule$1.evaluate(SystemPropertiesRestoreRule.java:53)
	at org.apache.lucene.util.TestRuleSetupTeardownChained$1.evaluate(TestRuleSetupTeardownChained.java:50)
	at org.apache.lucene.util.TestRuleFieldCacheSanity$1.evaluate(TestRuleFieldCacheSanity.java:51)
	at org.apache.lucene.util.AbstractBeforeAfterRule$1.evaluate(AbstractBeforeAfterRule.java:46)
	at com.carrotsearch.randomizedtesting.rules.SystemPropertiesInvariantRule$1.evaluate(SystemPropertiesInvariantRule.java:55)
	at org.apache.lucene.util.TestRuleThreadAndTestName$1.evaluate(TestRuleThreadAndTestName.java:49)
	at org.apache.lucene.util.TestRuleIgnoreAfterMaxFailures$1.evaluate(TestRuleIgnoreAfterMaxFailures.java:70)
	at org.apache.lucene.util.TestRuleMarkFailure$1.evaluate(TestRuleMarkFailure.java:48)
	at com.carrotsearch.randomizedtesting.rules.StatementAdapter.evaluate(StatementAdapter.java:36)
	at com.carrotsearch.randomizedtesting.ThreadLeakControl$StatementRunner.run(ThreadLeakControl.java:358)
	at com.carrotsearch.randomizedtesting.ThreadLeakControl.forkTimeoutingTask(ThreadLeakControl.java:782)
	at com.carrotsearch.randomizedtesting.ThreadLeakControl$3.evaluate(ThreadLeakControl.java:442)
	at com.carrotsearch.randomizedtesting.RandomizedRunner.runSingleTest(RandomizedRunner.java:746)
	at com.carrotsearch.randomizedtesting.RandomizedRunner$3.evaluate(RandomizedRunner.java:648)
	at com.carrotsearch.randomizedtesting.RandomizedRunner$4.evaluate(RandomizedRunner.java:682)
	at com.carrotsearch.randomizedtesting.RandomizedRunner$5.evaluate(RandomizedRunner.java:693)
	at com.carrotsearch.randomizedtesting.rules.StatementAdapter.evaluate(StatementAdapter.java:36)
	at com.carrotsearch.randomizedtesting.rules.SystemPropertiesRestoreRule$1.evaluate(SystemPropertiesRestoreRule.java:53)
	at org.apache.lucene.util.AbstractBeforeAfterRule$1.evaluate(AbstractBeforeAfterRule.java:46)
	at org.apache.lucene.util.TestRuleStoreClassName$1.evaluate(TestRuleStoreClassName.java:42)
	at com.carrotsearch.randomizedtesting.rules.SystemPropertiesInvariantRule$1.evaluate(SystemPropertiesInvariantRule.java:55)
	at com.carrotsearch.randomizedtesting.rules.NoShadowingOrOverridesOnMethodsRule$1.evaluate(NoShadowingOrOverridesOnMethodsRule.java:39)
	at com.carrotsearch.randomizedtesting.rules.NoShadowingOrOverridesOnMethodsRule$1.evaluate(NoShadowingOrOverridesOnMethodsRule.java:39)
	at com.carrotsearch.randomizedtesting.rules.StatementAdapter.evaluate(StatementAdapter.java:36)
	at org.apache.lucene.util.TestRuleAssertionsRequired$1.evaluate(TestRuleAssertionsRequired.java:43)
	at org.apache.lucene.util.TestRuleMarkFailure$1.evaluate(TestRuleMarkFailure.java:48)
	at org.apache.lucene.util.TestRuleIgnoreAfterMaxFailures$1.evaluate(TestRuleIgnoreAfterMaxFailures.java:70)
	at org.apache.lucene.util.TestRuleIgnoreTestSuites$1.evaluate(TestRuleIgnoreTestSuites.java:55)
	at com.carrotsearch.randomizedtesting.rules.StatementAdapter.evaluate(StatementAdapter.java:36)
	at com.carrotsearch.randomizedtesting.ThreadLeakControl$StatementRunner.run(ThreadLeakControl.java:358)
	at java.lang.Thread.run(Thread.java:679)
Caused by: java.lang.RuntimeException: REQUEST FAILED: xpath=//*[@numFound='6']
	xml response was: <?xml version="1.0" encoding="UTF-8"?>
<response>
<lst name="responseHeader"><int name="status">0</int><int name="QTime">0</int></lst><result name="response" numFound="2" start="0"><doc><arr name="parent_s"><str>f</str></arr><str name="id">13</str></doc><doc><arr name="parent_s"><str>e</str></arr><str name="id">27</str></doc></result>
</response>

	request was:q={!parent+which%3D"parent_s:[*+TO+*]"}child_s:l
	at org.apache.solr.SolrTestCaseJ4.assertQ(SolrTestCaseJ4.java:629)
	... 42 more




Build Log:
[...truncated 9384 lines...]
   [junit4] Suite: org.apache.solr.search.join.BJQParserTest
   [junit4]   2> 1547047 T2521 oas.SolrTestCaseJ4.initCore ####initCore
   [junit4]   2> Creating dataDir: /usr/home/hudson/hudson-slave/workspace/Lucene-Solr-NightlyTests-4.x/solr/build/solr-core/test/J1/./solrtest-BJQParserTest-1376693579098
   [junit4]   2> 1547049 T2521 oasc.SolrResourceLoader.<init> new SolrResourceLoader for directory: '/usr/home/hudson/hudson-slave/workspace/Lucene-Solr-NightlyTests-4.x/solr/build/solr-core/test-files/solr/collection1/'
   [junit4]   2> 1547050 T2521 oasc.SolrResourceLoader.replaceClassLoader Adding 'file:/usr/home/hudson/hudson-slave/workspace/Lucene-Solr-NightlyTests-4.x/solr/build/solr-core/test-files/solr/collection1/lib/classes/' to classloader
   [junit4]   2> 1547051 T2521 oasc.SolrResourceLoader.replaceClassLoader Adding 'file:/usr/home/hudson/hudson-slave/workspace/Lucene-Solr-NightlyTests-4.x/solr/build/solr-core/test-files/solr/collection1/lib/README' to classloader
   [junit4]   2> 1547159 T2521 oasc.SolrConfig.<init> Using Lucene MatchVersion: LUCENE_45
   [junit4]   2> 1547239 T2521 oasc.SolrConfig.<init> Loaded SolrConfig: solrconfig.xml
   [junit4]   2> 1547240 T2521 oass.IndexSchema.readSchema Reading Solr Schema from schema15.xml
   [junit4]   2> 1547250 T2521 oass.IndexSchema.readSchema [null] Schema name=test
   [junit4]   2> 1547721 T2521 oass.IndexSchema.readSchema default search field in schema is text
   [junit4]   2> 1547724 T2521 oass.IndexSchema.readSchema unique key field: id
   [junit4]   2> 1547726 T2521 oass.FileExchangeRateProvider.reload Reloading exchange rates from file currency.xml
   [junit4]   2> 1547729 T2521 oass.FileExchangeRateProvider.reload Reloading exchange rates from file currency.xml
   [junit4]   2> 1547738 T2521 oasc.SolrResourceLoader.locateSolrHome JNDI not configured for solr (NoInitialContextEx)
   [junit4]   2> 1547738 T2521 oasc.SolrResourceLoader.locateSolrHome using system property solr.solr.home: /usr/home/hudson/hudson-slave/workspace/Lucene-Solr-NightlyTests-4.x/solr/build/solr-core/test-files/solr
   [junit4]   2> 1547738 T2521 oasc.SolrResourceLoader.<init> new SolrResourceLoader for directory: '/usr/home/hudson/hudson-slave/workspace/Lucene-Solr-NightlyTests-4.x/solr/build/solr-core/test-files/solr/'
   [junit4]   2> 1547748 T2521 oasc.SolrResourceLoader.locateSolrHome JNDI not configured for solr (NoInitialContextEx)
   [junit4]   2> 1547748 T2521 oasc.SolrResourceLoader.locateSolrHome using system property solr.solr.home: /usr/home/hudson/hudson-slave/workspace/Lucene-Solr-NightlyTests-4.x/solr/build/solr-core/test-files/solr
   [junit4]   2> 1547748 T2521 oasc.SolrResourceLoader.<init> new SolrResourceLoader for deduced Solr Home: '/usr/home/hudson/hudson-slave/workspace/Lucene-Solr-NightlyTests-4.x/solr/build/solr-core/test-files/solr/'
   [junit4]   2> 1547802 T2521 oasc.CoreContainer.<init> New CoreContainer 535303742
   [junit4]   2> 1547802 T2521 oasc.CoreContainer.load Loading cores into CoreContainer [instanceDir=/usr/home/hudson/hudson-slave/workspace/Lucene-Solr-NightlyTests-4.x/solr/build/solr-core/test-files/solr/]
   [junit4]   2> 1547803 T2521 oashc.HttpShardHandlerFactory.getParameter Setting socketTimeout to: 0
   [junit4]   2> 1547804 T2521 oashc.HttpShardHandlerFactory.getParameter Setting urlScheme to: http://
   [junit4]   2> 1547804 T2521 oashc.HttpShardHandlerFactory.getParameter Setting connTimeout to: 0
   [junit4]   2> 1547804 T2521 oashc.HttpShardHandlerFactory.getParameter Setting maxConnectionsPerHost to: 20
   [junit4]   2> 1547804 T2521 oashc.HttpShardHandlerFactory.getParameter Setting corePoolSize to: 0
   [junit4]   2> 1547805 T2521 oashc.HttpShardHandlerFactory.getParameter Setting maximumPoolSize to: 2147483647
   [junit4]   2> 1547805 T2521 oashc.HttpShardHandlerFactory.getParameter Setting maxThreadIdleTime to: 5
   [junit4]   2> 1547805 T2521 oashc.HttpShardHandlerFactory.getParameter Setting sizeOfQueue to: -1
   [junit4]   2> 1547805 T2521 oashc.HttpShardHandlerFactory.getParameter Setting fairnessPolicy to: false
   [junit4]   2> 1547806 T2521 oascsi.HttpClientUtil.createClient Creating new http client, config:maxConnectionsPerHost=20&maxConnections=10000&socketTimeout=0&connTimeout=0&retry=false
   [junit4]   2> 1547816 T2521 oasl.LogWatcher.newRegisteredLogWatcher Registering Log Listener [Log4j (org.slf4j.impl.Log4jLoggerFactory)]
   [junit4]   2> 1547820 T2522 oasc.CoreContainer.create Creating SolrCore 'collection1' using instanceDir: /usr/home/hudson/hudson-slave/workspace/Lucene-Solr-NightlyTests-4.x/solr/build/solr-core/test-files/solr/collection1
   [junit4]   2> 1547820 T2522 oasc.SolrResourceLoader.<init> new SolrResourceLoader for directory: '/usr/home/hudson/hudson-slave/workspace/Lucene-Solr-NightlyTests-4.x/solr/build/solr-core/test-files/solr/collection1/'
   [junit4]   2> 1547821 T2522 oasc.SolrResourceLoader.replaceClassLoader Adding 'file:/usr/home/hudson/hudson-slave/workspace/Lucene-Solr-NightlyTests-4.x/solr/build/solr-core/test-files/solr/collection1/lib/classes/' to classloader
   [junit4]   2> 1547821 T2522 oasc.SolrResourceLoader.replaceClassLoader Adding 'file:/usr/home/hudson/hudson-slave/workspace/Lucene-Solr-NightlyTests-4.x/solr/build/solr-core/test-files/solr/collection1/lib/README' to classloader
   [junit4]   2> 1547864 T2522 oasc.SolrConfig.<init> Using Lucene MatchVersion: LUCENE_45
   [junit4]   2> 1547917 T2522 oasc.SolrConfig.<init> Loaded SolrConfig: solrconfig.xml
   [junit4]   2> 1547917 T2522 oass.IndexSchema.readSchema Reading Solr Schema from schema15.xml
   [junit4]   2> 1547924 T2522 oass.IndexSchema.readSchema [collection1] Schema name=test
   [junit4]   2> 1548296 T2522 oass.IndexSchema.readSchema default search field in schema is text
   [junit4]   2> 1548299 T2522 oass.IndexSchema.readSchema unique key field: id
   [junit4]   2> 1548300 T2522 oass.FileExchangeRateProvider.reload Reloading exchange rates from file currency.xml
   [junit4]   2> 1548303 T2522 oass.FileExchangeRateProvider.reload Reloading exchange rates from file currency.xml
   [junit4]   2> 1548311 T2522 oasc.SolrCore.initDirectoryFactory org.apache.solr.core.MockDirectoryFactory
   [junit4]   2> 1548311 T2522 oasc.SolrCore.<init> [collection1] Opening new SolrCore at /usr/home/hudson/hudson-slave/workspace/Lucene-Solr-NightlyTests-4.x/solr/build/solr-core/test-files/solr/collection1/, dataDir=/usr/home/hudson/hudson-slave/workspace/Lucene-Solr-NightlyTests-4.x/solr/build/solr-core/test/J1/./solrtest-BJQParserTest-1376693579098/
   [junit4]   2> 1548311 T2522 oasc.JmxMonitoredMap.<init> JMX monitoring is enabled. Adding Solr mbeans to JMX Server: com.sun.jmx.mbeanserver.JmxMBeanServer@46377e2a
   [junit4]   2> 1548312 T2522 oasc.CachingDirectoryFactory.get return new directory for /usr/home/hudson/hudson-slave/workspace/Lucene-Solr-NightlyTests-4.x/solr/build/solr-core/test/J1/./solrtest-BJQParserTest-1376693579098
   [junit4]   2> 1548312 T2522 oasc.SolrCore.getNewIndexDir New index directory detected: old=null new=/usr/home/hudson/hudson-slave/workspace/Lucene-Solr-NightlyTests-4.x/solr/build/solr-core/test/J1/./solrtest-BJQParserTest-1376693579098/index/
   [junit4]   2> 1548312 T2522 oasc.SolrCore.initIndex WARN [collection1] Solr index directory '/usr/home/hudson/hudson-slave/workspace/Lucene-Solr-NightlyTests-4.x/solr/build/solr-core/test/J1/./solrtest-BJQParserTest-1376693579098/index' doesn't exist. Creating new index...
   [junit4]   2> 1548313 T2522 oasc.CachingDirectoryFactory.get return new directory for /usr/home/hudson/hudson-slave/workspace/Lucene-Solr-NightlyTests-4.x/solr/build/solr-core/test/J1/./solrtest-BJQParserTest-1376693579098/index
   [junit4]   2> 1548313 T2522 oasu.RandomMergePolicy.<init> RandomMergePolicy wrapping class org.apache.lucene.index.MockRandomMergePolicy: org.apache.lucene.index.MockRandomMergePolicy@6c4151de
   [junit4]   2> 1548314 T2522 oasc.SolrDeletionPolicy.onCommit SolrDeletionPolicy.onCommit: commits: num=1
   [junit4]   2> 		commit{dir=RateLimitedDirectoryWrapper(MockDirWrapper(RateLimitedDirectoryWrapper(org.apache.lucene.store.RAMDirectory@6f04f37b lockFactory=org.apache.lucene.store.SingleInstanceLockFactory@6f990cde))),segFN=segments_1,generation=1}
   [junit4]   2> 1548314 T2522 oasc.SolrDeletionPolicy.updateCommits newest commit generation = 1
   [junit4]   2> 1548314 T2522 oasc.SolrCore.initWriters created xml: solr.XMLResponseWriter
   [junit4]   2> 1548317 T2522 oasup.UpdateRequestProcessorChain.init creating updateRequestProcessorChain "dedupe"
   [junit4]   2> 1548317 T2522 oasup.UpdateRequestProcessorChain.init inserting DistributedUpdateProcessorFactory into updateRequestProcessorChain "dedupe"
   [junit4]   2> 1548317 T2522 oasup.UpdateRequestProcessorChain.init creating updateRequestProcessorChain "dedupe-allfields"
   [junit4]   2> 1548317 T2522 oasup.UpdateRequestProcessorChain.init inserting DistributedUpdateProcessorFactory into updateRequestProcessorChain "dedupe-allfields"
   [junit4]   2> 1548317 T2522 oasup.UpdateRequestProcessorChain.init creating updateRequestProcessorChain "stored_sig"
   [junit4]   2> 1548318 T2522 oasup.UpdateRequestProcessorChain.init inserting DistributedUpdateProcessorFactory into updateRequestProcessorChain "stored_sig"
   [junit4]   2> 1548318 T2522 oasup.UpdateRequestProcessorChain.init creating updateRequestProcessorChain "uniq-fields"
   [junit4]   2> 1548318 T2522 oasup.UpdateRequestProcessorChain.init inserting DistributedUpdateProcessorFactory into updateRequestProcessorChain "uniq-fields"
   [junit4]   2> 1548318 T2522 oasup.UpdateRequestProcessorChain.init creating updateRequestProcessorChain "distrib-dup-test-chain-explicit"
   [junit4]   2> 1548319 T2522 oasup.UpdateRequestProcessorChain.init creating updateRequestProcessorChain "distrib-dup-test-chain-implicit"
   [junit4]   2> 1548319 T2522 oasup.UpdateRequestProcessorChain.init inserting DistributedUpdateProcessorFactory into updateRequestProcessorChain "distrib-dup-test-chain-implicit"
   [junit4]   2> 1548319 T2522 oasc.SolrCore.loadUpdateProcessorChains no updateRequestProcessorChain defined as default, creating implicit default
   [junit4]   2> 1548319 T2522 oasc.RequestHandlers.initHandlersFromConfig adding lazy requestHandler: solr.ReplicationHandler
   [junit4]   2> 1548319 T2522 oasc.RequestHandlers.initHandlersFromConfig created /replication: solr.ReplicationHandler
   [junit4]   2> 1548320 T2522 oasc.RequestHandlers.initHandlersFromConfig created standard: solr.StandardRequestHandler
   [junit4]   2> 1548320 T2522 oasc.RequestHandlers.initHandlersFromConfig created /get: solr.RealTimeGetHandler
   [junit4]   2> 1548321 T2522 oasc.RequestHandlers.initHandlersFromConfig created dismax: solr.SearchHandler
   [junit4]   2> 1548321 T2522 oasc.RequestHandlers.initHandlersFromConfig created mock: org.apache.solr.core.MockQuerySenderListenerReqHandler
   [junit4]   2> 1548321 T2522 oasc.RequestHandlers.initHandlersFromConfig created /admin/: org.apache.solr.handler.admin.AdminHandlers
   [junit4]   2> 1548322 T2522 oasc.RequestHandlers.initHandlersFromConfig created defaults: solr.StandardRequestHandler
   [junit4]   2> 1548322 T2522 oasc.RequestHandlers.initHandlersFromConfig adding lazy requestHandler: solr.StandardRequestHandler
   [junit4]   2> 1548322 T2522 oasc.RequestHandlers.initHandlersFromConfig created lazy: solr.StandardRequestHandler
   [junit4]   2> 1548322 T2522 oasc.RequestHandlers.initHandlersFromConfig created /update: solr.UpdateRequestHandler
   [junit4]   2> 1548323 T2522 oasc.RequestHandlers.initHandlersFromConfig created /terms: org.apache.solr.handler.component.SearchHandler
   [junit4]   2> 1548323 T2522 oasc.RequestHandlers.initHandlersFromConfig created spellCheckCompRH: org.apache.solr.handler.component.SearchHandler
   [junit4]   2> 1548323 T2522 oasc.RequestHandlers.initHandlersFromConfig created spellCheckCompRH_Direct: org.apache.solr.handler.component.SearchHandler
   [junit4]   2> 1548324 T2522 oasc.RequestHandlers.initHandlersFromConfig created spellCheckWithWordbreak: org.apache.solr.handler.component.SearchHandler
   [junit4]   2> 1548324 T2522 oasc.RequestHandlers.initHandlersFromConfig created spellCheckWithWordbreak_Direct: org.apache.solr.handler.component.SearchHandler
   [junit4]   2> 1548324 T2522 oasc.RequestHandlers.initHandlersFromConfig created spellCheckCompRH1: org.apache.solr.handler.component.SearchHandler
   [junit4]   2> 1548325 T2522 oasc.RequestHandlers.initHandlersFromConfig created mltrh: org.apache.solr.handler.component.SearchHandler
   [junit4]   2> 1548325 T2522 oasc.RequestHandlers.initHandlersFromConfig created tvrh: org.apache.solr.handler.component.SearchHandler
   [junit4]   2> 1548325 T2522 oasc.RequestHandlers.initHandlersFromConfig created /mlt: solr.MoreLikeThisHandler
   [junit4]   2> 1548326 T2522 oasc.RequestHandlers.initHandlersFromConfig created /debug/dump: solr.DumpRequestHandler
   [junit4]   2> 1548332 T2522 oashl.XMLLoader.init xsltCacheLifetimeSeconds=60
   [junit4]   2> 1548333 T2522 oasc.SolrCore.initDeprecatedSupport WARN solrconfig.xml uses deprecated <admin/gettableFiles>, Please update your config to use the ShowFileRequestHandler.
   [junit4]   2> 1548334 T2522 oasc.SolrCore.initDeprecatedSupport WARN adding ShowFileRequestHandler with hidden files: [THROW.ERROR.ON.ADD.UPDATEPROCESSOR.JS, SOLRCONFIG-HIGHLIGHT.XML, SCHEMA-REQUIRED-FIELDS.XML, SCHEMA-MINIMAL.XML, BAD-SCHEMA-DOCVALUES-NOT-REQUIRED-NO-DEFAULT.XML, TRIVIAL.UPDATEPROCESSOR1.JS, SCHEMA-REPLICATION2.XML, BAD-SCHEMA-DUP-DYNAMICFIELD.XML, SOLRCONFIG-CACHING.XML, BAD-SOLRCONFIG-UNEXPECTED-SCHEMA-ATTRIBUTE.XML, SCHEMA-POSTINGSHIGHLIGHT.XML, SOLRCONFIG-REPEATER.XML, REGEX-BOOST-PROCESSOR-TEST.TXT, BAD-SCHEMA-CURRENCY-FT-BOGUS-CODE-IN-XML.XML, CURRENCY.XML, BAD-SCHEMA-NONTEXT-ANALYZER.XML, SOLRCONFIG-MERGEPOLICY.XML, SOLRCONFIG-TLOG.XML, SOLRCONFIG-MASTER.XML, SOLRCONFIG-MERGEPOLICY-LEGACY.XML, SOLRCONFIG-COMPONENTS-NAME.XML, BAD-SCHEMA-UNIQUEKEY-MULTIVALUED.XML, SCHEMA11.XML, SOLRCONFIG-BASIC.XML, DA_COMPOUNDDICTIONARY.TXT, MISSLEADING.EXTENSION.UPDATEPROCESSOR.JS.TXT, SCHEMA-COPYFIELD-TEST.XML, SOLRCONFIG-SLAVE.XML, ELEVATE.XML, TRIVIAL.UPDATEPROCESSOR0.JS, SCHEMA-SWEETSPOT.XML, BAD-SOLRCONFIG-BOGUS-SCRIPTENGINE-NAME.XML, SCHEMA-CHARFILTERS.XML, SCHEMA-IB.XML, SOLRCONFIG-QUERYSENDER.XML, BAD-SCHEMA-MISPLACED-ASTERISK-COPYFIELD-SOURCE-SHOULD-FAIL-TEST.XML, SCHEMA-REPLICATION1.XML, DA_UTF8.XML, SOLRCONFIG-SNIPPET-PROCESSOR.XML, BAD-SOLRCONFIG-MULTIPLE-INDEXCONFIGS.XML, BAD-SCHEMA-NON-GLOB-COPYFIELD-SOURCE-MATCHING-NOTHING-SHOULD-FAIL-TEST.XML, CONDITIONAL.UPDATEPROCESSOR.JS, SCHEMA-TINY.XML, MISSING.FUNCTIONS.UPDATEPROCESSOR.JS, SOLRCONFIG-DEFAULTS.XML, HYPHENATION.DTD, BAD-SOLRCONFIG-SCHEMA-MUTABLE-BUT-NOT-MANAGED.XML, STEMDICT.TXT, SCHEMA-PHRASESUGGEST.XML, SCHEMA-ID-AND-VERSION-FIELDS-ONLY.XML, HUNSPELL-TEST.AFF, SCHEMA-ONE-FIELD-NO-DYNAMIC-FIELD-UNIQUE-KEY.XML, BAD-SCHEMA-CURRENCY-FT-OER-NORATES.XML, SCHEMA-SNIPPET-TYPE.XML, STOPTYPES-1.TXT, STOPWORDSWRONGENCODING.TXT, SCHEMA-NUMERIC.XML, SOLRCONFIG-TRANSFORMERS.XML, BAD-SCHEMA-NOT-INDEXED-BUT-TF.XML, SCHEMA-DOCVALUES.XML, SOLRCONFIG-INFOSTREAM-LOGGING.XML, WDFTYPES.TXT, STOPTYPES-2.TXT, SCHEMA-REVERSED.XML, BAD-SCHEMA-BOGUS-ANALYSIS-PARAMETERS.XML, BAD-SCHEMA-CURRENCY-FT-MULTIVALUED.XML, SOLRCONFIG-SPELLCHECKCOMPONENT.XML, BAD-SCHEMA-CURRENCY-MULTIVALUED.XML, SOLRCONFIG-PHRASESUGGEST.XML, SCHEMA-DFR.XML, BAD-SCHEMA-NOT-INDEXED-BUT-POS.XML, KEEP-1.TXT, SCHEMA-SPATIAL.XML, OPEN-EXCHANGE-RATES.JSON, STOPWITHBOM.TXT, SOLRCONFIG-SPELLCHECKER.XML, SCHEMA-BINARYFIELD.XML, SOLRCONFIG-POSTINGSHIGHLIGHT.XML, SOLRCONFIG-UPDATE-PROCESSOR-CHAINS.XML, SOLRCONFIG-WARMER.XML, SOLRCONFIG-TEST-MISC.XML, BAD-SCHEMA-OMIT-TF-BUT-NOT-POS.XML, BAD-SCHEMA-DUP-FIELDTYPE.XML, SCHEMA-XINCLUDE.XML, SOLRCONFIG-MASTER1.XML, BAD-SCHEMA-MULTIPLE-ASTERISK-COPYFIELD-SOURCE-SHOULD-FAIL-TEST.XML, SCHEMA-BEHAVIOR.XML, SYNONYMS.TXT, SOLRCONFIG-MINIMAL.XML, SCHEMA-DOCVALUESMULTI.XML, BAD-SCHEMA-UNSUPPORTED-DOCVALUES.XML, BAD-SCHEMA-CURRENCY-DYNAMIC-MULTIVALUED.XML, SCHEMA_CODEC.XML, SCHEMA-SNIPPET-TYPES.INCL, BAD-SCHEMA-SWEETSPOT-PARTIAL-HYPERBOLIC.XML, SOLRCONFIG-SOLR-749.XML, SOLRCONFIG-MASTER1-KEEPONEBACKUP.XML, SCHEMA-EFF.XML, SOLRCONFIG-FUNCTIONQUERY.XML, STOP-2.TXT, SCHEMA-LMDIRICHLET.XML, SOLRCONFIG-TERMINDEX.XML, SCHEMA-ONE-FIELD-NO-DYNAMIC-FIELD.XML, SOLRCONFIG-ELEVATE.XML, BAD-SCHEMA-SWEETSPOT-PARTIAL-NORMS.XML, BAD-SCHEMA-SWEETSPOT-PARTIAL-BASELINE.XML, SCHEMA-FOLDING.XML, STOPWORDS.TXT, SCHEMA-STOP-KEEP.XML, BAD-SCHEMA-BOGUS-FIELD-PARAMETERS.XML, FUZZYSUGGEST.TXT, BAD-SOLRCONFIG-MANAGED-SCHEMA-NAMED-SCHEMA.XML.XML, BAD-SCHEMA-NOT-INDEXED-BUT-NORMS.XML, SCHEMA-REST.XML, SOLRCONFIG-PARSING-UPDATE-PROCESSOR-CHAINS.XML, SOLRCONFIG-SOLCOREPROPERTIES.XML, STOP-1.TXT, SOLRCONFIG-MASTER2.XML, SOLRCONFIG-MANAGED-SCHEMA.XML, SOLRCONFIG-MERGEPOLICY-DEFAULTS.XML, SCHEMA-SPELLCHECKER.XML, SOLRCONFIG-RESPONSE-LOG-COMPONENT.XML, SOLRCONFIG-LAZYWRITER.XML, BAD-SCHEMA-MISPLACED-ASTERISK-COPYFIELD-DEST-SHOULD-FAIL-TEST.XML, SCHEMA-LUCENEMATCHVERSION.XML, SCHEMA-CLASS-NAME-SHORTENING-ON-SERIALIZATION.XML, FRENCHARTICLES.TXT, BAD-MP-SOLRCONFIG.XML, SCHEMA15.XML, SOLRCONFIG-REQHANDLER.INCL, SCHEMASURROUND.XML, SCHEMA-COLLATEFILTER.XML, SOLRCONFIG-MASTER3.XML, HUNSPELL-TEST.DIC, BAD-SCHEMA-MULTIPLE-ASTERISK-COPYFIELD-DEST-SHOULD-FAIL-TEST.XML, BAD-SCHEMA-CODEC-GLOBAL-VS-FT-MISMATCH.XML, SOLRCONFIG-XINCLUDE.XML, SOLRCONFIG-DELPOLICY1.XML, SOLRCONFIG-SLAVE1.XML, SCHEMA-SIM.XML, SCHEMA-SNIPPET-FIELD.XML, SCHEMA-COLLATE.XML, STOP-SNOWBALL.TXT, BAD-SCHEMA-SIM-GLOBAL-VS-FT-MISMATCH.XML, PROTWORDS.TXT, SOLRCONFIG-ADD-SCHEMA-FIELDS-UPDATE-PROCESSOR-CHAINS.XML, SCHEMA-TRIE.XML, SOLRCONFIG_CODEC.XML, SCHEMA-SYNONYM-TOKENIZER.XML, BAD-SOLRCONFIG-INVALID-SCRIPTFILE.XML, JASUGGEST.TXT, SCHEMA-REST-LUCENE-MATCH-VERSION.XML, BAD-SOLRCONFIG-MULTIPLE-CFS.XML, SCHEMA-DOCVALUESFACETING.XML, SCHEMA-ADD-SCHEMA-FIELDS-UPDATE-PROCESSOR.XML, SCHEMA-TFIDF.XML, SOLRCONFIG-SCRIPT-UPDATEPROCESSOR.XML, SCHEMA-LMJELINEKMERCER.XML, PHRASESUGGEST.TXT, BAD-SOLRCONFIG-MISSING-SCRIPTFILE.XML, SOLRCONFIG-BASIC-LUCENEVERSION31.XML, BAD-SCHEMA-UNIQUEKEY-USES-DEFAULT.XML, OLD_SYNONYMS.TXT, SOLRCONFIG-DELPOLICY2.XML, XSLT, BAD-SCHEMA-DUP-FIELD.XML, SOLRCONFIG-NOCACHE.XML, SCHEMA-BM25.XML, BAD-SCHEMA-SWEETSPOT-BOTH-TF.XML, ADDFIELDS.UPDATEPROCESSOR.JS, SOLRCONFIG-QUERYSENDER-NOQUERY.XML, SOLRCONFIG-ALTDIRECTORY.XML, COMPOUNDDICTIONARY.TXT, BAD-SCHEMA-CURRENCY-FT-BOGUS-DEFAULT-CODE.XML, SOLRCONFIG_PERF.XML, SOLRCONFIG-INDEXCONFIG.XML, BAD-CURRENCY.XML, BAD-SCHEMA-ANALYZER-CLASS-AND-NESTED.XML, SCHEMA-NOT-REQUIRED-UNIQUE-KEY.XML, KEEP-2.TXT, SCHEMA12.XML, BAD-SCHEMA-UNIQUEKEY-IS-COPYFIELD-DEST.XML, MAPPING-ISOLATIN1ACCENT.TXT, BAD_SOLRCONFIG.XML, SOLRCONFIG.SNIPPET.RANDOMINDEXCONFIG.XML, BAD-SCHEMA-EXTERNAL-FILEFIELD.XML]
   [junit4]   2> 1548336 T2522 oasu.CommitTracker.<init> Hard AutoCommit: disabled
   [junit4]   2> 1548337 T2522 oasu.CommitTracker.<init> Soft AutoCommit: disabled
   [junit4]   2> 1548337 T2522 oasu.RandomMergePolicy.<init> RandomMergePolicy wrapping class org.apache.lucene.index.LogDocMergePolicy: [LogDocMergePolicy: minMergeSize=1000, mergeFactor=27, maxMergeSize=9223372036854775807, maxMergeSizeForForcedMerge=9223372036854775807, calibrateSizeByDeletes=true, maxMergeDocs=2147483647, maxCFSSegmentSizeMB=8.796093022207999E12, noCFSRatio=0.25794562664311105]
   [junit4]   2> 1548338 T2522 oasc.SolrDeletionPolicy.onInit SolrDeletionPolicy.onInit: commits: num=1
   [junit4]   2> 		commit{dir=RateLimitedDirectoryWrapper(MockDirWrapper(RateLimitedDirectoryWrapper(org.apache.lucene.store.RAMDirectory@6f04f37b lockFactory=org.apache.lucene.store.SingleInstanceLockFactory@6f990cde))),segFN=segments_1,generation=1}
   [junit4]   2> 1548338 T2522 oasc.SolrDeletionPolicy.updateCommits newest commit generation = 1
   [junit4]   2> 1548338 T2522 oass.SolrIndexSearcher.<init> Opening Searcher@6566b4c7 main
   [junit4]   2> 1548338 T2522 oashc.SpellCheckComponent.inform Initializing spell checkers
   [junit4]   2> 1548344 T2522 oass.DirectSolrSpellChecker.init init: {name=direct,classname=DirectSolrSpellChecker,field=lowerfilt,minQueryLength=3}
   [junit4]   2> 1548394 T2523 oasc.SolrCore.registerSearcher [collection1] Registered new searcher Searcher@6566b4c7 main{StandardDirectoryReader(segments_1:1:nrt)}
   [junit4]   2> 1548397 T2522 oasc.CoreContainer.registerCore registering core: collection1
   [junit4]   2> 1548407 T2521 oas.SolrTestCaseJ4.initCore ####initCore end
   [junit4]   2> ASYNC  NEW_CORE C18284 name=collection1 org.apache.solr.core.SolrCore@112d1010
   [junit4]   2> 1548421 T2521 C18284 oasup.LogUpdateProcessor.finish [collection1] webapp=null path=null params={} {add=[0]} 0 1
   [junit4]   2> 1548441 T2521 C18284 oasup.LogUpdateProcessor.finish [collection1] webapp=null path=null params={} {add=[1]} 0 0
   [junit4]   2> 1548452 T2521 C18284 oasup.LogUpdateProcessor.finish [collection1] webapp=null path=null params={} {add=[2]} 0 1
   [junit4]   2> 1548464 T2521 C18284 oasup.LogUpdateProcessor.finish [collection1] webapp=null path=null params={} {add=[3]} 0 3
   [junit4]   2> 1548475 T2521 C18284 oasup.LogUpdateProcessor.finish [collection1] webapp=null path=null params={} {add=[4]} 0 1
   [junit4]   2> 1548485 T2521 C18284 oasup.LogUpdateProcessor.finish [collection1] webapp=null path=null params={} {add=[5]} 0 0
   [junit4]   2> 1548496 T2521 C18284 oasup.LogUpdateProcessor.finish [collection1] webapp=null path=null params={} {add=[6]} 0 1
   [junit4]   2> 1548506 T2521 C18284 oasu.DirectUpdateHandler2.commit start commit{,optimize=false,openSearcher=true,waitSearcher=true,expungeDeletes=false,softCommit=false,prepareCommit=false}
   [junit4]   2> 1548510 T2521 C18284 oasc.SolrDeletionPolicy.onCommit SolrDeletionPolicy.onCommit: commits: num=2
   [junit4]   2> 		commit{dir=RateLimitedDirectoryWrapper(MockDirWrapper(RateLimitedDirectoryWrapper(org.apache.lucene.store.RAMDirectory@6f04f37b lockFactory=org.apache.lucene.store.SingleInstanceLockFactory@6f990cde))),segFN=segments_1,generation=1}
   [junit4]   2> 		commit{dir=RateLimitedDirectoryWrapper(MockDirWrapper(RateLimitedDirectoryWrapper(org.apache.lucene.store.RAMDirectory@6f04f37b lockFactory=org.apache.lucene.store.SingleInstanceLockFactory@6f990cde))),segFN=segments_2,generation=2}
   [junit4]   2> 1548510 T2521 C18284 oasc.SolrDeletionPolicy.updateCommits newest commit generation = 2
   [junit4]   2> 1548511 T2521 C18284 oass.SolrIndexSearcher.<init> Opening Searcher@10b9c1bd main
   [junit4]   2> 1548512 T2521 C18284 oasu.DirectUpdateHandler2.commit end_commit_flush
   [junit4]   2> 1548513 T2523 oasc.SolrCore.registerSearcher [collection1] Registered new searcher Searcher@10b9c1bd main{StandardDirectoryReader(segments_2:5:nrt _0(4.5):c4 _1(4.5):c3)}
   [junit4]   2> 1548514 T2521 C18284 oasup.LogUpdateProcessor.finish [collection1] webapp=null path=null params={} {commit=} 0 8
   [junit4]   2> 1548525 T2521 C18284 oasup.LogUpdateProcessor.finish [collection1] webapp=null path=null params={} {add=[7]} 0 1
   [junit4]   2> 1548535 T2521 C18284 oasup.LogUpdateProcessor.finish [collection1] webapp=null path=null params={} {add=[8]} 0 1
   [junit4]   2> 1548545 T2521 C18284 oasup.LogUpdateProcessor.finish [collection1] webapp=null path=null params={} {add=[9]} 0 0
   [junit4]   2> 1548557 T2521 C18284 oasup.LogUpdateProcessor.finish [collection1] webapp=null path=null params={} {add=[10]} 0 2
   [junit4]   2> 1548568 T2521 C18284 oasup.LogUpdateProcessor.finish [collection1] webapp=null path=null params={} {add=[11]} 0 1
   [junit4]   2> 1548578 T2521 C18284 oasup.LogUpdateProcessor.finish [collection1] webapp=null path=null params={} {add=[12]} 0 0
   [junit4]   2> 1548588 T2521 C18284 oasup.LogUpdateProcessor.finish [collection1] webapp=null path=null params={} {add=[13]} 0 0
   [junit4]   2> 1548600 T2521 C18284 oasup.LogUpdateProcessor.finish [collection1] webapp=null path=null params={} {add=[14]} 0 2
   [junit4]   2> 1548611 T2521 C18284 oasup.LogUpdateProcessor.finish [collection1] webapp=null path=null params={} {add=[15]} 0 1
   [junit4]   2> 1548621 T2521 C18284 oasup.LogUpdateProcessor.finish [collection1] webapp=null path=null params={} {add=[16]} 0 0
   [junit4]   2> 1548632 T2521 C18284 oasup.LogUpdateProcessor.finish [collection1] webapp=null path=null params={} {add=[17]} 0 1
   [junit4]   2> 1548644 T2521 C18284 oasup.LogUpdateProcessor.finish [collection1] webapp=null path=null params={} {add=[18]} 0 3
   [junit4]   2> 1548654 T2521 C18284 oasup.LogUpdateProcessor.finish [collection1] webapp=null path=null params={} {add=[19]} 0 0
   [junit4]   2> 1548664 T2521 C18284 oasup.LogUpdateProcessor.finish [collection1] webapp=null path=null params={} {add=[20]} 0 0
   [junit4]   2> 1548674 T2521 C18284 oasu.DirectUpdateHandler2.commit start commit{,optimize=false,openSearcher=true,waitSearcher=true,expungeDeletes=false,softCommit=false,prepareCommit=false}
   [junit4]   2> 1548680 T2521 C18284 oasc.SolrDeletionPolicy.onCommit SolrDeletionPolicy.onCommit: commits: num=2
   [junit4]   2> 		commit{dir=RateLimitedDirectoryWrapper(MockDirWrapper(RateLimitedDirectoryWrapper(org.apache.lucene.store.RAMDirectory@6f04f37b lockFactory=org.apache.lucene.store.SingleInstanceLockFactory@6f990cde))),segFN=segments_2,generation=2}
   [junit4]   2> 		commit{dir=RateLimitedDirectoryWrapper(MockDirWrapper(RateLimitedDirectoryWrapper(org.apache.lucene.store.RAMDirectory@6f04f37b lockFactory=org.apache.lucene.store.SingleInstanceLockFactory@6f990cde))),segFN=segments_3,generation=3}
   [junit4]   2> 1548681 T2521 C18284 oasc.SolrDeletionPolicy.updateCommits newest commit generation = 3
   [junit4]   2> 1548682 T2521 C18284 oass.SolrIndexSearcher.<init> Opening Searcher@50e45833 main
   [junit4]   2> 1548683 T2521 C18284 oasu.DirectUpdateHandler2.commit end_commit_flush
   [junit4]   2> 1548685 T2523 oasc.SolrCore.registerSearcher [collection1] Registered new searcher Searcher@50e45833 main{StandardDirectoryReader(segments_3:13:nrt _0(4.5):c4 _1(4.5):c3 _2(4.5):c4 _3(4.5):c4 _4(4.5):c4 _5(4.5):c2)}
   [junit4]   2> 1548685 T2521 C18284 oasup.LogUpdateProcessor.finish [collection1] webapp=null path=null params={} {commit=} 0 11
   [junit4]   2> 1548695 T2521 C18284 oasu.DirectUpdateHandler2.commit start commit{,optimize=false,openSearcher=true,waitSearcher=true,expungeDeletes=false,softCommit=false,prepareCommit=false}
   [junit4]   2> 1548696 T2521 C18284 oasu.DirectUpdateHandler2.commit No uncommitted changes. Skipping IW.commit.
   [junit4]   2> 1548696 T2521 C18284 oass.SolrIndexSearcher.<init> Opening Searcher@5838840c main
   [junit4]   2> 1548697 T2521 C18284 oasu.DirectUpdateHandler2.commit end_commit_flush
   [junit4]   2> 1548699 T2523 oasc.SolrCore.registerSearcher [collection1] Registered new searcher Searcher@5838840c main{StandardDirectoryReader(segments_3:13:nrt _0(4.5):c4 _1(4.5):c3 _2(4.5):c4 _3(4.5):c4 _4(4.5):c4 _5(4.5):c2)}
   [junit4]   2> 1548699 T2521 C18284 oasup.LogUpdateProcessor.finish [collection1] webapp=null path=null params={} {commit=} 0 4
   [junit4]   2> 1548710 T2521 C18284 oasup.LogUpdateProcessor.finish [collection1] webapp=null path=null params={} {add=[21]} 0 1
   [junit4]   2> 1548720 T2521 C18284 oasup.LogUpdateProcessor.finish [collection1] webapp=null path=null params={} {add=[22]} 0 1
   [junit4]   2> 1548730 T2521 C18284 oasup.LogUpdateProcessor.finish [collection1] webapp=null path=null params={} {add=[23]} 0 0
   [junit4]   2> 1548743 T2521 C18284 oasup.LogUpdateProcessor.finish [collection1] webapp=null path=null params={} {add=[24]} 0 3
   [junit4]   2> 1548753 T2521 C18284 oasup.LogUpdateProcessor.finish [collection1] webapp=null path=null params={} {add=[25]} 0 0
   [junit4]   2> 1548763 T2521 C18284 oasup.LogUpdateProcessor.finish [collection1] webapp=null path=null params={} {add=[26]} 0 0
   [junit4]   2> 1548774 T2521 C18284 oasup.LogUpdateProcessor.finish [collection1] webapp=null path=null params={} {add=[27]} 0 1
   [junit4]   2> 1548784 T2521 C18284 oasu.DirectUpdateHandler2.commit start commit{,optimize=false,openSearcher=true,waitSearcher=true,expungeDeletes=false,softCommit=false,prepareCommit=false}
   [junit4]   2> ASYNC  NEW_CORE C18285 name=collection1 org.apache.solr.core.SolrCore@112d1010
   [junit4]   2> 1548794 T2521 C18285 oasc.SolrDeletionPolicy.onCommit SolrDeletionPolicy.onCommit: commits: num=2
   [junit4]   2> 		commit{dir=RateLimitedDirectoryWrapper(MockDirWrapper(RateLimitedDirectoryWrapper(org.apache.lucene.store.RAMDirectory@6f04f37b lockFactory=org.apache.lucene.store.SingleInstanceLockFactory@6f990cde))),segFN=segments_3,generation=3}
   [junit4]   2> 		commit{dir=RateLimitedDirectoryWrapper(MockDirWrapper(RateLimitedDirectoryWrapper(org.apache.lucene.store.RAMDirectory@6f04f37b lockFactory=org.apache.lucene.store.SingleInstanceLockFactory@6f990cde))),segFN=segments_4,generation=4}
   [junit4]   2> 1548795 T2521 C18285 oasc.SolrDeletionPolicy.updateCommits newest commit generation = 4
   [junit4]   2> 1548796 T2521 C18285 oass.SolrIndexSearcher.<init> Opening Searcher@3aca7a3d main
   [junit4]   2> 1548797 T2521 C18285 oasu.DirectUpdateHandler2.commit end_commit_flush
   [junit4]   2> 1548799 T2523 oasc.SolrCore.registerSearcher [collection1] Registered new searcher Searcher@3aca7a3d main{StandardDirectoryReader(segments_4:17:nrt _0(4.5):c4 _1(4.5):c3 _2(4.5):c4 _3(4.5):c4 _4(4.5):c4 _5(4.5):c2 _6(4.5):c4 _7(4.5):c3)}
   [junit4]   2> 1548800 T2521 C18285 oasup.LogUpdateProcessor.finish [collection1] webapp=null path=null params={} {commit=} 0 16
   [junit4]   2> 1548811 T2521 C18285 oasup.LogUpdateProcessor.finish [collection1] webapp=null path=null params={} {add=[28]} 0 0
   [junit4]   2> 1548822 T2521 C18285 oasup.LogUpdateProcessor.finish [collection1] webapp=null path=null params={} {add=[29]} 0 0
   [junit4]   2> 1548832 T2521 C18285 oasup.LogUpdateProcessor.finish [collection1] webapp=null path=null params={} {add=[30]} 0 0
   [junit4]   2> 1548845 T2521 C18285 oasup.LogUpdateProcessor.finish [collection1] webapp=null path=null params={} {add=[31]} 0 3
   [junit4]   2> 1548855 T2521 C18285 oasup.LogUpdateProcessor.finish [collection1] webapp=null path=null params={} {add=[32]} 0 0
   [junit4]   2> 1548865 T2521 C18285 oasup.LogUpdateProcessor.finish [collection1] webapp=null path=null params={} {add=[33]} 0 0
   [junit4]   2> 1548876 T2521 C18285 oasup.LogUpdateProcessor.finish [collection1] webapp=null path=null params={} {add=[34]} 0 1
   [junit4]   2> 1548885 T2521 C18285 oasu.DirectUpdateHandler2.commit start commit{,optimize=false,openSearcher=true,waitSearcher=true,expungeDeletes=false,softCommit=false,prepareCommit=false}
   [junit4]   2> 1548890 T2521 C18285 oasc.SolrDeletionPolicy.onCommit SolrDeletionPolicy.onCommit: commits: num=2
   [junit4]   2> 		commit{dir=RateLimitedDirectoryWrapper(MockDirWrapper(RateLimitedDirectoryWrapper(org.apache.lucene.store.RAMDirectory@6f04f37b lockFactory=org.apache.lucene.store.SingleInstanceLockFactory@6f990cde))),segFN=segments_4,generation=4}
   [junit4]   2> 		commit{dir=RateLimitedDirectoryWrapper(MockDirWrapper(RateLimitedDirectoryWrapper(org.apache.lucene.store.RAMDirectory@6f04f37b lockFactory=org.apache.lucene.store.SingleInstanceLockFactory@6f990cde))),segFN=segments_5,generation=5}
   [junit4]   2> 1548890 T2521 C18285 oasc.SolrDeletionPolicy.updateCommits newest commit generation = 5
   [junit4]   2> 1548891 T2521 C18285 oass.SolrIndexSearcher.<init> Opening Searcher@6fd1fe4a main
   [junit4]   2> 1548892 T2521 C18285 oasu.DirectUpdateHandler2.commit end_commit_flush
   [junit4]   2> 1548894 T2523 oasc.SolrCore.registerSearcher [collection1] Registered new searcher Searcher@6fd1fe4a main{StandardDirectoryReader(segments_5:21:nrt _0(4.5):c4 _1(4.5):c3 _2(4.5):c4 _3(4.5):c4 _4(4.5):c4 _5(4.5):c2 _6(4.5):c4 _7(4.5):c3 _8(4.5):c4 _9(4.5):c3)}
   [junit4]   2> 1548895 T2521 C18285 oasup.LogUpdateProcessor.finish [collection1] webapp=null path=null params={} {commit=} 0 10
   [junit4]   2> 1548905 T2521 C18285 oasu.DirectUpdateHandler2.commit start commit{,optimize=false,openSearcher=true,waitSearcher=true,expungeDeletes=false,softCommit=false,prepareCommit=false}
   [junit4]   2> 1548905 T2521 C18285 oasu.DirectUpdateHandler2.commit No uncommitted changes. Skipping IW.commit.
   [junit4]   2> 1548906 T2521 C18285 oass.SolrIndexSearcher.<init> Opening Searcher@18de8e06 main
   [junit4]   2> 1548906 T2521 C18285 oasu.DirectUpdateHandler2.commit end_commit_flush
   [junit4]   2> 1548908 T2523 oasc.SolrCore.registerSearcher [collection1] Registered new searcher Searcher@18de8e06 main{StandardDirectoryReader(segments_5:21:nrt _0(4.5):c4 _1(4.5):c3 _2(4.5):c4 _3(4.5):c4 _4(4.5):c4 _5(4.5):c2 _6(4.5):c4 _7(4.5):c3 _8(4.5):c4 _9(4.5):c3)}
   [junit4]   2> 1548908 T2521 C18285 oasup.LogUpdateProcessor.finish [collection1] webapp=null path=null params={} {commit=} 0 3
   [junit4]   2> 1548919 T2521 C18285 oasup.LogUpdateProcessor.finish [collection1] webapp=null path=null params={} {add=[35]} 0 1
   [junit4]   2> 1548929 T2521 C18285 oasup.LogUpdateProcessor.finish [collection1] webapp=null path=null params={} {add=[36]} 0 0
   [junit4]   2> 1548939 T2521 C18285 oasup.LogUpdateProcessor.finish [collection1] webapp=null path=null params={} {add=[37]} 0 0
   [junit4]   2> 1548952 T2521 C18285 oasup.LogUpdateProcessor.finish [collection1] webapp=null path=null params={} {add=[38]} 0 3
   [junit4]   2> 1548962 T2521 C18285 oasup.LogUpdateProcessor.finish [collection1] webapp=null path=null params={} {add=[39]} 0 0
   [junit4]   2> 1548973 T2521 C18285 oasup.LogUpdateProcessor.finish [collection1] webapp=null path=null params={} {add=[40]} 0 1
   [junit4]   2> 1548983 T2521 C18285 oasup.LogUpdateProcessor.finish [collection1] webapp=null path=null params={} {add=[41]} 0 0
   [junit4]   2> 1548993 T2521 C18285 oasu.DirectUpdateHandler2.commit start commit{,optimize=false,openSearcher=true,waitSearcher=true,expungeDeletes=false,softCommit=false,prepareCommit=false}
   [junit4]   2> 1548997 T2521 C18285 oasc.SolrDeletionPolicy.onCommit SolrDeletionPolicy.onCommit: commits: num=2
   [junit4]   2> 		commit{dir=RateLimitedDirectoryWrapper(MockDirWrapper(RateLimitedDirectoryWrapper(org.apache.lucene.store.RAMDirectory@6f04f37b lockFactory=org.apache.lucene.store.SingleInstanceLockFactory@6f990cde))),segFN=segments_5,generation=5}
   [junit4]   2> 		commit{dir=RateLimitedDirectoryWrapper(MockDirWrapper(RateLimitedDirectoryWrapper(org.apache.lucene.store.RAMDirectory@6f04f37b lockFactory=org.apache.lucene.store.SingleInstanceLockFactory@6f990cde))),segFN=segments_6,generation=6}
   [junit4]   2> 1548998 T2521 C18285 oasc.SolrDeletionPolicy.updateCommits newest commit generation = 6
   [junit4]   2> 1548999 T2521 C18285 oass.SolrIndexSearcher.<init> Opening Searcher@4d06c424 main
   [junit4]   2> 1549000 T2521 C18285 oasu.DirectUpdateHandler2.commit end_commit_flush
   [junit4]   2> 1549001 T2523 oasc.SolrCore.registerSearcher [collection1] Registered new searcher Searcher@4d06c424 main{StandardDirectoryReader(segments_6:25:nrt _0(4.5):c4 _1(4.5):c3 _2(4.5):c4 _3(4.5):c4 _4(4.5):c4 _5(4.5):c2 _6(4.5):c4 _7(4.5):c3 _8(4.5):c4 _9(4.5):c3 _a(4.5):c4 _b(4.5):c3)}
   [junit4]   2> 1549002 T2521 C18285 oasup.LogUpdateProcessor.finish [collection1] webapp=null path=null params={} {commit=} 0 9
   [junit4]   2> 1549012 T2521 C18285 oasu.DirectUpdateHandler2.commit start commit{,optimize=false,openSearcher=true,waitSearcher=true,expungeDeletes=false,softCommit=false,prepareCommit=false}
   [junit4]   2> 1549012 T2521 C18285 oasu.DirectUpdateHandler2.commit No uncommitted changes. Skipping IW.commit.
   [junit4]   2> 1549013 T2521 C18285 oass.SolrIndexSearcher.<init> Opening Searcher@4c089130 main
   [junit4]   2> 1549013 T2521 C18285 oasu.DirectUpdateHandler2.commit end_commit_flush
   [junit4]   2> 1549015 T2523 oasc.SolrCore.registerSearcher [collection1] Registered new searcher Searcher@4c089130 main{StandardDirectoryReader(segments_6:25:nrt _0(4.5):c4 _1(4.5):c3 _2(4.5):c4 _3(4.5):c4 _4(4.5):c4 _5(4.5):c2 _6(4.5):c4 _7(4.5):c3 _8(4.5):c4 _9(4.5):c3 _a(4.5):c4 _b(4.5):c3)}
   [junit4]   2> 1549016 T2521 C18285 oasup.LogUpdateProcessor.finish [collection1] webapp=null path=null params={} {commit=} 0 4
   [junit4]   2> 1549026 T2521 C18285 oasu.DirectUpdateHandler2.commit start commit{,optimize=false,openSearcher=true,waitSearcher=true,expungeDeletes=false,softCommit=false,prepareCommit=false}
   [junit4]   2> 1549026 T2521 C18285 oasu.DirectUpdateHandler2.commit No uncommitted changes. Skipping IW.commit.
   [junit4]   2> 1549027 T2521 C18285 oass.SolrIndexSearcher.<init> Opening Searcher@6d15e1ab main
   [junit4]   2> 1549027 T2521 C18285 oasu.DirectUpdateHandler2.commit end_commit_flush
   [junit4]   2> 1549029 T2523 oasc.SolrCore.registerSearcher [collection1] Registered new searcher Searcher@6d15e1ab main{StandardDirectoryReader(segments_6:25:nrt _0(4.5):c4 _1(4.5):c3 _2(4.5):c4 _3(4.5):c4 _4(4.5):c4 _5(4.5):c2 _6(4.5):c4 _7(4.5):c3 _8(4.5):c4 _9(4.5):c3 _a(4.5):c4 _b(4.5):c3)}
   [junit4]   2> 1549030 T2521 C18285 oasup.LogUpdateProcessor.finish [collection1] webapp=null path=null params={} {commit=} 0 4
   [junit4]   2> 1549032 T2521 C18285 oasc.SolrCore.execute [collection1] webapp=null path=null params={q=*:*} hits=42 status=0 QTime=1 
   [junit4]   2> 1549040 T2521 oas.SolrTestCaseJ4.setUp ###Starting nullInit
   [junit4]   2> 1549041 T2521 oas.SolrTestCaseJ4.tearDown ###Ending nullInit
   [junit4]   2> 1549046 T2521 oas.SolrTestCaseJ4.setUp ###Starting testIntersectBqBjq
   [junit4]   2> 1549101 T2521 C18285 oasc.SolrCore.execute [collection1] webapp=null path=null params={q=%2Bparent_s:(e+b)+%2B_query_:"{!parent+which%3D$pq+v%3D$chq}"&pq=parent_s:[*+TO+*]&chq=child_s:l} hits=1 status=0 QTime=54 
   [junit4]   2> 1549103 T2521 oas.SolrTestCaseJ4.assertQ ERROR REQUEST FAILED: xpath=//*[@numFound='2']
   [junit4]   2> 		xml response was: <?xml version="1.0" encoding="UTF-8"?>
   [junit4]   2> 	<response>
   [junit4]   2> 	<lst name="responseHeader"><int name="status">0</int><int name="QTime">54</int></lst><result name="response" numFound="1" start="0"><doc><arr name="parent_s"><str>e</str></arr><str name="id">27</str></doc></result>
   [junit4]   2> 	</response>
   [junit4]   2> 	
   [junit4]   2> 		request was:q=%2Bparent_s:(e+b)+%2B_query_:"{!parent+which%3D$pq+v%3D$chq}"&pq=parent_s:[*+TO+*]&chq=child_s:l
   [junit4]   2> 1549104 T2521 oasc.SolrException.log ERROR REQUEST FAILED: q=%2Bparent_s:(e+b)+%2B_query_:"{!parent+which%3D$pq+v%3D$chq}"&pq=parent_s:[*+TO+*]&chq=child_s:l:java.lang.RuntimeException: REQUEST FAILED: xpath=//*[@numFound='2']
   [junit4]   2> 		xml response was: <?xml version="1.0" encoding="UTF-8"?>
   [junit4]   2> 	<response>
   [junit4]   2> 	<lst name="responseHeader"><int name="status">0</int><int name="QTime">54</int></lst><result name="response" numFound="1" start="0"><doc><arr name="parent_s"><str>e</str></arr><str name="id">27</str></doc></result>
   [junit4]   2> 	</response>
   [junit4]   2> 	
   [junit4]   2> 		request was:q=%2Bparent_s:(e+b)+%2B_query_:"{!parent+which%3D$pq+v%3D$chq}"&pq=parent_s:[*+TO+*]&chq=child_s:l
   [junit4]   2> 		at org.apache.solr.SolrTestCaseJ4.assertQ(SolrTestCaseJ4.java:629)
   [junit4]   2> 		at org.apache.solr.SolrTestCaseJ4.assertQ(SolrTestCaseJ4.java:603)
   [junit4]   2> 		at org.apache.solr.search.join.BJQParserTest.testIntersectBqBjq(BJQParserTest.java:149)
   [junit4]   2> 		at sun.reflect.NativeMethodAccessorImpl.invoke0(Native Method)
   [junit4]   2> 		at sun.reflect.NativeMethodAccessorImpl.invoke(NativeMethodAccessorImpl.java:57)
   [junit4]   2> 		at sun.reflect.DelegatingMethodAccessorImpl.invoke(DelegatingMethodAccessorImpl.java:43)
   [junit4]   2> 		at java.lang.reflect.Method.invoke(Method.java:616)
   [junit4]   2> 		at com.carrotsearch.randomizedtesting.RandomizedRunner.invoke(RandomizedRunner.java:1559)
   [junit4]   2> 		at com.carrotsearch.randomizedtesting.RandomizedRunner.access$600(RandomizedRunner.java:79)
   [junit4]   2> 		at com.carrotsearch.randomizedtesting.RandomizedRunner$6.evaluate(RandomizedRunner.java:737)
   [junit4]   2> 		at com.carrotsearch.randomizedtesting.RandomizedRunner$7.evaluate(RandomizedRunner.java:773)
   [junit4]   2> 		at com.carrotsearch.randomizedtesting.RandomizedRunner$8.evaluate(RandomizedRunner.java:787)
   [junit4]   2> 		at com.carrotsearch.randomizedtesting.rules.SystemPropertiesRestoreRule$1.evaluate(SystemPropertiesRestoreRule.java:53)
   [junit4]   2> 		at org.apache.lucene.util.TestRuleSetupTeardownChained$1.evaluate(TestRuleSetupTeardownChained.java:50)
   [junit4]   2> 		at org.apache.lucene.util.TestRuleFieldCacheSanity$1.evaluate(TestRuleFieldCacheSanity.java:51)
   [junit4]   2> 		at org.apache.lucene.util.AbstractBeforeAfterRule$1.evaluate(AbstractBeforeAfterRule.java:46)
   [junit4]   2> 		at com.carrotsearch.randomizedtesting.rules.SystemPropertiesInvariantRule$1.evaluate(SystemPropertiesInvariantRule.java:55)
   [junit4]   2> 		at org.apache.lucene.util.TestRuleThreadAndTestName$1.evaluate(TestRuleThreadAndTestName.java:49)
   [junit4]   2> 		at org.apache.lucene.util.TestRuleIgnoreAfterMaxFailures$1.evaluate(TestRuleIgnoreAfterMaxFailures.java:70)
   [junit4]   2> 		at org.apache.lucene.util.TestRuleMarkFailure$1.evaluate(TestRuleMarkFailure.java:48)
   [junit4]   2> 		at com.carrotsearch.randomizedtesting.rules.StatementAdapter.evaluate(StatementAdapter.java:36)
   [junit4]   2> 		at com.carrotsearch.randomizedtesting.ThreadLeakControl$StatementRunner.run(ThreadLeakControl.java:358)
   [junit4]   2> 		at com.carrotsearch.randomizedtesting.ThreadLeakControl.forkTimeoutingTask(ThreadLeakControl.java:782)
   [junit4]   2> 		at com.carrotsearch.randomizedtesting.ThreadLeakControl$3.evaluate(ThreadLeakControl.java:442)
   [junit4]   2> 		at com.carrotsearch.randomizedtesting.RandomizedRunner.runSingleTest(RandomizedRunner.java:746)
   [junit4]   2> 		at com.carrotsearch.randomizedtesting.RandomizedRunner$3.evaluate(RandomizedRunner.java:648)
   [junit4]   2> 		at com.carrotsearch.randomizedtesting.RandomizedRunner$4.evaluate(RandomizedRunner.java:682)
   [junit4]   2> 		at com.carrotsearch.randomizedtesting.RandomizedRunner$5.evaluate(RandomizedRunner.java:693)
   [junit4]   2> 		at com.carrotsearch.randomizedtesting.rules.StatementAdapter.evaluate(StatementAdapter.java:36)
   [junit4]   2> 		at com.carrotsearch.randomizedtesting.rules.SystemPropertiesRestoreRule$1.evaluate(SystemPropertiesRestoreRule.java:53)
   [junit4]   2> 		at org.apache.lucene.util.AbstractBeforeAfterRule$1.evaluate(AbstractBeforeAfterRule.java:46)
   [junit4]   2> 		at org.apache.lucene.util.TestRuleStoreClassName$1.evaluate(TestRuleStoreClassName.java:42)
   [junit4]   2> 		at com.carrotsearch.randomizedtesting.rules.SystemPropertiesInvariantRule$1.evaluate(SystemPropertiesInvariantRule.java:55)
   [junit4]   2> 		at com.carrotsearch.randomizedtesting.rules.NoShadowingOrOverridesOnMethodsRule$1.evaluate(NoShadowingOrOverridesOnMethodsRule.java:39)
   [junit4]   2> 		at com.carrotsearch.randomizedtesting.rules.NoShadowingOrOverridesOnMethodsRule$1.evaluate(NoShadowingOrOverridesOnMethodsRule.java:39)
   [junit4]   2> 		at com.carrotsearch.randomizedtesting.rules.StatementAdapter.evaluate(StatementAdapter.java:36)
   [junit4]   2> 		at org.apache.lucene.util.TestRuleAssertionsRequired$1.evaluate(TestRuleAssertionsRequired.java:43)
   [junit4]   2> 		at org.apache.lucene.util.TestRuleMarkFailure$1.evaluate(TestRuleMarkFailure.java:48)
   [junit4]   2> 		at org.apache.lucene.util.TestRuleIgnoreAfterMaxFailures$1.evaluate(TestRuleIgnoreAfterMaxFailures.java:70)
   [junit4]   2> 		at org.apache.lucene.util.TestRuleIgnoreTestSuites$1.evaluate(TestRuleIgnoreTestSuites.java:55)
   [junit4]   2> 		at com.carrotsearch.randomizedtesting.rules.StatementAdapter.evaluate(StatementAdapter.java:36)
   [junit4]   2> 		at com.carrotsearch.randomizedtesting.ThreadLeakControl$StatementRunner.run(ThreadLeakControl.java:358)
   [junit4]   2> 		at java.lang.Thread.run(Thread.java:679)
   [junit4]   2> 	
   [junit4]   2> 1549105 T2521 oas.SolrTestCaseJ4.tearDown ###Ending testIntersectBqBjq
   [junit4]   2> NOTE: download the large Jenkins line-docs file by running 'ant get-jenkins-line-docs' in the lucene directory.
   [junit4]   2> NOTE: reproduce with: ant test  -Dtestcase=BJQParserTest -Dtests.method=testIntersectBqBjq -Dtests.seed=FEB2479FD4A26817 -Dtests.multiplier=2 -Dtests.nightly=true -Dtests.slow=true -Dtests.linedocsfile=/home/hudson/lucene-data/enwiki.random.lines.txt -Dtests.locale=lt -Dtests.timezone=Asia/Pontianak -Dtests.file.encoding=US-ASCII
   [junit4] ERROR   0.07s J1 | BJQParserTest.testIntersectBqBjq <<<
   [junit4]    > Throwable #1: java.lang.RuntimeException: Exception during query
   [junit4]    > 	at __randomizedtesting.SeedInfo.seed([FEB2479FD4A26817:804EB6071E172156]:0)
   [junit4]    > 	at org.apache.solr.SolrTestCaseJ4.assertQ(SolrTestCaseJ4.java:636)
   [junit4]    > 	at org.apache.solr.SolrTestCaseJ4.assertQ(SolrTestCaseJ4.java:603)
   [junit4]    > 	at org.apache.solr.search.join.BJQParserTest.testIntersectBqBjq(BJQParserTest.java:149)
   [junit4]    > 	at java.lang.Thread.run(Thread.java:679)
   [junit4]    > Caused by: java.lang.RuntimeException: REQUEST FAILED: xpath=//*[@numFound='2']
   [junit4]    > 	xml response was: <?xml version="1.0" encoding="UTF-8"?>
   [junit4]    > <response>
   [junit4]    > <lst name="responseHeader"><int name="status">0</int><int name="QTime">54</int></lst><result name="response" numFound="1" start="0"><doc><arr name="parent_s"><str>e</str></arr><str name="id">27</str></doc></result>
   [junit4]    > </response>
   [junit4]    > 	request was:q=%2Bparent_s:(e+b)+%2B_query_:"{!parent+which%3D$pq+v%3D$chq}"&pq=parent_s:[*+TO+*]&chq=child_s:l
   [junit4]    > 	at org.apache.solr.SolrTestCaseJ4.assertQ(SolrTestCaseJ4.java:629)
   [junit4]    > 	... 42 more
   [junit4]   2> 1549119 T2521 oas.SolrTestCaseJ4.setUp ###Starting testIntersectParentBqChildBq
   [junit4]   2> 1549120 T2521 C18285 oasc.SolrCore.execute [collection1] webapp=null path=null params={q=%2Bparent_s:(a+e+b)+%2B_query_:"{!parent+which%3D$pq+v%3D$chq}"&pq=parent_s:[*+TO+*]&chq=parentchild_s:(bm+ek+cl)} hits=1 status=0 QTime=1 
   [junit4]   2> 1549122 T2521 oas.SolrTestCaseJ4.assertQ ERROR REQUEST FAILED: xpath=//*[@numFound='2']
   [junit4]   2> 		xml response was: <?xml version="1.0" encoding="UTF-8"?>
   [junit4]   2> 	<response>
   [junit4]   2> 	<lst name="responseHeader"><int name="status">0</int><int name="QTime">1</int></lst><result name="response" numFound="1" start="0"><doc><arr name="parent_s"><str>b</str></arr><str name="id">34</str></doc></result>
   [junit4]   2> 	</response>
   [junit4]   2> 	
   [junit4]   2> 		request was:q=%2Bparent_s:(a+e+b)+%2B_query_:"{!parent+which%3D$pq+v%3D$chq}"&pq=parent_s:[*+TO+*]&chq=parentchild_s:(bm+ek+cl)
   [junit4]   2> 1549123 T2521 oasc.SolrException.log ERROR REQUEST FAILED: q=%2Bparent_s:(a+e+b)+%2B_query_:"{!parent+which%3D$pq+v%3D$chq}"&pq=parent_s:[*+TO+*]&chq=parentchild_s:(bm+ek+cl):java.lang.RuntimeException: REQUEST FAILED: xpath=//*[@numFound='2']
   [junit4]   2> 		xml response was: <?xml version="1.0" encoding="UTF-8"?>
   [junit4]   2> 	<response>
   [junit4]   2> 	<lst name="responseHeader"><int name="status">0</int><int name="QTime">1</int></lst><result name="response" numFound="1" start="0"><doc><arr name="parent_s"><str>b</str></arr><str name="id">34</str></doc></result>
   [junit4]   2> 	</response>
   [junit4]   2> 	
   [junit4]   2> 		request was:q=%2Bparent_s:(a+e+b)+%2B_query_:"{!parent+which%3D$pq+v%3D$chq}"&pq=parent_s:[*+TO+*]&chq=parentchild_s:(bm+ek+cl)
   [junit4]   2> 		at org.apache.solr.SolrTestCaseJ4.assertQ(SolrTestCaseJ4.java:629)
   [junit4]   2> 		at org.apache.solr.SolrTestCaseJ4.assertQ(SolrTestCaseJ4.java:603)
   [junit4]   2> 		at org.apache.solr.search.join.BJQParserTest.testIntersectParentBqChildBq(BJQParserTest.java:180)
   [junit4]   2> 		at sun.reflect.NativeMethodAccessorImpl.invoke0(Native Method)
   [junit4]   2> 		at sun.reflect.NativeMethodAccessorImpl.invoke(NativeMethodAccessorImpl.java:57)
   [junit4]   2> 		at sun.reflect.DelegatingMethodAccessorImpl.invoke(DelegatingMethodAccessorImpl.java:43)
   [junit4]   2> 		at java.lang.reflect.Method.invoke(Method.java:616)
   [junit4]   2> 		at com.carrotsearch.randomizedtesting.RandomizedRunner.invoke(RandomizedRunner.java:1559)
   [junit4]   2> 		at com.carrotsearch.randomizedtesting.RandomizedRunner.access$600(RandomizedRunner.java:79)
   [junit4]   2> 		at com.carrotsearch.randomizedtesting.RandomizedRunner$6.evaluate(RandomizedRunner.java:737)
   [junit4]   2> 		at com.carrotsearch.randomizedtesting.RandomizedRunner$7.evaluate(RandomizedRunner.java:773)
   [junit4]   2> 		at com.carrotsearch.randomizedtesting.RandomizedRunner$8.evaluate(RandomizedRunner.java:787)
   [junit4]   2> 		at com.carrotsearch.randomizedtesting.rules.SystemPropertiesRestoreRule$1.evaluate(SystemPropertiesRestoreRule.java:53)
   [junit4]   2> 		at org.apache.lucene.util.TestRuleSetupTeardownChained$1.evaluate(TestRuleSetupTeardownChained.java:50)
   [junit4]   2> 		at org.apache.lucene.util.TestRuleFieldCacheSanity$1.evaluate(TestRuleFieldCacheSanity.java:51)
   [junit4]   2> 		at org.apache.lucene.util.AbstractBeforeAfterRule$1.evaluate(AbstractBeforeAfterRule.java:46)
   [junit4]   2> 		at com.carrotsearch.randomizedtesting.rules.SystemPropertiesInvariantRule$1.evaluate(SystemPropertiesInvariantRule.java:55)
   [junit4]   2> 		at org.apache.lucene.util.TestRuleThreadAndTestName$1.evaluate(TestRuleThreadAndTestName.java:49)
   [junit4]   2> 		at org.apache.lucene.util.TestRuleIgnoreAfterMaxFailures$1.evaluate(TestRuleIgnoreAfterMaxFailures.java:70)
   [junit4]   2> 		at org.apache.lucene.util.TestRuleMarkFailure$1.evaluate(TestRuleMarkFailure.java:48)
   [junit4]   2> 		at com.carrotsearch.randomizedtesting.rules.StatementAdapter.evaluate(StatementAdapter.java:36)
   [junit4]   2> 		at com.carrotsearch.randomizedtesting.ThreadLeakControl$StatementRunner.run(ThreadLeakControl.java:358)
   [junit4]   2> 		at com.carrotsearch.randomizedtesting.ThreadLeakControl.forkTimeoutingTask(ThreadLeakControl.java:782)
   [junit4]   2> 		at com.carrotsearch.randomizedtesting.ThreadLeakControl$3.evaluate(ThreadLeakControl.java:442)
   [junit4]   2> 		at com.carrotsearch.randomizedtesting.RandomizedRunner.runSingleTest(RandomizedRunner.java:746)
   [junit4]   2> 		at com.carrotsearch.randomizedtesting.RandomizedRunner$3.evaluate(RandomizedRunner.java:648)
   [junit4]   2> 		at com.carrotsearch.randomizedtesting.RandomizedRunner$4.evaluate(RandomizedRunner.java:682)
   [junit4]   2> 		at com.carrotsearch.randomizedtesting.RandomizedRunner$5.evaluate(RandomizedRunner.java:693)
   [junit4]   2> 		at com.carrotsearch.randomizedtesting.rules.StatementAdapter.evaluate(StatementAdapter.java:36)
   [junit4]   2> 		at com.carrotsearch.randomizedtesting.rules.SystemPropertiesRestoreRule$1.evaluate(SystemPropertiesRestoreRule.java:53)
   [junit4]   2> 		at org.apache.lucene.util.AbstractBeforeAfterRule$1.evaluate(AbstractBeforeAfterRule.java:46)
   [junit4]   2> 		at org.apache.lucene.util.TestRuleStoreClassName$1.evaluate(TestRuleStoreClassName.java:42)
   [junit4]   2> 		at com.carrotsearch.randomizedtesting.rules.SystemPropertiesInvariantRule$1.evaluate(SystemPropertiesInvariantRule.java:55)
   [junit4]   2> 		at com.carrotsearch.randomizedtesting.rules.NoShadowingOrOverridesOnMethodsRule$1.evaluate(NoShadowingOrOverridesOnMethodsRule.java:39)
   [junit4]   2> 		at com.carrotsearch.randomizedtesting.rules.NoShadowingOrOverridesOnMethodsRule$1.evaluate(NoShadowingOrOverridesOnMethodsRule.java:39)
   [junit4]   2> 		at com.carrotsearch.randomizedtesting.rules.StatementAdapter.evaluate(StatementAdapter.java:36)
   [junit4]   2> 		at org.apache.lucene.util.TestRuleAssertionsRequired$1.evaluate(TestRuleAssertionsRequired.java:43)
   [junit4]   2> 		at org.apache.lucene.util.TestRuleMarkFailure$1.evaluate(TestRuleMarkFailure.java:48)
   [junit4]   2> 		at org.apache.lucene.util.TestRuleIgnoreAfterMaxFailures$1.evaluate(TestRuleIgnoreAfterMaxFailures.java:70)
   [junit4]   2> 		at org.apache.lucene.util.TestRuleIgnoreTestSuites$1.evaluate(TestRuleIgnoreTestSuites.java:55)
   [junit4]   2> 		at com.carrotsearch.randomizedtesting.rules.StatementAdapter.evaluate(StatementAdapter.java:36)
   [junit4]   2> 		at com.carrotsearch.randomizedtesting.ThreadLeakControl$StatementRunner.run(ThreadLeakControl.java:358)
   [junit4]   2> 		at java.lang.Thread.run(Thread.java:679)
   [junit4]   2> 	
   [junit4]   2> 1549124 T2521 oas.SolrTestCaseJ4.tearDown ###Ending testIntersectParentBqChildBq
   [junit4]   2> NOTE: download the large Jenkins line-docs file by running 'ant get-jenkins-line-docs' in the lucene directory.
   [junit4]   2> NOTE: reproduce with: ant test  -Dtestcase=BJQParserTest -Dtests.method=testIntersectParentBqChildBq -Dtests.seed=FEB2479FD4A26817 -Dtests.multiplier=2 -Dtests.nightly=true -Dtests.slow=true -Dtests.linedocsfile=/home/hudson/lucene-data/enwiki.random.lines.txt -Dtests.locale=lt -Dtests.timezone=Asia/Pontianak -Dtests.file.encoding=US-ASCII
   [junit4] ERROR   0.02s J1 | BJQParserTest.testIntersectParentBqChildBq <<<
   [junit4]    > Throwable #1: java.lang.RuntimeException: Exception during query
   [junit4]    > 	at __randomizedtesting.SeedInfo.seed([FEB2479FD4A26817:29FC0D2AE2066E11]:0)
   [junit4]    > 	at org.apache.solr.SolrTestCaseJ4.assertQ(SolrTestCaseJ4.java:636)
   [junit4]    > 	at org.apache.solr.SolrTestCaseJ4.assertQ(SolrTestCaseJ4.java:603)
   [junit4]    > 	at org.apache.solr.search.join.BJQParserTest.testIntersectParentBqChildBq(BJQParserTest.java:180)
   [junit4]    > 	at java.lang.Thread.run(Thread.java:679)
   [junit4]    > Caused by: java.lang.RuntimeException: REQUEST FAILED: xpath=//*[@numFound='2']
   [junit4]    > 	xml response was: <?xml version="1.0" encoding="UTF-8"?>
   [junit4]    > <response>
   [junit4]    > <lst name="responseHeader"><int name="status">0</int><int name="QTime">1</int></lst><result name="response" numFound="1" start="0"><doc><arr name="parent_s"><str>b</str></arr><str name="id">34</str></doc></result>
   [junit4]    > </response>
   [junit4]    > 	request was:q=%2Bparent_s:(a+e+b)+%2B_query_:"{!parent+which%3D$pq+v%3D$chq}"&pq=parent_s:[*+

[...truncated too long message...]

mizedRunner.java:682)
   [junit4]   2> 		at com.carrotsearch.randomizedtesting.RandomizedRunner$5.evaluate(RandomizedRunner.java:693)
   [junit4]   2> 		at com.carrotsearch.randomizedtesting.rules.StatementAdapter.evaluate(StatementAdapter.java:36)
   [junit4]   2> 		at com.carrotsearch.randomizedtesting.rules.SystemPropertiesRestoreRule$1.evaluate(SystemPropertiesRestoreRule.java:53)
   [junit4]   2> 		at org.apache.lucene.util.AbstractBeforeAfterRule$1.evaluate(AbstractBeforeAfterRule.java:46)
   [junit4]   2> 		at org.apache.lucene.util.TestRuleStoreClassName$1.evaluate(TestRuleStoreClassName.java:42)
   [junit4]   2> 		at com.carrotsearch.randomizedtesting.rules.SystemPropertiesInvariantRule$1.evaluate(SystemPropertiesInvariantRule.java:55)
   [junit4]   2> 		at com.carrotsearch.randomizedtesting.rules.NoShadowingOrOverridesOnMethodsRule$1.evaluate(NoShadowingOrOverridesOnMethodsRule.java:39)
   [junit4]   2> 		at com.carrotsearch.randomizedtesting.rules.NoShadowingOrOverridesOnMethodsRule$1.evaluate(NoShadowingOrOverridesOnMethodsRule.java:39)
   [junit4]   2> 		at com.carrotsearch.randomizedtesting.rules.StatementAdapter.evaluate(StatementAdapter.java:36)
   [junit4]   2> 		at org.apache.lucene.util.TestRuleAssertionsRequired$1.evaluate(TestRuleAssertionsRequired.java:43)
   [junit4]   2> 		at org.apache.lucene.util.TestRuleMarkFailure$1.evaluate(TestRuleMarkFailure.java:48)
   [junit4]   2> 		at org.apache.lucene.util.TestRuleIgnoreAfterMaxFailures$1.evaluate(TestRuleIgnoreAfterMaxFailures.java:70)
   [junit4]   2> 		at org.apache.lucene.util.TestRuleIgnoreTestSuites$1.evaluate(TestRuleIgnoreTestSuites.java:55)
   [junit4]   2> 		at com.carrotsearch.randomizedtesting.rules.StatementAdapter.evaluate(StatementAdapter.java:36)
   [junit4]   2> 		at com.carrotsearch.randomizedtesting.ThreadLeakControl$StatementRunner.run(ThreadLeakControl.java:358)
   [junit4]   2> 		at java.lang.Thread.run(Thread.java:679)
   [junit4]   2> 	
   [junit4]   2> 1549238 T2521 oas.SolrTestCaseJ4.tearDown ###Ending testFull
   [junit4]   2> NOTE: download the large Jenkins line-docs file by running 'ant get-jenkins-line-docs' in the lucene directory.
   [junit4]   2> NOTE: reproduce with: ant test  -Dtestcase=BJQParserTest -Dtests.method=testFull -Dtests.seed=FEB2479FD4A26817 -Dtests.multiplier=2 -Dtests.nightly=true -Dtests.slow=true -Dtests.linedocsfile=/home/hudson/lucene-data/enwiki.random.lines.txt -Dtests.locale=lt -Dtests.timezone=Asia/Pontianak -Dtests.file.encoding=US-ASCII
   [junit4] ERROR   0.01s J1 | BJQParserTest.testFull <<<
   [junit4]    > Throwable #1: java.lang.RuntimeException: Exception during query
   [junit4]    > 	at __randomizedtesting.SeedInfo.seed([FEB2479FD4A26817:F79031AF9A5965FC]:0)
   [junit4]    > 	at org.apache.solr.SolrTestCaseJ4.assertQ(SolrTestCaseJ4.java:636)
   [junit4]    > 	at org.apache.solr.SolrTestCaseJ4.assertQ(SolrTestCaseJ4.java:603)
   [junit4]    > 	at org.apache.solr.search.join.BJQParserTest.testFull(BJQParserTest.java:126)
   [junit4]    > 	at java.lang.Thread.run(Thread.java:679)
   [junit4]    > Caused by: java.lang.RuntimeException: REQUEST FAILED: xpath=//*[@numFound='6']
   [junit4]    > 	xml response was: <?xml version="1.0" encoding="UTF-8"?>
   [junit4]    > <response>
   [junit4]    > <lst name="responseHeader"><int name="status">0</int><int name="QTime">0</int></lst><result name="response" numFound="2" start="0"><doc><arr name="parent_s"><str>f</str></arr><str name="id">13</str></doc><doc><arr name="parent_s"><str>e</str></arr><str name="id">27</str></doc></result>
   [junit4]    > </response>
   [junit4]    > 	request was:q={!parent+which%3D"parent_s:[*+TO+*]"}child_s:l
   [junit4]    > 	at org.apache.solr.SolrTestCaseJ4.assertQ(SolrTestCaseJ4.java:629)
   [junit4]    > 	... 42 more
   [junit4]   2> 1549244 T2521 oas.SolrTestCaseJ4.deleteCore ###deleteCore
   [junit4]   2> 1549245 T2521 oasc.CoreContainer.shutdown Shutting down CoreContainer instance=535303742
   [junit4]   2> 1549245 T2521 oasc.SolrCore.close [collection1]  CLOSING SolrCore org.apache.solr.core.SolrCore@112d1010
   [junit4]   2> 1549257 T2521 oasu.DirectUpdateHandler2.close closing DirectUpdateHandler2{commits=9,autocommits=0,soft autocommits=0,optimizes=0,rollbacks=0,expungeDeletes=0,docsPending=0,adds=0,deletesById=0,deletesByQuery=0,errors=0,cumulative_adds=42,cumulative_deletesById=0,cumulative_deletesByQuery=0,cumulative_errors=0}
   [junit4]   2> 1549258 T2521 oasu.SolrCoreState.decrefSolrCoreState Closing SolrCoreState
   [junit4]   2> 1549258 T2521 oasu.DefaultSolrCoreState.closeIndexWriter SolrCoreState ref count has reached 0 - closing IndexWriter
   [junit4]   2> 1549258 T2521 oasu.DefaultSolrCoreState.closeIndexWriter closing IndexWriter with IndexWriterCloser
   [junit4]   2> 1549259 T2521 oasc.SolrCore.closeSearcher [collection1] Closing main searcher on request.
   [junit4]   2> 1549260 T2521 oasc.CachingDirectoryFactory.close Closing MockDirectoryFactory - 2 directories currently being tracked
   [junit4]   2> 1549260 T2521 oasc.CachingDirectoryFactory.closeCacheValue looking to close /usr/home/hudson/hudson-slave/workspace/Lucene-Solr-NightlyTests-4.x/solr/build/solr-core/test/J1/./solrtest-BJQParserTest-1376693579098 [CachedDir<<refCount=0;path=/usr/home/hudson/hudson-slave/workspace/Lucene-Solr-NightlyTests-4.x/solr/build/solr-core/test/J1/./solrtest-BJQParserTest-1376693579098;done=false>>]
   [junit4]   2> 1549260 T2521 oasc.CachingDirectoryFactory.close Closing directory: /usr/home/hudson/hudson-slave/workspace/Lucene-Solr-NightlyTests-4.x/solr/build/solr-core/test/J1/./solrtest-BJQParserTest-1376693579098
   [junit4]   2> 1549261 T2521 oasc.CachingDirectoryFactory.closeCacheValue looking to close /usr/home/hudson/hudson-slave/workspace/Lucene-Solr-NightlyTests-4.x/solr/build/solr-core/test/J1/./solrtest-BJQParserTest-1376693579098/index [CachedDir<<refCount=0;path=/usr/home/hudson/hudson-slave/workspace/Lucene-Solr-NightlyTests-4.x/solr/build/solr-core/test/J1/./solrtest-BJQParserTest-1376693579098/index;done=false>>]
   [junit4]   2> 1549261 T2521 oasc.CachingDirectoryFactory.close Closing directory: /usr/home/hudson/hudson-slave/workspace/Lucene-Solr-NightlyTests-4.x/solr/build/solr-core/test/J1/./solrtest-BJQParserTest-1376693579098/index
   [junit4]   2> NOTE: test params are: codec=Lucene42: {id=MockFixedIntBlock(blockSize=1428), grand_s=Lucene41(blocksize=128), parent_s=PostingsFormat(name=Asserting), grand_parentchild_s=MockVariableIntBlock(baseBlockSize=103), grand_child_s=MockVariableIntBlock(baseBlockSize=103), parentchild_s=PostingsFormat(name=Asserting), child_s=Lucene41(blocksize=128)}, docValues:{}, sim=RandomSimilarityProvider(queryNorm=true,coord=yes): {}, locale=lt, timezone=Asia/Pontianak
   [junit4]   2> NOTE: FreeBSD 9.1-RELEASE-p3 amd64/Sun Microsystems Inc. 1.6.0_32 (64-bit)/cpus=16,threads=1,free=101809560,total=532807680
   [junit4]   2> NOTE: All tests run in this JVM: [TestBinaryResponseWriter, SolrTestCaseJ4Test, HdfsDirectoryTest, TestCodecSupport, PreAnalyzedFieldTest, OutputWriterTest, SolrIndexConfigTest, TermVectorComponentDistributedTest, BadIndexSchemaTest, TestQuerySenderListener, TestOmitPositions, TestRecoveryHdfs, TestSolrXmlPersistence, TestQueryTypes, TestPhraseSuggestions, TestFiltering, TestIBSimilarityFactory, QueryResultKeyTest, TestNRTOpen, XsltUpdateRequestHandlerTest, ConvertedLegacyTest, TimeZoneUtilsTest, TestRTGBase, TestSchemaNameResource, DebugComponentTest, TestUniqueKeyFieldResource, PluginInfoTest, TestManagedSchema, TestFuzzyAnalyzedSuggestions, TestQuerySenderNoQuery, DirectSolrSpellCheckerTest, TestAnalyzedSuggestions, CoreContainerCoreInitFailuresTest, NotRequiredUniqueKeyTest, RAMDirectoryFactoryTest, TestSweetSpotSimilarityFactory, TestSolrCoreProperties, MinimalSchemaTest, JSONWriterTest, DocValuesMultiTest, IndexSchemaRuntimeFieldTest, RequestHandlersTest, SimplePostToolTest, TestMultiCoreConfBootstrap, FileUtilsTest, BasicDistributedZk2Test, SolrCmdDistributorTest, CollectionsAPIDistributedZkTest, AlternateDirectoryTest, TestAtomicUpdateErrorCases, TestAddFieldRealTimeGet, HighlighterTest, NoCacheHeaderTest, TestComponentsName, TestRangeQuery, TestRecovery, TestCSVLoader, PathHierarchyTokenizerFactoryTest, BasicZkTest, TestStressLucene, TestCollationField, AddSchemaFieldsUpdateProcessorFactoryTest, TestIndexingPerformance, OpenCloseCoreStressTest, TestLazyCores, SolrRequestParserTest, SpellCheckCollatorTest, BadCopyFieldTest, OpenExchangeRatesOrgProviderTest, TestCloudManagedSchema, TestDFRSimilarityFactory, TestManagedSchemaFieldResource, BJQParserTest]
   [junit4] Completed on J1 in 2.25s, 9 tests, 1 failure, 6 errors <<< FAILURES!

[...truncated 599 lines...]
BUILD FAILED
/usr/home/hudson/hudson-slave/workspace/Lucene-Solr-NightlyTests-4.x/build.xml:402: The following error occurred while executing this line:
/usr/home/hudson/hudson-slave/workspace/Lucene-Solr-NightlyTests-4.x/build.xml:375: The following error occurred while executing this line:
/usr/home/hudson/hudson-slave/workspace/Lucene-Solr-NightlyTests-4.x/build.xml:39: The following error occurred while executing this line:
/usr/home/hudson/hudson-slave/workspace/Lucene-Solr-NightlyTests-4.x/solr/build.xml:181: The following error occurred while executing this line:
/usr/home/hudson/hudson-slave/workspace/Lucene-Solr-NightlyTests-4.x/solr/common-build.xml:450: The following error occurred while executing this line:
/usr/home/hudson/hudson-slave/workspace/Lucene-Solr-NightlyTests-4.x/lucene/common-build.xml:1233: The following error occurred while executing this line:
/usr/home/hudson/hudson-slave/workspace/Lucene-Solr-NightlyTests-4.x/lucene/common-build.xml:876: There were test failures: 322 suites, 1375 tests, 6 errors, 1 failure, 32 ignored (4 assumptions)

Total time: 109 minutes 24 seconds
Build step 'Invoke Ant' marked build as failure
Archiving artifacts
Recording test results
Email was triggered for: Failure
Sending email for trigger: Failure



Mime
View raw message