lucene-dev mailing list archives

Site index · List index
Message view « Date » · « Thread »
Top « Date » · « Thread »
From Apache Jenkins Server <jenk...@builds.apache.org>
Subject [JENKINS] Lucene-Solr-Tests-4.x-Java7 - Build # 1469 - Still Failing
Date Thu, 01 Aug 2013 15:56:58 GMT
Build: https://builds.apache.org/job/Lucene-Solr-Tests-4.x-Java7/1469/

1 tests failed.
FAILED:  org.apache.solr.cloud.CollectionsAPIDistributedZkTest.testDistribSearch

Error Message:
IOException occured when talking to server at: http://127.0.0.1:57928

Stack Trace:
org.apache.solr.client.solrj.SolrServerException: IOException occured when talking to server at: http://127.0.0.1:57928
	at __randomizedtesting.SeedInfo.seed([FF70BEA89546F037:7E9630B0E219900B]:0)
	at org.apache.solr.client.solrj.impl.HttpSolrServer.request(HttpSolrServer.java:435)
	at org.apache.solr.client.solrj.impl.HttpSolrServer.request(HttpSolrServer.java:180)
	at org.apache.solr.cloud.AbstractFullDistribZkTestBase.createCollection(AbstractFullDistribZkTestBase.java:1535)
	at org.apache.solr.cloud.CollectionsAPIDistributedZkTest.testCustomCollectionsAPI(CollectionsAPIDistributedZkTest.java:677)
	at org.apache.solr.cloud.CollectionsAPIDistributedZkTest.doTest(CollectionsAPIDistributedZkTest.java:159)
	at org.apache.solr.BaseDistributedSearchTestCase.testDistribSearch(BaseDistributedSearchTestCase.java:835)
	at sun.reflect.NativeMethodAccessorImpl.invoke0(Native Method)
	at sun.reflect.NativeMethodAccessorImpl.invoke(NativeMethodAccessorImpl.java:57)
	at sun.reflect.DelegatingMethodAccessorImpl.invoke(DelegatingMethodAccessorImpl.java:43)
	at java.lang.reflect.Method.invoke(Method.java:606)
	at com.carrotsearch.randomizedtesting.RandomizedRunner.invoke(RandomizedRunner.java:1559)
	at com.carrotsearch.randomizedtesting.RandomizedRunner.access$600(RandomizedRunner.java:79)
	at com.carrotsearch.randomizedtesting.RandomizedRunner$6.evaluate(RandomizedRunner.java:737)
	at com.carrotsearch.randomizedtesting.RandomizedRunner$7.evaluate(RandomizedRunner.java:773)
	at com.carrotsearch.randomizedtesting.RandomizedRunner$8.evaluate(RandomizedRunner.java:787)
	at com.carrotsearch.randomizedtesting.rules.SystemPropertiesRestoreRule$1.evaluate(SystemPropertiesRestoreRule.java:53)
	at org.apache.lucene.util.TestRuleSetupTeardownChained$1.evaluate(TestRuleSetupTeardownChained.java:50)
	at org.apache.lucene.util.TestRuleFieldCacheSanity$1.evaluate(TestRuleFieldCacheSanity.java:51)
	at org.apache.lucene.util.AbstractBeforeAfterRule$1.evaluate(AbstractBeforeAfterRule.java:46)
	at com.carrotsearch.randomizedtesting.rules.SystemPropertiesInvariantRule$1.evaluate(SystemPropertiesInvariantRule.java:55)
	at org.apache.lucene.util.TestRuleThreadAndTestName$1.evaluate(TestRuleThreadAndTestName.java:49)
	at org.apache.lucene.util.TestRuleIgnoreAfterMaxFailures$1.evaluate(TestRuleIgnoreAfterMaxFailures.java:70)
	at org.apache.lucene.util.TestRuleMarkFailure$1.evaluate(TestRuleMarkFailure.java:48)
	at com.carrotsearch.randomizedtesting.rules.StatementAdapter.evaluate(StatementAdapter.java:36)
	at com.carrotsearch.randomizedtesting.ThreadLeakControl$StatementRunner.run(ThreadLeakControl.java:358)
	at com.carrotsearch.randomizedtesting.ThreadLeakControl.forkTimeoutingTask(ThreadLeakControl.java:782)
	at com.carrotsearch.randomizedtesting.ThreadLeakControl$3.evaluate(ThreadLeakControl.java:442)
	at com.carrotsearch.randomizedtesting.RandomizedRunner.runSingleTest(RandomizedRunner.java:746)
	at com.carrotsearch.randomizedtesting.RandomizedRunner$3.evaluate(RandomizedRunner.java:648)
	at com.carrotsearch.randomizedtesting.RandomizedRunner$4.evaluate(RandomizedRunner.java:682)
	at com.carrotsearch.randomizedtesting.RandomizedRunner$5.evaluate(RandomizedRunner.java:693)
	at com.carrotsearch.randomizedtesting.rules.StatementAdapter.evaluate(StatementAdapter.java:36)
	at com.carrotsearch.randomizedtesting.rules.SystemPropertiesRestoreRule$1.evaluate(SystemPropertiesRestoreRule.java:53)
	at org.apache.lucene.util.AbstractBeforeAfterRule$1.evaluate(AbstractBeforeAfterRule.java:46)
	at org.apache.lucene.util.TestRuleStoreClassName$1.evaluate(TestRuleStoreClassName.java:42)
	at com.carrotsearch.randomizedtesting.rules.SystemPropertiesInvariantRule$1.evaluate(SystemPropertiesInvariantRule.java:55)
	at com.carrotsearch.randomizedtesting.rules.NoShadowingOrOverridesOnMethodsRule$1.evaluate(NoShadowingOrOverridesOnMethodsRule.java:39)
	at com.carrotsearch.randomizedtesting.rules.NoShadowingOrOverridesOnMethodsRule$1.evaluate(NoShadowingOrOverridesOnMethodsRule.java:39)
	at com.carrotsearch.randomizedtesting.rules.StatementAdapter.evaluate(StatementAdapter.java:36)
	at org.apache.lucene.util.TestRuleAssertionsRequired$1.evaluate(TestRuleAssertionsRequired.java:43)
	at org.apache.lucene.util.TestRuleMarkFailure$1.evaluate(TestRuleMarkFailure.java:48)
	at org.apache.lucene.util.TestRuleIgnoreAfterMaxFailures$1.evaluate(TestRuleIgnoreAfterMaxFailures.java:70)
	at org.apache.lucene.util.TestRuleIgnoreTestSuites$1.evaluate(TestRuleIgnoreTestSuites.java:55)
	at com.carrotsearch.randomizedtesting.rules.StatementAdapter.evaluate(StatementAdapter.java:36)
	at com.carrotsearch.randomizedtesting.ThreadLeakControl$StatementRunner.run(ThreadLeakControl.java:358)
	at java.lang.Thread.run(Thread.java:724)
Caused by: org.apache.http.conn.ConnectTimeoutException: Connect to 127.0.0.1:57928 timed out
	at org.apache.http.conn.scheme.PlainSocketFactory.connectSocket(PlainSocketFactory.java:129)
	at org.apache.http.impl.conn.DefaultClientConnectionOperator.openConnection(DefaultClientConnectionOperator.java:180)
	at org.apache.http.impl.conn.ManagedClientConnectionImpl.open(ManagedClientConnectionImpl.java:294)
	at org.apache.http.impl.client.DefaultRequestDirector.tryConnect(DefaultRequestDirector.java:645)
	at org.apache.http.impl.client.DefaultRequestDirector.execute(DefaultRequestDirector.java:480)
	at org.apache.http.impl.client.AbstractHttpClient.execute(AbstractHttpClient.java:906)
	at org.apache.http.impl.client.AbstractHttpClient.execute(AbstractHttpClient.java:805)
	at org.apache.http.impl.client.AbstractHttpClient.execute(AbstractHttpClient.java:784)
	at org.apache.solr.client.solrj.impl.HttpSolrServer.request(HttpSolrServer.java:365)
	... 45 more




Build Log:
[...truncated 9864 lines...]
   [junit4] Suite: org.apache.solr.cloud.CollectionsAPIDistributedZkTest
   [junit4]   2> 1433096 T3758 oas.BaseDistributedSearchTestCase.initHostContext Setting hostContext system property: /
   [junit4]   2> 1433102 T3758 oas.SolrTestCaseJ4.setUp ###Starting testDistribSearch
   [junit4]   2> Creating dataDir: /usr/home/hudson/hudson-slave/workspace/Lucene-Solr-Tests-4.x-Java7/solr/build/solr-core/test/J0/./solrtest-CollectionsAPIDistributedZkTest-1375371954273
   [junit4]   2> 1433104 T3758 oasc.ZkTestServer.run STARTING ZK TEST SERVER
   [junit4]   2> 1433104 T3759 oasc.ZkTestServer$ZKServerMain.runFromConfig Starting server
   [junit4]   2> 1433205 T3758 oasc.ZkTestServer.run start zk server on port:21997
   [junit4]   2> 1433206 T3758 oascc.ConnectionManager.waitForConnected Waiting for client to connect to ZooKeeper
   [junit4]   2> 1433212 T3765 oascc.ConnectionManager.process Watcher org.apache.solr.common.cloud.ConnectionManager@554168d2 name:ZooKeeperConnection Watcher:127.0.0.1:21997 got event WatchedEvent state:SyncConnected type:None path:null path:null type:None
   [junit4]   2> 1433213 T3758 oascc.ConnectionManager.waitForConnected Client is connected to ZooKeeper
   [junit4]   2> 1433213 T3758 oascc.SolrZkClient.makePath makePath: /solr
   [junit4]   2> 1433230 T3758 oascc.ConnectionManager.waitForConnected Waiting for client to connect to ZooKeeper
   [junit4]   2> 1433235 T3767 oascc.ConnectionManager.process Watcher org.apache.solr.common.cloud.ConnectionManager@39497f53 name:ZooKeeperConnection Watcher:127.0.0.1:21997/solr got event WatchedEvent state:SyncConnected type:None path:null path:null type:None
   [junit4]   2> 1433235 T3758 oascc.ConnectionManager.waitForConnected Client is connected to ZooKeeper
   [junit4]   2> 1433235 T3758 oascc.SolrZkClient.makePath makePath: /collections/collection1
   [junit4]   2> 1433247 T3758 oascc.SolrZkClient.makePath makePath: /collections/collection1/shards
   [junit4]   2> 1433250 T3758 oascc.SolrZkClient.makePath makePath: /collections/control_collection
   [junit4]   2> 1433252 T3758 oascc.SolrZkClient.makePath makePath: /collections/control_collection/shards
   [junit4]   2> 1433261 T3758 oasc.AbstractZkTestCase.putConfig put /usr/home/hudson/hudson-slave/workspace/Lucene-Solr-Tests-4.x-Java7/solr/build/solr-core/test-files/solr/collection1/conf/solrconfig-tlog.xml to /configs/conf1/solrconfig.xml
   [junit4]   2> 1433262 T3758 oascc.SolrZkClient.makePath makePath: /configs/conf1/solrconfig.xml
   [junit4]   2> 1433279 T3758 oasc.AbstractZkTestCase.putConfig put /usr/home/hudson/hudson-slave/workspace/Lucene-Solr-Tests-4.x-Java7/solr/build/solr-core/test-files/solr/collection1/conf/schema.xml to /configs/conf1/schema.xml
   [junit4]   2> 1433279 T3758 oascc.SolrZkClient.makePath makePath: /configs/conf1/schema.xml
   [junit4]   2> 1433387 T3758 oasc.AbstractZkTestCase.putConfig put /usr/home/hudson/hudson-slave/workspace/Lucene-Solr-Tests-4.x-Java7/solr/build/solr-core/test-files/solr/collection1/conf/stopwords.txt to /configs/conf1/stopwords.txt
   [junit4]   2> 1433388 T3758 oascc.SolrZkClient.makePath makePath: /configs/conf1/stopwords.txt
   [junit4]   2> 1433391 T3758 oasc.AbstractZkTestCase.putConfig put /usr/home/hudson/hudson-slave/workspace/Lucene-Solr-Tests-4.x-Java7/solr/build/solr-core/test-files/solr/collection1/conf/protwords.txt to /configs/conf1/protwords.txt
   [junit4]   2> 1433392 T3758 oascc.SolrZkClient.makePath makePath: /configs/conf1/protwords.txt
   [junit4]   2> 1433401 T3758 oasc.AbstractZkTestCase.putConfig put /usr/home/hudson/hudson-slave/workspace/Lucene-Solr-Tests-4.x-Java7/solr/build/solr-core/test-files/solr/collection1/conf/currency.xml to /configs/conf1/currency.xml
   [junit4]   2> 1433402 T3758 oascc.SolrZkClient.makePath makePath: /configs/conf1/currency.xml
   [junit4]   2> 1433431 T3758 oasc.AbstractZkTestCase.putConfig put /usr/home/hudson/hudson-slave/workspace/Lucene-Solr-Tests-4.x-Java7/solr/build/solr-core/test-files/solr/collection1/conf/open-exchange-rates.json to /configs/conf1/open-exchange-rates.json
   [junit4]   2> 1433431 T3758 oascc.SolrZkClient.makePath makePath: /configs/conf1/open-exchange-rates.json
   [junit4]   2> 1433435 T3758 oasc.AbstractZkTestCase.putConfig put /usr/home/hudson/hudson-slave/workspace/Lucene-Solr-Tests-4.x-Java7/solr/build/solr-core/test-files/solr/collection1/conf/mapping-ISOLatin1Accent.txt to /configs/conf1/mapping-ISOLatin1Accent.txt
   [junit4]   2> 1433436 T3758 oascc.SolrZkClient.makePath makePath: /configs/conf1/mapping-ISOLatin1Accent.txt
   [junit4]   2> 1433439 T3758 oasc.AbstractZkTestCase.putConfig put /usr/home/hudson/hudson-slave/workspace/Lucene-Solr-Tests-4.x-Java7/solr/build/solr-core/test-files/solr/collection1/conf/old_synonyms.txt to /configs/conf1/old_synonyms.txt
   [junit4]   2> 1433439 T3758 oascc.SolrZkClient.makePath makePath: /configs/conf1/old_synonyms.txt
   [junit4]   2> 1433443 T3758 oasc.AbstractZkTestCase.putConfig put /usr/home/hudson/hudson-slave/workspace/Lucene-Solr-Tests-4.x-Java7/solr/build/solr-core/test-files/solr/collection1/conf/synonyms.txt to /configs/conf1/synonyms.txt
   [junit4]   2> 1433444 T3758 oascc.SolrZkClient.makePath makePath: /configs/conf1/synonyms.txt
   [junit4]   2> 1433724 T3758 oejs.Server.doStart jetty-8.1.10.v20130312
   [junit4]   2> 1433727 T3758 oejs.AbstractConnector.doStart Started SocketConnector@127.0.0.1:50578
   [junit4]   2> 1433728 T3758 oass.SolrDispatchFilter.init SolrDispatchFilter.init()
   [junit4]   2> 1433729 T3758 oasc.SolrResourceLoader.locateSolrHome JNDI not configured for solr (NoInitialContextEx)
   [junit4]   2> 1433729 T3758 oasc.SolrResourceLoader.locateSolrHome using system property solr.solr.home: /usr/home/hudson/hudson-slave/workspace/Lucene-Solr-Tests-4.x-Java7/solr/build/solr-core/test/J0/./org.apache.solr.cloud.CollectionsAPIDistributedZkTest-controljetty-1375371954624
   [junit4]   2> 1433730 T3758 oasc.SolrResourceLoader.<init> new SolrResourceLoader for directory: '/usr/home/hudson/hudson-slave/workspace/Lucene-Solr-Tests-4.x-Java7/solr/build/solr-core/test/J0/./org.apache.solr.cloud.CollectionsAPIDistributedZkTest-controljetty-1375371954624/'
   [junit4]   2> 1433770 T3758 oasc.ConfigSolr.fromFile Loading container configuration from /usr/home/hudson/hudson-slave/workspace/Lucene-Solr-Tests-4.x-Java7/solr/build/solr-core/test/J0/./org.apache.solr.cloud.CollectionsAPIDistributedZkTest-controljetty-1375371954624/solr.xml
   [junit4]   2> 1433889 T3758 oasc.ConfigSolrXml.<init> Config-defined core root directory: 
   [junit4]   2> 1433890 T3758 oasc.CoreContainer.<init> New CoreContainer 956013680
   [junit4]   2> 1433891 T3758 oasc.CoreContainer.load Loading cores into CoreContainer [instanceDir=/usr/home/hudson/hudson-slave/workspace/Lucene-Solr-Tests-4.x-Java7/solr/build/solr-core/test/J0/./org.apache.solr.cloud.CollectionsAPIDistributedZkTest-controljetty-1375371954624/]
   [junit4]   2> 1433892 T3758 oashc.HttpShardHandlerFactory.getParameter Setting socketTimeout to: 120000
   [junit4]   2> 1433893 T3758 oashc.HttpShardHandlerFactory.getParameter Setting urlScheme to: http://
   [junit4]   2> 1433894 T3758 oashc.HttpShardHandlerFactory.getParameter Setting connTimeout to: 15000
   [junit4]   2> 1433894 T3758 oashc.HttpShardHandlerFactory.getParameter Setting maxConnectionsPerHost to: 20
   [junit4]   2> 1433895 T3758 oashc.HttpShardHandlerFactory.getParameter Setting corePoolSize to: 0
   [junit4]   2> 1433895 T3758 oashc.HttpShardHandlerFactory.getParameter Setting maximumPoolSize to: 2147483647
   [junit4]   2> 1433895 T3758 oashc.HttpShardHandlerFactory.getParameter Setting maxThreadIdleTime to: 5
   [junit4]   2> 1433896 T3758 oashc.HttpShardHandlerFactory.getParameter Setting sizeOfQueue to: -1
   [junit4]   2> 1433896 T3758 oashc.HttpShardHandlerFactory.getParameter Setting fairnessPolicy to: false
   [junit4]   2> 1433897 T3758 oascsi.HttpClientUtil.createClient Creating new http client, config:maxConnectionsPerHost=20&maxConnections=10000&socketTimeout=120000&connTimeout=15000&retry=false
   [junit4]   2> 1433913 T3758 oasc.ZkContainer.initZooKeeper Zookeeper client=127.0.0.1:21997/solr
   [junit4]   2> 1433913 T3758 oasc.ZkController.checkChrootPath zkHost includes chroot
   [junit4]   2> 1433914 T3758 oascc.ConnectionManager.waitForConnected Waiting for client to connect to ZooKeeper
   [junit4]   2> 1433924 T3778 oascc.ConnectionManager.process Watcher org.apache.solr.common.cloud.ConnectionManager@598154f0 name:ZooKeeperConnection Watcher:127.0.0.1:21997 got event WatchedEvent state:SyncConnected type:None path:null path:null type:None
   [junit4]   2> 1433924 T3758 oascc.ConnectionManager.waitForConnected Client is connected to ZooKeeper
   [junit4]   2> 1433936 T3758 oascsi.HttpClientUtil.createClient Creating new http client, config:maxConnections=500&maxConnectionsPerHost=16&socketTimeout=120000&connTimeout=15000
   [junit4]   2> 1433946 T3758 oascc.ConnectionManager.waitForConnected Waiting for client to connect to ZooKeeper
   [junit4]   2> 1433948 T3780 oascc.ConnectionManager.process Watcher org.apache.solr.common.cloud.ConnectionManager@3ea339de name:ZooKeeperConnection Watcher:127.0.0.1:21997/solr got event WatchedEvent state:SyncConnected type:None path:null path:null type:None
   [junit4]   2> 1433949 T3758 oascc.ConnectionManager.waitForConnected Client is connected to ZooKeeper
   [junit4]   2> 1433951 T3758 oascc.SolrZkClient.makePath makePath: /overseer/queue
   [junit4]   2> 1433960 T3758 oascc.SolrZkClient.makePath makePath: /overseer/collection-queue-work
   [junit4]   2> 1433963 T3758 oascc.SolrZkClient.makePath makePath: /live_nodes
   [junit4]   2> 1433970 T3758 oasc.ZkController.createEphemeralLiveNode Register node as live in ZooKeeper:/live_nodes/127.0.0.1:50578_
   [junit4]   2> 1433972 T3758 oascc.SolrZkClient.makePath makePath: /live_nodes/127.0.0.1:50578_
   [junit4]   2> 1433975 T3758 oascc.SolrZkClient.makePath makePath: /overseer_elect/election
   [junit4]   2> 1433991 T3758 oascc.SolrZkClient.makePath makePath: /overseer_elect/leader
   [junit4]   2> 1433998 T3758 oasc.Overseer.start Overseer (id=90136376395759619-127.0.0.1:50578_-n_0000000000) starting
   [junit4]   2> 1434008 T3758 oascc.SolrZkClient.makePath makePath: /overseer/queue-work
   [junit4]   2> 1434020 T3782 oasc.OverseerCollectionProcessor.run Process current queue of collection creations
   [junit4]   2> 1434020 T3758 oascc.SolrZkClient.makePath makePath: /clusterstate.json
   [junit4]   2> 1434023 T3758 oascc.SolrZkClient.makePath makePath: /aliases.json
   [junit4]   2> 1434025 T3758 oascc.ZkStateReader.createClusterStateWatchersAndUpdate Updating cluster state from ZooKeeper... 
   [junit4]   2> 1434027 T3781 oasc.Overseer$ClusterStateUpdater.run Starting to work on the main queue
   [junit4]   2> 1434030 T3758 oasc.CorePropertiesLocator.discover Looking for core definitions underneath /usr/home/hudson/hudson-slave/workspace/Lucene-Solr-Tests-4.x-Java7/solr/build/solr-core/test/J0/./org.apache.solr.cloud.CollectionsAPIDistributedZkTest-controljetty-1375371954624
   [junit4]   2> 1434033 T3758 oasc.CorePropertiesLocator.discoverUnder Found core conf in /usr/home/hudson/hudson-slave/workspace/Lucene-Solr-Tests-4.x-Java7/solr/build/solr-core/test/J0/./org.apache.solr.cloud.CollectionsAPIDistributedZkTest-controljetty-1375371954624/conf/
   [junit4]   2> 1434205 T3758 oasc.CorePropertiesLocator.discover Found 1 core definitions
   [junit4]   2> 1434206 T3758 oass.SolrDispatchFilter.init user.dir=/usr/home/hudson/hudson-slave/workspace/Lucene-Solr-Tests-4.x-Java7/solr/build/solr-core/test/J0
   [junit4]   2> 1434207 T3758 oass.SolrDispatchFilter.init SolrDispatchFilter.init() done
   [junit4]   2> 1434207 T3758 oascsi.HttpClientUtil.createClient Creating new http client, config:maxConnections=128&maxConnectionsPerHost=32&followRedirects=false
   [junit4]   2> 1434223 T3758 oascsi.HttpClientUtil.createClient Creating new http client, config:
   [junit4]   2> 1434225 T3758 oascc.ConnectionManager.waitForConnected Waiting for client to connect to ZooKeeper
   [junit4]   2> 1434227 T3785 oascc.ConnectionManager.process Watcher org.apache.solr.common.cloud.ConnectionManager@26631f6c name:ZooKeeperConnection Watcher:127.0.0.1:21997/solr got event WatchedEvent state:SyncConnected type:None path:null path:null type:None
   [junit4]   2> 1434227 T3758 oascc.ConnectionManager.waitForConnected Client is connected to ZooKeeper
   [junit4]   2> 1434228 T3758 oascc.ZkStateReader.createClusterStateWatchersAndUpdate Updating cluster state from ZooKeeper... 
   [junit4]   2> 1434230 T3758 oasc.ChaosMonkey.monkeyLog monkey: init - expire sessions:true cause connection loss:true
   [junit4]   2> 1434508 T3758 oejs.Server.doStart jetty-8.1.10.v20130312
   [junit4]   2> 1434512 T3758 oejs.AbstractConnector.doStart Started SocketConnector@127.0.0.1:44411
   [junit4]   2> 1434513 T3758 oass.SolrDispatchFilter.init SolrDispatchFilter.init()
   [junit4]   2> 1434513 T3758 oasc.SolrResourceLoader.locateSolrHome JNDI not configured for solr (NoInitialContextEx)
   [junit4]   2> 1434514 T3758 oasc.SolrResourceLoader.locateSolrHome using system property solr.solr.home: /usr/home/hudson/hudson-slave/workspace/Lucene-Solr-Tests-4.x-Java7/solr/build/solr-core/test/J0/./org.apache.solr.cloud.CollectionsAPIDistributedZkTest-jetty1-1375371955400
   [junit4]   2> 1434514 T3758 oasc.SolrResourceLoader.<init> new SolrResourceLoader for directory: '/usr/home/hudson/hudson-slave/workspace/Lucene-Solr-Tests-4.x-Java7/solr/build/solr-core/test/J0/./org.apache.solr.cloud.CollectionsAPIDistributedZkTest-jetty1-1375371955400/'
   [junit4]   2> 1434557 T3758 oasc.ConfigSolr.fromFile Loading container configuration from /usr/home/hudson/hudson-slave/workspace/Lucene-Solr-Tests-4.x-Java7/solr/build/solr-core/test/J0/./org.apache.solr.cloud.CollectionsAPIDistributedZkTest-jetty1-1375371955400/solr.xml
   [junit4]   2> 1434653 T3758 oasc.ConfigSolrXml.<init> Config-defined core root directory: 
   [junit4]   2> 1434654 T3758 oasc.CoreContainer.<init> New CoreContainer 352538356
   [junit4]   2> 1434655 T3758 oasc.CoreContainer.load Loading cores into CoreContainer [instanceDir=/usr/home/hudson/hudson-slave/workspace/Lucene-Solr-Tests-4.x-Java7/solr/build/solr-core/test/J0/./org.apache.solr.cloud.CollectionsAPIDistributedZkTest-jetty1-1375371955400/]
   [junit4]   2> 1434657 T3758 oashc.HttpShardHandlerFactory.getParameter Setting socketTimeout to: 120000
   [junit4]   2> 1434657 T3758 oashc.HttpShardHandlerFactory.getParameter Setting urlScheme to: http://
   [junit4]   2> 1434658 T3758 oashc.HttpShardHandlerFactory.getParameter Setting connTimeout to: 15000
   [junit4]   2> 1434658 T3758 oashc.HttpShardHandlerFactory.getParameter Setting maxConnectionsPerHost to: 20
   [junit4]   2> 1434658 T3758 oashc.HttpShardHandlerFactory.getParameter Setting corePoolSize to: 0
   [junit4]   2> 1434659 T3758 oashc.HttpShardHandlerFactory.getParameter Setting maximumPoolSize to: 2147483647
   [junit4]   2> 1434659 T3758 oashc.HttpShardHandlerFactory.getParameter Setting maxThreadIdleTime to: 5
   [junit4]   2> 1434660 T3758 oashc.HttpShardHandlerFactory.getParameter Setting sizeOfQueue to: -1
   [junit4]   2> 1434660 T3758 oashc.HttpShardHandlerFactory.getParameter Setting fairnessPolicy to: false
   [junit4]   2> 1434661 T3758 oascsi.HttpClientUtil.createClient Creating new http client, config:maxConnectionsPerHost=20&maxConnections=10000&socketTimeout=120000&connTimeout=15000&retry=false
   [junit4]   2> 1434676 T3758 oasc.ZkContainer.initZooKeeper Zookeeper client=127.0.0.1:21997/solr
   [junit4]   2> 1434677 T3758 oasc.ZkController.checkChrootPath zkHost includes chroot
   [junit4]   2> 1434678 T3758 oascc.ConnectionManager.waitForConnected Waiting for client to connect to ZooKeeper
   [junit4]   2> 1434691 T3796 oascc.ConnectionManager.process Watcher org.apache.solr.common.cloud.ConnectionManager@9267f26 name:ZooKeeperConnection Watcher:127.0.0.1:21997 got event WatchedEvent state:SyncConnected type:None path:null path:null type:None
   [junit4]   2> 1434691 T3758 oascc.ConnectionManager.waitForConnected Client is connected to ZooKeeper
   [junit4]   2> 1434694 T3758 oascsi.HttpClientUtil.createClient Creating new http client, config:maxConnections=500&maxConnectionsPerHost=16&socketTimeout=120000&connTimeout=15000
   [junit4]   2> 1434705 T3758 oascc.ConnectionManager.waitForConnected Waiting for client to connect to ZooKeeper
   [junit4]   2> 1434710 T3798 oascc.ConnectionManager.process Watcher org.apache.solr.common.cloud.ConnectionManager@1765a45 name:ZooKeeperConnection Watcher:127.0.0.1:21997/solr got event WatchedEvent state:SyncConnected type:None path:null path:null type:None
   [junit4]   2> 1434711 T3758 oascc.ConnectionManager.waitForConnected Client is connected to ZooKeeper
   [junit4]   2> 1434728 T3758 oascc.ZkStateReader.createClusterStateWatchersAndUpdate Updating cluster state from ZooKeeper... 
   [junit4]   2> 1435731 T3758 oasc.ZkController.createEphemeralLiveNode Register node as live in ZooKeeper:/live_nodes/127.0.0.1:44411_
   [junit4]   2> 1435733 T3758 oascc.SolrZkClient.makePath makePath: /live_nodes/127.0.0.1:44411_
   [junit4]   2> 1435736 T3780 oascc.ZkStateReader$3.process Updating live nodes... (2)
   [junit4]   2> 1435736 T3798 oascc.ZkStateReader$3.process Updating live nodes... (2)
   [junit4]   2> 1435736 T3785 oascc.ZkStateReader$3.process Updating live nodes... (2)
   [junit4]   2> 1435751 T3758 oasc.CorePropertiesLocator.discover Looking for core definitions underneath /usr/home/hudson/hudson-slave/workspace/Lucene-Solr-Tests-4.x-Java7/solr/build/solr-core/test/J0/./org.apache.solr.cloud.CollectionsAPIDistributedZkTest-jetty1-1375371955400
   [junit4]   2> 1435920 T3758 oasc.CorePropertiesLocator.discoverUnder Found core conf in /usr/home/hudson/hudson-slave/workspace/Lucene-Solr-Tests-4.x-Java7/solr/build/solr-core/test/J0/./org.apache.solr.cloud.CollectionsAPIDistributedZkTest-jetty1-1375371955400/conf/
   [junit4]   2> 1435923 T3758 oasc.CorePropertiesLocator.discover Found 1 core definitions
   [junit4]   2> 1435924 T3758 oass.SolrDispatchFilter.init user.dir=/usr/home/hudson/hudson-slave/workspace/Lucene-Solr-Tests-4.x-Java7/solr/build/solr-core/test/J0
   [junit4]   2> 1435924 T3758 oass.SolrDispatchFilter.init SolrDispatchFilter.init() done
   [junit4]   2> 1435925 T3758 oascsi.HttpClientUtil.createClient Creating new http client, config:maxConnections=128&maxConnectionsPerHost=32&followRedirects=false
   [junit4]   2> 1436211 T3758 oejs.Server.doStart jetty-8.1.10.v20130312
   [junit4]   2> 1436215 T3758 oejs.AbstractConnector.doStart Started SocketConnector@127.0.0.1:57928
   [junit4]   2> 1436216 T3758 oass.SolrDispatchFilter.init SolrDispatchFilter.init()
   [junit4]   2> 1436216 T3758 oasc.SolrResourceLoader.locateSolrHome JNDI not configured for solr (NoInitialContextEx)
   [junit4]   2> 1436217 T3758 oasc.SolrResourceLoader.locateSolrHome using system property solr.solr.home: /usr/home/hudson/hudson-slave/workspace/Lucene-Solr-Tests-4.x-Java7/solr/build/solr-core/test/J0/./org.apache.solr.cloud.CollectionsAPIDistributedZkTest-jetty2-1375371957110
   [junit4]   2> 1436217 T3758 oasc.SolrResourceLoader.<init> new SolrResourceLoader for directory: '/usr/home/hudson/hudson-slave/workspace/Lucene-Solr-Tests-4.x-Java7/solr/build/solr-core/test/J0/./org.apache.solr.cloud.CollectionsAPIDistributedZkTest-jetty2-1375371957110/'
   [junit4]   2> 1436258 T3758 oasc.ConfigSolr.fromFile Loading container configuration from /usr/home/hudson/hudson-slave/workspace/Lucene-Solr-Tests-4.x-Java7/solr/build/solr-core/test/J0/./org.apache.solr.cloud.CollectionsAPIDistributedZkTest-jetty2-1375371957110/solr.xml
   [junit4]   2> 1436348 T3758 oasc.ConfigSolrXml.<init> Config-defined core root directory: 
   [junit4]   2> 1436349 T3758 oasc.CoreContainer.<init> New CoreContainer 168735604
   [junit4]   2> 1436349 T3758 oasc.CoreContainer.load Loading cores into CoreContainer [instanceDir=/usr/home/hudson/hudson-slave/workspace/Lucene-Solr-Tests-4.x-Java7/solr/build/solr-core/test/J0/./org.apache.solr.cloud.CollectionsAPIDistributedZkTest-jetty2-1375371957110/]
   [junit4]   2> 1436351 T3758 oashc.HttpShardHandlerFactory.getParameter Setting socketTimeout to: 120000
   [junit4]   2> 1436351 T3758 oashc.HttpShardHandlerFactory.getParameter Setting urlScheme to: http://
   [junit4]   2> 1436352 T3758 oashc.HttpShardHandlerFactory.getParameter Setting connTimeout to: 15000
   [junit4]   2> 1436352 T3758 oashc.HttpShardHandlerFactory.getParameter Setting maxConnectionsPerHost to: 20
   [junit4]   2> 1436353 T3758 oashc.HttpShardHandlerFactory.getParameter Setting corePoolSize to: 0
   [junit4]   2> 1436353 T3758 oashc.HttpShardHandlerFactory.getParameter Setting maximumPoolSize to: 2147483647
   [junit4]   2> 1436354 T3758 oashc.HttpShardHandlerFactory.getParameter Setting maxThreadIdleTime to: 5
   [junit4]   2> 1436354 T3758 oashc.HttpShardHandlerFactory.getParameter Setting sizeOfQueue to: -1
   [junit4]   2> 1436355 T3758 oashc.HttpShardHandlerFactory.getParameter Setting fairnessPolicy to: false
   [junit4]   2> 1436355 T3758 oascsi.HttpClientUtil.createClient Creating new http client, config:maxConnectionsPerHost=20&maxConnections=10000&socketTimeout=120000&connTimeout=15000&retry=false
   [junit4]   2> 1436372 T3758 oasc.ZkContainer.initZooKeeper Zookeeper client=127.0.0.1:21997/solr
   [junit4]   2> 1436373 T3758 oasc.ZkController.checkChrootPath zkHost includes chroot
   [junit4]   2> 1436374 T3758 oascc.ConnectionManager.waitForConnected Waiting for client to connect to ZooKeeper
   [junit4]   2> 1436376 T3810 oascc.ConnectionManager.process Watcher org.apache.solr.common.cloud.ConnectionManager@368d8284 name:ZooKeeperConnection Watcher:127.0.0.1:21997 got event WatchedEvent state:SyncConnected type:None path:null path:null type:None
   [junit4]   2> 1436377 T3758 oascc.ConnectionManager.waitForConnected Client is connected to ZooKeeper
   [junit4]   2> 1436379 T3758 oascsi.HttpClientUtil.createClient Creating new http client, config:maxConnections=500&maxConnectionsPerHost=16&socketTimeout=120000&connTimeout=15000
   [junit4]   2> 1436389 T3758 oascc.ConnectionManager.waitForConnected Waiting for client to connect to ZooKeeper
   [junit4]   2> 1436391 T3812 oascc.ConnectionManager.process Watcher org.apache.solr.common.cloud.ConnectionManager@4a27c82f name:ZooKeeperConnection Watcher:127.0.0.1:21997/solr got event WatchedEvent state:SyncConnected type:None path:null path:null type:None
   [junit4]   2> 1436392 T3758 oascc.ConnectionManager.waitForConnected Client is connected to ZooKeeper
   [junit4]   2> 1436403 T3758 oascc.ZkStateReader.createClusterStateWatchersAndUpdate Updating cluster state from ZooKeeper... 
   [junit4]   2> 1437407 T3758 oasc.ZkController.createEphemeralLiveNode Register node as live in ZooKeeper:/live_nodes/127.0.0.1:57928_
   [junit4]   2> 1437424 T3758 oascc.SolrZkClient.makePath makePath: /live_nodes/127.0.0.1:57928_
   [junit4]   2> 1437428 T3798 oascc.ZkStateReader$3.process Updating live nodes... (3)
   [junit4]   2> 1437428 T3812 oascc.ZkStateReader$3.process Updating live nodes... (3)
   [junit4]   2> 1437428 T3780 oascc.ZkStateReader$3.process Updating live nodes... (3)
   [junit4]   2> 1437428 T3785 oascc.ZkStateReader$3.process Updating live nodes... (3)
   [junit4]   2> 1437435 T3758 oasc.CorePropertiesLocator.discover Looking for core definitions underneath /usr/home/hudson/hudson-slave/workspace/Lucene-Solr-Tests-4.x-Java7/solr/build/solr-core/test/J0/./org.apache.solr.cloud.CollectionsAPIDistributedZkTest-jetty2-1375371957110
   [junit4]   2> 1437604 T3758 oasc.CorePropertiesLocator.discoverUnder Found core conf in /usr/home/hudson/hudson-slave/workspace/Lucene-Solr-Tests-4.x-Java7/solr/build/solr-core/test/J0/./org.apache.solr.cloud.CollectionsAPIDistributedZkTest-jetty2-1375371957110/conf/
   [junit4]   2> 1437610 T3758 oasc.CorePropertiesLocator.discover Found 1 core definitions
   [junit4]   2> 1437610 T3758 oass.SolrDispatchFilter.init user.dir=/usr/home/hudson/hudson-slave/workspace/Lucene-Solr-Tests-4.x-Java7/solr/build/solr-core/test/J0
   [junit4]   2> 1437611 T3758 oass.SolrDispatchFilter.init SolrDispatchFilter.init() done
   [junit4]   2> 1437611 T3758 oascsi.HttpClientUtil.createClient Creating new http client, config:maxConnections=128&maxConnectionsPerHost=32&followRedirects=false
   [junit4]   2> 1437895 T3758 oejs.Server.doStart jetty-8.1.10.v20130312
   [junit4]   2> 1437898 T3758 oejs.AbstractConnector.doStart Started SocketConnector@127.0.0.1:22723
   [junit4]   2> 1437899 T3758 oass.SolrDispatchFilter.init SolrDispatchFilter.init()
   [junit4]   2> 1437899 T3758 oasc.SolrResourceLoader.locateSolrHome JNDI not configured for solr (NoInitialContextEx)
   [junit4]   2> 1437900 T3758 oasc.SolrResourceLoader.locateSolrHome using system property solr.solr.home: /usr/home/hudson/hudson-slave/workspace/Lucene-Solr-Tests-4.x-Java7/solr/build/solr-core/test/J0/./org.apache.solr.cloud.CollectionsAPIDistributedZkTest-jetty3-1375371958797
   [junit4]   2> 1437900 T3758 oasc.SolrResourceLoader.<init> new SolrResourceLoader for directory: '/usr/home/hudson/hudson-slave/workspace/Lucene-Solr-Tests-4.x-Java7/solr/build/solr-core/test/J0/./org.apache.solr.cloud.CollectionsAPIDistributedZkTest-jetty3-1375371958797/'
   [junit4]   2> 1437941 T3758 oasc.ConfigSolr.fromFile Loading container configuration from /usr/home/hudson/hudson-slave/workspace/Lucene-Solr-Tests-4.x-Java7/solr/build/solr-core/test/J0/./org.apache.solr.cloud.CollectionsAPIDistributedZkTest-jetty3-1375371958797/solr.xml
   [junit4]   2> 1438007 T3758 oasc.ConfigSolrXml.<init> Config-defined core root directory: 
   [junit4]   2> 1438008 T3758 oasc.CoreContainer.<init> New CoreContainer 699177704
   [junit4]   2> 1438008 T3758 oasc.CoreContainer.load Loading cores into CoreContainer [instanceDir=/usr/home/hudson/hudson-slave/workspace/Lucene-Solr-Tests-4.x-Java7/solr/build/solr-core/test/J0/./org.apache.solr.cloud.CollectionsAPIDistributedZkTest-jetty3-1375371958797/]
   [junit4]   2> 1438010 T3758 oashc.HttpShardHandlerFactory.getParameter Setting socketTimeout to: 120000
   [junit4]   2> 1438010 T3758 oashc.HttpShardHandlerFactory.getParameter Setting urlScheme to: http://
   [junit4]   2> 1438010 T3758 oashc.HttpShardHandlerFactory.getParameter Setting connTimeout to: 15000
   [junit4]   2> 1438011 T3758 oashc.HttpShardHandlerFactory.getParameter Setting maxConnectionsPerHost to: 20
   [junit4]   2> 1438011 T3758 oashc.HttpShardHandlerFactory.getParameter Setting corePoolSize to: 0
   [junit4]   2> 1438011 T3758 oashc.HttpShardHandlerFactory.getParameter Setting maximumPoolSize to: 2147483647
   [junit4]   2> 1438012 T3758 oashc.HttpShardHandlerFactory.getParameter Setting maxThreadIdleTime to: 5
   [junit4]   2> 1438012 T3758 oashc.HttpShardHandlerFactory.getParameter Setting sizeOfQueue to: -1
   [junit4]   2> 1438012 T3758 oashc.HttpShardHandlerFactory.getParameter Setting fairnessPolicy to: false
   [junit4]   2> 1438013 T3758 oascsi.HttpClientUtil.createClient Creating new http client, config:maxConnectionsPerHost=20&maxConnections=10000&socketTimeout=120000&connTimeout=15000&retry=false
   [junit4]   2> 1438023 T3758 oasc.ZkContainer.initZooKeeper Zookeeper client=127.0.0.1:21997/solr
   [junit4]   2> 1438023 T3758 oasc.ZkController.checkChrootPath zkHost includes chroot
   [junit4]   2> 1438024 T3758 oascc.ConnectionManager.waitForConnected Waiting for client to connect to ZooKeeper
   [junit4]   2> 1438025 T3824 oascc.ConnectionManager.process Watcher org.apache.solr.common.cloud.ConnectionManager@26b86fe2 name:ZooKeeperConnection Watcher:127.0.0.1:21997 got event WatchedEvent state:SyncConnected type:None path:null path:null type:None
   [junit4]   2> 1438026 T3758 oascc.ConnectionManager.waitForConnected Client is connected to ZooKeeper
   [junit4]   2> 1438027 T3758 oascsi.HttpClientUtil.createClient Creating new http client, config:maxConnections=500&maxConnectionsPerHost=16&socketTimeout=120000&connTimeout=15000
   [junit4]   2> 1438034 T3758 oascc.ConnectionManager.waitForConnected Waiting for client to connect to ZooKeeper
   [junit4]   2> 1438035 T3826 oascc.ConnectionManager.process Watcher org.apache.solr.common.cloud.ConnectionManager@6632449a name:ZooKeeperConnection Watcher:127.0.0.1:21997/solr got event WatchedEvent state:SyncConnected type:None path:null path:null type:None
   [junit4]   2> 1438035 T3758 oascc.ConnectionManager.waitForConnected Client is connected to ZooKeeper
   [junit4]   2> 1438039 T3758 oascc.ZkStateReader.createClusterStateWatchersAndUpdate Updating cluster state from ZooKeeper... 
   [junit4]   2> 1439042 T3758 oasc.ZkController.createEphemeralLiveNode Register node as live in ZooKeeper:/live_nodes/127.0.0.1:22723_
   [junit4]   2> 1439047 T3758 oascc.SolrZkClient.makePath makePath: /live_nodes/127.0.0.1:22723_
   [junit4]   2> 1439052 T3812 oascc.ZkStateReader$3.process Updating live nodes... (4)
   [junit4]   2> 1439052 T3826 oascc.ZkStateReader$3.process Updating live nodes... (4)
   [junit4]   2> 1439052 T3785 oascc.ZkStateReader$3.process Updating live nodes... (4)
   [junit4]   2> 1439052 T3798 oascc.ZkStateReader$3.process Updating live nodes... (4)
   [junit4]   2> 1439052 T3780 oascc.ZkStateReader$3.process Updating live nodes... (4)
   [junit4]   2> 1439072 T3758 oasc.CorePropertiesLocator.discover Looking for core definitions underneath /usr/home/hudson/hudson-slave/workspace/Lucene-Solr-Tests-4.x-Java7/solr/build/solr-core/test/J0/./org.apache.solr.cloud.CollectionsAPIDistributedZkTest-jetty3-1375371958797
   [junit4]   2> 1439529 T3758 oasc.CorePropertiesLocator.discoverUnder Found core conf in /usr/home/hudson/hudson-slave/workspace/Lucene-Solr-Tests-4.x-Java7/solr/build/solr-core/test/J0/./org.apache.solr.cloud.CollectionsAPIDistributedZkTest-jetty3-1375371958797/conf/
   [junit4]   2> 1439540 T3758 oasc.CorePropertiesLocator.discover Found 1 core definitions
   [junit4]   2> 1439541 T3758 oass.SolrDispatchFilter.init user.dir=/usr/home/hudson/hudson-slave/workspace/Lucene-Solr-Tests-4.x-Java7/solr/build/solr-core/test/J0
   [junit4]   2> 1439541 T3758 oass.SolrDispatchFilter.init SolrDispatchFilter.init() done
   [junit4]   2> 1439542 T3758 oascsi.HttpClientUtil.createClient Creating new http client, config:maxConnections=128&maxConnectionsPerHost=32&followRedirects=false
   [junit4]   2> 1440131 T3758 oejs.Server.doStart jetty-8.1.10.v20130312
   [junit4]   2> 1440136 T3758 oejs.AbstractConnector.doStart Started SocketConnector@127.0.0.1:22726
   [junit4]   2> 1440137 T3758 oass.SolrDispatchFilter.init SolrDispatchFilter.init()
   [junit4]   2> 1440138 T3758 oasc.SolrResourceLoader.locateSolrHome JNDI not configured for solr (NoInitialContextEx)
   [junit4]   2> 1440138 T3758 oasc.SolrResourceLoader.locateSolrHome using system property solr.solr.home: /usr/home/hudson/hudson-slave/workspace/Lucene-Solr-Tests-4.x-Java7/solr/build/solr-core/test/J0/./org.apache.solr.cloud.CollectionsAPIDistributedZkTest-jetty4-1375371960740
   [junit4]   2> 1440139 T3758 oasc.SolrResourceLoader.<init> new SolrResourceLoader for directory: '/usr/home/hudson/hudson-slave/workspace/Lucene-Solr-Tests-4.x-Java7/solr/build/solr-core/test/J0/./org.apache.solr.cloud.CollectionsAPIDistributedZkTest-jetty4-1375371960740/'
   [junit4]   2> 1440235 T3758 oasc.ConfigSolr.fromFile Loading container configuration from /usr/home/hudson/hudson-slave/workspace/Lucene-Solr-Tests-4.x-Java7/solr/build/solr-core/test/J0/./org.apache.solr.cloud.CollectionsAPIDistributedZkTest-jetty4-1375371960740/solr.xml
   [junit4]   2> 1440410 T3758 oasc.ConfigSolrXml.<init> Config-defined core root directory: 
   [junit4]   2> 1440411 T3758 oasc.CoreContainer.<init> New CoreContainer 1574715133
   [junit4]   2> 1440412 T3758 oasc.CoreContainer.load Loading cores into CoreContainer [instanceDir=/usr/home/hudson/hudson-slave/workspace/Lucene-Solr-Tests-4.x-Java7/solr/build/solr-core/test/J0/./org.apache.solr.cloud.CollectionsAPIDistributedZkTest-jetty4-1375371960740/]
   [junit4]   2> 1440413 T3758 oashc.HttpShardHandlerFactory.getParameter Setting socketTimeout to: 120000
   [junit4]   2> 1440414 T3758 oashc.HttpShardHandlerFactory.getParameter Setting urlScheme to: http://
   [junit4]   2> 1440414 T3758 oashc.HttpShardHandlerFactory.getParameter Setting connTimeout to: 15000
   [junit4]   2> 1440415 T3758 oashc.HttpShardHandlerFactory.getParameter Setting maxConnectionsPerHost to: 20
   [junit4]   2> 1440415 T3758 oashc.HttpShardHandlerFactory.getParameter Setting corePoolSize to: 0
   [junit4]   2> 1440416 T3758 oashc.HttpShardHandlerFactory.getParameter Setting maximumPoolSize to: 2147483647
   [junit4]   2> 1440416 T3758 oashc.HttpShardHandlerFactory.getParameter Setting maxThreadIdleTime to: 5
   [junit4]   2> 1440417 T3758 oashc.HttpShardHandlerFactory.getParameter Setting sizeOfQueue to: -1
   [junit4]   2> 1440417 T3758 oashc.HttpShardHandlerFactory.getParameter Setting fairnessPolicy to: false
   [junit4]   2> 1440418 T3758 oascsi.HttpClientUtil.createClient Creating new http client, config:maxConnectionsPerHost=20&maxConnections=10000&socketTimeout=120000&connTimeout=15000&retry=false
   [junit4]   2> 1440443 T3758 oasc.ZkContainer.initZooKeeper Zookeeper client=127.0.0.1:21997/solr
   [junit4]   2> 1440444 T3758 oasc.ZkController.checkChrootPath zkHost includes chroot
   [junit4]   2> 1440445 T3758 oascc.ConnectionManager.waitForConnected Waiting for client to connect to ZooKeeper
   [junit4]   2> 1440449 T3838 oascc.ConnectionManager.process Watcher org.apache.solr.common.cloud.ConnectionManager@37ca3f54 name:ZooKeeperConnection Watcher:127.0.0.1:21997 got event WatchedEvent state:SyncConnected type:None path:null path:null type:None
   [junit4]   2> 1440450 T3758 oascc.ConnectionManager.waitForConnected Client is connected to ZooKeeper
   [junit4]   2> 1440465 T3758 oascsi.HttpClientUtil.createClient Creating new http client, config:maxConnections=500&maxConnectionsPerHost=16&socketTimeout=120000&connTimeout=15000
   [junit4]   2> 1440492 T3758 oascc.ConnectionManager.waitForConnected Waiting for client to connect to ZooKeeper
   [junit4]   2> 1440495 T3840 oascc.ConnectionManager.process Watcher org.apache.solr.common.cloud.ConnectionManager@42c7e025 name:ZooKeeperConnection Watcher:127.0.0.1:21997/solr got event WatchedEvent state:SyncConnected type:None path:null path:null type:None
   [junit4]   2> 1440496 T3758 oascc.ConnectionManager.waitForConnected Client is connected to ZooKeeper
   [junit4]   2> 1440509 T3758 oascc.ZkStateReader.createClusterStateWatchersAndUpdate Updating cluster state from ZooKeeper... 
   [junit4]   2> 1441514 T3758 oasc.ZkController.createEphemeralLiveNode Register node as live in ZooKeeper:/live_nodes/127.0.0.1:22726_
   [junit4]   2> 1441516 T3758 oascc.SolrZkClient.makePath makePath: /live_nodes/127.0.0.1:22726_
   [junit4]   2> 1441519 T3798 oascc.ZkStateReader$3.process Updating live nodes... (5)
   [junit4]   2> 1441519 T3826 oascc.ZkStateReader$3.process Updating live nodes... (5)
   [junit4]   2> 1441519 T3840 oascc.ZkStateReader$3.process Updating live nodes... (5)
   [junit4]   2> 1441519 T3812 oascc.ZkStateReader$3.process Updating live nodes... (5)
   [junit4]   2> 1441519 T3785 oascc.ZkStateReader$3.process Updating live nodes... (5)
   [junit4]   2> 1441519 T3780 oascc.ZkStateReader$3.process Updating live nodes... (5)
   [junit4]   2> 1441532 T3758 oasc.CorePropertiesLocator.discover Looking for core definitions underneath /usr/home/hudson/hudson-slave/workspace/Lucene-Solr-Tests-4.x-Java7/solr/build/solr-core/test/J0/./org.apache.solr.cloud.CollectionsAPIDistributedZkTest-jetty4-1375371960740
   [junit4]   2> 1441537 T3758 oasc.CorePropertiesLocator.discoverUnder Found core conf in /usr/home/hudson/hudson-slave/workspace/Lucene-Solr-Tests-4.x-Java7/solr/build/solr-core/test/J0/./org.apache.solr.cloud.CollectionsAPIDistributedZkTest-jetty4-1375371960740/conf/
   [junit4]   2> 1441705 T3758 oasc.CorePropertiesLocator.discover Found 1 core definitions
   [junit4]   2> 1441706 T3758 oass.SolrDispatchFilter.init user.dir=/usr/home/hudson/hudson-slave/workspace/Lucene-Solr-Tests-4.x-Java7/solr/build/solr-core/test/J0
   [junit4]   2> 1441706 T3758 oass.SolrDispatchFilter.init SolrDispatchFilter.init() done
   [junit4]   2> 1441707 T3758 oascsi.HttpClientUtil.createClient Creating new http client, config:maxConnections=128&maxConnectionsPerHost=32&followRedirects=false
   [junit4]   2> 1441724 T3758 oascsi.HttpClientUtil.createClient Creating new http client, config:maxConnections=128&maxConnectionsPerHost=32&followRedirects=false
   [junit4]   2> 1441743 T3788 oasha.CollectionsHandler.handleCreateAction Creating Collection : numShards=2&name=nodes_used_collection&replicationFactor=2&action=CREATE&wt=javabin&version=2
   [junit4]   2> 1441745 T3780 oasc.DistributedQueue$LatchChildWatcher.process Watcher fired on path: /overseer/collection-queue-work state: SyncConnected type NodeChildrenChanged
   [junit4]   2> 1441746 T3782 oasc.OverseerCollectionProcessor.run Overseer Collection Processor: Get the message id:/overseer/collection-queue-work/qn-0000000000 message:{
   [junit4]   2> 	  "operation":"createcollection",
   [junit4]   2> 	  "numShards":"2",
   [junit4]   2> 	  "name":"nodes_used_collection",
   [junit4]   2> 	  "replicationFactor":"2"}
   [junit4]   2> 1441746 T3782 oasc.OverseerCollectionProcessor.processMessage WARN OverseerCollectionProcessor.processMessage : createcollection , {
   [junit4]   2> 	  "operation":"createcollection",
   [junit4]   2> 	  "numShards":"2",
   [junit4]   2> 	  "name":"nodes_used_collection",
   [junit4]   2> 	  "replicationFactor":"2"}
   [junit4]   2> 1443042 T3781 oascc.ZkStateReader.updateClusterState Updating cloud state from ZooKeeper... 
   [junit4]   2> 1443043 T3781 oasc.Overseer$ClusterStateUpdater.buildCollection building a new collection: nodes_used_collection
   [junit4]   2> 1443043 T3781 oasc.Overseer$ClusterStateUpdater.createCollection Create collection nodes_used_collection with shards [shard1, shard2]
   [junit4]   2> 1443047 T3780 oascc.ZkStateReader$2.process A cluster state change: WatchedEvent state:SyncConnected type:NodeDataChanged path:/clusterstate.json, has occurred - updating... (live nodes size: 5)
   [junit4]   2> 1443047 T3840 oascc.ZkStateReader$2.process A cluster state change: WatchedEvent state:SyncConnected type:NodeDataChanged path:/clusterstate.json, has occurred - updating... (live nodes size: 5)
   [junit4]   2> 1443047 T3785 oascc.ZkStateReader$2.process A cluster state change: WatchedEvent state:SyncConnected type:NodeDataChanged path:/clusterstate.json, has occurred - updating... (live nodes size: 5)
   [junit4]   2> 1443047 T3826 oascc.ZkStateReader$2.process A cluster state change: WatchedEvent state:SyncConnected type:NodeDataChanged path:/clusterstate.json, has occurred - updating... (live nodes size: 5)
   [junit4]   2> 1443047 T3798 oascc.ZkStateReader$2.process A cluster state change: WatchedEvent state:SyncConnected type:NodeDataChanged path:/clusterstate.json, has occurred - updating... (live nodes size: 5)
   [junit4]   2> 1443047 T3812 oascc.ZkStateReader$2.process A cluster state change: WatchedEvent state:SyncConnected type:NodeDataChanged path:/clusterstate.json, has occurred - updating... (live nodes size: 5)
   [junit4]   2> 1443066 T3782 oasc.OverseerCollectionProcessor.createCollection going to create cores replicas shardNames [shard1, shard2] , repFactor : 2
   [junit4]   2> 1443066 T3782 oasc.OverseerCollectionProcessor.createCollection Creating shard nodes_used_collection_shard1_replica1 as part of slice shard1 of collection nodes_used_collection on 127.0.0.1:57928_
   [junit4]   2> 1443066 T3782 oasc.OverseerCollectionProcessor.createCollection Creating shard nodes_used_collection_shard1_replica2 as part of slice shard1 of collection nodes_used_collection on 127.0.0.1:44411_
   [junit4]   2> 1443068 T3782 oasc.OverseerCollectionProcessor.createCollection Creating shard nodes_used_collection_shard2_replica1 as part of slice shard2 of collection nodes_used_collection on 127.0.0.1:50578_
   [junit4]   2> 1443068 T3782 oasc.OverseerCollectionProcessor.createCollection Creating shard nodes_used_collection_shard2_replica2 as part of slice shard2 of collection nodes_used_collection on 127.0.0.1:22726_
   [junit4]   2> 1443071 T3789 oasc.ZkController.publish publishing core=nodes_used_collection_shard1_replica2 state=down
   [junit4]   2> 1443072 T3770 oasc.ZkController.publish publishing core=nodes_used_collection_shard2_replica1 state=down
   [junit4]   2> 1443072 T3830 oasc.ZkController.publish publishing core=nodes_used_collection_shard2_replica2 state=down
   [junit4]   2> 1443071 T3802 oasc.ZkController.publish publishing core=nodes_used_collection_shard1_replica1 state=down
   [junit4]   2> 1443073 T3789 oasc.ZkController.waitForCoreNodeName look for our core node name
   [junit4]   2> 1443073 T3770 oasc.ZkController.waitForCoreNodeName look for our core node name
   [junit4]   2> 1443074 T3830 oasc.ZkController.waitForCoreNodeName look for our core node name
   [junit4]   2> 1443074 T3802 oasc.ZkController.waitForCoreNodeName look for our core node name
   [junit4]   2> 1444553 T3781 oascc.ZkStateReader.updateClusterState Updating cloud state from ZooKeeper... 
   [junit4]   2> 1444554 T3781 oasc.Overseer$ClusterStateUpdater.updateState WARN Could not find collection node for nodes_used_collection, skipping publish state
   [junit4]   2> 1444554 T3781 oasc.Overseer$ClusterStateUpdater.updateState Update state numShards=2 message={
   [junit4]   2> 	  "operation":"state",
   [junit4]   2> 	  "core_node_name":"core_node1",
   [junit4]   2> 	  "numShards":"2",
   [junit4]   2> 	  "shard":"shard1",
   [junit4]   2> 	  "roles":null,
   [junit4]   2> 	  "state":"down",
   [junit4]   2> 	  "shard_state":"active",
   [junit4]   2> 	  "core":"nodes_used_collection_shard1_replica2",
   [junit4]   2> 	  "collection":"nodes_used_collection",
   [junit4]   2> 	  "shard_range":null,
   [junit4]   2> 	  "node_name":"127.0.0.1:44411_",
   [junit4]   2> 	  "base_url":"http://127.0.0.1:44411"}
   [junit4]   2> 1444567 T3781 oasc.Overseer$ClusterStateUpdater.updateState WARN Could not find collection node for nodes_used_collection, skipping publish state
   [junit4]   2> 1444567 T3781 oasc.Overseer$ClusterStateUpdater.updateState Update state numShards=2 message={
   [junit4]   2> 	  "operation":"state",
   [junit4]   2> 	  "core_node_name":"core_node2",
   [junit4]   2> 	  "numShards":"2",
   [junit4]   2> 	  "shard":"shard2",
   [junit4]   2> 	  "roles":null,
   [junit4]   2> 	  "state":"down",
   [junit4]   2> 	  "shard_state":"active",
   [junit4]   2> 	  "core":"nodes_used_collection_shard2_replica1",
   [junit4]   2> 	  "collection":"nodes_used_collection",
   [junit4]   2> 	  "shard_range":null,
   [junit4]   2> 	  "node_name":"127.0.0.1:50578_",
   [junit4]   2> 	  "base_url":"http://127.0.0.1:50578"}
   [junit4]   2> 1444576 T3781 oasc.Overseer$ClusterStateUpdater.updateState WARN Could not find collection node for nodes_used_collection, skipping publish state
   [junit4]   2> 1444577 T3781 oasc.Overseer$ClusterStateUpdater.updateState Update state numShards=2 message={
   [junit4]   2> 	  "operation":"state",
   [junit4]   2> 	  "core_node_name":"core_node3",
   [junit4]   2> 	  "numShards":"2",
   [junit4]   2> 	  "shard":"shard2",
   [junit4]   2> 	  "roles":null,
   [junit4]   2> 	  "state":"down",
   [junit4]   2> 	  "shard_state":"active",
   [junit4]   2> 	  "core":"nodes_used_collection_shard2_replica2",
   [junit4]   2> 	  "collection":"nodes_used_collection",
   [junit4]   2> 	  "shard_range":null,
   [junit4]   2> 	  "node_name":"127.0.0.1:22726_",
   [junit4]   2> 	  "base_url":"http://127.0.0.1:22726"}
   [junit4]   2> 1444580 T3781 oasc.Overseer$ClusterStateUpdater.updateState WARN Could not find collection node for nodes_used_collection, skipping publish state
   [junit4]   2> 1444580 T3781 oasc.Overseer$ClusterStateUpdater.updateState Update state numShards=2 message={
   [junit4]   2> 	  "operation":"state",
   [junit4]   2> 	  "core_node_name":"core_node4",
   [junit4]   2> 	  "numShards":"2",
   [junit4]   2> 	  "shard":"shard1",
   [junit4]   2> 	  "roles":null,
   [junit4]   2> 	  "state":"down",
   [junit4]   2> 	  "shard_state":"active",
   [junit4]   2> 	  "core":"nodes_used_collection_shard1_replica1",
   [junit4]   2> 	  "collection":"nodes_used_collection",
   [junit4]   2> 	  "shard_range":null,
   [junit4]   2> 	  "node_name":"127.0.0.1:57928_",
   [junit4]   2> 	  "base_url":"http://127.0.0.1:57928"}
   [junit4]   2> 1444584 T3798 oascc.ZkStateReader$2.process A cluster state change: WatchedEvent state:SyncConnected type:NodeDataChanged path:/clusterstate.json, has occurred - updating... (live nodes size: 5)
   [junit4]   2> 1444584 T3826 oascc.ZkStateReader$2.process A cluster state change: WatchedEvent state:SyncConnected type:NodeDataChanged path:/clusterstate.json, has occurred - updating... (live nodes size: 5)
   [junit4]   2> 1444584 T3812 oascc.ZkStateReader$2.process A cluster state change: WatchedEvent state:SyncConnected type:NodeDataChanged path:/clusterstate.json, has occurred - updating... (live nodes size: 5)
   [junit4]   2> 1444584 T3785 oascc.ZkStateReader$2.process A cluster state change: WatchedEvent state:SyncConnected type:NodeDataChanged path:/clusterstate.json, has occurred - updating... (live nodes size: 5)
   [junit4]   2> 1444584 T3840 oascc.ZkStateReader$2.process A cluster state change: WatchedEvent state:SyncConnected type:NodeDataChanged path:/clusterstate.json, has occurred - updating... (live nodes size: 5)
   [junit4]   2> 1444584 T3780 oascc.ZkStateReader$2.process A cluster state change: WatchedEvent state:SyncConnected type:NodeDataChanged path:/clusterstate.json, has occurred - updating... (live nodes size: 5)
   [junit4]   2> 1445076 T3789 oasc.ZkController.waitForShardId waiting to find shard id in clusterstate for nodes_used_collection_shard1_replica2
   [junit4]   2> 1445076 T3830 oasc.ZkController.waitForShardId waiting to find shard id in clusterstate for nodes_used_collection_shard2_replica2
   [junit4]   2> 1445076 T3770 oasc.ZkController.waitForShardId waiting to find shard id in clusterstate for nodes_used_collection_shard2_replica1
   [junit4]   2> 1445077 T3789 oasc.CorePropertiesLocator.writePropertiesFile ERROR Couldn't persist core properties to /usr/home/hudson/hudson-slave/workspace/Lucene-Solr-Tests-4.x-Java7/solr/build/solr-core/test/J0/./org.apache.solr.cloud.CollectionsAPIDistributedZkTest-jetty1-1375371955400/nodes_used_collection_shard1_replica2/core.properties: java.io.FileNotFoundException: /usr/home/hudson/hudson-slave/workspace/Lucene-Solr-Tests-4.x-Java7/solr/build/solr-core/test/J0/./org.apache.solr.cloud.CollectionsAPIDistributedZkTest-jetty1-1375371955400/nodes_used_collection_shard1_replica2/core.properties (No such file or directory)
   [junit4]   2> 1445078 T3802 oasc.ZkController.waitForShardId waiting to find shard id in clusterstate for nodes_used_collection_shard1_replica1
   [junit4]   2> 1445078 T3830 oasc.CorePropertiesLocator.writePropertiesFile ERROR Couldn't persist core properties to /usr/home/hudson/hudson-slave/workspace/Lucene-Solr-Tests-4.x-Java7/solr/build/solr-core/test/J0/./org.apache.solr.cloud.CollectionsAPIDistributedZkTest-jetty4-1375371960740/nodes_used_collection_shard2_replica2/core.properties: java.io.FileNotFoundException: /usr/home/hudson/hudson-slave/workspace/Lucene-Solr-Tests-4.x-Java7/solr/build/solr-core/test/J0/./org.apache.solr.cloud.CollectionsAPIDistributedZkTest-jetty4-1375371960740/nodes_used_collection_shard2_replica2/core.properties (No such file or directory)
   [junit4]   2> 1445078 T3770 oasc.CorePropertiesLocator.writePropertiesFile ERROR Couldn't persist core properties to /usr/home/hudson/hudson-slave/workspace/Lucene-Solr-Tests-4.x-Java7/solr/build/solr-core/test/J0/./org.apache.solr.cloud.CollectionsAPIDistributedZkTest-controljetty-1375371954624/nodes_used_collection_shard2_replica1/core.properties: java.io.FileNotFoundException: /usr/home/hudson/hudson-slave/workspace/Lucene-Solr-Tests-4.x-Java7/solr/build/solr-core/test/J0/./org.apache.solr.cloud.CollectionsAPIDistributedZkTest-controljetty-1375371954624/nodes_used_collection_shard2_replica1/core.properties (No such file or directory)
   [junit4]   2> 1445078 T3789 oasc.CoreContainer.create Creating SolrCore 'nodes_used_collection_shard1_replica2' using instanceDir: /usr/home/hudson/hudson-slave/workspace/Lucene-Solr-Tests-4.x-Java7/solr/build/solr-core/test/J0/./org.apache.solr.cloud.CollectionsAPIDistributedZkTest-jetty1-1375371955400/nodes_used_collection_shard1_replica2
   [junit4]   2> 1445079 T3770 oasc.CoreContainer.create Creating SolrCore 'nodes_used_collection_shard2_replica1' using instanceDir: /usr/home/hudson/hudson-slave/workspace/Lucene-Solr-Tests-4.x-Java7/solr/build/solr-core/test/J0/./org.apache.solr.cloud.CollectionsAPIDistributedZkTest-controljetty-1375371954624/nodes_used_collection_shard2_replica1
   [junit4]   2> 1445079 T3802 oasc.CorePropertiesLocator.writePropertiesFile ERROR Couldn't persist core properties to /usr/home/hudson/hudson-slave/workspace/Lucene-Solr-Tests-4.x-Java7/solr/build/solr-core/test/J0/./org.apache.solr.cloud.CollectionsAPIDistributedZkTest-jetty2-1375371957110/nodes_used_collection_shard1_replica1/core.properties: java.io.FileNotFoundException: /usr/home/hudson/hudson-slave/workspace/Lucene-Solr-Tests-4.x-Java7/solr/build/solr-core/test/J0/./org.apache.solr.cloud.CollectionsAPIDistributedZkTest-jetty2-1375371957110/nodes_used_collection_shard1_replica1/core.properties (No such file or directory)
   [junit4]   2> 1445079 T3830 oasc.CoreContainer.create Creating SolrCore 'nodes_used_collection_shard2_replica2' using instanceDir: /usr/home/hudson/hudson-slave/workspace/Lucene-Solr-Tests-4.x-Java7/solr/build/solr-core/test/J0/./org.apache.solr.cloud.CollectionsAPIDistributedZkTest-jetty4-1375371960740/nodes_used_collection_shard2_replica2
   [junit4]   2> 1445080 T3802 oasc.CoreContainer.create Creating SolrCore 'nodes_used_collection_shard1_replica1' using instanceDir: /usr/home/hudson/hudson-slave/workspace/Lucene-Solr-Tests-4.x-Java7/solr/build/solr-core/test/J0/./org.apache.solr.cloud.CollectionsAPIDistributedZkTest-jetty2-1375371957110/nodes_used_collection_shard1_replica1
   [junit4]   2> 1445080 T3770 oasc.ZkController.createCollectionZkNode Check for collection zkNode:nodes_used_collection
   [junit4]   2> 1445079 T3789 oasc.ZkController.createCollectionZkNode Check for collection zkNode:nodes_used_collection
   [junit4]   2> 1445081 T3802 oasc.ZkController.createCollectionZkNode Check for collection zkNode:nodes_used_collection
   [junit4]   2> 1445081 T3830 oasc.ZkController.createCollectionZkNode Check for collection zkNode:nodes_used_collection
   [junit4]   2> 1445082 T3789 oasc.ZkController.createCollectionZkNode Creating collection in ZooKeeper:nodes_used_collection
   [junit4]   2> 1445082 T3770 oasc.ZkController.createCollectionZkNode Creating collection in ZooKeeper:nodes_used_collection
   [junit4]   2> 1445083 T3830 oasc.ZkController.createCollectionZkNode Creating collection in ZooKeeper:nodes_used_collection
   [junit4]   2> 1445083 T3789 oasc.ZkController.getConfName Looking for collection configName
   [junit4]   2> 1445082 T3802 oasc.ZkController.createCollectionZkNode Creating collection in ZooKeeper:nodes_used_collection
   [junit4]   2> 1445084 T3830 oasc.ZkController.getConfName Looking for collection configName
   [junit4]   2> 1445083 T3770 oasc.ZkController.getConfName Looking for collection configName
   [junit4]   2> 1445085 T3789 oasc.ZkController.getConfName Only one config set found in zk - using it:conf1
   [junit4]   2> 1445084 T3802 oasc.ZkController.getConfName Looking for collection configName
   [junit4]   2> 1445085 T3789 oascc.SolrZkClient.makePath makePath: /collections/nodes_used_collection
   [junit4]   2> 1445085 T3830 oasc.ZkController.getConfName Only one config set found in zk - using it:conf1
   [junit4]   2> 1445086 T3770 oasc.ZkController.getConfName Only one config set found in zk - using it:conf1
   [junit4]   2> 1445086 T3802 oasc.ZkController.getConfName Only one config set found in zk - using it:conf1
   [junit4]   2> 1445086 T3830 oascc.SolrZkClient.makePath makePath: /collections/nodes_used_collection
   [junit4]   2> 1445087 T3802 oascc.SolrZkClient.makePath makePath: /collections/nodes_used_collection
   [junit4]   2> 1445087 T3770 oascc.SolrZkClient.makePath makePath: /collections/nodes_used_collection
   [junit4]   2> 1445088 T3789 oasc.ZkController.readConfigName Load collection config from:/collections/nodes_used_collection
   [junit4]   2> 1445089 T3830 oasc.ZkController.readConfigName Load collection config from:/collections/nodes_used_collection
   [junit4]   2> 1445101 T3802 oasc.ZkController.readConfigName Load collection config from:/collections/nodes_used_collection
   [junit4]   2> 1445101 T3789 oasc.SolrResourceLoader.<init> new SolrResourceLoader for directory: '/usr/home/hudson/hudson-slave/workspace/Lucene-Solr-Tests-4.x-Java7/solr/build/solr-core/test/J0/./org.apache.solr.cloud.CollectionsAPIDistributedZkTest-jetty1-1375371955400/nodes_used_collection_shard1_replica2/'
   [junit4]   2> 1445101 T3770 oasc.ZkController.readConfigName Load collection config from:/collections/nodes_used_collection
   [junit4]   2> 1445102 T3802 oasc.SolrResourceLoader.<init> new SolrResourceLoader for directory: '/usr/home/hudson/hudson-slave/workspace/Lucene-Solr-Tests-4.x-Java7/solr/build/solr-core/test/J0/./org.apache.solr.cloud.CollectionsAPIDistributedZkTest-jetty2-1375371957110/nodes_used_collection_shard1_replica1/'
   [junit4]   2> 1445102 T3830 oasc.SolrResourceLoader.<init> new SolrResourceLoader for directory: '/usr/home/hudson/hudson-slave/workspace/Lucene-Solr-Tests-4.x-Java7/solr/build/solr-core/test/J0/./org.apache.solr.cloud.CollectionsAPIDistributedZkTest-jetty4-1375371960740/nodes_used_collection_shard2_replica2/'
   [junit4]   2> 1445103 T3770 oasc.SolrResourceLoader.<init> new SolrResourceLoader for directory: '/usr/home/hudson/hudson-slave/workspace/Lucene-Solr-Tests-4.x-Java7/solr/build/solr-core/test/J0/./org.apache.solr.cloud.CollectionsAPIDistributedZkTest-controljetty-1375371954624/nodes_used_collection_shard2_replica1/'
   [junit4]   2> 1445249 T3802 oasc.SolrConfig.<init> Using Lucene MatchVersion: LUCENE_45
   [junit4]   2> 1445249 T3770 oasc.SolrConfig.<init> Using Lucene MatchVersion: LUCENE_45
   [junit4]   2> 1445249 T3789 oasc.SolrConfig.<init> Using Lucene MatchVersion: LUCENE_45
   [junit4]   2> 1445249 T3830 oasc.SolrConfig.<init> Using Lucene MatchVersion: LUCENE_45
   [junit4]   2> 1445327 T3802 oasc.SolrConfig.<init> Loaded SolrConfig: solrconfig.xml
   [junit4]   2> 1445328 T3789 oasc.SolrConfig.<init> Loaded SolrConfig: solrconfig.xml
   [junit4]   2> 1445329 T3830 oasc.SolrConfig.<init> Loaded SolrConfig: solrconfig.xml
   [junit4]   2> 1445328 T3770 oasc.SolrConfig.<init> Loaded SolrConfig: solrconfig.xml
   [junit4]   2> 1445430 T3802 oass.IndexSchema.readSchema Reading Solr Schema from schema.xml
   [junit4]   2> 1445431 T3789 oass.IndexSchema.readSchema Reading Solr Schema from schema.xml
   [junit4]   2> 1445431 T3770 oass.IndexSchema.readSchema Reading Solr Schema from schema.xml
   [junit4]   2> 1445431 T3830 oass.IndexSchema.readSchema Reading Solr Schema from schema.xml
   [junit4]   2> 1445470 T3802 oass.IndexSchema.readSchema [nodes_used_collection_shard1_replica1] Schema name=test
   [junit4]   2> 1445472 T3789 oass.IndexSchema.readSchema [nodes_used_collection_shard1_replica2] Schema name=test
   [junit4]   2> 1445472 T3770 oass.IndexSchema.readSchema [nodes_used_collection_shard2_replica1] Schema name=test
   [junit4]   2> 1445472 T3830 oass.IndexSchema.readSchema [nodes_used_collection_shard2_replica2] Schema name=test
   [junit4]   2> 1446281 T3802 oass.ByteField.init WARN ByteField is deprecated and will be removed in 5.0. You should use TrieIntField instead.
   [junit4]   2> 1446282 T3802 oass.ShortField.init WARN ShortField is deprecated and will be removed in 5.0. You should use TrieIntField instead.
   [junit4]   2> 1446283 T3802 oass.OpenExchangeRatesOrgProvider.init Initialized with rates=open-exchange-rates.json, refreshInterval=1440.
   [junit4]   2> 1446285 T3770 oass.ByteField.init WARN ByteField is deprecated and will be removed in 5.0. You should use TrieIntField instead.
   [junit4]   2> 1446285 T3770 oass.ShortField.init WARN ShortField is deprecated and will be removed in 5.0. You should use TrieIntField instead.
   [junit4]   2> 1446286 T3770 oass.OpenExchangeRatesOrgProvider.init Initialized with rates=open-exchange-rates.json, refreshInterval=1440.
   [junit4]   2> 1446296 T3802 oass.IndexSchema.readSchema default search field in schema is text
   [junit4]   2> 1446318 T3770 oass.IndexSchema.readSchema default search field in schema is text
   [junit4]   2> 1446321 T3830 oass.ByteField.init WARN ByteField is deprecated and will be removed in 5.0. You should use TrieIntField instead.
   [junit4]   2> 1446322 T3830 oass.ShortField.init WARN ShortField is deprecated and will be removed in 5.0. You should use TrieIntField instead.
   [junit4]   2> 1446323 T3802 oass.IndexSchema.readSchema unique key field: id
   [junit4]   2> 1446323 T3830 oass.OpenExchangeRatesOrgProvider.init Initialized with rates=open-exchange-rates.json, refreshInterval=1440.
   [junit4]   2> 1446323 T3770 oass.IndexSchema.readSchema unique key field: id
   [junit4]   2> 1446324 T3789 oass.ByteField.init WARN ByteField is deprecated and will be removed in 5.0. You should use TrieIntField instead.
   [junit4]   2> 1446325 T3789 oass.ShortField.init WARN ShortField is deprecated and will be removed in 5.0. You should use TrieIntField instead.
   [junit4]   2> 1446326 T3789 oass.OpenExchangeRatesOrgProvider.init Initialized with rates=open-exchange-rates.json, refreshInterval=1440.
   [junit4]   2> 1446332 T3830 oass.IndexSchema.readSchema default search field in schema is text
   [junit4]   2> 1446334 T3789 oass.IndexSchema.readSchema default search field in schema is text
   [junit4]   2> 1446337 T3830 oass.IndexSchema.readSchema unique key field: id
   [junit4]   2> 1446338 T3770 oass.FileExchangeRateProvider.reload Reloading exchange rates from file currency.xml
   [junit4]   2> 1446338 T3802 oass.FileExchangeRateProvider.reload Reloading exchange rates from file currency.xml
   [junit4]   2> 1446338 T3789 oass.IndexSchema.readSchema unique key field: id
   [junit4]   2> 1446343 T3770 oass.FileExchangeRateProvider.reload Reloading exchange rates from file currency.xml
   [junit4]   2> 1446344 T3802 oass.FileExchangeRateProvider.reload Reloading exchange rates from file currency.xml
   [junit4]   2> 1446348 T3770 oass.OpenExchangeRatesOrgProvider.reload Reloading exchange rates from open-exchange-rates.json
   [junit4]   2> 1446349 T3770 oass.OpenExchangeRatesOrgProvider$OpenExchangeRates.<init> WARN Unknown key IMPORTANT NOTE
   [junit4]   2> 1446349 T3802 oass.OpenExchangeRatesOrgProvider.reload Reloading exchange rates from open-exchange-rates.json
   [junit4]   2> 1446350 T3770 oass.OpenExchangeRatesOrgProvider$OpenExchangeRates.<init> WARN Expected key, got STRING
   [junit4]   2> 1446351 T3770 oass.OpenExchangeRatesOrgProvider.reload Reloading exchange rates from open-exchange-rates.json
   [junit4]   2> 1446351 T3830 oass.FileExchangeRateProvider.reload Reloading exchange rates from file currency.xml
   [junit4]   2> 1446351 T3802 oass.OpenExchangeRatesOrgProvider$OpenExchangeRates.<init> WARN Unknown key IMPORTANT NOTE
   [junit4]   2> 1446352 T3770 oass.OpenExchangeRatesOrgProvider$OpenExchangeRates.<init> WARN Unknown key IMPORTANT NOTE
   [junit4]   2> 1446352 T3802 oass.OpenExchangeRatesOrgProvider$OpenExchangeRates.<init> WARN Expected key, got STRING
   [junit4]   2> 1446352 T3789 oass.FileExchangeRateProvider.reload Reloading exchange rates from file currency.xml
   [junit4]   2> 1446352 T3770 oass.OpenExchangeRatesOrgProvider$OpenExchangeRates.<init> WARN Expected key, got STRING
   [junit4]   2> 1446353 T3802 oass.OpenExchangeRatesOrgProvider.reload Reloading exchange rates from open-exchange-rates.json
   [junit4]   2> 1446353 T3770 oasc.SolrCore.initDirectoryFactory org.apache.solr.core.MockDirectoryFactory
   [junit4]   2> 1446354 T3770 oasc.SolrCore.<init> [nodes_used_collection_shard2_replica1] Opening new SolrCore at /usr/home/hudson/hudson-slave/workspace/Lucene-Solr-Tests-4.x-Java7/solr/build/solr-core/test/J0/./org.apache.solr.cloud.CollectionsAPIDistributedZkTest-controljetty-1375371954624/nodes_used_collection_shard2_replica1/, dataDir=/usr/home/hudson/hudson-slave/workspace/Lucene-Solr-Tests-4.x-Java7/solr/build/solr-core/test/J0/./org.apache.solr.cloud.CollectionsAPIDistributedZkTest-controljetty-1375371954624//nodes_used_collection_shard2_replica1/data/
   [junit4]   2> 1446354 T3802 oass.OpenExchangeRatesOrgProvider$OpenExchangeRates.<init> WARN Unknown key IMPORTANT NOTE
   [junit4]   2> 1446355 T3802 oass.OpenExchangeRatesOrgProvider$OpenExchangeRates.<init> WARN Expected key, got STRING
   [junit4]   2> 1446355 T3770 oasc.JmxMonitoredMap.<init> JMX monitoring is enabled. Adding Solr mbeans to JMX Server: com.sun.jmx.mbeanserver.JmxMBeanServer@5123fa9f
   [junit4]   2> 1446356 T3802 oasc.SolrCore.initDirectoryFactory org.apache.solr.core.MockDirectoryFactory
   [junit4]   2> 1446356 T3830 oass.FileExchangeRateProvider.reload Reloading exchange rates from file currency.xml
   [junit4]   2> 1446356 T3802 oasc.SolrCore.<init> [nodes_used_collection_shard1_replica1] Opening new SolrCore at /usr/home/hudson/hudson-slave/workspace/Lucene-Solr-Tests-4.x-Java7/solr/build/solr-core/test/J0/./org.apache.solr.cloud.CollectionsAPIDistributedZkTest-jetty2-1375371957110/nodes_used_collection_shard1_replica1/, dataDir=/usr/home/hudson/hudson-slave/workspace/Lucene-Solr-Tests-4.x-Java7/solr/build/solr-core/test/J0/./org.apache.solr.cloud.CollectionsAPIDistributedZkTest-jetty2-1375371957110//nodes_used_collection_shard1_replica1/data/
   [junit4]   2> 1446357 T3770 oasc.CachingDirectoryFactory.get return new directory for /usr/home/hudson/hudson-slave/workspace/Lucene-Solr-Tests-4.x-Java7/solr/build/solr-core/test/J0/./org.apache.solr.cloud.CollectionsAPIDistributedZkTest-controljetty-1375371954624//nodes_used_collection_shard2_replica1/data
   [junit4]   2> 1446357 T3802 oasc.JmxMonitoredMap.<init> JMX monitoring is enabled. Adding Solr mbeans to JMX Server: com.sun.jmx.mbeanserver.JmxMBeanServer@5123fa9f
   [junit4]   2> 1446357 T3770 oasc.SolrCore.getNewIndexDir New index directory detected: old=null new=/usr/home/hudson/hudson-slave/workspace/Lucene-Solr-Tests-4.x-Java7/solr/build/solr-core/test/J0/./org.apache.solr.cloud.CollectionsAPIDistributedZkTest-controljetty-1375371954624//nodes_used_collection_shard2_replica1/data/index/
   [junit4]   2> 1446357 T3789 oass.FileExchangeRateProvider.reload Reloading exchange rates from file currency.xml
   [junit4]   2> 1446358 T3770 oasc.SolrCore.initIndex WARN [nodes_used_collection_shard2_replica1] Solr index directory '/usr/home/hudson/hudson-slave/workspace/Lucene-Solr-Tests-4.x-Java7/solr/build/solr-core/test/J0/./org.apache.solr.cloud.CollectionsAPIDistributedZkTest-controljetty-1375371954624/nodes_used_collection_shard2_replica1/data/index' doesn't exist. Creating new index...
   [junit4]   2> 1446359 T3802 oasc.CachingDirectoryFactory.get return new directory for /usr/home/hudson/hudson-slave/workspace/Lucene-Solr-Tests-4.x-Java7/solr/build/solr-core/test/J0/./org.apache.solr.cloud.CollectionsAPIDistributedZkTest-jetty2-1375371957110//nodes_used_collection_shard1_replica1/data
   [junit4]   2> 1446359 T3770 oasc.CachingDirectoryFactory.get return new directory for /usr/home/hudson/hudson-slave/workspace/Lucene-Solr-Tests-4.x-Java7/solr/build/solr-core/test/J0/./org.apache.solr.cloud.CollectionsAPIDistributedZkTest-controljetty-1375371954624//nodes_used_collection_shard2_replica1/data/index
   [junit4]   2> 1446359 T3802 oasc.SolrCore.getNewIndexDir New index directory detected: old=null new=/usr/home/hudson/hudson-slave/workspace/Lucene-Solr-Tests-4.x-Java7/solr/build/solr-core/test/J0/./org.apache.solr.cloud.CollectionsAPIDistributedZkTest-jetty2-1375371957110//nodes_used_collection_shard1_replica1/data/index/
   [junit4]   2> 1446360 T3802 oasc.SolrCore.initIndex WARN [nodes_used_collection_shard1_replica1] Solr index directory '/usr/home/hudson/hudson-slave/workspace/Lucene-Solr-Tests-4.x-Java7/solr/build/solr-core/test/J0/./org.apache.solr.cloud.CollectionsAPIDistributedZkTest-jetty2-1375371957110/nodes_used_collection_shard1_replica1/data/index' doesn't exist. Creating new index...
   [junit4]   2> 1446361 T3802 oasc.CachingDirectoryFactory.get return new directory for /usr/home/hudson/hudson-slave/workspace/Lucene-Solr-Tests-4.x-Java7/solr/build/solr-core/test/J0/./org.apache.solr.cloud.CollectionsAPIDistributedZkTest-jetty2-1375371957110//nodes_used_collection_shard1_replica1/data/index
   [junit4]   2> 1446361 T3830 oass.OpenExchangeRatesOrgProvider.reload Reloading exchange rates from open-exchange-rates.json
   [junit4]   2> 1446363 T3830 oass.OpenExchangeRatesOrgProvider$OpenExchangeRates.<init> WARN Unknown key IMPORTANT NOTE
   [junit4]   2> 1446363 T3830 oass.OpenExchangeRatesOrgProvider$OpenExchangeRates.<init> WARN Expected key, got STRING
   [junit4]   2> 1446363 T3789 oass.OpenExchangeRatesOrgProvider.reload Reloading exchange rates from open-exchange-rates.json
   [junit4]   2> 1446363 T3830 oass.OpenExchangeRatesOrgProvider.reload Reloading exchange rates from open-exchange-rates.json
   [junit4]   2> 1446365 T3789 oass.OpenExchangeRatesOrgProvider$OpenExchangeRates.<init> WARN Unknown key IMPORTANT NOTE
   [junit4]   2> 1446365 T3830 oass.OpenExchangeRatesOrgProvider$OpenExchangeRates.<init> WARN Unknown key IMPORTANT NOTE
   [junit4]   2> 1446365 T3770 oasc.SolrDeletionPolicy.onCommit SolrDeletionPolicy.onCommit: commits: num=1
   [junit4]   2> 		commit{dir=MockDirWrapper(org.apache.lucene.store.RAMDirectory@5cc91f35 lockFactory=org.apache.lucene.store.NativeFSLockFactory@3c720c2b),segFN=segments_1,generation=1}
   [junit4]   2> 1446365 T3789 oass.OpenExchangeRatesOrgProvider$OpenExchangeRates.<init> WARN Expected key, got STRING
   [junit4]   2> 1446366 T3770 oasc.SolrDeletionPolicy.updateCommits newest commit generation = 1
   [junit4]   2> 1446365 T3830 oass.OpenExchangeRatesOrgProvider$OpenExchangeRates.<init> WARN Expected key, got STRING
   [junit4]   2> 1446367 T3802 oasc.SolrDeletionPolicy.onCommit SolrDeletionPolicy.onCommit: commits: num=1
   [junit4]   2> 		commit{dir=MockDirWrapper(org.apache.lucene.store.RAMDirectory@22049e82 lockFactory=org.apache.lucene.store.NativeFSLockFactory@190bfb9e),segFN=segments_1,generation=1}
   [junit4]   2> 1446366 T3789 oass.OpenExchangeRatesOrgProvider.reload Reloading exchange rates from open-exchange-rates.json
   [junit4]   2> 1446367 T3802 oasc.SolrDeletionPolicy.updateCommits newest commit generation = 1
   [junit4]   2> 1446367 T3830 oasc.SolrCore.initDirectoryFactory org.apache.solr.core.MockDirectoryFactory
   [junit4]   2> 1446368 T3789 oass.OpenExchangeRatesOrgProvider$OpenExchangeRates.<init> WARN Unknown key IMPORTANT NOTE
   [junit4]   2> 1446369 T3830 oasc.SolrCore.<init> [nodes_used_collection_shard2_replica2] Opening new SolrCore at /usr/home/hudson/hudson-slave/workspace/Lucene-Solr-Tests-4.x-Java7/solr/build/solr-core/test/J0/./org.apache.solr.cloud.CollectionsAPIDistributedZkTest-jetty4-1375371960740/nodes_used_collection_shard2_replica2/, dataDir=/usr/home/hudson/hudson-slave/workspace/Lucene-Solr-Tests-4.x-Java7/solr/build/solr-core/test/J0/./org.apache.solr.cloud.CollectionsAPIDistributedZkTest-jetty4-1375371960740//nodes_used_collection_shard2_replica2/data/
   [junit4]   2> 1446369 T3789 oass.OpenExchangeRatesOrgProvider$OpenExchangeRates.<init> WARN Expected key, got STRING
   [junit4]   2> 1446369 T3830 oasc.JmxMonitoredMap.<init> JMX monitoring is enabled. Adding Solr mbeans to JMX Server: com.sun.jmx.mbeanserver.JmxMBeanServer@5123fa9f
   [junit4]   2> 1446370 T3789 oasc.SolrCore.initDirectoryFactory org.apache.solr.core.MockDirectoryFactory
   [junit4]   2> 1446371 T3789 oasc.SolrCore.<init> [nodes_used_collection_shard1_replica2] Opening new SolrCore at /usr/home/hudson/hudson-slave/workspace/Lucene-Solr-Tests-4.x-Java7/solr/build/solr-core/test/J0/./org.apache.solr.cloud.CollectionsAPIDistributedZkTest-jetty1-1375371955400/nodes_used_collection_shard1_replica2/, dataDir=/usr/home/hudson/hudson-slave/workspace/Lucene-Solr-Tests-4.x-Java7/solr/build/solr-core/test/J0/./org.apache.solr.cloud.CollectionsAPIDistributedZkTest-jetty1-1375371955400//nodes_used_collection_shard1_replica2/data/
   [junit4]   2> 1446371 T3830 oasc.CachingDirectoryFactory.get return new directory for /usr/home/hudson/hudson-slave/workspace/Lucene-Solr-Tests-4.x-Java7/solr/build/solr-core/test/J0/./org.apache.solr.cloud.CollectionsAPIDistributedZkTest-jetty4-1375371960740//nodes_used_collection_shard2_replica2/data
   [junit4]   2> 1446371 T3789 oasc.JmxMonitoredMap.<init> JMX monitoring is enabled. Adding Solr mbeans to JMX Server: com.sun.jmx.mbeanserver.JmxMBeanServer@5123fa9f
   [junit4]   2> 1446372 T3770 oasup.UpdateRequestProcessorChain.init inserting DistributedUpdateProcessorFactory into updateRequestProcessorChain "dedupe"
   [junit4]   2> 1446371 T3830 oasc.SolrCore.getNewIndexDir New index directory detected: old=null new=/usr/home/hudson/hudson-slave/workspace/Lucene-Solr-Tests-4.x-Java7/solr/build/solr-core/test/J0/./org.apache.solr.cloud.CollectionsAPIDistributedZkTest-jetty4-1375371960740//nodes_used_collection_shard2_replica2/data/index/
   [junit4]   2> 1446372 T3789 oasc.CachingDirectoryFactory.get return new directory for /usr/home/hudson/hudson-slave/workspace/Lucene-Solr-Tests-4.x-Java7/solr/build/solr-core/test/J0/./org.apache.solr.cloud.CollectionsAPIDistributedZkTest-jetty1-1375371955400//nodes_used_collection_shard1_replica2/data
   [junit4]   2> 1446372 T3770 oasup.UpdateRequestProcessorChain.init inserting DistributedUpdateProcessorFactory into updateRequestProcessorChain "stored_sig"
   [junit4]   2> 1446373 T3789 oasc.SolrCore.getNewIndexDir New index directory detected: old=null new=/usr/home/hudson/hudson-slave/workspace/Lucene-Solr-Tests-4.x-Java7/solr/build/solr-core/test/J0/./org.apache.solr.cloud.CollectionsAPIDistributedZkTest-jetty1-1375371955400//nodes_used_collection_shard1_replica2/data/index/
   [junit4]   2> 1446373 T3830 oasc.SolrCore.initIndex WARN [nodes_used_collection_shard2_replica2] Solr index directory '/usr/home/hudson/hudson-slave/workspace/Lucene-Solr-Tests-4.x-Java7/solr/build/solr-core/test/J0/./org.apache.solr.cloud.CollectionsAPIDistributedZkTest-jetty4-1375371960740/nodes_used_collection_shard2_replica2/data/index' doesn't exist. Creating new index...
   [junit4]   2> 1446374 T3802 oasup.UpdateRequestProcessorChain.init inserting DistributedUpdateProcessorFactory into updateRequestProcessorChain "dedupe"
   [junit4]   2> 1446374 T3830 oasc.CachingDirectoryFactory.get return new directory for /usr/home/hudson/hudson-slave/workspace/Lucene-Solr-Tests-4.x-Java7/solr/build/solr-core/test/J0/./org.apache.solr.cloud.CollectionsAPIDistributedZkTest-jetty4-1375371960740//nodes_used_collection_shard2_replica2/data/index
   [junit4]   2> 1446374 T3770 oasup.UpdateRequestProcessorChain.init inserting DistributedUpdateProcessorFactory into updateRequestProcessorChain "distrib-dup-test-chain-implicit"
   [junit4]   2> 1446374 T3789 oasc.SolrCore.initIndex WARN [nodes_used_collection_shard1_replica2] Solr index directory '/usr/home/hudson/hudson-slave/workspace/Lucene-Solr-Tests-4.x-Java7/solr/build/solr-core/test/J0/./org.apache.solr.cloud.CollectionsAPIDistributedZkTest-jetty1-1375371955400/nodes_used_collection_shard1_replica2/data/index' doesn't exist. Creating new index...
   [junit4]   2> 1446375 T3802 oasup.UpdateRequestProcessorChain.init inserting DistributedUpdateProcessorFactory into updateRequestProcessorChain "stored_sig"
   [junit4]   2> 1446376 T3789 oasc.CachingDirectoryFactory.get return new directory for /usr/home/hudson/hudson-slave/workspace/Lucene-Solr-Tests-4.x-Java7/solr/build/solr-core/test/J0/./org.apache.solr.cloud.CollectionsAPIDistributedZkTest-jetty1-1375371955400//nodes_used_collection_shard1_replica2/data/index
   [junit4]   2> 1446376 T3770 oasc.RequestHandlers.initHandlersFromConfig created standard: solr.StandardRequestHandler
   [junit4]   2> 1446376 T3802 oasup.UpdateRequestProcessorChain.init inserting DistributedUpdateProcessorFactory into updateRequestProcessorChain "distrib-dup-test-chain-implicit"
   [junit4]   2> 1446377 T3770 oasc.RequestHandlers.initHandlersFromConfig created /get: solr.RealTimeGetHandler
   [junit4]   2> 1446377 T3770 oasc.RequestHandlers.initHandlersFromConfig adding lazy requestHandler: solr.ReplicationHandler
   [junit4]   2> 1446377 T3802 oasc.RequestHandlers.initHandlersFromConfig created standard: solr.StandardRequestHandler
   [junit4]   2> 1446378 T3770 oasc.RequestHandlers.initHandlersFromConfig created /replication: solr.ReplicationHandler
   [junit4]   2> 1446378 T3802 oasc.RequestHandlers.initHandlersFromConfig created /get: solr.RealTimeGetHandler
   [junit4]   2> 1446379 T3770 oasc.RequestHandlers.initHandlersFromConfig created /update: solr.UpdateRequestHandler
   [junit4]   2> 1446379 T3802 oasc.RequestHandlers.initHandlersFromConfig adding lazy requestHandler: solr.ReplicationHandler
   [junit4]   2> 1446379 T3770 oasc.RequestHandlers.initHandlersFromConfig created /admin/: org.apache.solr.handler.admin.AdminHandlers
   [junit4]   2> 1446380 T3802 oasc.RequestHandlers.initHandlersFromConfig created /replication: solr.ReplicationHandler
   [junit4]   2> 1446380 T3830 oasc.SolrDeletionPolicy.onCommit SolrDeletionPolicy.onCommit: commits: num=1
   [junit4]   2> 		commit{dir=MockDirWrapper(org.apache.lucene.store.RAMDirectory@64682fd0 lockFactory=org.apache.lucene.store.NativeFSLockFactory@15fe7fb7),segFN=segments_1,generation=1}
   [junit4]   2> 1446381 T3802 oasc.RequestHandlers.initHandlersFromConfig created /update: solr.UpdateRequestHandler
   [junit4]   2> 1446381 T3830 oasc.SolrDeletionPolicy.updateCommits newest commit generation = 1
   [junit4]   2> 1446381 T3802 oasc.RequestHandlers.initHandlersFromConfig created /admin/: org.apache.solr.handler.admin.AdminHandlers
   [junit4]   2> 1446381 T3789 oasc.SolrDeletionPolicy.onCommit SolrDeletionPolicy.onCommit: commits: num=1
   [junit4]   2> 		commit{dir=MockDirWrapper(org.apache.lucene.store.RAMDirectory@1ef8a576 lockFactory=org.apache.lucene.store.NativeFSLockFactory@6eb0766d),segFN=segments_1,generation=1}
   [junit4]   2> 1446382 T3789 oasc.SolrDeletionPolicy.updateCommits newest commit generation = 1
   [junit4]   2> 1446387 T3830 oasup.UpdateRequestProcessorChain.init inserting DistributedUpdateProcessorFactory into updateRequestProcessorChain "dedupe"
   [junit4]   2> 1446388 T3830 oasup.UpdateRequestProcessorChain.init inserting DistributedUpdateProcessorFactory into updateRequestProcessorChain "stored_sig"
   [junit4]   2> 1446388 T3789 oasup.UpdateRequestProcessorChain.init inserting DistributedUpdateProcessorFactory into updateRequestProcessorChain "dedupe"
   [junit4]   2> 1446389 T3830 oasup.UpdateRequestProcessorChain.init inserting DistributedUpdateProcessorFactory into updateRequestProcessorChain "distrib-dup-test-chain-implicit"
   [junit4]   2> 1446389 T3789 oasup.UpdateRequestProcessorChain.init inserting DistributedUpdateProcessorFactory into updateRequestProcessorChain "stored_sig"
   [junit4]   2> 1446390 T3830 oasc.RequestHandlers.initHandlersFromConfig created standard: solr.StandardRequestHandler
   [junit4]   2> 1446390 T3789 oasup.UpdateRequestProcessorChain.init inserting DistributedUpdateProcessorFactory into updateRequestProcessorChain "distrib-dup-test-chain-implicit"
   [junit4]   2> 1446390 T3830 oasc.RequestHandlers.initHandlersFromConfig created /get: solr.RealTimeGetHandler
   [junit4]   2> 1446391 T3830 oasc.RequestHandlers.initHandlersFromConfig adding lazy requestHandler: solr.ReplicationHandler
   [junit4]   2> 1446391 T3789 oasc.RequestHandlers.initHandlersFromConfig created standard: solr.StandardRequestHandler
   [junit4]   2> 1446391 T3830 oasc.RequestHandlers.initHandlersFromConfig created /replication: solr.ReplicationHandler
   [junit4]   2> 1446392 T3789 oasc.RequestHandlers.initHandlersFromConfig created /get: solr.RealTimeGetHandler
   [junit4]   2> 1446392 T3789 oasc.RequestHandlers.initHandlersFromConfig adding lazy requestHandler: solr.ReplicationHandler
   [junit4]   2> 1446392 T3830 oasc.RequestHandlers.initHandlersFromConfig created /update: solr.UpdateRequestHandler
   [junit4]   2> 1446393 T3789 oasc.RequestHandlers.initHandlersFromConfig created /replication: solr.ReplicationHandler
   [junit4]   2> 1446393 T3830 oasc.RequestHandlers.initHandlersFromConfig created /admin/: org.apache.solr.handler.admin.AdminHandlers
   [junit4]   2> 1446394 T3789 oasc.RequestHandlers.initHandlersFromConfig created /update: solr.UpdateRequestHandler
   [junit4]   2> 1446394 T3789 oasc.RequestHandlers.initHandlersFromConfig created /admin/: org.apache.solr.handler.admin.AdminHandlers
   [junit4]   2> 1446406 T3770 oashl.XMLLoader.init xsltCacheLifetimeSeconds=60
   [junit4]   2> 1446407 T3830 oashl.XMLLoader.init xsltCacheLifetimeSeconds=60
   [junit4]   2> 1446407 T3789 oashl.XMLLoader.init xsltCacheLifetimeSeconds=60
   [junit4]   2> 1446407 T3802 oashl.XMLLoader.init xsltCacheLifetimeSeconds=60
   [junit4]   2> 1446418 T3770 oass.SolrIndexSearcher.<init> Opening Searcher@1ad0c54b main
   [junit4]   2> 1446418 T3789 oass.SolrIndexSearcher.<init> Opening Searcher@63449e6c main
   [junit4]   2> 1446418 T3802 oass.SolrIndexSearcher.<init> Opening Searcher@7ffdfda0 main
   [junit4]   2> 1446418 T3830 oass.SolrIndexSearcher.<init> Opening Searcher@18c80feb main
   [junit4]   2> 1446419 T3770 oasu.CommitTracker.<init> Hard AutoCommit: disabled
   [junit4]   2> 1446420 T3770 oasu.CommitTracker.<init> Soft AutoCommit: disabled
   [junit4]   2> 1446420 T3789 oasu.CommitTracker.<init> Hard AutoCommit: disabled
   [junit4]   2> 1446420 T3802 oasu.CommitTracker.<init> Hard AutoCommit: disabled
   [junit4]   2> 1446420 T3830 oasu.CommitTracker.<init> Hard AutoCommit: disabled
   [junit4]   2> 1446420 T3789 oasu.CommitTracker.<init> Soft AutoCommit: disabled
   [junit4]   2> 1446421 T3830 oasu.CommitTracker.<init> Soft AutoCommit: disabled
   [junit4]   2> 1446421 T3802 oasu.CommitTracker.<init> Soft AutoCommit: disabled
   [junit4]   2> 1446424 T3846 oasc.SolrCore.registerSearcher [nodes_used_collection_shard2_replica1] Registered new searcher Searcher@1ad0c54b main{StandardDirectoryReader(segments_1:1)}
   [junit4]   2> 1446425 T3847 oasc.SolrCore.registerSearcher [nodes_used_collection_shard1_replica2] Registered new searcher Searcher@63449e6c main{StandardDirectoryReader(segments_1:1)}
   [junit4]   2> 1446426 T3848 oasc.SolrCore.registerSearcher [nodes_used_collection_shard2_replica2] Registered new searcher Searcher@18c80feb main{StandardDirectoryReader(segments_1:1)}
   [junit4]   2> 1446426 T3849 oasc.SolrCore.registerSearcher [nodes_used_collection_shard1_replica1] Registered new searcher Searcher@7ffdfda0 main{StandardDirectoryReader(segments_1:1)}
   [junit4]   2> 1446426 T3770 oasc.CoreContainer.registerCore registering core: nodes_used_collection_shard2_replica1
   [junit4]   2> 1446427 T3770 oasc.ZkController.register Register replica - core:nodes_used_collection_shard2_replica1 address:http://127.0.0.1:50578 collection:nodes_used_collection shard:shard2
   [junit4]   2> 1446427 T3770 oascsi.HttpClientUtil.createClient Creating new http client, config:maxConnections=10000&maxConnectionsPerHost=20&connTimeout=15000&socketTimeout=30000&retry=false
   [junit4]   2> 1446428 T3789 oasc.CoreContainer.registerCore registering core: nodes_used_collection_shard1_replica2
   [junit4]   2> 1446428 T3789 oasc.ZkController.register Register replica - core:nodes_used_collection_shard1_replica2 address:http://127.0.0.1:44411 collection:nodes_used_collection shard:shard1
   [junit4]   2> 1446429 T3789 oascsi.HttpClientUtil.createClient Creating new http client, config:maxConnections=10000&maxConnectionsPerHost=20&connTimeout=15000&socketTimeout=30000&retry=false
   [junit4]   2> 1446429 T3802 oasc.CoreContainer.registerCore registering core: nodes_used_collection_shard1_replica1
   [junit4]   2> 1446429 T3830 oasc.CoreContainer.registerCore registering core: nodes_used_collection_shard2_replica2
   [junit4]   2> 1446429 T3802 oasc.ZkController.register Register replica - core:nodes_used_collection_shard1_replica1 address:http://127.0.0.1:57928 collection:nodes_used_collection shard:shard1
   [junit4]   2> 1446430 T3830 oasc.ZkController.register Register replica - core:nodes_used_collection_shard2_replica2 address:http://127.0.0.1:22726 collection:nodes_used_collection shard:shard2
   [junit4]   2> 1446430 T3802 oascsi.HttpClientUtil.createClient Creating new http client, config:maxConnections=10000&maxConnectionsPerHost=20&connTimeout=15000&socketTimeout=30000&retry=false
   [junit4]   2> 1446430 T3830 oascsi.HttpClientUtil.createClient Creating new http client, config:maxConnections=10000&maxConnectionsPerHost=20&connTimeout=15000&socketTimeout=30000&retry=false
   [junit4]   2> 1446455 T3789 oascc.SolrZkClient.makePath makePath: /collections/nodes_used_collection/leader_elect/shard1/election
   [junit4]   2> 1446455 T3830 oascc.SolrZkClient.makePath makePath: /collections/nodes_used_collection/leader_elect/shard2/election
   [junit4]   2> 1446455 T3802 oascc.SolrZkClient.makePath makePath: /collections/nodes_used_collection/leader_elect/shard1/election
   [junit4]   2> 1446455 T3770 oascc.SolrZkClient.makePath makePath: /collections/nodes_used_collection/leader_elect/shard2/election
   [junit4]   2> 1446487 T3789 oasc.ShardLeaderElectionContext.runLeaderProcess Running the leader process for shard shard1
   [junit4]   2> 1446497 T3830 oasc.ShardLeaderElectionContext.runLeaderProcess Running the leader process for shard shard2
   [junit4]   2> 1446508 T3789 oasc.ShardLeaderElectionContext.waitForReplicasToComeUp Enough replicas found to continue.
   [junit4]   2> 1446508 T3789 oasc.ShardLeaderElectionContext.runLeaderProcess I may be the new leader - try and sync
   [junit4]   2> 1446508 T3830 oasc.ShardLeaderElectionContext.waitForReplicasToComeUp Enough replicas found to continue.
   [junit4]   2> 1446509 T3830 oasc.ShardLeaderElectionContext.runLeaderProcess I may be the new leader - try and sync
   [junit4]   2> 1446508 T3789 oasc.SyncStrategy.sync Sync replicas to http://127.0.0.1:44411/nodes_used_collection_shard1_replica2/
   [junit4]   2> 1446509 T3830 oasc.SyncStrategy.sync Sync replicas to http://127.0.0.1:22726/nodes_used_collection_shard2_replica2/
   [junit4]   2> 1446510 T3789 oasu.PeerSync.sync PeerSync: core=nodes_used_collection_shard1_replica2 url=http://127.0.0.1:44411 START replicas=[http://127.0.0.1:57928/nodes_used_collection_shard1_replica1/] nUpdates=100
   [junit4]   2> 1446510 T3830 oasu.PeerSync.sync PeerSync: core=nodes_used_collection_shard2_replica2 url=http://127.0.0.1:22726 START replicas=[http://127.0.0.1:50578/nodes_used_collection_shard2_replica1/] nUpdates=100
   [junit4]   2> 1446510 T3789 oasu.PeerSync.sync PeerSync: 

[...truncated too long message...]

stribSearch -Dtests.seed=FF70BEA89546F037 -Dtests.multiplier=3 -Dtests.slow=true -Dtests.locale=lv -Dtests.timezone=Australia/North -Dtests.file.encoding=US-ASCII
   [junit4] ERROR    156s J0 | CollectionsAPIDistributedZkTest.testDistribSearch <<<
   [junit4]    > Throwable #1: org.apache.solr.client.solrj.SolrServerException: IOException occured when talking to server at: http://127.0.0.1:57928
   [junit4]    > 	at __randomizedtesting.SeedInfo.seed([FF70BEA89546F037:7E9630B0E219900B]:0)
   [junit4]    > 	at org.apache.solr.client.solrj.impl.HttpSolrServer.request(HttpSolrServer.java:435)
   [junit4]    > 	at org.apache.solr.client.solrj.impl.HttpSolrServer.request(HttpSolrServer.java:180)
   [junit4]    > 	at org.apache.solr.cloud.AbstractFullDistribZkTestBase.createCollection(AbstractFullDistribZkTestBase.java:1535)
   [junit4]    > 	at org.apache.solr.cloud.CollectionsAPIDistributedZkTest.testCustomCollectionsAPI(CollectionsAPIDistributedZkTest.java:677)
   [junit4]    > 	at org.apache.solr.cloud.CollectionsAPIDistributedZkTest.doTest(CollectionsAPIDistributedZkTest.java:159)
   [junit4]    > 	at org.apache.solr.BaseDistributedSearchTestCase.testDistribSearch(BaseDistributedSearchTestCase.java:835)
   [junit4]    > 	at java.lang.Thread.run(Thread.java:724)
   [junit4]    > Caused by: org.apache.http.conn.ConnectTimeoutException: Connect to 127.0.0.1:57928 timed out
   [junit4]    > 	at org.apache.http.conn.scheme.PlainSocketFactory.connectSocket(PlainSocketFactory.java:129)
   [junit4]    > 	at org.apache.http.impl.conn.DefaultClientConnectionOperator.openConnection(DefaultClientConnectionOperator.java:180)
   [junit4]    > 	at org.apache.http.impl.conn.ManagedClientConnectionImpl.open(ManagedClientConnectionImpl.java:294)
   [junit4]    > 	at org.apache.http.impl.client.DefaultRequestDirector.tryConnect(DefaultRequestDirector.java:645)
   [junit4]    > 	at org.apache.http.impl.client.DefaultRequestDirector.execute(DefaultRequestDirector.java:480)
   [junit4]    > 	at org.apache.http.impl.client.AbstractHttpClient.execute(AbstractHttpClient.java:906)
   [junit4]    > 	at org.apache.http.impl.client.AbstractHttpClient.execute(AbstractHttpClient.java:805)
   [junit4]    > 	at org.apache.http.impl.client.AbstractHttpClient.execute(AbstractHttpClient.java:784)
   [junit4]    > 	at org.apache.solr.client.solrj.impl.HttpSolrServer.request(HttpSolrServer.java:365)
   [junit4]    > 	... 45 more
   [junit4]   2> 1588607 T3758 oas.SolrTestCaseJ4.deleteCore ###deleteCore
   [junit4]   2> 155522 T3757 ccr.ThreadLeakControl.checkThreadLeaks WARNING Will linger awaiting termination of 2 leaked thread(s).
   [junit4]   2> 1589744 T3840 oasc.LeaderElector$1.process WARN  org.apache.zookeeper.KeeperException$SessionExpiredException: KeeperErrorCode = Session expired for /collections/new_implicit_coll_0/leader_elect/b/election
   [junit4]   2> 	at org.apache.zookeeper.KeeperException.create(KeeperException.java:127)
   [junit4]   2> 	at org.apache.zookeeper.KeeperException.create(KeeperException.java:51)
   [junit4]   2> 	at org.apache.zookeeper.ZooKeeper.getChildren(ZooKeeper.java:1468)
   [junit4]   2> 	at org.apache.solr.common.cloud.SolrZkClient$6.execute(SolrZkClient.java:235)
   [junit4]   2> 	at org.apache.solr.common.cloud.SolrZkClient$6.execute(SolrZkClient.java:232)
   [junit4]   2> 	at org.apache.solr.common.cloud.ZkCmdExecutor.retryOperation(ZkCmdExecutor.java:65)
   [junit4]   2> 	at org.apache.solr.common.cloud.SolrZkClient.getChildren(SolrZkClient.java:232)
   [junit4]   2> 	at org.apache.solr.cloud.LeaderElector.checkIfIamLeader(LeaderElector.java:84)
   [junit4]   2> 	at org.apache.solr.cloud.LeaderElector.access$000(LeaderElector.java:55)
   [junit4]   2> 	at org.apache.solr.cloud.LeaderElector$1.process(LeaderElector.java:129)
   [junit4]   2> 	at org.apache.zookeeper.ClientCnxn$EventThread.processEvent(ClientCnxn.java:519)
   [junit4]   2> 	at org.apache.zookeeper.ClientCnxn$EventThread.run(ClientCnxn.java:495)
   [junit4]   2> 
   [junit4]   2> 1589744 T3840 oascc.ZkStateReader$2.process A cluster state change: WatchedEvent state:SyncConnected type:NodeChildrenChanged path:/live_nodes, has occurred - updating... (live nodes size: 1)
   [junit4]   2> 1589745 T3840 oascc.ZkStateReader$2.process WARN ZooKeeper watch triggered, but Solr cannot talk to ZK
   [junit4]   2> 1589745 T3840 oascc.ZkStateReader$3.process WARN ZooKeeper watch triggered, but Solr cannot talk to ZK
   [junit4]   2> 1589745 T3840 oasc.LeaderElector$1.process WARN  org.apache.zookeeper.KeeperException$SessionExpiredException: KeeperErrorCode = Session expired for /collections/new_implicit_coll_0/leader_elect/c/election
   [junit4]   2> 	at org.apache.zookeeper.KeeperException.create(KeeperException.java:127)
   [junit4]   2> 	at org.apache.zookeeper.KeeperException.create(KeeperException.java:51)
   [junit4]   2> 	at org.apache.zookeeper.ZooKeeper.getChildren(ZooKeeper.java:1468)
   [junit4]   2> 	at org.apache.solr.common.cloud.SolrZkClient$6.execute(SolrZkClient.java:235)
   [junit4]   2> 	at org.apache.solr.common.cloud.SolrZkClient$6.execute(SolrZkClient.java:232)
   [junit4]   2> 	at org.apache.solr.common.cloud.ZkCmdExecutor.retryOperation(ZkCmdExecutor.java:65)
   [junit4]   2> 	at org.apache.solr.common.cloud.SolrZkClient.getChildren(SolrZkClient.java:232)
   [junit4]   2> 	at org.apache.solr.cloud.LeaderElector.checkIfIamLeader(LeaderElector.java:84)
   [junit4]   2> 	at org.apache.solr.cloud.LeaderElector.access$000(LeaderElector.java:55)
   [junit4]   2> 	at org.apache.solr.cloud.LeaderElector$1.process(LeaderElector.java:129)
   [junit4]   2> 	at org.apache.zookeeper.ClientCnxn$EventThread.processEvent(ClientCnxn.java:519)
   [junit4]   2> 	at org.apache.zookeeper.ClientCnxn$EventThread.run(ClientCnxn.java:495)
   [junit4]   2> 
   [junit4]   2> NOTE: test params are: codec=Lucene42: {timestamp=PostingsFormat(name=TestBloomFilteredLucene41Postings), range_facet_l=PostingsFormat(name=TestBloomFilteredLucene41Postings), id=Pulsing41(freqCutoff=13 minBlockSize=77 maxBlockSize=194), range_facet_sl=Pulsing41(freqCutoff=13 minBlockSize=77 maxBlockSize=194), a_t=PostingsFormat(name=TestBloomFilteredLucene41Postings), text=MockVariableIntBlock(baseBlockSize=88), range_facet_si=PostingsFormat(name=TestBloomFilteredLucene41Postings), _version_=MockFixedIntBlock(blockSize=397), other_tl1=MockFixedIntBlock(blockSize=397), multiDefault=PostingsFormat(name=TestBloomFilteredLucene41Postings), a_si=MockFixedIntBlock(blockSize=397), intDefault=MockFixedIntBlock(blockSize=397)}, docValues:{}, sim=DefaultSimilarity, locale=lv, timezone=Australia/North
   [junit4]   2> NOTE: FreeBSD 9.1-RELEASE-p3 amd64/Oracle Corporation 1.7.0_25 (64-bit)/cpus=16,threads=7,free=79266080,total=536870912
   [junit4]   2> NOTE: All tests run in this JVM: [TestWriterPerf, HdfsUnloadDistributedZkTest, DocValuesTest, TestPhraseSuggestions, OverseerCollectionProcessorTest, TestArbitraryIndexDir, UniqFieldsUpdateProcessorFactoryTest, TestDefaultSearchFieldResource, AlternateDirectoryTest, TestSurroundQueryParser, CSVRequestHandlerTest, BadComponentTest, TestSolrXml, TestQueryTypes, TestDFRSimilarityFactory, LeaderElectionIntegrationTest, ParsingFieldUpdateProcessorsTest, TestPHPSerializedResponseWriter, ShardRoutingTest, TestSolrJ, TestBinaryField, IndexSchemaRuntimeFieldTest, ClusterStateUpdateTest, DateFieldTest, BasicDistributedZkTest, TestQueryUtils, TestWordDelimiterFilterFactory, OverseerTest, RequiredFieldsTest, TestCloudManagedSchemaAddField, TestShardHandlerFactory, OutputWriterTest, TestCSVLoader, TestSweetSpotSimilarityFactory, FieldMutatingUpdateProcessorTest, TestSolrQueryParserResource, BlockDirectoryTest, TestSchemaSimilarityResource, SynonymTokenizerTest, DeleteShardTest, QueryElevationComponentTest, TestConfig, TestFuzzyAnalyzedSuggestions, SolrRequestParserTest, TestDynamicFieldResource, DocumentBuilderTest, TestFieldResource, TestSort, TestComponentsName, SuggesterFSTTest, TestOmitPositions, URLClassifyProcessorTest, OpenExchangeRatesOrgProviderTest, FieldAnalysisRequestHandlerTest, TestSchemaResource, ExternalFileFieldSortTest, TestValueSourceCache, ChaosMonkeySafeLeaderTest, QueryParsingTest, TestStressLucene, ScriptEngineTest, TestIndexSearcher, SOLR749Test, HardAutoCommitTest, CopyFieldTest, TestSolrIndexConfig, TestRealTimeGet, PathHierarchyTokenizerFactoryTest, ZkControllerTest, TestManagedSchemaFieldResource, QueryResultKeyTest, ZkCLITest, MBeansHandlerTest, SolrCoreTest, HdfsCollectionsAPIDistributedZkTest, PingRequestHandlerTest, BasicDistributedZk2Test, TestReplicationHandler, CollectionsAPIDistributedZkTest]
   [junit4] Completed on J0 in 156.81s, 1 test, 1 error <<< FAILURES!

[...truncated 470 lines...]
BUILD FAILED
/usr/home/hudson/hudson-slave/workspace/Lucene-Solr-Tests-4.x-Java7/build.xml:395: The following error occurred while executing this line:
/usr/home/hudson/hudson-slave/workspace/Lucene-Solr-Tests-4.x-Java7/build.xml:375: The following error occurred while executing this line:
/usr/home/hudson/hudson-slave/workspace/Lucene-Solr-Tests-4.x-Java7/build.xml:39: The following error occurred while executing this line:
/usr/home/hudson/hudson-slave/workspace/Lucene-Solr-Tests-4.x-Java7/solr/build.xml:181: The following error occurred while executing this line:
/usr/home/hudson/hudson-slave/workspace/Lucene-Solr-Tests-4.x-Java7/solr/common-build.xml:449: The following error occurred while executing this line:
/usr/home/hudson/hudson-slave/workspace/Lucene-Solr-Tests-4.x-Java7/lucene/common-build.xml:1233: The following error occurred while executing this line:
/usr/home/hudson/hudson-slave/workspace/Lucene-Solr-Tests-4.x-Java7/lucene/common-build.xml:876: There were test failures: 321 suites, 1350 tests, 1 error, 34 ignored (6 assumptions)

Total time: 58 minutes 25 seconds
Build step 'Invoke Ant' marked build as failure
Archiving artifacts
Recording test results
Email was triggered for: Failure
Sending email for trigger: Failure



Mime
View raw message