lucene-dev mailing list archives

Site index · List index
Message view « Date » · « Thread »
Top « Date » · « Thread »
From Policeman Jenkins Server <jenk...@thetaphi.de>
Subject [JENKINS] Lucene-Solr-4.x-Linux (32bit/jdk1.6.0_45) - Build # 6772 - Failure!
Date Fri, 02 Aug 2013 21:48:40 GMT
Build: http://jenkins.thetaphi.de/job/Lucene-Solr-4.x-Linux/6772/
Java: 32bit/jdk1.6.0_45 -server -XX:+UseConcMarkSweepGC

1 tests failed.
FAILED:  org.apache.solr.cloud.CollectionsAPIDistributedZkTest.testDistribSearch

Error Message:
Server refused connection at: http://127.0.0.1:57661

Stack Trace:
org.apache.solr.client.solrj.SolrServerException: Server refused connection at: http://127.0.0.1:57661
	at __randomizedtesting.SeedInfo.seed([878F5A354C3164F2:669D42D3B6E04CE]:0)
	at org.apache.solr.client.solrj.impl.HttpSolrServer.request(HttpSolrServer.java:428)
	at org.apache.solr.client.solrj.impl.HttpSolrServer.request(HttpSolrServer.java:180)
	at org.apache.solr.cloud.CollectionsAPIDistributedZkTest.testCustomCollectionsAPI(CollectionsAPIDistributedZkTest.java:764)
	at org.apache.solr.cloud.CollectionsAPIDistributedZkTest.doTest(CollectionsAPIDistributedZkTest.java:159)
	at org.apache.solr.BaseDistributedSearchTestCase.testDistribSearch(BaseDistributedSearchTestCase.java:835)
	at sun.reflect.NativeMethodAccessorImpl.invoke0(Native Method)
	at sun.reflect.NativeMethodAccessorImpl.invoke(NativeMethodAccessorImpl.java:39)
	at sun.reflect.DelegatingMethodAccessorImpl.invoke(DelegatingMethodAccessorImpl.java:25)
	at java.lang.reflect.Method.invoke(Method.java:597)
	at com.carrotsearch.randomizedtesting.RandomizedRunner.invoke(RandomizedRunner.java:1559)
	at com.carrotsearch.randomizedtesting.RandomizedRunner.access$600(RandomizedRunner.java:79)
	at com.carrotsearch.randomizedtesting.RandomizedRunner$6.evaluate(RandomizedRunner.java:737)
	at com.carrotsearch.randomizedtesting.RandomizedRunner$7.evaluate(RandomizedRunner.java:773)
	at com.carrotsearch.randomizedtesting.RandomizedRunner$8.evaluate(RandomizedRunner.java:787)
	at com.carrotsearch.randomizedtesting.rules.SystemPropertiesRestoreRule$1.evaluate(SystemPropertiesRestoreRule.java:53)
	at org.apache.lucene.util.TestRuleSetupTeardownChained$1.evaluate(TestRuleSetupTeardownChained.java:50)
	at org.apache.lucene.util.TestRuleFieldCacheSanity$1.evaluate(TestRuleFieldCacheSanity.java:51)
	at org.apache.lucene.util.AbstractBeforeAfterRule$1.evaluate(AbstractBeforeAfterRule.java:46)
	at com.carrotsearch.randomizedtesting.rules.SystemPropertiesInvariantRule$1.evaluate(SystemPropertiesInvariantRule.java:55)
	at org.apache.lucene.util.TestRuleThreadAndTestName$1.evaluate(TestRuleThreadAndTestName.java:49)
	at org.apache.lucene.util.TestRuleIgnoreAfterMaxFailures$1.evaluate(TestRuleIgnoreAfterMaxFailures.java:70)
	at org.apache.lucene.util.TestRuleMarkFailure$1.evaluate(TestRuleMarkFailure.java:48)
	at com.carrotsearch.randomizedtesting.rules.StatementAdapter.evaluate(StatementAdapter.java:36)
	at com.carrotsearch.randomizedtesting.ThreadLeakControl$StatementRunner.run(ThreadLeakControl.java:358)
	at com.carrotsearch.randomizedtesting.ThreadLeakControl.forkTimeoutingTask(ThreadLeakControl.java:782)
	at com.carrotsearch.randomizedtesting.ThreadLeakControl$3.evaluate(ThreadLeakControl.java:442)
	at com.carrotsearch.randomizedtesting.RandomizedRunner.runSingleTest(RandomizedRunner.java:746)
	at com.carrotsearch.randomizedtesting.RandomizedRunner$3.evaluate(RandomizedRunner.java:648)
	at com.carrotsearch.randomizedtesting.RandomizedRunner$4.evaluate(RandomizedRunner.java:682)
	at com.carrotsearch.randomizedtesting.RandomizedRunner$5.evaluate(RandomizedRunner.java:693)
	at com.carrotsearch.randomizedtesting.rules.StatementAdapter.evaluate(StatementAdapter.java:36)
	at com.carrotsearch.randomizedtesting.rules.SystemPropertiesRestoreRule$1.evaluate(SystemPropertiesRestoreRule.java:53)
	at org.apache.lucene.util.AbstractBeforeAfterRule$1.evaluate(AbstractBeforeAfterRule.java:46)
	at org.apache.lucene.util.TestRuleStoreClassName$1.evaluate(TestRuleStoreClassName.java:42)
	at com.carrotsearch.randomizedtesting.rules.SystemPropertiesInvariantRule$1.evaluate(SystemPropertiesInvariantRule.java:55)
	at com.carrotsearch.randomizedtesting.rules.NoShadowingOrOverridesOnMethodsRule$1.evaluate(NoShadowingOrOverridesOnMethodsRule.java:39)
	at com.carrotsearch.randomizedtesting.rules.NoShadowingOrOverridesOnMethodsRule$1.evaluate(NoShadowingOrOverridesOnMethodsRule.java:39)
	at com.carrotsearch.randomizedtesting.rules.StatementAdapter.evaluate(StatementAdapter.java:36)
	at org.apache.lucene.util.TestRuleAssertionsRequired$1.evaluate(TestRuleAssertionsRequired.java:43)
	at org.apache.lucene.util.TestRuleMarkFailure$1.evaluate(TestRuleMarkFailure.java:48)
	at org.apache.lucene.util.TestRuleIgnoreAfterMaxFailures$1.evaluate(TestRuleIgnoreAfterMaxFailures.java:70)
	at org.apache.lucene.util.TestRuleIgnoreTestSuites$1.evaluate(TestRuleIgnoreTestSuites.java:55)
	at com.carrotsearch.randomizedtesting.rules.StatementAdapter.evaluate(StatementAdapter.java:36)
	at com.carrotsearch.randomizedtesting.ThreadLeakControl$StatementRunner.run(ThreadLeakControl.java:358)
	at java.lang.Thread.run(Thread.java:662)
Caused by: org.apache.http.conn.HttpHostConnectException: Connection to http://127.0.0.1:57661 refused
	at org.apache.http.impl.conn.DefaultClientConnectionOperator.openConnection(DefaultClientConnectionOperator.java:190)
	at org.apache.http.impl.conn.ManagedClientConnectionImpl.open(ManagedClientConnectionImpl.java:294)
	at org.apache.http.impl.client.DefaultRequestDirector.tryConnect(DefaultRequestDirector.java:645)
	at org.apache.http.impl.client.DefaultRequestDirector.execute(DefaultRequestDirector.java:480)
	at org.apache.http.impl.client.AbstractHttpClient.execute(AbstractHttpClient.java:906)
	at org.apache.http.impl.client.AbstractHttpClient.execute(AbstractHttpClient.java:805)
	at org.apache.http.impl.client.AbstractHttpClient.execute(AbstractHttpClient.java:784)
	at org.apache.solr.client.solrj.impl.HttpSolrServer.request(HttpSolrServer.java:365)
	... 44 more
Caused by: java.net.ConnectException: Connection refused
	at java.net.PlainSocketImpl.socketConnect(Native Method)
	at java.net.PlainSocketImpl.doConnect(PlainSocketImpl.java:351)
	at java.net.PlainSocketImpl.connectToAddress(PlainSocketImpl.java:213)
	at java.net.PlainSocketImpl.connect(PlainSocketImpl.java:200)
	at java.net.SocksSocketImpl.connect(SocksSocketImpl.java:366)
	at java.net.Socket.connect(Socket.java:529)
	at org.apache.http.conn.scheme.PlainSocketFactory.connectSocket(PlainSocketFactory.java:127)
	at org.apache.http.impl.conn.DefaultClientConnectionOperator.openConnection(DefaultClientConnectionOperator.java:180)
	... 51 more




Build Log:
[...truncated 9251 lines...]
   [junit4] Suite: org.apache.solr.cloud.CollectionsAPIDistributedZkTest
   [junit4]   2> 653478 T2061 oas.BaseDistributedSearchTestCase.initHostContext Setting hostContext system property: /
   [junit4]   2> 653482 T2061 oas.SolrTestCaseJ4.setUp ###Starting testDistribSearch
   [junit4]   2> Creating dataDir: /mnt/ssd/jenkins/workspace/Lucene-Solr-4.x-Linux/solr/build/solr-core/test/J1/./solrtest-CollectionsAPIDistributedZkTest-1375479197046
   [junit4]   2> 653482 T2061 oasc.ZkTestServer.run STARTING ZK TEST SERVER
   [junit4]   2> 653483 T2062 oasc.ZkTestServer$ZKServerMain.runFromConfig Starting server
   [junit4]   2> 653583 T2061 oasc.ZkTestServer.run start zk server on port:53607
   [junit4]   2> 653584 T2061 oascc.ConnectionManager.waitForConnected Waiting for client to connect to ZooKeeper
   [junit4]   2> 653588 T2068 oascc.ConnectionManager.process Watcher org.apache.solr.common.cloud.ConnectionManager@38a7b9 name:ZooKeeperConnection Watcher:127.0.0.1:53607 got event WatchedEvent state:SyncConnected type:None path:null path:null type:None
   [junit4]   2> 653588 T2061 oascc.ConnectionManager.waitForConnected Client is connected to ZooKeeper
   [junit4]   2> 653588 T2061 oascc.SolrZkClient.makePath makePath: /solr
   [junit4]   2> 653593 T2061 oascc.ConnectionManager.waitForConnected Waiting for client to connect to ZooKeeper
   [junit4]   2> 653594 T2070 oascc.ConnectionManager.process Watcher org.apache.solr.common.cloud.ConnectionManager@113fd7b name:ZooKeeperConnection Watcher:127.0.0.1:53607/solr got event WatchedEvent state:SyncConnected type:None path:null path:null type:None
   [junit4]   2> 653595 T2061 oascc.ConnectionManager.waitForConnected Client is connected to ZooKeeper
   [junit4]   2> 653595 T2061 oascc.SolrZkClient.makePath makePath: /collections/collection1
   [junit4]   2> 653599 T2061 oascc.SolrZkClient.makePath makePath: /collections/collection1/shards
   [junit4]   2> 653602 T2061 oascc.SolrZkClient.makePath makePath: /collections/control_collection
   [junit4]   2> 653610 T2061 oascc.SolrZkClient.makePath makePath: /collections/control_collection/shards
   [junit4]   2> 653614 T2061 oasc.AbstractZkTestCase.putConfig put /mnt/ssd/jenkins/workspace/Lucene-Solr-4.x-Linux/solr/build/solr-core/test-files/solr/collection1/conf/solrconfig-tlog.xml to /configs/conf1/solrconfig.xml
   [junit4]   2> 653614 T2061 oascc.SolrZkClient.makePath makePath: /configs/conf1/solrconfig.xml
   [junit4]   2> 653620 T2061 oasc.AbstractZkTestCase.putConfig put /mnt/ssd/jenkins/workspace/Lucene-Solr-4.x-Linux/solr/build/solr-core/test-files/solr/collection1/conf/schema.xml to /configs/conf1/schema.xml
   [junit4]   2> 653620 T2061 oascc.SolrZkClient.makePath makePath: /configs/conf1/schema.xml
   [junit4]   2> 653625 T2061 oasc.AbstractZkTestCase.putConfig put /mnt/ssd/jenkins/workspace/Lucene-Solr-4.x-Linux/solr/build/solr-core/test-files/solr/collection1/conf/stopwords.txt to /configs/conf1/stopwords.txt
   [junit4]   2> 653625 T2061 oascc.SolrZkClient.makePath makePath: /configs/conf1/stopwords.txt
   [junit4]   2> 653629 T2061 oasc.AbstractZkTestCase.putConfig put /mnt/ssd/jenkins/workspace/Lucene-Solr-4.x-Linux/solr/build/solr-core/test-files/solr/collection1/conf/protwords.txt to /configs/conf1/protwords.txt
   [junit4]   2> 653629 T2061 oascc.SolrZkClient.makePath makePath: /configs/conf1/protwords.txt
   [junit4]   2> 653633 T2061 oasc.AbstractZkTestCase.putConfig put /mnt/ssd/jenkins/workspace/Lucene-Solr-4.x-Linux/solr/build/solr-core/test-files/solr/collection1/conf/currency.xml to /configs/conf1/currency.xml
   [junit4]   2> 653633 T2061 oascc.SolrZkClient.makePath makePath: /configs/conf1/currency.xml
   [junit4]   2> 653637 T2061 oasc.AbstractZkTestCase.putConfig put /mnt/ssd/jenkins/workspace/Lucene-Solr-4.x-Linux/solr/build/solr-core/test-files/solr/collection1/conf/open-exchange-rates.json to /configs/conf1/open-exchange-rates.json
   [junit4]   2> 653637 T2061 oascc.SolrZkClient.makePath makePath: /configs/conf1/open-exchange-rates.json
   [junit4]   2> 653641 T2061 oasc.AbstractZkTestCase.putConfig put /mnt/ssd/jenkins/workspace/Lucene-Solr-4.x-Linux/solr/build/solr-core/test-files/solr/collection1/conf/mapping-ISOLatin1Accent.txt to /configs/conf1/mapping-ISOLatin1Accent.txt
   [junit4]   2> 653641 T2061 oascc.SolrZkClient.makePath makePath: /configs/conf1/mapping-ISOLatin1Accent.txt
   [junit4]   2> 653645 T2061 oasc.AbstractZkTestCase.putConfig put /mnt/ssd/jenkins/workspace/Lucene-Solr-4.x-Linux/solr/build/solr-core/test-files/solr/collection1/conf/old_synonyms.txt to /configs/conf1/old_synonyms.txt
   [junit4]   2> 653645 T2061 oascc.SolrZkClient.makePath makePath: /configs/conf1/old_synonyms.txt
   [junit4]   2> 653649 T2061 oasc.AbstractZkTestCase.putConfig put /mnt/ssd/jenkins/workspace/Lucene-Solr-4.x-Linux/solr/build/solr-core/test-files/solr/collection1/conf/synonyms.txt to /configs/conf1/synonyms.txt
   [junit4]   2> 653649 T2061 oascc.SolrZkClient.makePath makePath: /configs/conf1/synonyms.txt
   [junit4]   2> 653722 T2061 oejs.Server.doStart jetty-8.1.10.v20130312
   [junit4]   2> 653724 T2061 oejs.AbstractConnector.doStart Started SelectChannelConnector@127.0.0.1:53977
   [junit4]   2> 653725 T2061 oass.SolrDispatchFilter.init SolrDispatchFilter.init()
   [junit4]   2> 653725 T2061 oasc.SolrResourceLoader.locateSolrHome JNDI not configured for solr (NoInitialContextEx)
   [junit4]   2> 653726 T2061 oasc.SolrResourceLoader.locateSolrHome using system property solr.solr.home: /mnt/ssd/jenkins/workspace/Lucene-Solr-4.x-Linux/solr/build/solr-core/test/J1/./org.apache.solr.cloud.CollectionsAPIDistributedZkTest-controljetty-1375479197218
   [junit4]   2> 653726 T2061 oasc.SolrResourceLoader.<init> new SolrResourceLoader for directory: '/mnt/ssd/jenkins/workspace/Lucene-Solr-4.x-Linux/solr/build/solr-core/test/J1/./org.apache.solr.cloud.CollectionsAPIDistributedZkTest-controljetty-1375479197218/'
   [junit4]   2> 653738 T2061 oasc.ConfigSolr.fromFile Loading container configuration from /mnt/ssd/jenkins/workspace/Lucene-Solr-4.x-Linux/solr/build/solr-core/test/J1/./org.apache.solr.cloud.CollectionsAPIDistributedZkTest-controljetty-1375479197218/solr.xml
   [junit4]   2> 653787 T2061 oasc.ConfigSolrXml.<init> Config-defined core root directory: 
   [junit4]   2> 653788 T2061 oasc.CoreContainer.<init> New CoreContainer 1977916
   [junit4]   2> 653788 T2061 oasc.CoreContainer.load Loading cores into CoreContainer [instanceDir=/mnt/ssd/jenkins/workspace/Lucene-Solr-4.x-Linux/solr/build/solr-core/test/J1/./org.apache.solr.cloud.CollectionsAPIDistributedZkTest-controljetty-1375479197218/]
   [junit4]   2> 653789 T2061 oashc.HttpShardHandlerFactory.getParameter Setting socketTimeout to: 120000
   [junit4]   2> 653790 T2061 oashc.HttpShardHandlerFactory.getParameter Setting urlScheme to: http://
   [junit4]   2> 653790 T2061 oashc.HttpShardHandlerFactory.getParameter Setting connTimeout to: 15000
   [junit4]   2> 653791 T2061 oashc.HttpShardHandlerFactory.getParameter Setting maxConnectionsPerHost to: 20
   [junit4]   2> 653791 T2061 oashc.HttpShardHandlerFactory.getParameter Setting corePoolSize to: 0
   [junit4]   2> 653791 T2061 oashc.HttpShardHandlerFactory.getParameter Setting maximumPoolSize to: 2147483647
   [junit4]   2> 653792 T2061 oashc.HttpShardHandlerFactory.getParameter Setting maxThreadIdleTime to: 5
   [junit4]   2> 653792 T2061 oashc.HttpShardHandlerFactory.getParameter Setting sizeOfQueue to: -1
   [junit4]   2> 653792 T2061 oashc.HttpShardHandlerFactory.getParameter Setting fairnessPolicy to: false
   [junit4]   2> 653793 T2061 oascsi.HttpClientUtil.createClient Creating new http client, config:maxConnectionsPerHost=20&maxConnections=10000&socketTimeout=120000&connTimeout=15000&retry=false
   [junit4]   2> 653796 T2061 oasc.ZkContainer.initZooKeeper Zookeeper client=127.0.0.1:53607/solr
   [junit4]   2> 653797 T2061 oasc.ZkController.checkChrootPath zkHost includes chroot
   [junit4]   2> 653798 T2061 oascc.ConnectionManager.waitForConnected Waiting for client to connect to ZooKeeper
   [junit4]   2> 653799 T2081 oascc.ConnectionManager.process Watcher org.apache.solr.common.cloud.ConnectionManager@16d6d68 name:ZooKeeperConnection Watcher:127.0.0.1:53607 got event WatchedEvent state:SyncConnected type:None path:null path:null type:None
   [junit4]   2> 653799 T2061 oascc.ConnectionManager.waitForConnected Client is connected to ZooKeeper
   [junit4]   2> 653801 T2061 oascsi.HttpClientUtil.createClient Creating new http client, config:maxConnections=500&maxConnectionsPerHost=16&socketTimeout=120000&connTimeout=15000
   [junit4]   2> 653805 T2061 oascc.ConnectionManager.waitForConnected Waiting for client to connect to ZooKeeper
   [junit4]   2> 653806 T2083 oascc.ConnectionManager.process Watcher org.apache.solr.common.cloud.ConnectionManager@f2375d name:ZooKeeperConnection Watcher:127.0.0.1:53607/solr got event WatchedEvent state:SyncConnected type:None path:null path:null type:None
   [junit4]   2> 653806 T2061 oascc.ConnectionManager.waitForConnected Client is connected to ZooKeeper
   [junit4]   2> 653808 T2061 oascc.SolrZkClient.makePath makePath: /overseer/queue
   [junit4]   2> 653813 T2061 oascc.SolrZkClient.makePath makePath: /overseer/collection-queue-work
   [junit4]   2> 653817 T2061 oascc.SolrZkClient.makePath makePath: /live_nodes
   [junit4]   2> 653820 T2061 oasc.ZkController.createEphemeralLiveNode Register node as live in ZooKeeper:/live_nodes/127.0.0.1:53977_
   [junit4]   2> 653821 T2061 oascc.SolrZkClient.makePath makePath: /live_nodes/127.0.0.1:53977_
   [junit4]   2> 653827 T2061 oascc.SolrZkClient.makePath makePath: /overseer_elect/election
   [junit4]   2> 653834 T2061 oascc.SolrZkClient.makePath makePath: /overseer_elect/leader
   [junit4]   2> 653837 T2061 oasc.Overseer.start Overseer (id=90143404657803267-127.0.0.1:53977_-n_0000000000) starting
   [junit4]   2> 653841 T2061 oascc.SolrZkClient.makePath makePath: /overseer/queue-work
   [junit4]   2> 653845 T2085 oasc.OverseerCollectionProcessor.run Process current queue of collection creations
   [junit4]   2> 653847 T2061 oascc.SolrZkClient.makePath makePath: /clusterstate.json
   [junit4]   2> 653851 T2061 oascc.SolrZkClient.makePath makePath: /aliases.json
   [junit4]   2> 653855 T2061 oascc.ZkStateReader.createClusterStateWatchersAndUpdate Updating cluster state from ZooKeeper... 
   [junit4]   2> 653859 T2084 oasc.Overseer$ClusterStateUpdater.run Starting to work on the main queue
   [junit4]   2> 653861 T2061 oasc.CorePropertiesLocator.discover Looking for core definitions underneath /mnt/ssd/jenkins/workspace/Lucene-Solr-4.x-Linux/solr/build/solr-core/test/J1/./org.apache.solr.cloud.CollectionsAPIDistributedZkTest-controljetty-1375479197218
   [junit4]   2> 653885 T2061 oasc.CorePropertiesLocator.discoverUnder Found core conf in /mnt/ssd/jenkins/workspace/Lucene-Solr-4.x-Linux/solr/build/solr-core/test/J1/./org.apache.solr.cloud.CollectionsAPIDistributedZkTest-controljetty-1375479197218/conf/
   [junit4]   2> 653886 T2061 oasc.CorePropertiesLocator.discover Found 1 core definitions
   [junit4]   2> 653887 T2061 oass.SolrDispatchFilter.init user.dir=/mnt/ssd/jenkins/workspace/Lucene-Solr-4.x-Linux/solr/build/solr-core/test/J1
   [junit4]   2> 653887 T2061 oass.SolrDispatchFilter.init SolrDispatchFilter.init() done
   [junit4]   2> 653887 T2061 oascsi.HttpClientUtil.createClient Creating new http client, config:maxConnections=128&maxConnectionsPerHost=32&followRedirects=false
   [junit4]   2> 653890 T2061 oascsi.HttpClientUtil.createClient Creating new http client, config:
   [junit4]   2> 653891 T2061 oascc.ConnectionManager.waitForConnected Waiting for client to connect to ZooKeeper
   [junit4]   2> 653893 T2088 oascc.ConnectionManager.process Watcher org.apache.solr.common.cloud.ConnectionManager@10d728f name:ZooKeeperConnection Watcher:127.0.0.1:53607/solr got event WatchedEvent state:SyncConnected type:None path:null path:null type:None
   [junit4]   2> 653893 T2061 oascc.ConnectionManager.waitForConnected Client is connected to ZooKeeper
   [junit4]   2> 653895 T2061 oascc.ZkStateReader.createClusterStateWatchersAndUpdate Updating cluster state from ZooKeeper... 
   [junit4]   2> 653905 T2061 oasc.ChaosMonkey.monkeyLog monkey: init - expire sessions:true cause connection loss:true
   [junit4]   2> 653974 T2061 oejs.Server.doStart jetty-8.1.10.v20130312
   [junit4]   2> 653976 T2061 oejs.AbstractConnector.doStart Started SelectChannelConnector@127.0.0.1:57661
   [junit4]   2> 653977 T2061 oass.SolrDispatchFilter.init SolrDispatchFilter.init()
   [junit4]   2> 653977 T2061 oasc.SolrResourceLoader.locateSolrHome JNDI not configured for solr (NoInitialContextEx)
   [junit4]   2> 653977 T2061 oasc.SolrResourceLoader.locateSolrHome using system property solr.solr.home: /mnt/ssd/jenkins/workspace/Lucene-Solr-4.x-Linux/solr/build/solr-core/test/J1/./org.apache.solr.cloud.CollectionsAPIDistributedZkTest-jetty1-1375479197470
   [junit4]   2> 653978 T2061 oasc.SolrResourceLoader.<init> new SolrResourceLoader for directory: '/mnt/ssd/jenkins/workspace/Lucene-Solr-4.x-Linux/solr/build/solr-core/test/J1/./org.apache.solr.cloud.CollectionsAPIDistributedZkTest-jetty1-1375479197470/'
   [junit4]   2> 653990 T2061 oasc.ConfigSolr.fromFile Loading container configuration from /mnt/ssd/jenkins/workspace/Lucene-Solr-4.x-Linux/solr/build/solr-core/test/J1/./org.apache.solr.cloud.CollectionsAPIDistributedZkTest-jetty1-1375479197470/solr.xml
   [junit4]   2> 654038 T2061 oasc.ConfigSolrXml.<init> Config-defined core root directory: 
   [junit4]   2> 654039 T2061 oasc.CoreContainer.<init> New CoreContainer 14528547
   [junit4]   2> 654039 T2061 oasc.CoreContainer.load Loading cores into CoreContainer [instanceDir=/mnt/ssd/jenkins/workspace/Lucene-Solr-4.x-Linux/solr/build/solr-core/test/J1/./org.apache.solr.cloud.CollectionsAPIDistributedZkTest-jetty1-1375479197470/]
   [junit4]   2> 654041 T2061 oashc.HttpShardHandlerFactory.getParameter Setting socketTimeout to: 120000
   [junit4]   2> 654041 T2061 oashc.HttpShardHandlerFactory.getParameter Setting urlScheme to: http://
   [junit4]   2> 654041 T2061 oashc.HttpShardHandlerFactory.getParameter Setting connTimeout to: 15000
   [junit4]   2> 654042 T2061 oashc.HttpShardHandlerFactory.getParameter Setting maxConnectionsPerHost to: 20
   [junit4]   2> 654042 T2061 oashc.HttpShardHandlerFactory.getParameter Setting corePoolSize to: 0
   [junit4]   2> 654042 T2061 oashc.HttpShardHandlerFactory.getParameter Setting maximumPoolSize to: 2147483647
   [junit4]   2> 654043 T2061 oashc.HttpShardHandlerFactory.getParameter Setting maxThreadIdleTime to: 5
   [junit4]   2> 654043 T2061 oashc.HttpShardHandlerFactory.getParameter Setting sizeOfQueue to: -1
   [junit4]   2> 654044 T2061 oashc.HttpShardHandlerFactory.getParameter Setting fairnessPolicy to: false
   [junit4]   2> 654044 T2061 oascsi.HttpClientUtil.createClient Creating new http client, config:maxConnectionsPerHost=20&maxConnections=10000&socketTimeout=120000&connTimeout=15000&retry=false
   [junit4]   2> 654047 T2061 oasc.ZkContainer.initZooKeeper Zookeeper client=127.0.0.1:53607/solr
   [junit4]   2> 654047 T2061 oasc.ZkController.checkChrootPath zkHost includes chroot
   [junit4]   2> 654048 T2061 oascc.ConnectionManager.waitForConnected Waiting for client to connect to ZooKeeper
   [junit4]   2> 654050 T2099 oascc.ConnectionManager.process Watcher org.apache.solr.common.cloud.ConnectionManager@56fa7d name:ZooKeeperConnection Watcher:127.0.0.1:53607 got event WatchedEvent state:SyncConnected type:None path:null path:null type:None
   [junit4]   2> 654050 T2061 oascc.ConnectionManager.waitForConnected Client is connected to ZooKeeper
   [junit4]   2> 654052 T2061 oascsi.HttpClientUtil.createClient Creating new http client, config:maxConnections=500&maxConnectionsPerHost=16&socketTimeout=120000&connTimeout=15000
   [junit4]   2> 654055 T2061 oascc.ConnectionManager.waitForConnected Waiting for client to connect to ZooKeeper
   [junit4]   2> 654056 T2101 oascc.ConnectionManager.process Watcher org.apache.solr.common.cloud.ConnectionManager@11e11ea name:ZooKeeperConnection Watcher:127.0.0.1:53607/solr got event WatchedEvent state:SyncConnected type:None path:null path:null type:None
   [junit4]   2> 654056 T2061 oascc.ConnectionManager.waitForConnected Client is connected to ZooKeeper
   [junit4]   2> 654062 T2061 oascc.ZkStateReader.createClusterStateWatchersAndUpdate Updating cluster state from ZooKeeper... 
   [junit4]   2> 655066 T2061 oasc.ZkController.createEphemeralLiveNode Register node as live in ZooKeeper:/live_nodes/127.0.0.1:57661_
   [junit4]   2> 655067 T2061 oascc.SolrZkClient.makePath makePath: /live_nodes/127.0.0.1:57661_
   [junit4]   2> 655072 T2101 oascc.ZkStateReader$3.process Updating live nodes... (2)
   [junit4]   2> 655074 T2088 oascc.ZkStateReader$3.process Updating live nodes... (2)
   [junit4]   2> 655074 T2083 oascc.ZkStateReader$3.process Updating live nodes... (2)
   [junit4]   2> 655079 T2061 oasc.CorePropertiesLocator.discover Looking for core definitions underneath /mnt/ssd/jenkins/workspace/Lucene-Solr-4.x-Linux/solr/build/solr-core/test/J1/./org.apache.solr.cloud.CollectionsAPIDistributedZkTest-jetty1-1375479197470
   [junit4]   2> 655103 T2061 oasc.CorePropertiesLocator.discoverUnder Found core conf in /mnt/ssd/jenkins/workspace/Lucene-Solr-4.x-Linux/solr/build/solr-core/test/J1/./org.apache.solr.cloud.CollectionsAPIDistributedZkTest-jetty1-1375479197470/conf/
   [junit4]   2> 655104 T2061 oasc.CorePropertiesLocator.discover Found 1 core definitions
   [junit4]   2> 655105 T2061 oass.SolrDispatchFilter.init user.dir=/mnt/ssd/jenkins/workspace/Lucene-Solr-4.x-Linux/solr/build/solr-core/test/J1
   [junit4]   2> 655105 T2061 oass.SolrDispatchFilter.init SolrDispatchFilter.init() done
   [junit4]   2> 655106 T2061 oascsi.HttpClientUtil.createClient Creating new http client, config:maxConnections=128&maxConnectionsPerHost=32&followRedirects=false
   [junit4]   2> 655177 T2061 oejs.Server.doStart jetty-8.1.10.v20130312
   [junit4]   2> 655179 T2061 oejs.AbstractConnector.doStart Started SelectChannelConnector@127.0.0.1:36214
   [junit4]   2> 655180 T2061 oass.SolrDispatchFilter.init SolrDispatchFilter.init()
   [junit4]   2> 655180 T2061 oasc.SolrResourceLoader.locateSolrHome JNDI not configured for solr (NoInitialContextEx)
   [junit4]   2> 655180 T2061 oasc.SolrResourceLoader.locateSolrHome using system property solr.solr.home: /mnt/ssd/jenkins/workspace/Lucene-Solr-4.x-Linux/solr/build/solr-core/test/J1/./org.apache.solr.cloud.CollectionsAPIDistributedZkTest-jetty2-1375479198673
   [junit4]   2> 655181 T2061 oasc.SolrResourceLoader.<init> new SolrResourceLoader for directory: '/mnt/ssd/jenkins/workspace/Lucene-Solr-4.x-Linux/solr/build/solr-core/test/J1/./org.apache.solr.cloud.CollectionsAPIDistributedZkTest-jetty2-1375479198673/'
   [junit4]   2> 655203 T2061 oasc.ConfigSolr.fromFile Loading container configuration from /mnt/ssd/jenkins/workspace/Lucene-Solr-4.x-Linux/solr/build/solr-core/test/J1/./org.apache.solr.cloud.CollectionsAPIDistributedZkTest-jetty2-1375479198673/solr.xml
   [junit4]   2> 655243 T2061 oasc.ConfigSolrXml.<init> Config-defined core root directory: 
   [junit4]   2> 655244 T2061 oasc.CoreContainer.<init> New CoreContainer 11009522
   [junit4]   2> 655244 T2061 oasc.CoreContainer.load Loading cores into CoreContainer [instanceDir=/mnt/ssd/jenkins/workspace/Lucene-Solr-4.x-Linux/solr/build/solr-core/test/J1/./org.apache.solr.cloud.CollectionsAPIDistributedZkTest-jetty2-1375479198673/]
   [junit4]   2> 655245 T2061 oashc.HttpShardHandlerFactory.getParameter Setting socketTimeout to: 120000
   [junit4]   2> 655246 T2061 oashc.HttpShardHandlerFactory.getParameter Setting urlScheme to: http://
   [junit4]   2> 655246 T2061 oashc.HttpShardHandlerFactory.getParameter Setting connTimeout to: 15000
   [junit4]   2> 655247 T2061 oashc.HttpShardHandlerFactory.getParameter Setting maxConnectionsPerHost to: 20
   [junit4]   2> 655247 T2061 oashc.HttpShardHandlerFactory.getParameter Setting corePoolSize to: 0
   [junit4]   2> 655247 T2061 oashc.HttpShardHandlerFactory.getParameter Setting maximumPoolSize to: 2147483647
   [junit4]   2> 655248 T2061 oashc.HttpShardHandlerFactory.getParameter Setting maxThreadIdleTime to: 5
   [junit4]   2> 655248 T2061 oashc.HttpShardHandlerFactory.getParameter Setting sizeOfQueue to: -1
   [junit4]   2> 655248 T2061 oashc.HttpShardHandlerFactory.getParameter Setting fairnessPolicy to: false
   [junit4]   2> 655249 T2061 oascsi.HttpClientUtil.createClient Creating new http client, config:maxConnectionsPerHost=20&maxConnections=10000&socketTimeout=120000&connTimeout=15000&retry=false
   [junit4]   2> 655252 T2061 oasc.ZkContainer.initZooKeeper Zookeeper client=127.0.0.1:53607/solr
   [junit4]   2> 655252 T2061 oasc.ZkController.checkChrootPath zkHost includes chroot
   [junit4]   2> 655253 T2061 oascc.ConnectionManager.waitForConnected Waiting for client to connect to ZooKeeper
   [junit4]   2> 655255 T2113 oascc.ConnectionManager.process Watcher org.apache.solr.common.cloud.ConnectionManager@11134d9 name:ZooKeeperConnection Watcher:127.0.0.1:53607 got event WatchedEvent state:SyncConnected type:None path:null path:null type:None
   [junit4]   2> 655255 T2061 oascc.ConnectionManager.waitForConnected Client is connected to ZooKeeper
   [junit4]   2> 655257 T2061 oascsi.HttpClientUtil.createClient Creating new http client, config:maxConnections=500&maxConnectionsPerHost=16&socketTimeout=120000&connTimeout=15000
   [junit4]   2> 655260 T2061 oascc.ConnectionManager.waitForConnected Waiting for client to connect to ZooKeeper
   [junit4]   2> 655261 T2115 oascc.ConnectionManager.process Watcher org.apache.solr.common.cloud.ConnectionManager@648a56 name:ZooKeeperConnection Watcher:127.0.0.1:53607/solr got event WatchedEvent state:SyncConnected type:None path:null path:null type:None
   [junit4]   2> 655261 T2061 oascc.ConnectionManager.waitForConnected Client is connected to ZooKeeper
   [junit4]   2> 655267 T2061 oascc.ZkStateReader.createClusterStateWatchersAndUpdate Updating cluster state from ZooKeeper... 
   [junit4]   2> 656271 T2061 oasc.ZkController.createEphemeralLiveNode Register node as live in ZooKeeper:/live_nodes/127.0.0.1:36214_
   [junit4]   2> 656274 T2061 oascc.SolrZkClient.makePath makePath: /live_nodes/127.0.0.1:36214_
   [junit4]   2> 656280 T2101 oascc.ZkStateReader$3.process Updating live nodes... (3)
   [junit4]   2> 656281 T2088 oascc.ZkStateReader$3.process Updating live nodes... (3)
   [junit4]   2> 656282 T2083 oascc.ZkStateReader$3.process Updating live nodes... (3)
   [junit4]   2> 656283 T2115 oascc.ZkStateReader$3.process Updating live nodes... (3)
   [junit4]   2> 656297 T2061 oasc.CorePropertiesLocator.discover Looking for core definitions underneath /mnt/ssd/jenkins/workspace/Lucene-Solr-4.x-Linux/solr/build/solr-core/test/J1/./org.apache.solr.cloud.CollectionsAPIDistributedZkTest-jetty2-1375479198673
   [junit4]   2> 656331 T2061 oasc.CorePropertiesLocator.discoverUnder Found core conf in /mnt/ssd/jenkins/workspace/Lucene-Solr-4.x-Linux/solr/build/solr-core/test/J1/./org.apache.solr.cloud.CollectionsAPIDistributedZkTest-jetty2-1375479198673/conf/
   [junit4]   2> 656331 T2061 oasc.CorePropertiesLocator.discover Found 1 core definitions
   [junit4]   2> 656332 T2061 oass.SolrDispatchFilter.init user.dir=/mnt/ssd/jenkins/workspace/Lucene-Solr-4.x-Linux/solr/build/solr-core/test/J1
   [junit4]   2> 656332 T2061 oass.SolrDispatchFilter.init SolrDispatchFilter.init() done
   [junit4]   2> 656333 T2061 oascsi.HttpClientUtil.createClient Creating new http client, config:maxConnections=128&maxConnectionsPerHost=32&followRedirects=false
   [junit4]   2> 656428 T2061 oejs.Server.doStart jetty-8.1.10.v20130312
   [junit4]   2> 656436 T2061 oejs.AbstractConnector.doStart Started SelectChannelConnector@127.0.0.1:38432
   [junit4]   2> 656437 T2061 oass.SolrDispatchFilter.init SolrDispatchFilter.init()
   [junit4]   2> 656437 T2061 oasc.SolrResourceLoader.locateSolrHome JNDI not configured for solr (NoInitialContextEx)
   [junit4]   2> 656438 T2061 oasc.SolrResourceLoader.locateSolrHome using system property solr.solr.home: /mnt/ssd/jenkins/workspace/Lucene-Solr-4.x-Linux/solr/build/solr-core/test/J1/./org.apache.solr.cloud.CollectionsAPIDistributedZkTest-jetty3-1375479199901
   [junit4]   2> 656438 T2061 oasc.SolrResourceLoader.<init> new SolrResourceLoader for directory: '/mnt/ssd/jenkins/workspace/Lucene-Solr-4.x-Linux/solr/build/solr-core/test/J1/./org.apache.solr.cloud.CollectionsAPIDistributedZkTest-jetty3-1375479199901/'
   [junit4]   2> 656461 T2061 oasc.ConfigSolr.fromFile Loading container configuration from /mnt/ssd/jenkins/workspace/Lucene-Solr-4.x-Linux/solr/build/solr-core/test/J1/./org.apache.solr.cloud.CollectionsAPIDistributedZkTest-jetty3-1375479199901/solr.xml
   [junit4]   2> 656524 T2061 oasc.ConfigSolrXml.<init> Config-defined core root directory: 
   [junit4]   2> 656524 T2061 oasc.CoreContainer.<init> New CoreContainer 2338168
   [junit4]   2> 656525 T2061 oasc.CoreContainer.load Loading cores into CoreContainer [instanceDir=/mnt/ssd/jenkins/workspace/Lucene-Solr-4.x-Linux/solr/build/solr-core/test/J1/./org.apache.solr.cloud.CollectionsAPIDistributedZkTest-jetty3-1375479199901/]
   [junit4]   2> 656527 T2061 oashc.HttpShardHandlerFactory.getParameter Setting socketTimeout to: 120000
   [junit4]   2> 656528 T2061 oashc.HttpShardHandlerFactory.getParameter Setting urlScheme to: http://
   [junit4]   2> 656528 T2061 oashc.HttpShardHandlerFactory.getParameter Setting connTimeout to: 15000
   [junit4]   2> 656529 T2061 oashc.HttpShardHandlerFactory.getParameter Setting maxConnectionsPerHost to: 20
   [junit4]   2> 656529 T2061 oashc.HttpShardHandlerFactory.getParameter Setting corePoolSize to: 0
   [junit4]   2> 656530 T2061 oashc.HttpShardHandlerFactory.getParameter Setting maximumPoolSize to: 2147483647
   [junit4]   2> 656530 T2061 oashc.HttpShardHandlerFactory.getParameter Setting maxThreadIdleTime to: 5
   [junit4]   2> 656531 T2061 oashc.HttpShardHandlerFactory.getParameter Setting sizeOfQueue to: -1
   [junit4]   2> 656531 T2061 oashc.HttpShardHandlerFactory.getParameter Setting fairnessPolicy to: false
   [junit4]   2> 656532 T2061 oascsi.HttpClientUtil.createClient Creating new http client, config:maxConnectionsPerHost=20&maxConnections=10000&socketTimeout=120000&connTimeout=15000&retry=false
   [junit4]   2> 656536 T2061 oasc.ZkContainer.initZooKeeper Zookeeper client=127.0.0.1:53607/solr
   [junit4]   2> 656536 T2061 oasc.ZkController.checkChrootPath zkHost includes chroot
   [junit4]   2> 656539 T2061 oascc.ConnectionManager.waitForConnected Waiting for client to connect to ZooKeeper
   [junit4]   2> 656540 T2127 oascc.ConnectionManager.process Watcher org.apache.solr.common.cloud.ConnectionManager@51b4d7 name:ZooKeeperConnection Watcher:127.0.0.1:53607 got event WatchedEvent state:SyncConnected type:None path:null path:null type:None
   [junit4]   2> 656540 T2061 oascc.ConnectionManager.waitForConnected Client is connected to ZooKeeper
   [junit4]   2> 656543 T2061 oascsi.HttpClientUtil.createClient Creating new http client, config:maxConnections=500&maxConnectionsPerHost=16&socketTimeout=120000&connTimeout=15000
   [junit4]   2> 656552 T2061 oascc.ConnectionManager.waitForConnected Waiting for client to connect to ZooKeeper
   [junit4]   2> 656555 T2129 oascc.ConnectionManager.process Watcher org.apache.solr.common.cloud.ConnectionManager@7022d4 name:ZooKeeperConnection Watcher:127.0.0.1:53607/solr got event WatchedEvent state:SyncConnected type:None path:null path:null type:None
   [junit4]   2> 656559 T2061 oascc.ConnectionManager.waitForConnected Client is connected to ZooKeeper
   [junit4]   2> 656566 T2061 oascc.ZkStateReader.createClusterStateWatchersAndUpdate Updating cluster state from ZooKeeper... 
   [junit4]   2> 657578 T2061 oasc.ZkController.createEphemeralLiveNode Register node as live in ZooKeeper:/live_nodes/127.0.0.1:38432_
   [junit4]   2> 657582 T2061 oascc.SolrZkClient.makePath makePath: /live_nodes/127.0.0.1:38432_
   [junit4]   2> 657590 T2083 oascc.ZkStateReader$3.process Updating live nodes... (4)
   [junit4]   2> 657591 T2088 oascc.ZkStateReader$3.process Updating live nodes... (4)
   [junit4]   2> 657592 T2129 oascc.ZkStateReader$3.process Updating live nodes... (4)
   [junit4]   2> 657592 T2101 oascc.ZkStateReader$3.process Updating live nodes... (4)
   [junit4]   2> 657592 T2115 oascc.ZkStateReader$3.process Updating live nodes... (4)
   [junit4]   2> 657599 T2061 oasc.CorePropertiesLocator.discover Looking for core definitions underneath /mnt/ssd/jenkins/workspace/Lucene-Solr-4.x-Linux/solr/build/solr-core/test/J1/./org.apache.solr.cloud.CollectionsAPIDistributedZkTest-jetty3-1375479199901
   [junit4]   2> 657636 T2061 oasc.CorePropertiesLocator.discoverUnder Found core conf in /mnt/ssd/jenkins/workspace/Lucene-Solr-4.x-Linux/solr/build/solr-core/test/J1/./org.apache.solr.cloud.CollectionsAPIDistributedZkTest-jetty3-1375479199901/conf/
   [junit4]   2> 657636 T2061 oasc.CorePropertiesLocator.discover Found 1 core definitions
   [junit4]   2> 657637 T2061 oass.SolrDispatchFilter.init user.dir=/mnt/ssd/jenkins/workspace/Lucene-Solr-4.x-Linux/solr/build/solr-core/test/J1
   [junit4]   2> 657637 T2061 oass.SolrDispatchFilter.init SolrDispatchFilter.init() done
   [junit4]   2> 657638 T2061 oascsi.HttpClientUtil.createClient Creating new http client, config:maxConnections=128&maxConnectionsPerHost=32&followRedirects=false
   [junit4]   2> 657750 T2061 oejs.Server.doStart jetty-8.1.10.v20130312
   [junit4]   2> 657754 T2061 oejs.AbstractConnector.doStart Started SelectChannelConnector@127.0.0.1:55484
   [junit4]   2> 657755 T2061 oass.SolrDispatchFilter.init SolrDispatchFilter.init()
   [junit4]   2> 657755 T2061 oasc.SolrResourceLoader.locateSolrHome JNDI not configured for solr (NoInitialContextEx)
   [junit4]   2> 657755 T2061 oasc.SolrResourceLoader.locateSolrHome using system property solr.solr.home: /mnt/ssd/jenkins/workspace/Lucene-Solr-4.x-Linux/solr/build/solr-core/test/J1/./org.apache.solr.cloud.CollectionsAPIDistributedZkTest-jetty4-1375479201206
   [junit4]   2> 657756 T2061 oasc.SolrResourceLoader.<init> new SolrResourceLoader for directory: '/mnt/ssd/jenkins/workspace/Lucene-Solr-4.x-Linux/solr/build/solr-core/test/J1/./org.apache.solr.cloud.CollectionsAPIDistributedZkTest-jetty4-1375479201206/'
   [junit4]   2> 657780 T2061 oasc.ConfigSolr.fromFile Loading container configuration from /mnt/ssd/jenkins/workspace/Lucene-Solr-4.x-Linux/solr/build/solr-core/test/J1/./org.apache.solr.cloud.CollectionsAPIDistributedZkTest-jetty4-1375479201206/solr.xml
   [junit4]   2> 657841 T2061 oasc.ConfigSolrXml.<init> Config-defined core root directory: 
   [junit4]   2> 657842 T2061 oasc.CoreContainer.<init> New CoreContainer 3691703
   [junit4]   2> 657842 T2061 oasc.CoreContainer.load Loading cores into CoreContainer [instanceDir=/mnt/ssd/jenkins/workspace/Lucene-Solr-4.x-Linux/solr/build/solr-core/test/J1/./org.apache.solr.cloud.CollectionsAPIDistributedZkTest-jetty4-1375479201206/]
   [junit4]   2> 657851 T2061 oashc.HttpShardHandlerFactory.getParameter Setting socketTimeout to: 120000
   [junit4]   2> 657852 T2061 oashc.HttpShardHandlerFactory.getParameter Setting urlScheme to: http://
   [junit4]   2> 657855 T2061 oashc.HttpShardHandlerFactory.getParameter Setting connTimeout to: 15000
   [junit4]   2> 657859 T2061 oashc.HttpShardHandlerFactory.getParameter Setting maxConnectionsPerHost to: 20
   [junit4]   2> 657860 T2061 oashc.HttpShardHandlerFactory.getParameter Setting corePoolSize to: 0
   [junit4]   2> 657860 T2061 oashc.HttpShardHandlerFactory.getParameter Setting maximumPoolSize to: 2147483647
   [junit4]   2> 657861 T2061 oashc.HttpShardHandlerFactory.getParameter Setting maxThreadIdleTime to: 5
   [junit4]   2> 657861 T2061 oashc.HttpShardHandlerFactory.getParameter Setting sizeOfQueue to: -1
   [junit4]   2> 657861 T2061 oashc.HttpShardHandlerFactory.getParameter Setting fairnessPolicy to: false
   [junit4]   2> 657862 T2061 oascsi.HttpClientUtil.createClient Creating new http client, config:maxConnectionsPerHost=20&maxConnections=10000&socketTimeout=120000&connTimeout=15000&retry=false
   [junit4]   2> 657866 T2061 oasc.ZkContainer.initZooKeeper Zookeeper client=127.0.0.1:53607/solr
   [junit4]   2> 657866 T2061 oasc.ZkController.checkChrootPath zkHost includes chroot
   [junit4]   2> 657871 T2061 oascc.ConnectionManager.waitForConnected Waiting for client to connect to ZooKeeper
   [junit4]   2> 657872 T2141 oascc.ConnectionManager.process Watcher org.apache.solr.common.cloud.ConnectionManager@da4b7 name:ZooKeeperConnection Watcher:127.0.0.1:53607 got event WatchedEvent state:SyncConnected type:None path:null path:null type:None
   [junit4]   2> 657872 T2061 oascc.ConnectionManager.waitForConnected Client is connected to ZooKeeper
   [junit4]   2> 657884 T2061 oascsi.HttpClientUtil.createClient Creating new http client, config:maxConnections=500&maxConnectionsPerHost=16&socketTimeout=120000&connTimeout=15000
   [junit4]   2> 657891 T2061 oascc.ConnectionManager.waitForConnected Waiting for client to connect to ZooKeeper
   [junit4]   2> 657894 T2143 oascc.ConnectionManager.process Watcher org.apache.solr.common.cloud.ConnectionManager@1415ba0 name:ZooKeeperConnection Watcher:127.0.0.1:53607/solr got event WatchedEvent state:SyncConnected type:None path:null path:null type:None
   [junit4]   2> 657894 T2061 oascc.ConnectionManager.waitForConnected Client is connected to ZooKeeper
   [junit4]   2> 657900 T2061 oascc.ZkStateReader.createClusterStateWatchersAndUpdate Updating cluster state from ZooKeeper... 
   [junit4]   2> 658914 T2061 oasc.ZkController.createEphemeralLiveNode Register node as live in ZooKeeper:/live_nodes/127.0.0.1:55484_
   [junit4]   2> 658916 T2061 oascc.SolrZkClient.makePath makePath: /live_nodes/127.0.0.1:55484_
   [junit4]   2> 658925 T2088 oascc.ZkStateReader$3.process Updating live nodes... (5)
   [junit4]   2> 658925 T2083 oascc.ZkStateReader$3.process Updating live nodes... (5)
   [junit4]   2> 658925 T2129 oascc.ZkStateReader$3.process Updating live nodes... (5)
   [junit4]   2> 658925 T2115 oascc.ZkStateReader$3.process Updating live nodes... (5)
   [junit4]   2> 658926 T2101 oascc.ZkStateReader$3.process Updating live nodes... (5)
   [junit4]   2> 658926 T2143 oascc.ZkStateReader$3.process Updating live nodes... (5)
   [junit4]   2> 658933 T2061 oasc.CorePropertiesLocator.discover Looking for core definitions underneath /mnt/ssd/jenkins/workspace/Lucene-Solr-4.x-Linux/solr/build/solr-core/test/J1/./org.apache.solr.cloud.CollectionsAPIDistributedZkTest-jetty4-1375479201206
   [junit4]   2> 658963 T2061 oasc.CorePropertiesLocator.discoverUnder Found core conf in /mnt/ssd/jenkins/workspace/Lucene-Solr-4.x-Linux/solr/build/solr-core/test/J1/./org.apache.solr.cloud.CollectionsAPIDistributedZkTest-jetty4-1375479201206/conf/
   [junit4]   2> 658964 T2061 oasc.CorePropertiesLocator.discover Found 1 core definitions
   [junit4]   2> 658964 T2061 oass.SolrDispatchFilter.init user.dir=/mnt/ssd/jenkins/workspace/Lucene-Solr-4.x-Linux/solr/build/solr-core/test/J1
   [junit4]   2> 658965 T2061 oass.SolrDispatchFilter.init SolrDispatchFilter.init() done
   [junit4]   2> 658965 T2061 oascsi.HttpClientUtil.createClient Creating new http client, config:maxConnections=128&maxConnectionsPerHost=32&followRedirects=false
   [junit4]   2> 658970 T2061 oascsi.HttpClientUtil.createClient Creating new http client, config:maxConnections=128&maxConnectionsPerHost=32&followRedirects=false
   [junit4]   2> 658975 T2095 oasha.CollectionsHandler.handleCreateAction Creating Collection : numShards=2&name=nodes_used_collection&replicationFactor=2&action=CREATE&wt=javabin&version=2
   [junit4]   2> 658977 T2083 oasc.DistributedQueue$LatchChildWatcher.process Watcher fired on path: /overseer/collection-queue-work state: SyncConnected type NodeChildrenChanged
   [junit4]   2> 658980 T2083 oasc.DistributedQueue$LatchChildWatcher.process Watcher fired on path: /overseer/collection-queue-work state: SyncConnected type NodeChildrenChanged
   [junit4]   2> 658980 T2085 oasc.OverseerCollectionProcessor.run Overseer Collection Processor: Get the message id:/overseer/collection-queue-work/qn-0000000000 message:{
   [junit4]   2> 	  "operation":"createcollection",
   [junit4]   2> 	  "numShards":"2",
   [junit4]   2> 	  "name":"nodes_used_collection",
   [junit4]   2> 	  "replicationFactor":"2"}
   [junit4]   2> 658981 T2085 oasc.OverseerCollectionProcessor.processMessage WARN OverseerCollectionProcessor.processMessage : createcollection , {
   [junit4]   2> 	  "operation":"createcollection",
   [junit4]   2> 	  "numShards":"2",
   [junit4]   2> 	  "name":"nodes_used_collection",
   [junit4]   2> 	  "replicationFactor":"2"}
   [junit4]   2> 659874 T2084 oascc.ZkStateReader.updateClusterState Updating cloud state from ZooKeeper... 
   [junit4]   2> 659875 T2084 oasc.Overseer$ClusterStateUpdater.buildCollection building a new collection: nodes_used_collection
   [junit4]   2> 659875 T2084 oasc.Overseer$ClusterStateUpdater.createCollection Create collection nodes_used_collection with shards [shard1, shard2]
   [junit4]   2> 659880 T2088 oascc.ZkStateReader$2.process A cluster state change: WatchedEvent state:SyncConnected type:NodeDataChanged path:/clusterstate.json, has occurred - updating... (live nodes size: 5)
   [junit4]   2> 659880 T2115 oascc.ZkStateReader$2.process A cluster state change: WatchedEvent state:SyncConnected type:NodeDataChanged path:/clusterstate.json, has occurred - updating... (live nodes size: 5)
   [junit4]   2> 659880 T2101 oascc.ZkStateReader$2.process A cluster state change: WatchedEvent state:SyncConnected type:NodeDataChanged path:/clusterstate.json, has occurred - updating... (live nodes size: 5)
   [junit4]   2> 659880 T2143 oascc.ZkStateReader$2.process A cluster state change: WatchedEvent state:SyncConnected type:NodeDataChanged path:/clusterstate.json, has occurred - updating... (live nodes size: 5)
   [junit4]   2> 659881 T2083 oascc.ZkStateReader$2.process A cluster state change: WatchedEvent state:SyncConnected type:NodeDataChanged path:/clusterstate.json, has occurred - updating... (live nodes size: 5)
   [junit4]   2> 659881 T2129 oascc.ZkStateReader$2.process A cluster state change: WatchedEvent state:SyncConnected type:NodeDataChanged path:/clusterstate.json, has occurred - updating... (live nodes size: 5)
   [junit4]   2> 659986 T2085 oasc.OverseerCollectionProcessor.createCollection going to create cores replicas shardNames [shard1, shard2] , repFactor : 2
   [junit4]   2> 659987 T2085 oasc.OverseerCollectionProcessor.createCollection Creating shard nodes_used_collection_shard1_replica1 as part of slice shard1 of collection nodes_used_collection on 127.0.0.1:53977_
   [junit4]   2> 659987 T2085 oasc.OverseerCollectionProcessor.createCollection Creating shard nodes_used_collection_shard1_replica2 as part of slice shard1 of collection nodes_used_collection on 127.0.0.1:38432_
   [junit4]   2> 659988 T2085 oasc.OverseerCollectionProcessor.createCollection Creating shard nodes_used_collection_shard2_replica1 as part of slice shard2 of collection nodes_used_collection on 127.0.0.1:36214_
   [junit4]   2> 659989 T2085 oasc.OverseerCollectionProcessor.createCollection Creating shard nodes_used_collection_shard2_replica2 as part of slice shard2 of collection nodes_used_collection on 127.0.0.1:55484_
   [junit4]   2> 659991 T2079 oasc.ZkController.publish publishing core=nodes_used_collection_shard1_replica1 state=down
   [junit4]   2> 659992 T2139 oasc.ZkController.publish publishing core=nodes_used_collection_shard2_replica2 state=down
   [junit4]   2> 659991 T2109 oasc.ZkController.publish publishing core=nodes_used_collection_shard2_replica1 state=down
   [junit4]   2> 659991 T2123 oasc.ZkController.publish publishing core=nodes_used_collection_shard1_replica2 state=down
   [junit4]   2> 659993 T2079 oasc.ZkController.waitForCoreNodeName look for our core node name
   [junit4]   2> 659995 T2109 oasc.ZkController.waitForCoreNodeName look for our core node name
   [junit4]   2> 659995 T2139 oasc.ZkController.waitForCoreNodeName look for our core node name
   [junit4]   2> 659995 T2123 oasc.ZkController.waitForCoreNodeName look for our core node name
   [junit4]   2> 661394 T2084 oascc.ZkStateReader.updateClusterState Updating cloud state from ZooKeeper... 
   [junit4]   2> 661396 T2084 oasc.Overseer$ClusterStateUpdater.updateState WARN Could not find collection node for nodes_used_collection, skipping publish state
   [junit4]   2> 661396 T2084 oasc.Overseer$ClusterStateUpdater.updateState Update state numShards=2 message={
   [junit4]   2> 	  "operation":"state",
   [junit4]   2> 	  "core_node_name":"core_node1",
   [junit4]   2> 	  "numShards":"2",
   [junit4]   2> 	  "shard":"shard1",
   [junit4]   2> 	  "roles":null,
   [junit4]   2> 	  "state":"down",
   [junit4]   2> 	  "shard_state":"active",
   [junit4]   2> 	  "core":"nodes_used_collection_shard1_replica1",
   [junit4]   2> 	  "collection":"nodes_used_collection",
   [junit4]   2> 	  "shard_range":null,
   [junit4]   2> 	  "node_name":"127.0.0.1:53977_",
   [junit4]   2> 	  "base_url":"http://127.0.0.1:53977"}
   [junit4]   2> 661404 T2084 oasc.Overseer$ClusterStateUpdater.updateState WARN Could not find collection node for nodes_used_collection, skipping publish state
   [junit4]   2> 661404 T2084 oasc.Overseer$ClusterStateUpdater.updateState Update state numShards=2 message={
   [junit4]   2> 	  "operation":"state",
   [junit4]   2> 	  "core_node_name":"core_node2",
   [junit4]   2> 	  "numShards":"2",
   [junit4]   2> 	  "shard":"shard2",
   [junit4]   2> 	  "roles":null,
   [junit4]   2> 	  "state":"down",
   [junit4]   2> 	  "shard_state":"active",
   [junit4]   2> 	  "core":"nodes_used_collection_shard2_replica2",
   [junit4]   2> 	  "collection":"nodes_used_collection",
   [junit4]   2> 	  "shard_range":null,
   [junit4]   2> 	  "node_name":"127.0.0.1:55484_",
   [junit4]   2> 	  "base_url":"http://127.0.0.1:55484"}
   [junit4]   2> 661412 T2084 oasc.Overseer$ClusterStateUpdater.updateState WARN Could not find collection node for nodes_used_collection, skipping publish state
   [junit4]   2> 661413 T2084 oasc.Overseer$ClusterStateUpdater.updateState Update state numShards=2 message={
   [junit4]   2> 	  "operation":"state",
   [junit4]   2> 	  "core_node_name":"core_node3",
   [junit4]   2> 	  "numShards":"2",
   [junit4]   2> 	  "shard":"shard2",
   [junit4]   2> 	  "roles":null,
   [junit4]   2> 	  "state":"down",
   [junit4]   2> 	  "shard_state":"active",
   [junit4]   2> 	  "core":"nodes_used_collection_shard2_replica1",
   [junit4]   2> 	  "collection":"nodes_used_collection",
   [junit4]   2> 	  "shard_range":null,
   [junit4]   2> 	  "node_name":"127.0.0.1:36214_",
   [junit4]   2> 	  "base_url":"http://127.0.0.1:36214"}
   [junit4]   2> 661420 T2084 oasc.Overseer$ClusterStateUpdater.updateState WARN Could not find collection node for nodes_used_collection, skipping publish state
   [junit4]   2> 661420 T2084 oasc.Overseer$ClusterStateUpdater.updateState Update state numShards=2 message={
   [junit4]   2> 	  "operation":"state",
   [junit4]   2> 	  "core_node_name":"core_node4",
   [junit4]   2> 	  "numShards":"2",
   [junit4]   2> 	  "shard":"shard1",
   [junit4]   2> 	  "roles":null,
   [junit4]   2> 	  "state":"down",
   [junit4]   2> 	  "shard_state":"active",
   [junit4]   2> 	  "core":"nodes_used_collection_shard1_replica2",
   [junit4]   2> 	  "collection":"nodes_used_collection",
   [junit4]   2> 	  "shard_range":null,
   [junit4]   2> 	  "node_name":"127.0.0.1:38432_",
   [junit4]   2> 	  "base_url":"http://127.0.0.1:38432"}
   [junit4]   2> 661426 T2101 oascc.ZkStateReader$2.process A cluster state change: WatchedEvent state:SyncConnected type:NodeDataChanged path:/clusterstate.json, has occurred - updating... (live nodes size: 5)
   [junit4]   2> 661426 T2088 oascc.ZkStateReader$2.process A cluster state change: WatchedEvent state:SyncConnected type:NodeDataChanged path:/clusterstate.json, has occurred - updating... (live nodes size: 5)
   [junit4]   2> 661426 T2143 oascc.ZkStateReader$2.process A cluster state change: WatchedEvent state:SyncConnected type:NodeDataChanged path:/clusterstate.json, has occurred - updating... (live nodes size: 5)
   [junit4]   2> 661427 T2115 oascc.ZkStateReader$2.process A cluster state change: WatchedEvent state:SyncConnected type:NodeDataChanged path:/clusterstate.json, has occurred - updating... (live nodes size: 5)
   [junit4]   2> 661426 T2129 oascc.ZkStateReader$2.process A cluster state change: WatchedEvent state:SyncConnected type:NodeDataChanged path:/clusterstate.json, has occurred - updating... (live nodes size: 5)
   [junit4]   2> 661426 T2083 oascc.ZkStateReader$2.process A cluster state change: WatchedEvent state:SyncConnected type:NodeDataChanged path:/clusterstate.json, has occurred - updating... (live nodes size: 5)
   [junit4]   2> 661994 T2079 oasc.ZkController.waitForShardId waiting to find shard id in clusterstate for nodes_used_collection_shard1_replica1
   [junit4]   2> 661996 T2123 oasc.ZkController.waitForShardId waiting to find shard id in clusterstate for nodes_used_collection_shard1_replica2
   [junit4]   2> 661995 T2079 oasc.CorePropertiesLocator.writePropertiesFile ERROR Couldn't persist core properties to /mnt/ssd/jenkins/workspace/Lucene-Solr-4.x-Linux/solr/build/solr-core/test/J1/./org.apache.solr.cloud.CollectionsAPIDistributedZkTest-controljetty-1375479197218/nodes_used_collection_shard1_replica1/core.properties: java.io.FileNotFoundException: /mnt/ssd/jenkins/workspace/Lucene-Solr-4.x-Linux/solr/build/solr-core/test/J1/./org.apache.solr.cloud.CollectionsAPIDistributedZkTest-controljetty-1375479197218/nodes_used_collection_shard1_replica1/core.properties (No such file or directory)
   [junit4]   2> 661996 T2109 oasc.ZkController.waitForShardId waiting to find shard id in clusterstate for nodes_used_collection_shard2_replica1
   [junit4]   2> 661996 T2139 oasc.ZkController.waitForShardId waiting to find shard id in clusterstate for nodes_used_collection_shard2_replica2
   [junit4]   2> 661998 T2109 oasc.CorePropertiesLocator.writePropertiesFile ERROR Couldn't persist core properties to /mnt/ssd/jenkins/workspace/Lucene-Solr-4.x-Linux/solr/build/solr-core/test/J1/./org.apache.solr.cloud.CollectionsAPIDistributedZkTest-jetty2-1375479198673/nodes_used_collection_shard2_replica1/core.properties: java.io.FileNotFoundException: /mnt/ssd/jenkins/workspace/Lucene-Solr-4.x-Linux/solr/build/solr-core/test/J1/./org.apache.solr.cloud.CollectionsAPIDistributedZkTest-jetty2-1375479198673/nodes_used_collection_shard2_replica1/core.properties (No such file or directory)
   [junit4]   2> 661997 T2079 oasc.CoreContainer.create Creating SolrCore 'nodes_used_collection_shard1_replica1' using instanceDir: /mnt/ssd/jenkins/workspace/Lucene-Solr-4.x-Linux/solr/build/solr-core/test/J1/./org.apache.solr.cloud.CollectionsAPIDistributedZkTest-controljetty-1375479197218/nodes_used_collection_shard1_replica1
   [junit4]   2> 661999 T2079 oasc.ZkController.createCollectionZkNode Check for collection zkNode:nodes_used_collection
   [junit4]   2> 661997 T2123 oasc.CorePropertiesLocator.writePropertiesFile ERROR Couldn't persist core properties to /mnt/ssd/jenkins/workspace/Lucene-Solr-4.x-Linux/solr/build/solr-core/test/J1/./org.apache.solr.cloud.CollectionsAPIDistributedZkTest-jetty3-1375479199901/nodes_used_collection_shard1_replica2/core.properties: java.io.FileNotFoundException: /mnt/ssd/jenkins/workspace/Lucene-Solr-4.x-Linux/solr/build/solr-core/test/J1/./org.apache.solr.cloud.CollectionsAPIDistributedZkTest-jetty3-1375479199901/nodes_used_collection_shard1_replica2/core.properties (No such file or directory)
   [junit4]   2> 661998 T2109 oasc.CoreContainer.create Creating SolrCore 'nodes_used_collection_shard2_replica1' using instanceDir: /mnt/ssd/jenkins/workspace/Lucene-Solr-4.x-Linux/solr/build/solr-core/test/J1/./org.apache.solr.cloud.CollectionsAPIDistributedZkTest-jetty2-1375479198673/nodes_used_collection_shard2_replica1
   [junit4]   2> 662000 T2109 oasc.ZkController.createCollectionZkNode Check for collection zkNode:nodes_used_collection
   [junit4]   2> 661998 T2139 oasc.CorePropertiesLocator.writePropertiesFile ERROR Couldn't persist core properties to /mnt/ssd/jenkins/workspace/Lucene-Solr-4.x-Linux/solr/build/solr-core/test/J1/./org.apache.solr.cloud.CollectionsAPIDistributedZkTest-jetty4-1375479201206/nodes_used_collection_shard2_replica2/core.properties: java.io.FileNotFoundException: /mnt/ssd/jenkins/workspace/Lucene-Solr-4.x-Linux/solr/build/solr-core/test/J1/./org.apache.solr.cloud.CollectionsAPIDistributedZkTest-jetty4-1375479201206/nodes_used_collection_shard2_replica2/core.properties (No such file or directory)
   [junit4]   2> 662000 T2079 oasc.ZkController.createCollectionZkNode Creating collection in ZooKeeper:nodes_used_collection
   [junit4]   2> 661999 T2123 oasc.CoreContainer.create Creating SolrCore 'nodes_used_collection_shard1_replica2' using instanceDir: /mnt/ssd/jenkins/workspace/Lucene-Solr-4.x-Linux/solr/build/solr-core/test/J1/./org.apache.solr.cloud.CollectionsAPIDistributedZkTest-jetty3-1375479199901/nodes_used_collection_shard1_replica2
   [junit4]   2> 662001 T2123 oasc.ZkController.createCollectionZkNode Check for collection zkNode:nodes_used_collection
   [junit4]   2> 662001 T2079 oasc.ZkController.getConfName Looking for collection configName
   [junit4]   2> 662000 T2139 oasc.CoreContainer.create Creating SolrCore 'nodes_used_collection_shard2_replica2' using instanceDir: /mnt/ssd/jenkins/workspace/Lucene-Solr-4.x-Linux/solr/build/solr-core/test/J1/./org.apache.solr.cloud.CollectionsAPIDistributedZkTest-jetty4-1375479201206/nodes_used_collection_shard2_replica2
   [junit4]   2> 662010 T2139 oasc.ZkController.createCollectionZkNode Check for collection zkNode:nodes_used_collection
   [junit4]   2> 662001 T2109 oasc.ZkController.createCollectionZkNode Creating collection in ZooKeeper:nodes_used_collection
   [junit4]   2> 662010 T2123 oasc.ZkController.createCollectionZkNode Creating collection in ZooKeeper:nodes_used_collection
   [junit4]   2> 662011 T2109 oasc.ZkController.getConfName Looking for collection configName
   [junit4]   2> 662012 T2123 oasc.ZkController.getConfName Looking for collection configName
   [junit4]   2> 662013 T2139 oasc.ZkController.createCollectionZkNode Creating collection in ZooKeeper:nodes_used_collection
   [junit4]   2> 662014 T2139 oasc.ZkController.getConfName Looking for collection configName
   [junit4]   2> 662014 T2079 oasc.ZkController.getConfName Only one config set found in zk - using it:conf1
   [junit4]   2> 662014 T2079 oascc.SolrZkClient.makePath makePath: /collections/nodes_used_collection
   [junit4]   2> 662017 T2109 oasc.ZkController.getConfName Only one config set found in zk - using it:conf1
   [junit4]   2> 662017 T2123 oasc.ZkController.getConfName Only one config set found in zk - using it:conf1
   [junit4]   2> 662017 T2109 oascc.SolrZkClient.makePath makePath: /collections/nodes_used_collection
   [junit4]   2> 662017 T2123 oascc.SolrZkClient.makePath makePath: /collections/nodes_used_collection
   [junit4]   2> 662019 T2139 oasc.ZkController.getConfName Only one config set found in zk - using it:conf1
   [junit4]   2> 662019 T2139 oascc.SolrZkClient.makePath makePath: /collections/nodes_used_collection
   [junit4]   2> 662022 T2109 oasc.ZkController.readConfigName Load collection config from:/collections/nodes_used_collection
   [junit4]   2> 662024 T2123 oasc.ZkController.readConfigName Load collection config from:/collections/nodes_used_collection
   [junit4]   2> 662025 T2079 oasc.ZkController.readConfigName Load collection config from:/collections/nodes_used_collection
   [junit4]   2> 662026 T2109 oasc.SolrResourceLoader.<init> new SolrResourceLoader for directory: '/mnt/ssd/jenkins/workspace/Lucene-Solr-4.x-Linux/solr/build/solr-core/test/J1/./org.apache.solr.cloud.CollectionsAPIDistributedZkTest-jetty2-1375479198673/nodes_used_collection_shard2_replica1/'
   [junit4]   2> 662026 T2139 oasc.ZkController.readConfigName Load collection config from:/collections/nodes_used_collection
   [junit4]   2> 662028 T2079 oasc.SolrResourceLoader.<init> new SolrResourceLoader for directory: '/mnt/ssd/jenkins/workspace/Lucene-Solr-4.x-Linux/solr/build/solr-core/test/J1/./org.apache.solr.cloud.CollectionsAPIDistributedZkTest-controljetty-1375479197218/nodes_used_collection_shard1_replica1/'
   [junit4]   2> 662028 T2139 oasc.SolrResourceLoader.<init> new SolrResourceLoader for directory: '/mnt/ssd/jenkins/workspace/Lucene-Solr-4.x-Linux/solr/build/solr-core/test/J1/./org.apache.solr.cloud.CollectionsAPIDistributedZkTest-jetty4-1375479201206/nodes_used_collection_shard2_replica2/'
   [junit4]   2> 662029 T2123 oasc.SolrResourceLoader.<init> new SolrResourceLoader for directory: '/mnt/ssd/jenkins/workspace/Lucene-Solr-4.x-Linux/solr/build/solr-core/test/J1/./org.apache.solr.cloud.CollectionsAPIDistributedZkTest-jetty3-1375479199901/nodes_used_collection_shard1_replica2/'
   [junit4]   2> 662090 T2139 oasc.SolrConfig.<init> Using Lucene MatchVersion: LUCENE_45
   [junit4]   2> 662093 T2109 oasc.SolrConfig.<init> Using Lucene MatchVersion: LUCENE_45
   [junit4]   2> 662116 T2123 oasc.SolrConfig.<init> Using Lucene MatchVersion: LUCENE_45
   [junit4]   2> 662118 T2079 oasc.SolrConfig.<init> Using Lucene MatchVersion: LUCENE_45
   [junit4]   2> 662177 T2139 oasc.SolrConfig.<init> Loaded SolrConfig: solrconfig.xml
   [junit4]   2> 662179 T2109 oasc.SolrConfig.<init> Loaded SolrConfig: solrconfig.xml
   [junit4]   2> 662180 T2139 oass.IndexSchema.readSchema Reading Solr Schema from schema.xml
   [junit4]   2> 662181 T2109 oass.IndexSchema.readSchema Reading Solr Schema from schema.xml
   [junit4]   2> 662194 T2139 oass.IndexSchema.readSchema [nodes_used_collection_shard2_replica2] Schema name=test
   [junit4]   2> 662198 T2109 oass.IndexSchema.readSchema [nodes_used_collection_shard2_replica1] Schema name=test
   [junit4]   2> 662227 T2123 oasc.SolrConfig.<init> Loaded SolrConfig: solrconfig.xml
   [junit4]   2> 662229 T2079 oasc.SolrConfig.<init> Loaded SolrConfig: solrconfig.xml
   [junit4]   2> 662230 T2123 oass.IndexSchema.readSchema Reading Solr Schema from schema.xml
   [junit4]   2> 662231 T2079 oass.IndexSchema.readSchema Reading Solr Schema from schema.xml
   [junit4]   2> 662247 T2079 oass.IndexSchema.readSchema [nodes_used_collection_shard1_replica1] Schema name=test
   [junit4]   2> 662247 T2123 oass.IndexSchema.readSchema [nodes_used_collection_shard1_replica2] Schema name=test
   [junit4]   2> 663117 T2139 oass.ByteField.init WARN ByteField is deprecated and will be removed in 5.0. You should use TrieIntField instead.
   [junit4]   2> 663118 T2139 oass.ShortField.init WARN ShortField is deprecated and will be removed in 5.0. You should use TrieIntField instead.
   [junit4]   2> 663119 T2139 oass.OpenExchangeRatesOrgProvider.init Initialized with rates=open-exchange-rates.json, refreshInterval=1440.
   [junit4]   2> 663135 T2139 oass.IndexSchema.readSchema default search field in schema is text
   [junit4]   2> 663139 T2139 oass.IndexSchema.readSchema unique key field: id
   [junit4]   2> 663271 T2139 oass.FileExchangeRateProvider.reload Reloading exchange rates from file currency.xml
   [junit4]   2> 663277 T2139 oass.FileExchangeRateProvider.reload Reloading exchange rates from file currency.xml
   [junit4]   2> 663290 T2139 oass.OpenExchangeRatesOrgProvider.reload Reloading exchange rates from open-exchange-rates.json
   [junit4]   2> 663292 T2139 oass.OpenExchangeRatesOrgProvider$OpenExchangeRates.<init> WARN Unknown key IMPORTANT NOTE
   [junit4]   2> 663293 T2139 oass.OpenExchangeRatesOrgProvider$OpenExchangeRates.<init> WARN Expected key, got STRING
   [junit4]   2> 663293 T2139 oass.OpenExchangeRatesOrgProvider.reload Reloading exchange rates from open-exchange-rates.json
   [junit4]   2> 663296 T2139 oass.OpenExchangeRatesOrgProvider$OpenExchangeRates.<init> WARN Unknown key IMPORTANT NOTE
   [junit4]   2> 663296 T2139 oass.OpenExchangeRatesOrgProvider$OpenExchangeRates.<init> WARN Expected key, got STRING
   [junit4]   2> 663297 T2139 oasc.SolrCore.initDirectoryFactory org.apache.solr.core.MockDirectoryFactory
   [junit4]   2> 663297 T2139 oasc.SolrCore.<init> [nodes_used_collection_shard2_replica2] Opening new SolrCore at /mnt/ssd/jenkins/workspace/Lucene-Solr-4.x-Linux/solr/build/solr-core/test/J1/./org.apache.solr.cloud.CollectionsAPIDistributedZkTest-jetty4-1375479201206/nodes_used_collection_shard2_replica2/, dataDir=/mnt/ssd/jenkins/workspace/Lucene-Solr-4.x-Linux/solr/build/solr-core/test/J1/./org.apache.solr.cloud.CollectionsAPIDistributedZkTest-jetty4-1375479201206//nodes_used_collection_shard2_replica2/data/
   [junit4]   2> 663298 T2139 oasc.JmxMonitoredMap.<init> JMX monitoring is enabled. Adding Solr mbeans to JMX Server: com.sun.jmx.mbeanserver.JmxMBeanServer@904497
   [junit4]   2> 663299 T2139 oasc.CachingDirectoryFactory.get return new directory for /mnt/ssd/jenkins/workspace/Lucene-Solr-4.x-Linux/solr/build/solr-core/test/J1/./org.apache.solr.cloud.CollectionsAPIDistributedZkTest-jetty4-1375479201206//nodes_used_collection_shard2_replica2/data
   [junit4]   2> 663300 T2139 oasc.SolrCore.getNewIndexDir New index directory detected: old=null new=/mnt/ssd/jenkins/workspace/Lucene-Solr-4.x-Linux/solr/build/solr-core/test/J1/./org.apache.solr.cloud.CollectionsAPIDistributedZkTest-jetty4-1375479201206//nodes_used_collection_shard2_replica2/data/index/
   [junit4]   2> 663300 T2139 oasc.SolrCore.initIndex WARN [nodes_used_collection_shard2_replica2] Solr index directory '/mnt/ssd/jenkins/workspace/Lucene-Solr-4.x-Linux/solr/build/solr-core/test/J1/./org.apache.solr.cloud.CollectionsAPIDistributedZkTest-jetty4-1375479201206/nodes_used_collection_shard2_replica2/data/index' doesn't exist. Creating new index...
   [junit4]   2> 663301 T2139 oasc.CachingDirectoryFactory.get return new directory for /mnt/ssd/jenkins/workspace/Lucene-Solr-4.x-Linux/solr/build/solr-core/test/J1/./org.apache.solr.cloud.CollectionsAPIDistributedZkTest-jetty4-1375479201206//nodes_used_collection_shard2_replica2/data/index
   [junit4]   2> 663310 T2139 oasc.SolrDeletionPolicy.onCommit SolrDeletionPolicy.onCommit: commits: num=1
   [junit4]   2> 		commit{dir=MockDirWrapper(RateLimitedDirectoryWrapper(org.apache.lucene.store.RAMDirectory@197ba6 lockFactory=org.apache.lucene.store.NativeFSLockFactory@feafeb)),segFN=segments_1,generation=1}
   [junit4]   2> 663310 T2139 oasc.SolrDeletionPolicy.updateCommits newest commit generation = 1
   [junit4]   2> 663313 T2079 oass.ByteField.init WARN ByteField is deprecated and will be removed in 5.0. You should use TrieIntField instead.
   [junit4]   2> 663314 T2079 oass.ShortField.init WARN ShortField is deprecated and will be removed in 5.0. You should use TrieIntField instead.
   [junit4]   2> 663314 T2079 oass.OpenExchangeRatesOrgProvider.init Initialized with rates=open-exchange-rates.json, refreshInterval=1440.
   [junit4]   2> 663315 T2139 oasup.UpdateRequestProcessorChain.init inserting DistributedUpdateProcessorFactory into updateRequestProcessorChain "dedupe"
   [junit4]   2> 663316 T2139 oasup.UpdateRequestProcessorChain.init inserting DistributedUpdateProcessorFactory into updateRequestProcessorChain "stored_sig"
   [junit4]   2> 663316 T2109 oass.ByteField.init WARN ByteField is deprecated and will be removed in 5.0. You should use TrieIntField instead.
   [junit4]   2> 663317 T2109 oass.ShortField.init WARN ShortField is deprecated and will be removed in 5.0. You should use TrieIntField instead.
   [junit4]   2> 663317 T2139 oasup.UpdateRequestProcessorChain.init inserting DistributedUpdateProcessorFactory into updateRequestProcessorChain "distrib-dup-test-chain-implicit"
   [junit4]   2> 663318 T2109 oass.OpenExchangeRatesOrgProvider.init Initialized with rates=open-exchange-rates.json, refreshInterval=1440.
   [junit4]   2> 663318 T2139 oasc.RequestHandlers.initHandlersFromConfig created standard: solr.StandardRequestHandler
   [junit4]   2> 663320 T2139 oasc.RequestHandlers.initHandlersFromConfig created /get: solr.RealTimeGetHandler
   [junit4]   2> 663320 T2139 oasc.RequestHandlers.initHandlersFromConfig adding lazy requestHandler: solr.ReplicationHandler
   [junit4]   2> 663320 T2139 oasc.RequestHandlers.initHandlersFromConfig created /replication: solr.ReplicationHandler
   [junit4]   2> 663321 T2079 oass.IndexSchema.readSchema default search field in schema is text
   [junit4]   2> 663321 T2139 oasc.RequestHandlers.initHandlersFromConfig created /update: solr.UpdateRequestHandler
   [junit4]   2> 663333 T2139 oasc.RequestHandlers.initHandlersFromConfig created /admin/: org.apache.solr.handler.admin.AdminHandlers
   [junit4]   2> 663336 T2139 oashl.XMLLoader.init xsltCacheLifetimeSeconds=60
   [junit4]   2> 663336 T2079 oass.IndexSchema.readSchema unique key field: id
   [junit4]   2> 663338 T2109 oass.IndexSchema.readSchema default search field in schema is text
   [junit4]   2> 663338 T2139 oass.SolrIndexSearcher.<init> Opening Searcher@6de6e1 main
   [junit4]   2> 663339 T2139 oasu.CommitTracker.<init> Hard AutoCommit: disabled
   [junit4]   2> 663339 T2139 oasu.CommitTracker.<init> Soft AutoCommit: disabled
   [junit4]   2> 663343 T2109 oass.IndexSchema.readSchema unique key field: id
   [junit4]   2> 663345 T2123 oass.ByteField.init WARN ByteField is deprecated and will be removed in 5.0. You should use TrieIntField instead.
   [junit4]   2> 663346 T2123 oass.ShortField.init WARN ShortField is deprecated and will be removed in 5.0. You should use TrieIntField instead.
   [junit4]   2> 663346 T2149 oasc.SolrCore.registerSearcher [nodes_used_collection_shard2_replica2] Registered new searcher Searcher@6de6e1 main{StandardDirectoryReader(segments_1:1)}
   [junit4]   2> 663346 T2139 oasc.CoreContainer.registerCore registering core: nodes_used_collection_shard2_replica2
   [junit4]   2> 663347 T2139 oasc.ZkController.register Register replica - core:nodes_used_collection_shard2_replica2 address:http://127.0.0.1:55484 collection:nodes_used_collection shard:shard2
   [junit4]   2> 663347 T2123 oass.OpenExchangeRatesOrgProvider.init Initialized with rates=open-exchange-rates.json, refreshInterval=1440.
   [junit4]   2> 663347 T2139 oascsi.HttpClientUtil.createClient Creating new http client, config:maxConnections=10000&maxConnectionsPerHost=20&connTimeout=15000&socketTimeout=30000&retry=false
   [junit4]   2> 663360 T2139 oascc.SolrZkClient.makePath makePath: /collections/nodes_used_collection/leader_elect/shard2/election
   [junit4]   2> 663362 T2123 oass.IndexSchema.readSchema default search field in schema is text
   [junit4]   2> 663366 T2123 oass.IndexSchema.readSchema unique key field: id
   [junit4]   2> 663380 T2079 oass.FileExchangeRateProvider.reload Reloading exchange rates from file currency.xml
   [junit4]   2> 663386 T2109 oass.FileExchangeRateProvider.reload Reloading exchange rates from file currency.xml
   [junit4]   2> 663388 T2079 oass.FileExchangeRateProvider.reload Reloading exchange rates from file currency.xml
   [junit4]   2> 663390 T2139 oasc.ShardLeaderElectionContext.runLeaderProcess Running the leader process for shard shard2
   [junit4]   2> 663394 T2109 oass.FileExchangeRateProvider.reload Reloading exchange rates from file currency.xml
   [junit4]   2> 663395 T2079 oass.OpenExchangeRatesOrgProvider.reload Reloading exchange rates from open-exchange-rates.json
   [junit4]   2> 663397 T2139 oasc.ShardLeaderElectionContext.waitForReplicasToComeUp Waiting until we see more replicas up for shard shard2: total=2 found=1 timeoutin=179999
   [junit4]   2> 663400 T2079 oass.OpenExchangeRatesOrgProvider$OpenExchangeRates.<init> WARN Unknown key IMPORTANT NOTE
   [junit4]   2> 663400 T2079 oass.OpenExchangeRatesOrgProvider$OpenExchangeRates.<init> WARN Expected key, got STRING
   [junit4]   2> 663400 T2109 oass.OpenExchangeRatesOrgProvider.reload Reloading exchange rates from open-exchange-rates.json
   [junit4]   2> 663401 T2079 oass.OpenExchangeRatesOrgProvider.reload Reloading exchange rates from open-exchange-rates.json
   [junit4]   2> 663405 T2123 oass.FileExchangeRateProvider.reload Reloading exchange rates from file currency.xml
   [junit4]   2> 663405 T2079 oass.OpenExchangeRatesOrgProvider$OpenExchangeRates.<init> WARN Unknown key IMPORTANT NOTE
   [junit4]   2> 663405 T2109 oass.OpenExchangeRatesOrgProvider$OpenExchangeRates.<init> WARN Unknown key IMPORTANT NOTE
   [junit4]   2> 663406 T2109 oass.OpenExchangeRatesOrgProvider$OpenExchangeRates.<init> WARN Expected key, got STRING
   [junit4]   2> 663405 T2079 oass.OpenExchangeRatesOrgProvider$OpenExchangeRates.<init> WARN Expected key, got STRING
   [junit4]   2> 663406 T2109 oass.OpenExchangeRatesOrgProvider.reload Reloading exchange rates from open-exchange-rates.json
   [junit4]   2> 663406 T2079 oasc.SolrCore.initDirectoryFactory org.apache.solr.core.MockDirectoryFactory
   [junit4]   2> 663407 T2079 oasc.SolrCore.<init> [nodes_used_collection_shard1_replica1] Opening new SolrCore at /mnt/ssd/jenkins/workspace/Lucene-Solr-4.x-Linux/solr/build/solr-core/test/J1/./org.apache.solr.cloud.CollectionsAPIDistributedZkTest-controljetty-1375479197218/nodes_used_collection_shard1_replica1/, dataDir=/mnt/ssd/jenkins/workspace/Lucene-Solr-4.x-Linux/solr/build/solr-core/test/J1/./org.apache.solr.cloud.CollectionsAPIDistributedZkTest-controljetty-1375479197218//nodes_used_collection_shard1_replica1/data/
   [junit4]   2> 663408 T2079 oasc.JmxMonitoredMap.<init> JMX monitoring is enabled. Adding Solr mbeans to JMX Server: com.sun.jmx.mbeanserver.JmxMBeanServer@904497
   [junit4]   2> 663409 T2079 oasc.CachingDirectoryFactory.get return new directory for /mnt/ssd/jenkins/workspace/Lucene-Solr-4.x-Linux/solr/build/solr-core/test/J1/./org.apache.solr.cloud.CollectionsAPIDistributedZkTest-controljetty-1375479197218//nodes_used_collection_shard1_replica1/data
   [junit4]   2> 663409 T2079 oasc.SolrCore.getNewIndexDir New index directory detected: old=null new=/mnt/ssd/jenkins/workspace/Lucene-Solr-4.x-Linux/solr/build/solr-core/test/J1/./org.apache.solr.cloud.CollectionsAPIDistributedZkTest-controljetty-1375479197218//nodes_used_collection_shard1_replica1/data/index/
   [junit4]   2> 663410 T2079 oasc.SolrCore.initIndex WARN [nodes_used_collection_shard1_replica1] Solr index directory '/mnt/ssd/jenkins/workspace/Lucene-Solr-4.x-Linux/solr/build/solr-core/test/J1/./org.apache.solr.cloud.CollectionsAPIDistributedZkTest-controljetty-1375479197218/nodes_used_collection_shard1_replica1/data/index' doesn't exist. Creating new index...
   [junit4]   2> 663411 T2079 oasc.CachingDirectoryFactory.get return new directory for /mnt/ssd/jenkins/workspace/Lucene-Solr-4.x-Linux/solr/build/solr-core/test/J1/./org.apache.solr.cloud.CollectionsAPIDistributedZkTest-controljetty-1375479197218//nodes_used_collection_shard1_replica1/data/index
   [junit4]   2> 663411 T2123 oass.FileExchangeRateProvider.reload Reloading exchange rates from file currency.xml
   [junit4]   2> 663411 T2109 oass.OpenExchangeRatesOrgProvider$OpenExchangeRates.<init> WARN Unknown key IMPORTANT NOTE
   [junit4]   2> 663412 T2109 oass.OpenExchangeRatesOrgProvider$OpenExchangeRates.<init> WARN Expected key, got STRING
   [junit4]   2> 663412 T2109 oasc.SolrCore.initDirectoryFactory org.apache.solr.core.MockDirectoryFactory
   [junit4]   2> 663413 T2079 oasc.SolrDeletionPolicy.onCommit SolrDeletionPolicy.onCommit: commits: num=1
   [junit4]   2> 		commit{dir=MockDirWrapper(RateLimitedDirectoryWrapper(org.apache.lucene.store.RAMDirectory@1492d7a lockFactory=org.apache.lucene.store.NativeFSLockFactory@762e53)),segFN=segments_1,generation=1}
   [junit4]   2> 663413 T2109 oasc.SolrCore.<init> [nodes_used_collection_shard2_replica1] Opening new SolrCore at /mnt/ssd/jenkins/workspace/Lucene-Solr-4.x-Linux/solr/build/solr-core/test/J1/./org.apache.solr.cloud.CollectionsAPIDistributedZkTest-jetty2-1375479198673/nodes_used_collection_shard2_replica1/, dataDir=/mnt/ssd/jenkins/workspace/Lucene-Solr-4.x-Linux/solr/build/solr-core/test/J1/./org.apache.solr.cloud.CollectionsAPIDistributedZkTest-jetty2-1375479198673//nodes_used_collection_shard2_replica1/data/
   [junit4]   2> 663413 T2079 oasc.SolrDeletionPolicy.updateCommits newest commit generation = 1
   [junit4]   2> 663413 T2109 oasc.JmxMonitoredMap.<init> JMX monitoring is enabled. Adding Solr mbeans to JMX Server: com.sun.jmx.mbeanserver.JmxMBeanServer@904497
   [junit4]   2> 663415 T2109 oasc.CachingDirectoryFactory.get return new directory for /mnt/ssd/jenkins/workspace/Lucene-Solr-4.x-Linux/solr/build/solr-core/test/J1/./org.apache.solr.cloud.CollectionsAPIDistributedZkTest-jetty2-1375479198673//nodes_used_collection_shard2_replica1/data
   [junit4]   2> 663415 T2109 oasc.SolrCore.getNewIndexDir New index directory detected: old=null new=/mnt/ssd/jenkins/workspace/Lucene-Solr-4.x-Linux/solr/build/solr-core/test/J1/./org.apache.solr.cloud.CollectionsAPIDistributedZkTest-jetty2-1375479198673//nodes_used_collection_shard2_replica1/data/index/
   [junit4]   2> 663415 T2109 oasc.SolrCore.initIndex WARN [nodes_used_collection_shard2_replica1] Solr index directory '/mnt/ssd/jenkins/workspace/Lucene-Solr-4.x-Linux/solr/build/solr-core/test/J1/./org.apache.solr.cloud.CollectionsAPIDistributedZkTest-jetty2-1375479198673/nodes_used_collection_shard2_replica1/data/index' doesn't exist. Creating new index...
   [junit4]   2> 663416 T2109 oasc.CachingDirectoryFactory.get return new directory for /mnt/ssd/jenkins/workspace/Lucene-Solr-4.x-Linux/solr/build/solr-core/test/J1/./org.apache.solr.cloud.CollectionsAPIDistributedZkTest-jetty2-1375479198673//nodes_used_collection_shard2_replica1/data/index
   [junit4]   2> 663416 T2123 oass.OpenExchangeRatesOrgProvider.reload Reloading exchange rates from open-exchange-rates.json
   [junit4]   2> 663417 T2079 oasup.UpdateRequestProcessorChain.init inserting DistributedUpdateProcessorFactory into updateRequestProcessorChain "dedupe"
   [junit4]   2> 663418 T2079 oasup.UpdateRequestProcessorChain.init inserting DistributedUpdateProcessorFactory into updateRequestProcessorChain "stored_sig"
   [junit4]   2> 663418 T2109 oasc.SolrDeletionPolicy.onCommit SolrDeletionPolicy.onCommit: commits: num=1
   [junit4]   2> 		commit{dir=MockDirWrapper(RateLimitedDirectoryWrapper(org.apache.lucene.store.RAMDirectory@a525b4 lockFactory=org.apache.lucene.store.NativeFSLockFactory@11ffdf2)),segFN=segments_1,generation=1}
   [junit4]   2> 663418 T2109 oasc.SolrDeletionPolicy.updateCommits newest commit generation = 1
   [junit4]   2> 663428 T2123 oass.OpenExchangeRatesOrgProvider$OpenExchangeRates.<init> WARN Unknown key IMPORTANT NOTE
   [junit4]   2> 663427 T2079 oasup.UpdateRequestProcessorChain.init inserting DistributedUpdateProcessorFactory into updateRequestProcessorChain "distrib-dup-test-chain-implicit"
   [junit4]   2> 663428 T2123 oass.OpenExchangeRatesOrgProvider$OpenExchangeRates.<init> WARN Expected key, got STRING
   [junit4]   2> 663429 T2123 oass.OpenExchangeRatesOrgProvider.reload Reloading exchange rates from open-exchange-rates.json
   [junit4]   2> 663429 T2079 oasc.RequestHandlers.initHandlersFromConfig created standard: solr.StandardRequestHandler
   [junit4]   2> 663430 T2079 oasc.RequestHandlers.initHandlersFromConfig created /get: solr.RealTimeGetHandler
   [junit4]   2> 663430 T2079 oasc.RequestHandlers.initHandlersFromConfig adding lazy requestHandler: solr.ReplicationHandler
   [junit4]   2> 663431 T2079 oasc.RequestHandlers.initHandlersFromConfig created /replication: solr.ReplicationHandler
   [junit4]   2> 663431 T2123 oass.OpenExchangeRatesOrgProvider$OpenExchangeRates.<init> WARN Unknown key IMPORTANT NOTE
   [junit4]   2> 663431 T2079 oasc.RequestHandlers.initHandlersFromConfig created /update: solr.UpdateRequestHandler
   [junit4]   2> 663431 T2123 oass.OpenExchangeRatesOrgProvider$OpenExchangeRates.<init> WARN Expected key, got STRING
   [junit4]   2> 663432 T2079 oasc.RequestHandlers.initHandlersFromConfig created /admin/: org.apache.solr.handler.admin.AdminHandlers
   [junit4]   2> 663432 T2123 oasc.SolrCore.initDirectoryFactory org.apache.solr.core.MockDirectoryFactory
   [junit4]   2> 663433 T2109 oasup.UpdateRequestProcessorChain.init inserting DistributedUpdateProcessorFactory into updateRequestProcessorChain "dedupe"
   [junit4]   2> 663433 T2123 oasc.SolrCore.<init> [nodes_used_collection_shard1_replica2] Opening new SolrCore at /mnt/ssd/jenkins/workspace/Lucene-Solr-4.x-Linux/solr/build/solr-core/test/J1/./org.apache.solr.cloud.CollectionsAPIDistributedZkTest-jetty3-1375479199901/nodes_used_collection_shard1_replica2/, dataDir=/mnt/ssd/jenkins/workspace/Lucene-Solr-4.x-Linux/solr/build/solr-core/test/J1/./org.apache.solr.cloud.CollectionsAPIDistributedZkTest-jetty3-1375479199901//nodes_used_collection_shard1_replica2/data/
   [junit4]   2> 663433 T2109 oasup.UpdateRequestProcessorChain.init inserting DistributedUpdateProcessorFactory into updateRequestProcessorChain "stored_sig"
   [junit4]   2> 663433 T2123 oasc.JmxMonitoredMap.<init> JMX monitoring is enabled. Adding Solr mbeans to JMX Server: com.sun.jmx.mbeanserver.JmxMBeanServer@904497
   [junit4]   2> 663434 T2079 oashl.XMLLoader.init xsltCacheLifetimeSeconds=60
   [junit4]   2> 663434 T2109 oasup.UpdateRequestProcessorChain.init inserting DistributedUpdateProcessorFactory into updateRequestProcessorChain "distrib-dup-test-chain-implicit"
   [junit4]   2> 663435 T2123 oasc.CachingDirectoryFactory.get return new directory for /mnt/ssd/jenkins/workspace/Lucene-Solr-4.x-Linux/solr/build/solr-core/test/J1/./org.apache.solr.cloud.CollectionsAPIDistributedZkTest-jetty3-1375479199901//nodes_used_collection_shard1_replica2/data
   [junit4]   2> 663435 T2123 oasc.SolrCore.getNewIndexDir New index directory detected: old=null new=/mnt/ssd/jenkins/workspace/Lucene-Solr-4.x-Linux/solr/build/solr-core/test/J1/./org.apache.solr.cloud.CollectionsAPIDistributedZkTest-jetty3-1375479199901//nodes_used_collection_shard1_replica2/data/index/
   [junit4]   2> 663435 T2109 oasc.RequestHandlers.initHandlersFromConfig created standard: solr.StandardRequestHandler
   [junit4]   2> 663435 T2123 oasc.SolrCore.initIndex WARN [nodes_used_collection_shard1_replica2] Solr index directory '/mnt/ssd/jenkins/workspace/Lucene-Solr-4.x-Linux/solr/build/solr-core/test/J1/./org.apache.solr.cloud.CollectionsAPIDistributedZkTest-jetty3-1375479199901/nodes_used_collection_shard1_replica2/data/index' doesn't exist. Creating new index...
   [junit4]   2> 663436 T2109 oasc.RequestHandlers.initHandlersFromConfig created /get: solr.RealTimeGetHandler
   [junit4]   2> 663436 T2123 oasc.CachingDirectoryFactory.get return new directory for /mnt/ssd/jenkins/workspace/Lucene-Solr-4.x-Linux/solr/build/solr-core/test/J1/./org.apache.solr.cloud.CollectionsAPIDistributedZkTest-jetty3-1375479199901//nodes_used_collection_shard1_replica2/data/index
   [junit4]   2> 663436 T2109 oasc.RequestHandlers.initHandlersFromConfig adding lazy requestHandler: solr.ReplicationHandler
   [junit4]   2> 663437 T2079 oass.SolrIndexSearcher.<init> Opening Searcher@17c747b main
   [junit4]   2> 663437 T2109 oasc.RequestHandlers.initHandlersFromConfig created /replication: solr.ReplicationHandler
   [junit4]   2> 663438 T2079 oasu.CommitTracker.<init> Hard AutoCommit: disabled
   [junit4]   2> 663438 T2109 oasc.RequestHandlers.initHandlersFromConfig created /update: solr.UpdateRequestHandler
   [junit4]   2> 663438 T2079 oasu.CommitTracker.<init> Soft AutoCommit: disabled
   [junit4]   2> 663438 T2123 oasc.SolrDeletionPolicy.onCommit SolrDeletionPolicy.onCommit: commits: num=1
   [junit4]   2> 		commit{dir=MockDirWrapper(RateLimitedDirectoryWrapper(org.apache.lucene.store.RAMDirectory@334749 lockFactory=org.apache.lucene.store.NativeFSLockFactory@1743a0b)),segFN=segments_1,generation=1}
   [junit4]   2> 663439 T2109 oasc.RequestHandlers.initHandlersFromConfig created /admin/: org.apache.solr.handler.admin.AdminHandlers
   [junit4]   2> 663439 T2123 oasc.SolrDeletionPolicy.updateCommits newest commit generation = 1
   [junit4]   2> 663441 T2109 oashl.XMLLoader.init xsltCacheLifetimeSeconds=60
   [junit4]   2> 663442 T2150 oasc.SolrCore.registerSearcher [nodes_used_collection_shard1_replica1] Registered new searcher Searcher@17c747b main{StandardDirectoryReader(segments_1:1)}
   [junit4]   2> 663443 T2123 oasup.UpdateRequestProcessorChain.init inserting DistributedUpdateProcessorFactory into updateRequestProcessorChain "dedupe"
   [junit4]   2> 663443 T2079 oasc.CoreContainer.registerCore registering core: nodes_used_collection_shard1_replica1
   [junit4]   2> 663444 T2109 oass.SolrIndexSearcher.<init> Opening Searcher@8ff1ae main
   [junit4]   2> 663443 T2123 oasup.UpdateRequestProcessorChain.init inserting DistributedUpdateProcessorFactory into updateRequestProcessorChain "stored_sig"
   [junit4]   2> 663444 T2079 oasc.ZkController.register Register replica - core:nodes_used_collection_shard1_replica1 address:http://127.0.0.1:53977 collection:nodes_used_collection shard:shard1
   [junit4]   2> 663444 T2109 oasu.CommitTracker.<init> Hard AutoCommit: disabled
   [junit4]   2> 663445 T2079 oascsi.HttpClientUtil.createClient Creating new http client, config:maxConnections=10000&maxConnectionsPerHost=20&connTimeout=15000&socketTimeout=30000&retry=false
   [junit4]   2> 663445 T2123 oasup.UpdateRequestProcessorChain.init inserting DistributedUpdateProcessorFactory into updateRequestProcessorChain "distrib-dup-test-chain-implicit"
   [junit4]   2> 663445 T2109 oasu.CommitTracker.<init> Soft AutoCommit: disabled
   [junit4]   2> 663446 T2123 oasc.RequestHandlers.initHandlersFromConfig created standard: solr.StandardRequestHandler
   [junit4]   2> 663447 T2123 oasc.RequestHandlers.initHandlersFromConfig created /get: solr.RealTimeGetHandler
   [junit4]   2> 663447 T2123 oasc.RequestHandlers.initHandlersFromConfig adding lazy requestHandler: solr.ReplicationHandler
   [junit4]   2> 663447 T2123 oasc.RequestHandlers.initHandlersFromConfig created /replication: solr.ReplicationHandler
   [junit4]   2> 663448 T2123 oasc.RequestHandlers.initHandlersFromConfig created /update: solr.UpdateRequestHandler
   [junit4]   2> 663448 T2123 oasc.RequestHandlers.initHandlersFromConfig created /admin/: org.apache.solr.handler.admin.AdminHandlers
   [junit4]   2> 663449 T2079 oascc.SolrZkClient.makePath makePath: /collections/nodes_used_collection/leader_elect/shard1/election
   [junit4]   2> 663449 T2151 oasc.SolrCore.registerSearcher [nodes_used_collection_shard2_replica1] Registered new searcher Searcher@8ff1ae main{StandardDirectoryReader(segments_1:1)}
   [junit4]   2> 663451 T2123 oashl.XMLLoader.init xsltCacheLifetimeSeconds=60
   [junit4]   2> 663451 T2109 oasc.CoreContainer.registerCore registering core: nodes_used_collection_shard2_replica1
   [junit4]   2> 663452 T2109 oasc.ZkController.register Register replica - core:nodes_used_collection_shard2_replica1 address:http://127.0.0.1:36214 collection:nodes_used_collection shard:shard2
   [junit4]   2> 663452 T2109 oascsi.HttpClientUtil.createClient Creating new http client, config:maxConnections=10000&maxConnectionsPerHost=20&connTimeout=15000&socketTimeout=30000&retry=false
   [junit4]   2> 663453 T2123 oass.SolrIndexSearcher.<init> Opening Searcher@16c8cd7 main
   [junit4]   2> 663454 T2123 oasu.CommitTracker.<init> Hard AutoCommit: disabled
   [junit4]   2> 663454 T2123 oasu.CommitTracker.<init> Soft AutoCommit: disabled
   [junit4]   2> 663457 T2152 oasc.SolrCore.registerSearcher [nodes_used_collection_shard1_replica2] Registered new searcher Searcher@16c8cd7 main{StandardDirectoryReader(segments_1:1)}
   [junit4]   2> 663459 T2123 oasc.CoreContainer.registerCore registering core: nodes_used_collection_shard1_replica2
   [junit4]   2> 663459 T2123 oasc.ZkController.register Register replica - core:nodes_used_collection_shard1_replica2 address:http://127.0.0.1:38432 collection:nodes_used_collection shard:shard1
   [junit4]   2> 663460 T2123 oascsi.HttpClientUtil.createClient Creating new http client, config:maxConnections=10000&maxConnectionsPerHost=20&connTimeout=15000&socketTimeout=30000&retry=false
   [junit4]   2> 663473 T2079 oasc.ShardLeaderElectionContext.runLeaderProcess Running the leader process for shard shard1
   [junit4]   2> 663477 T2079 oasc.ShardLeaderElectionContext.waitForReplicasToComeUp Enough replicas found to continue.
   [junit4]   2> 663477 T2079 oasc.ShardLeaderElectionContext.runLeaderProcess I may be the new leader - try and sync
   [junit4]   2> 663478 T2079 oasc.SyncStrategy.sync Sync replicas to http://127.0.0.1:53977/nodes_used_collection_shard1_replica1/
   [junit4]   2> 663478 T2079 oasu.PeerSync.sync PeerSync: core=nodes_used_collection_shard1_replica1 url=http://127.0.0.1:53977 START replicas=[http://127.0.0.1:38432/nodes_used_collection_shard1_replica2/] nUpdates=100
   [junit4]   2> 663479 T2079 oasu.PeerSync.sync PeerSync: core=nodes_used_collection_shard1_replica1 url=http://127.0.0.1:53977 DONE.  We have no versions.  sync failed.
   [junit4]   2> 663480 T2079 oasc.SyncStrategy.syncReplicas Leader's attempt to sync with shard failed, moving to the next candidate
   [junit4]   2> 663480 T2079 oasc.ShardLeaderElectionContext.runLeaderProcess We failed sync, but we have no versions - we can't sync in that case - we were active before, so become leader anyway
   [junit4]   2> 663481 T2079 oasc.ShardLeaderElectionContext.runLeaderProcess I am the new leader: http://127.0.0.1:53977/nodes_used_collection_shard1_replica1/ shard1
   [junit4]   2> 663481 T2079 oascc.SolrZkClient.makePath makePath: /collections/nodes_used_collection/leaders/shard1
   [junit4]   2> ASYNC  NEW_CORE C19264 name=nodes_used_collection_shard1_replica2 org.apache.solr.core.SolrCore@16c97b9 url=http://127.0.0.1:38432/nodes_used_collection_shard1_replica2 node=127.0.0.1:38432_ C19264_STATE=coll:nodes_used_collection core:nodes_used_collection_shard1_replica2 props:{state=down, core=nodes_used_collection_shard1_replica2, node_name=127.0.0.1:38432_, base_url=http://127.0.0.1:38432}
   [junit4]   2> 663487 T2125 C19264 P38432 oasc.SolrCore.execute [nodes_used_collection_shard1_replica2] webapp= path=/get params={getVersions=100&distrib=false&wt=javabin&qt=/get&version=2} status=0 QTime=1 
   [junit4]   2> 663900 T2139 oasc.ShardLeaderElectionContext.waitForReplicasToComeUp Enough replicas found to continue.
   [junit4]   2> 663900 T2139 oasc.ShardLeaderElectionContext.runLeaderProcess I may be the new leader - try and sync
   [junit4]   2> 663901 T2139 oasc.SyncStrategy.sync Sync replicas to http://127.0.0.1:55484/nodes_used_collection_shard2_replica2/
   [junit4]   2> 663902 T2139 oasu.PeerSync.sync PeerSync: core=nodes_used_collection_shard2_replica2 url=http://127.0.0.1:55484 START replicas=[http://127.0.0.1:36214/nodes_used_collection_shard2_replica1/] nUpdates=100
   [junit4]   2> 663903 T2139 oasu.PeerSync.sync PeerSync: core=nodes_used_collection_shard2_replica2 url=http://127.0.0.1:55484 DONE.  

[...truncated too long message...]

letesById=0,deletesByQuery=0,errors=0,cumulative_adds=0,cumulative_deletesById=0,cumulative_deletesByQuery=1,cumulative_errors=0}
   [junit4]   2> 796897 T2061 oasu.SolrCoreState.decrefSolrCoreState Closing SolrCoreState
   [junit4]   2> 796897 T2061 oasu.DefaultSolrCoreState.closeIndexWriter SolrCoreState ref count has reached 0 - closing IndexWriter
   [junit4]   2> 796898 T2061 oasu.DefaultSolrCoreState.closeIndexWriter closing IndexWriter with IndexWriterCloser
   [junit4]   2> 796899 T2061 oasc.SolrCore.closeSearcher [new_implicit_coll_0_d_replica2] Closing main searcher on request.
   [junit4]   2> 796900 T2061 oasc.CachingDirectoryFactory.close Closing MockDirectoryFactory - 2 directories currently being tracked
   [junit4]   2> 796900 T2061 oasc.CachingDirectoryFactory.closeCacheValue looking to close /mnt/ssd/jenkins/workspace/Lucene-Solr-4.x-Linux/solr/build/solr-core/test/J1/./org.apache.solr.cloud.CollectionsAPIDistributedZkTest-jetty4-1375479201206//new_implicit_coll_0_d_replica2/data/index [CachedDir<<refCount=0;path=/mnt/ssd/jenkins/workspace/Lucene-Solr-4.x-Linux/solr/build/solr-core/test/J1/./org.apache.solr.cloud.CollectionsAPIDistributedZkTest-jetty4-1375479201206//new_implicit_coll_0_d_replica2/data/index;done=false>>]
   [junit4]   2> 796900 T2061 oasc.CachingDirectoryFactory.close Closing directory: /mnt/ssd/jenkins/workspace/Lucene-Solr-4.x-Linux/solr/build/solr-core/test/J1/./org.apache.solr.cloud.CollectionsAPIDistributedZkTest-jetty4-1375479201206//new_implicit_coll_0_d_replica2/data/index
   [junit4]   2> 796901 T2061 oasc.CachingDirectoryFactory.closeCacheValue looking to close /mnt/ssd/jenkins/workspace/Lucene-Solr-4.x-Linux/solr/build/solr-core/test/J1/./org.apache.solr.cloud.CollectionsAPIDistributedZkTest-jetty4-1375479201206//new_implicit_coll_0_d_replica2/data [CachedDir<<refCount=0;path=/mnt/ssd/jenkins/workspace/Lucene-Solr-4.x-Linux/solr/build/solr-core/test/J1/./org.apache.solr.cloud.CollectionsAPIDistributedZkTest-jetty4-1375479201206//new_implicit_coll_0_d_replica2/data;done=false>>]
   [junit4]   2> 796901 T2061 oasc.CachingDirectoryFactory.close Closing directory: /mnt/ssd/jenkins/workspace/Lucene-Solr-4.x-Linux/solr/build/solr-core/test/J1/./org.apache.solr.cloud.CollectionsAPIDistributedZkTest-jetty4-1375479201206//new_implicit_coll_0_d_replica2/data
   [junit4]   2> 796911 T2504 oasc.Overseer$ClusterStateUpdater.amILeader According to ZK I (id=90143404657803276-127.0.0.1:55484_-n_0000000004) am no longer a leader.
   [junit4]   2> 796941 T2061 oejsh.ContextHandler.doStop stopped o.e.j.s.ServletContextHandler{/,null}
   [junit4]   2> 796995 T2061 oas.SolrTestCaseJ4.tearDown ###Ending testDistribSearch
   [junit4]   2> 797000 T2061 oasc.ZkTestServer.send4LetterWord connecting to 127.0.0.1:53607 53607
   [junit4]   1> client port:0.0.0.0/0.0.0.0:0
   [junit4]   2> NOTE: reproduce with: ant test  -Dtestcase=CollectionsAPIDistributedZkTest -Dtests.method=testDistribSearch -Dtests.seed=878F5A354C3164F2 -Dtests.multiplier=3 -Dtests.slow=true -Dtests.locale=en_PH -Dtests.timezone=Africa/Brazzaville -Dtests.file.encoding=ISO-8859-1
   [junit4] ERROR    144s J1 | CollectionsAPIDistributedZkTest.testDistribSearch <<<
   [junit4]    > Throwable #1: org.apache.solr.client.solrj.SolrServerException: Server refused connection at: http://127.0.0.1:57661
   [junit4]    > 	at __randomizedtesting.SeedInfo.seed([878F5A354C3164F2:669D42D3B6E04CE]:0)
   [junit4]    > 	at org.apache.solr.client.solrj.impl.HttpSolrServer.request(HttpSolrServer.java:428)
   [junit4]    > 	at org.apache.solr.client.solrj.impl.HttpSolrServer.request(HttpSolrServer.java:180)
   [junit4]    > 	at org.apache.solr.cloud.CollectionsAPIDistributedZkTest.testCustomCollectionsAPI(CollectionsAPIDistributedZkTest.java:764)
   [junit4]    > 	at org.apache.solr.cloud.CollectionsAPIDistributedZkTest.doTest(CollectionsAPIDistributedZkTest.java:159)
   [junit4]    > 	at org.apache.solr.BaseDistributedSearchTestCase.testDistribSearch(BaseDistributedSearchTestCase.java:835)
   [junit4]    > 	at java.lang.Thread.run(Thread.java:662)
   [junit4]    > Caused by: org.apache.http.conn.HttpHostConnectException: Connection to http://127.0.0.1:57661 refused
   [junit4]    > 	at org.apache.http.impl.conn.DefaultClientConnectionOperator.openConnection(DefaultClientConnectionOperator.java:190)
   [junit4]    > 	at org.apache.http.impl.conn.ManagedClientConnectionImpl.open(ManagedClientConnectionImpl.java:294)
   [junit4]    > 	at org.apache.http.impl.client.DefaultRequestDirector.tryConnect(DefaultRequestDirector.java:645)
   [junit4]    > 	at org.apache.http.impl.client.DefaultRequestDirector.execute(DefaultRequestDirector.java:480)
   [junit4]    > 	at org.apache.http.impl.client.AbstractHttpClient.execute(AbstractHttpClient.java:906)
   [junit4]    > 	at org.apache.http.impl.client.AbstractHttpClient.execute(AbstractHttpClient.java:805)
   [junit4]    > 	at org.apache.http.impl.client.AbstractHttpClient.execute(AbstractHttpClient.java:784)
   [junit4]    > 	at org.apache.solr.client.solrj.impl.HttpSolrServer.request(HttpSolrServer.java:365)
   [junit4]    > 	... 44 more
   [junit4]    > Caused by: java.net.ConnectException: Connection refused
   [junit4]    > 	at java.net.PlainSocketImpl.socketConnect(Native Method)
   [junit4]    > 	at java.net.PlainSocketImpl.doConnect(PlainSocketImpl.java:351)
   [junit4]    > 	at java.net.PlainSocketImpl.connectToAddress(PlainSocketImpl.java:213)
   [junit4]    > 	at java.net.PlainSocketImpl.connect(PlainSocketImpl.java:200)
   [junit4]    > 	at java.net.SocksSocketImpl.connect(SocksSocketImpl.java:366)
   [junit4]    > 	at java.net.Socket.connect(Socket.java:529)
   [junit4]    > 	at org.apache.http.conn.scheme.PlainSocketFactory.connectSocket(PlainSocketFactory.java:127)
   [junit4]    > 	at org.apache.http.impl.conn.DefaultClientConnectionOperator.openConnection(DefaultClientConnectionOperator.java:180)
   [junit4]    > 	... 51 more
   [junit4]   2> 797024 T2061 oas.SolrTestCaseJ4.deleteCore ###deleteCore
   [junit4]   2> 143552 T2060 ccr.ThreadLeakControl.checkThreadLeaks WARNING Will linger awaiting termination of 2 leaked thread(s).
   [junit4]   2> 798212 T2143 oascc.ZkStateReader$3.process WARN ZooKeeper watch triggered, but Solr cannot talk to ZK
   [junit4]   2> 798213 T2143 oascc.ZkStateReader$2.process A cluster state change: WatchedEvent state:SyncConnected type:NodeChildrenChanged path:/live_nodes, has occurred - updating... (live nodes size: 1)
   [junit4]   2> 798213 T2143 oascc.ZkStateReader$2.process WARN ZooKeeper watch triggered, but Solr cannot talk to ZK
   [junit4]   2> NOTE: test params are: codec=Asserting, sim=DefaultSimilarity, locale=en_PH, timezone=Africa/Brazzaville
   [junit4]   2> NOTE: Linux 3.2.0-51-generic i386/Sun Microsystems Inc. 1.6.0_45 (32-bit)/cpus=8,threads=4,free=62535240,total=194736128
   [junit4]   2> NOTE: All tests run in this JVM: [HighlighterTest, TestQuerySenderNoQuery, SolrIndexConfigTest, TestCSVLoader, TestLMJelinekMercerSimilarityFactory, TestMergePolicyConfig, TestAnalyzedSuggestions, TestIndexSearcher, TestManagedSchemaFieldResource, TestFastOutputStream, TestHashPartitioner, ConvertedLegacyTest, TestSolrJ, HardAutoCommitTest, TestCodecSupport, TestPostingsSolrHighlighter, DateMathParserTest, SimplePostToolTest, TestUtils, TestCollationField, IndexBasedSpellCheckerTest, TestDistributedSearch, URLClassifyProcessorTest, SolrRequestParserTest, OpenExchangeRatesOrgProviderTest, SpellCheckComponentTest, TestZkChroot, PingRequestHandlerTest, DocValuesMultiTest, SampleTest, OpenCloseCoreStressTest, BlockCacheTest, TestDistributedGrouping, HdfsSyncSliceTest, TestCoreDiscovery, DirectUpdateHandlerTest, OutputWriterTest, IndexSchemaRuntimeFieldTest, HdfsCollectionsAPIDistributedZkTest, ZkNodePropsTest, TestElisionMultitermQuery, FileUtilsTest, TestAddFieldRealTimeGet, TestCSVResponseWriter, TestMultiCoreConfBootstrap, TestRandomFaceting, SpellPossibilityIteratorTest, TestJmxMonitoredMap, SignatureUpdateProcessorFactoryTest, TestUpdate, DebugComponentTest, TestFiltering, XmlUpdateRequestHandlerTest, TestReloadAndDeleteDocs, PreAnalyzedUpdateProcessorTest, TestBinaryField, TestBinaryResponseWriter, TestAtomicUpdateErrorCases, CoreAdminCreateDiscoverTest, TestSchemaVersionResource, DistanceFunctionTest, BasicZkTest, ChaosMonkeySafeLeaderTest, DocumentAnalysisRequestHandlerTest, DOMUtilTest, SortByFunctionTest, CurrencyFieldOpenExchangeTest, TermVectorComponentDistributedTest, StandardRequestHandlerTest, SuggesterWFSTTest, RequestHandlersTest, DefaultValueUpdateProcessorTest, TestComponentsName, TestCollationKeyRangeQueries, BasicDistributedZk2Test, CollectionsAPIDistributedZkTest]
   [junit4] Completed on J1 in 144.84s, 1 test, 1 error <<< FAILURES!

[...truncated 575 lines...]
BUILD FAILED
/mnt/ssd/jenkins/workspace/Lucene-Solr-4.x-Linux/build.xml:395: The following error occurred while executing this line:
/mnt/ssd/jenkins/workspace/Lucene-Solr-4.x-Linux/build.xml:375: The following error occurred while executing this line:
/mnt/ssd/jenkins/workspace/Lucene-Solr-4.x-Linux/build.xml:39: The following error occurred while executing this line:
/mnt/ssd/jenkins/workspace/Lucene-Solr-4.x-Linux/solr/build.xml:181: The following error occurred while executing this line:
/mnt/ssd/jenkins/workspace/Lucene-Solr-4.x-Linux/solr/common-build.xml:449: The following error occurred while executing this line:
/mnt/ssd/jenkins/workspace/Lucene-Solr-4.x-Linux/lucene/common-build.xml:1233: The following error occurred while executing this line:
/mnt/ssd/jenkins/workspace/Lucene-Solr-4.x-Linux/lucene/common-build.xml:876: There were test failures: 321 suites, 1352 tests, 1 error, 34 ignored (6 assumptions)

Total time: 45 minutes 54 seconds
Build step 'Invoke Ant' marked build as failure
Description set: Java: 32bit/jdk1.6.0_45 -server -XX:+UseConcMarkSweepGC
Archiving artifacts
Recording test results
Email was triggered for: Failure
Sending email for trigger: Failure



Mime
View raw message