lucene-dev mailing list archives

Site index · List index
Message view « Date » · « Thread »
Top « Date » · « Thread »
From Apache Jenkins Server <jenk...@builds.apache.org>
Subject [JENKINS] Lucene-Solr-NightlyTests-trunk - Build # 337 - Failure
Date Thu, 01 Aug 2013 06:35:08 GMT
Build: https://builds.apache.org/job/Lucene-Solr-NightlyTests-trunk/337/

1 tests failed.
REGRESSION:  org.apache.solr.cloud.CollectionsAPIDistributedZkTest.testDistribSearch

Error Message:
IOException occured when talking to server at: http://127.0.0.1:24342

Stack Trace:
org.apache.solr.client.solrj.SolrServerException: IOException occured when talking to server at: http://127.0.0.1:24342
	at __randomizedtesting.SeedInfo.seed([C94B1CED4B992327:48AD92F53CC6431B]:0)
	at org.apache.solr.client.solrj.impl.HttpSolrServer.request(HttpSolrServer.java:435)
	at org.apache.solr.client.solrj.impl.HttpSolrServer.request(HttpSolrServer.java:180)
	at org.apache.solr.cloud.AbstractFullDistribZkTestBase.createCollection(AbstractFullDistribZkTestBase.java:1535)
	at org.apache.solr.cloud.CollectionsAPIDistributedZkTest.testCustomCollectionsAPI(CollectionsAPIDistributedZkTest.java:677)
	at org.apache.solr.cloud.CollectionsAPIDistributedZkTest.doTest(CollectionsAPIDistributedZkTest.java:159)
	at org.apache.solr.BaseDistributedSearchTestCase.testDistribSearch(BaseDistributedSearchTestCase.java:835)
	at sun.reflect.NativeMethodAccessorImpl.invoke0(Native Method)
	at sun.reflect.NativeMethodAccessorImpl.invoke(NativeMethodAccessorImpl.java:57)
	at sun.reflect.DelegatingMethodAccessorImpl.invoke(DelegatingMethodAccessorImpl.java:43)
	at java.lang.reflect.Method.invoke(Method.java:606)
	at com.carrotsearch.randomizedtesting.RandomizedRunner.invoke(RandomizedRunner.java:1559)
	at com.carrotsearch.randomizedtesting.RandomizedRunner.access$600(RandomizedRunner.java:79)
	at com.carrotsearch.randomizedtesting.RandomizedRunner$6.evaluate(RandomizedRunner.java:737)
	at com.carrotsearch.randomizedtesting.RandomizedRunner$7.evaluate(RandomizedRunner.java:773)
	at com.carrotsearch.randomizedtesting.RandomizedRunner$8.evaluate(RandomizedRunner.java:787)
	at com.carrotsearch.randomizedtesting.rules.SystemPropertiesRestoreRule$1.evaluate(SystemPropertiesRestoreRule.java:53)
	at org.apache.lucene.util.TestRuleSetupTeardownChained$1.evaluate(TestRuleSetupTeardownChained.java:50)
	at org.apache.lucene.util.TestRuleFieldCacheSanity$1.evaluate(TestRuleFieldCacheSanity.java:51)
	at org.apache.lucene.util.AbstractBeforeAfterRule$1.evaluate(AbstractBeforeAfterRule.java:46)
	at com.carrotsearch.randomizedtesting.rules.SystemPropertiesInvariantRule$1.evaluate(SystemPropertiesInvariantRule.java:55)
	at org.apache.lucene.util.TestRuleThreadAndTestName$1.evaluate(TestRuleThreadAndTestName.java:49)
	at org.apache.lucene.util.TestRuleIgnoreAfterMaxFailures$1.evaluate(TestRuleIgnoreAfterMaxFailures.java:70)
	at org.apache.lucene.util.TestRuleMarkFailure$1.evaluate(TestRuleMarkFailure.java:48)
	at com.carrotsearch.randomizedtesting.rules.StatementAdapter.evaluate(StatementAdapter.java:36)
	at com.carrotsearch.randomizedtesting.ThreadLeakControl$StatementRunner.run(ThreadLeakControl.java:358)
	at com.carrotsearch.randomizedtesting.ThreadLeakControl.forkTimeoutingTask(ThreadLeakControl.java:782)
	at com.carrotsearch.randomizedtesting.ThreadLeakControl$3.evaluate(ThreadLeakControl.java:442)
	at com.carrotsearch.randomizedtesting.RandomizedRunner.runSingleTest(RandomizedRunner.java:746)
	at com.carrotsearch.randomizedtesting.RandomizedRunner$3.evaluate(RandomizedRunner.java:648)
	at com.carrotsearch.randomizedtesting.RandomizedRunner$4.evaluate(RandomizedRunner.java:682)
	at com.carrotsearch.randomizedtesting.RandomizedRunner$5.evaluate(RandomizedRunner.java:693)
	at com.carrotsearch.randomizedtesting.rules.StatementAdapter.evaluate(StatementAdapter.java:36)
	at com.carrotsearch.randomizedtesting.rules.SystemPropertiesRestoreRule$1.evaluate(SystemPropertiesRestoreRule.java:53)
	at org.apache.lucene.util.AbstractBeforeAfterRule$1.evaluate(AbstractBeforeAfterRule.java:46)
	at org.apache.lucene.util.TestRuleStoreClassName$1.evaluate(TestRuleStoreClassName.java:42)
	at com.carrotsearch.randomizedtesting.rules.SystemPropertiesInvariantRule$1.evaluate(SystemPropertiesInvariantRule.java:55)
	at com.carrotsearch.randomizedtesting.rules.NoShadowingOrOverridesOnMethodsRule$1.evaluate(NoShadowingOrOverridesOnMethodsRule.java:39)
	at com.carrotsearch.randomizedtesting.rules.NoShadowingOrOverridesOnMethodsRule$1.evaluate(NoShadowingOrOverridesOnMethodsRule.java:39)
	at com.carrotsearch.randomizedtesting.rules.StatementAdapter.evaluate(StatementAdapter.java:36)
	at org.apache.lucene.util.TestRuleAssertionsRequired$1.evaluate(TestRuleAssertionsRequired.java:43)
	at org.apache.lucene.util.TestRuleMarkFailure$1.evaluate(TestRuleMarkFailure.java:48)
	at org.apache.lucene.util.TestRuleIgnoreAfterMaxFailures$1.evaluate(TestRuleIgnoreAfterMaxFailures.java:70)
	at org.apache.lucene.util.TestRuleIgnoreTestSuites$1.evaluate(TestRuleIgnoreTestSuites.java:55)
	at com.carrotsearch.randomizedtesting.rules.StatementAdapter.evaluate(StatementAdapter.java:36)
	at com.carrotsearch.randomizedtesting.ThreadLeakControl$StatementRunner.run(ThreadLeakControl.java:358)
	at java.lang.Thread.run(Thread.java:724)
Caused by: org.apache.http.conn.ConnectTimeoutException: Connect to 127.0.0.1:24342 timed out
	at org.apache.http.conn.scheme.PlainSocketFactory.connectSocket(PlainSocketFactory.java:129)
	at org.apache.http.impl.conn.DefaultClientConnectionOperator.openConnection(DefaultClientConnectionOperator.java:180)
	at org.apache.http.impl.conn.ManagedClientConnectionImpl.open(ManagedClientConnectionImpl.java:294)
	at org.apache.http.impl.client.DefaultRequestDirector.tryConnect(DefaultRequestDirector.java:645)
	at org.apache.http.impl.client.DefaultRequestDirector.execute(DefaultRequestDirector.java:480)
	at org.apache.http.impl.client.AbstractHttpClient.execute(AbstractHttpClient.java:906)
	at org.apache.http.impl.client.AbstractHttpClient.execute(AbstractHttpClient.java:805)
	at org.apache.http.impl.client.AbstractHttpClient.execute(AbstractHttpClient.java:784)
	at org.apache.solr.client.solrj.impl.HttpSolrServer.request(HttpSolrServer.java:365)
	... 45 more




Build Log:
[...truncated 9812 lines...]
   [junit4] Suite: org.apache.solr.cloud.CollectionsAPIDistributedZkTest
   [junit4]   2> 1155551 T2851 oas.BaseDistributedSearchTestCase.initHostContext Setting hostContext system property: /
   [junit4]   2> 1155557 T2851 oas.SolrTestCaseJ4.setUp ###Starting testDistribSearch
   [junit4]   2> Creating dataDir: /usr/home/hudson/hudson-slave/workspace/Lucene-Solr-NightlyTests-trunk/solr/build/solr-core/test/J1/./solrtest-CollectionsAPIDistributedZkTest-1375336757434
   [junit4]   2> 1155558 T2851 oasc.ZkTestServer.run STARTING ZK TEST SERVER
   [junit4]   2> 1155559 T2852 oasc.ZkTestServer$ZKServerMain.runFromConfig Starting server
   [junit4]   2> 1155660 T2851 oasc.ZkTestServer.run start zk server on port:24335
   [junit4]   2> 1155661 T2851 oascc.ConnectionManager.waitForConnected Waiting for client to connect to ZooKeeper
   [junit4]   2> 1155701 T2858 oascc.ConnectionManager.process Watcher org.apache.solr.common.cloud.ConnectionManager@28e54c94 name:ZooKeeperConnection Watcher:127.0.0.1:24335 got event WatchedEvent state:SyncConnected type:None path:null path:null type:None
   [junit4]   2> 1155702 T2851 oascc.ConnectionManager.waitForConnected Client is connected to ZooKeeper
   [junit4]   2> 1155702 T2851 oascc.SolrZkClient.makePath makePath: /solr
   [junit4]   2> 1155720 T2851 oascc.ConnectionManager.waitForConnected Waiting for client to connect to ZooKeeper
   [junit4]   2> 1155722 T2860 oascc.ConnectionManager.process Watcher org.apache.solr.common.cloud.ConnectionManager@3f39a007 name:ZooKeeperConnection Watcher:127.0.0.1:24335/solr got event WatchedEvent state:SyncConnected type:None path:null path:null type:None
   [junit4]   2> 1155722 T2851 oascc.ConnectionManager.waitForConnected Client is connected to ZooKeeper
   [junit4]   2> 1155722 T2851 oascc.SolrZkClient.makePath makePath: /collections/collection1
   [junit4]   2> 1155727 T2851 oascc.SolrZkClient.makePath makePath: /collections/collection1/shards
   [junit4]   2> 1155735 T2851 oascc.SolrZkClient.makePath makePath: /collections/control_collection
   [junit4]   2> 1155738 T2851 oascc.SolrZkClient.makePath makePath: /collections/control_collection/shards
   [junit4]   2> 1155743 T2851 oasc.AbstractZkTestCase.putConfig put /usr/home/hudson/hudson-slave/workspace/Lucene-Solr-NightlyTests-trunk/solr/build/solr-core/test-files/solr/collection1/conf/solrconfig-tlog.xml to /configs/conf1/solrconfig.xml
   [junit4]   2> 1155744 T2851 oascc.SolrZkClient.makePath makePath: /configs/conf1/solrconfig.xml
   [junit4]   2> 1155756 T2851 oasc.AbstractZkTestCase.putConfig put /usr/home/hudson/hudson-slave/workspace/Lucene-Solr-NightlyTests-trunk/solr/build/solr-core/test-files/solr/collection1/conf/schema.xml to /configs/conf1/schema.xml
   [junit4]   2> 1155757 T2851 oascc.SolrZkClient.makePath makePath: /configs/conf1/schema.xml
   [junit4]   2> 1155860 T2851 oasc.AbstractZkTestCase.putConfig put /usr/home/hudson/hudson-slave/workspace/Lucene-Solr-NightlyTests-trunk/solr/build/solr-core/test-files/solr/collection1/conf/stopwords.txt to /configs/conf1/stopwords.txt
   [junit4]   2> 1155861 T2851 oascc.SolrZkClient.makePath makePath: /configs/conf1/stopwords.txt
   [junit4]   2> 1155865 T2851 oasc.AbstractZkTestCase.putConfig put /usr/home/hudson/hudson-slave/workspace/Lucene-Solr-NightlyTests-trunk/solr/build/solr-core/test-files/solr/collection1/conf/protwords.txt to /configs/conf1/protwords.txt
   [junit4]   2> 1155865 T2851 oascc.SolrZkClient.makePath makePath: /configs/conf1/protwords.txt
   [junit4]   2> 1155874 T2851 oasc.AbstractZkTestCase.putConfig put /usr/home/hudson/hudson-slave/workspace/Lucene-Solr-NightlyTests-trunk/solr/build/solr-core/test-files/solr/collection1/conf/currency.xml to /configs/conf1/currency.xml
   [junit4]   2> 1155875 T2851 oascc.SolrZkClient.makePath makePath: /configs/conf1/currency.xml
   [junit4]   2> 1155878 T2851 oasc.AbstractZkTestCase.putConfig put /usr/home/hudson/hudson-slave/workspace/Lucene-Solr-NightlyTests-trunk/solr/build/solr-core/test-files/solr/collection1/conf/open-exchange-rates.json to /configs/conf1/open-exchange-rates.json
   [junit4]   2> 1155879 T2851 oascc.SolrZkClient.makePath makePath: /configs/conf1/open-exchange-rates.json
   [junit4]   2> 1155882 T2851 oasc.AbstractZkTestCase.putConfig put /usr/home/hudson/hudson-slave/workspace/Lucene-Solr-NightlyTests-trunk/solr/build/solr-core/test-files/solr/collection1/conf/mapping-ISOLatin1Accent.txt to /configs/conf1/mapping-ISOLatin1Accent.txt
   [junit4]   2> 1155883 T2851 oascc.SolrZkClient.makePath makePath: /configs/conf1/mapping-ISOLatin1Accent.txt
   [junit4]   2> 1155887 T2851 oasc.AbstractZkTestCase.putConfig put /usr/home/hudson/hudson-slave/workspace/Lucene-Solr-NightlyTests-trunk/solr/build/solr-core/test-files/solr/collection1/conf/old_synonyms.txt to /configs/conf1/old_synonyms.txt
   [junit4]   2> 1155887 T2851 oascc.SolrZkClient.makePath makePath: /configs/conf1/old_synonyms.txt
   [junit4]   2> 1155890 T2851 oasc.AbstractZkTestCase.putConfig put /usr/home/hudson/hudson-slave/workspace/Lucene-Solr-NightlyTests-trunk/solr/build/solr-core/test-files/solr/collection1/conf/synonyms.txt to /configs/conf1/synonyms.txt
   [junit4]   2> 1155891 T2851 oascc.SolrZkClient.makePath makePath: /configs/conf1/synonyms.txt
   [junit4]   2> 1156171 T2851 oejs.Server.doStart jetty-8.1.10.v20130312
   [junit4]   2> 1156175 T2851 oejs.AbstractConnector.doStart Started SocketConnector@127.0.0.1:24338
   [junit4]   2> 1156176 T2851 oass.SolrDispatchFilter.init SolrDispatchFilter.init()
   [junit4]   2> 1156176 T2851 oasc.SolrResourceLoader.locateSolrHome JNDI not configured for solr (NoInitialContextEx)
   [junit4]   2> 1156177 T2851 oasc.SolrResourceLoader.locateSolrHome using system property solr.solr.home: /usr/home/hudson/hudson-slave/workspace/Lucene-Solr-NightlyTests-trunk/solr/build/solr-core/test/J1/./org.apache.solr.cloud.CollectionsAPIDistributedZkTest-controljetty-1375336757778
   [junit4]   2> 1156177 T2851 oasc.SolrResourceLoader.<init> new SolrResourceLoader for directory: '/usr/home/hudson/hudson-slave/workspace/Lucene-Solr-NightlyTests-trunk/solr/build/solr-core/test/J1/./org.apache.solr.cloud.CollectionsAPIDistributedZkTest-controljetty-1375336757778/'
   [junit4]   2> 1156213 T2851 oasc.ConfigSolr.fromFile Loading container configuration from /usr/home/hudson/hudson-slave/workspace/Lucene-Solr-NightlyTests-trunk/solr/build/solr-core/test/J1/./org.apache.solr.cloud.CollectionsAPIDistributedZkTest-controljetty-1375336757778/solr.xml
   [junit4]   2> 1156299 T2851 oasc.ConfigSolrXml.<init> Config-defined core root directory: 
   [junit4]   2> 1156300 T2851 oasc.CoreContainer.<init> New CoreContainer 367428705
   [junit4]   2> 1156300 T2851 oasc.CoreContainer.load Loading cores into CoreContainer [instanceDir=/usr/home/hudson/hudson-slave/workspace/Lucene-Solr-NightlyTests-trunk/solr/build/solr-core/test/J1/./org.apache.solr.cloud.CollectionsAPIDistributedZkTest-controljetty-1375336757778/]
   [junit4]   2> 1156310 T2851 oashc.HttpShardHandlerFactory.getParameter Setting socketTimeout to: 120000
   [junit4]   2> 1156311 T2851 oashc.HttpShardHandlerFactory.getParameter Setting urlScheme to: http://
   [junit4]   2> 1156311 T2851 oashc.HttpShardHandlerFactory.getParameter Setting connTimeout to: 15000
   [junit4]   2> 1156312 T2851 oashc.HttpShardHandlerFactory.getParameter Setting maxConnectionsPerHost to: 20
   [junit4]   2> 1156312 T2851 oashc.HttpShardHandlerFactory.getParameter Setting corePoolSize to: 0
   [junit4]   2> 1156313 T2851 oashc.HttpShardHandlerFactory.getParameter Setting maximumPoolSize to: 2147483647
   [junit4]   2> 1156313 T2851 oashc.HttpShardHandlerFactory.getParameter Setting maxThreadIdleTime to: 5
   [junit4]   2> 1156314 T2851 oashc.HttpShardHandlerFactory.getParameter Setting sizeOfQueue to: -1
   [junit4]   2> 1156314 T2851 oashc.HttpShardHandlerFactory.getParameter Setting fairnessPolicy to: false
   [junit4]   2> 1156315 T2851 oascsi.HttpClientUtil.createClient Creating new http client, config:maxConnectionsPerHost=20&maxConnections=10000&socketTimeout=120000&connTimeout=15000&retry=false
   [junit4]   2> 1156332 T2851 oasc.ZkContainer.initZooKeeper Zookeeper client=127.0.0.1:24335/solr
   [junit4]   2> 1156333 T2851 oasc.ZkController.checkChrootPath zkHost includes chroot
   [junit4]   2> 1156334 T2851 oascc.ConnectionManager.waitForConnected Waiting for client to connect to ZooKeeper
   [junit4]   2> 1156337 T2871 oascc.ConnectionManager.process Watcher org.apache.solr.common.cloud.ConnectionManager@79b06039 name:ZooKeeperConnection Watcher:127.0.0.1:24335 got event WatchedEvent state:SyncConnected type:None path:null path:null type:None
   [junit4]   2> 1156337 T2851 oascc.ConnectionManager.waitForConnected Client is connected to ZooKeeper
   [junit4]   2> 1156348 T2851 oascsi.HttpClientUtil.createClient Creating new http client, config:maxConnections=500&maxConnectionsPerHost=16&socketTimeout=120000&connTimeout=15000
   [junit4]   2> 1156360 T2851 oascc.ConnectionManager.waitForConnected Waiting for client to connect to ZooKeeper
   [junit4]   2> 1156362 T2873 oascc.ConnectionManager.process Watcher org.apache.solr.common.cloud.ConnectionManager@5046b62f name:ZooKeeperConnection Watcher:127.0.0.1:24335/solr got event WatchedEvent state:SyncConnected type:None path:null path:null type:None
   [junit4]   2> 1156363 T2851 oascc.ConnectionManager.waitForConnected Client is connected to ZooKeeper
   [junit4]   2> 1156370 T2851 oascc.SolrZkClient.makePath makePath: /overseer/queue
   [junit4]   2> 1156374 T2851 oascc.SolrZkClient.makePath makePath: /overseer/collection-queue-work
   [junit4]   2> 1156384 T2851 oascc.SolrZkClient.makePath makePath: /live_nodes
   [junit4]   2> 1156386 T2851 oasc.ZkController.createEphemeralLiveNode Register node as live in ZooKeeper:/live_nodes/127.0.0.1:24338_
   [junit4]   2> 1156387 T2851 oascc.SolrZkClient.makePath makePath: /live_nodes/127.0.0.1:24338_
   [junit4]   2> 1156398 T2851 oascc.SolrZkClient.makePath makePath: /overseer_elect/election
   [junit4]   2> 1156491 T2851 oascc.SolrZkClient.makePath makePath: /overseer_elect/leader
   [junit4]   2> 1156494 T2851 oasc.Overseer.start Overseer (id=90134069735653379-127.0.0.1:24338_-n_0000000000) starting
   [junit4]   2> 1156544 T2851 oascc.SolrZkClient.makePath makePath: /overseer/queue-work
   [junit4]   2> 1156633 T2875 oasc.OverseerCollectionProcessor.run Process current queue of collection creations
   [junit4]   2> 1156634 T2851 oascc.SolrZkClient.makePath makePath: /clusterstate.json
   [junit4]   2> 1156681 T2851 oascc.SolrZkClient.makePath makePath: /aliases.json
   [junit4]   2> 1156724 T2851 oascc.ZkStateReader.createClusterStateWatchersAndUpdate Updating cluster state from ZooKeeper... 
   [junit4]   2> 1156727 T2874 oasc.Overseer$ClusterStateUpdater.run Starting to work on the main queue
   [junit4]   2> 1156730 T2851 oasc.CorePropertiesLocator.discover Looking for core definitions underneath /usr/home/hudson/hudson-slave/workspace/Lucene-Solr-NightlyTests-trunk/solr/build/solr-core/test/J1/./org.apache.solr.cloud.CollectionsAPIDistributedZkTest-controljetty-1375336757778
   [junit4]   2> 1156733 T2851 oasc.CorePropertiesLocator.discoverUnder Found core conf in /usr/home/hudson/hudson-slave/workspace/Lucene-Solr-NightlyTests-trunk/solr/build/solr-core/test/J1/./org.apache.solr.cloud.CollectionsAPIDistributedZkTest-controljetty-1375336757778/conf/
   [junit4]   2> 1156900 T2851 oasc.CorePropertiesLocator.discover Found 1 core definitions
   [junit4]   2> 1156901 T2851 oass.SolrDispatchFilter.init user.dir=/usr/home/hudson/hudson-slave/workspace/Lucene-Solr-NightlyTests-trunk/solr/build/solr-core/test/J1
   [junit4]   2> 1156901 T2851 oass.SolrDispatchFilter.init SolrDispatchFilter.init() done
   [junit4]   2> 1156902 T2851 oascsi.HttpClientUtil.createClient Creating new http client, config:maxConnections=128&maxConnectionsPerHost=32&followRedirects=false
   [junit4]   2> 1156919 T2851 oascsi.HttpClientUtil.createClient Creating new http client, config:
   [junit4]   2> 1156921 T2851 oascc.ConnectionManager.waitForConnected Waiting for client to connect to ZooKeeper
   [junit4]   2> 1156929 T2878 oascc.ConnectionManager.process Watcher org.apache.solr.common.cloud.ConnectionManager@38522317 name:ZooKeeperConnection Watcher:127.0.0.1:24335/solr got event WatchedEvent state:SyncConnected type:None path:null path:null type:None
   [junit4]   2> 1156929 T2851 oascc.ConnectionManager.waitForConnected Client is connected to ZooKeeper
   [junit4]   2> 1156931 T2851 oascc.ZkStateReader.createClusterStateWatchersAndUpdate Updating cluster state from ZooKeeper... 
   [junit4]   2> 1156934 T2851 oasc.ChaosMonkey.monkeyLog monkey: init - expire sessions:true cause connection loss:true
   [junit4]   2> 1157209 T2851 oejs.Server.doStart jetty-8.1.10.v20130312
   [junit4]   2> 1157212 T2851 oejs.AbstractConnector.doStart Started SocketConnector@127.0.0.1:24342
   [junit4]   2> 1157212 T2851 oass.SolrDispatchFilter.init SolrDispatchFilter.init()
   [junit4]   2> 1157213 T2851 oasc.SolrResourceLoader.locateSolrHome JNDI not configured for solr (NoInitialContextEx)
   [junit4]   2> 1157213 T2851 oasc.SolrResourceLoader.locateSolrHome using system property solr.solr.home: /usr/home/hudson/hudson-slave/workspace/Lucene-Solr-NightlyTests-trunk/solr/build/solr-core/test/J1/./org.apache.solr.cloud.CollectionsAPIDistributedZkTest-jetty1-1375336758810
   [junit4]   2> 1157213 T2851 oasc.SolrResourceLoader.<init> new SolrResourceLoader for directory: '/usr/home/hudson/hudson-slave/workspace/Lucene-Solr-NightlyTests-trunk/solr/build/solr-core/test/J1/./org.apache.solr.cloud.CollectionsAPIDistributedZkTest-jetty1-1375336758810/'
   [junit4]   2> 1157251 T2851 oasc.ConfigSolr.fromFile Loading container configuration from /usr/home/hudson/hudson-slave/workspace/Lucene-Solr-NightlyTests-trunk/solr/build/solr-core/test/J1/./org.apache.solr.cloud.CollectionsAPIDistributedZkTest-jetty1-1375336758810/solr.xml
   [junit4]   2> 1157337 T2851 oasc.ConfigSolrXml.<init> Config-defined core root directory: 
   [junit4]   2> 1157337 T2851 oasc.CoreContainer.<init> New CoreContainer 1306332432
   [junit4]   2> 1157338 T2851 oasc.CoreContainer.load Loading cores into CoreContainer [instanceDir=/usr/home/hudson/hudson-slave/workspace/Lucene-Solr-NightlyTests-trunk/solr/build/solr-core/test/J1/./org.apache.solr.cloud.CollectionsAPIDistributedZkTest-jetty1-1375336758810/]
   [junit4]   2> 1157339 T2851 oashc.HttpShardHandlerFactory.getParameter Setting socketTimeout to: 120000
   [junit4]   2> 1157340 T2851 oashc.HttpShardHandlerFactory.getParameter Setting urlScheme to: http://
   [junit4]   2> 1157340 T2851 oashc.HttpShardHandlerFactory.getParameter Setting connTimeout to: 15000
   [junit4]   2> 1157341 T2851 oashc.HttpShardHandlerFactory.getParameter Setting maxConnectionsPerHost to: 20
   [junit4]   2> 1157341 T2851 oashc.HttpShardHandlerFactory.getParameter Setting corePoolSize to: 0
   [junit4]   2> 1157342 T2851 oashc.HttpShardHandlerFactory.getParameter Setting maximumPoolSize to: 2147483647
   [junit4]   2> 1157342 T2851 oashc.HttpShardHandlerFactory.getParameter Setting maxThreadIdleTime to: 5
   [junit4]   2> 1157342 T2851 oashc.HttpShardHandlerFactory.getParameter Setting sizeOfQueue to: -1
   [junit4]   2> 1157343 T2851 oashc.HttpShardHandlerFactory.getParameter Setting fairnessPolicy to: false
   [junit4]   2> 1157343 T2851 oascsi.HttpClientUtil.createClient Creating new http client, config:maxConnectionsPerHost=20&maxConnections=10000&socketTimeout=120000&connTimeout=15000&retry=false
   [junit4]   2> 1157361 T2851 oasc.ZkContainer.initZooKeeper Zookeeper client=127.0.0.1:24335/solr
   [junit4]   2> 1157361 T2851 oasc.ZkController.checkChrootPath zkHost includes chroot
   [junit4]   2> 1157362 T2851 oascc.ConnectionManager.waitForConnected Waiting for client to connect to ZooKeeper
   [junit4]   2> 1157365 T2889 oascc.ConnectionManager.process Watcher org.apache.solr.common.cloud.ConnectionManager@166c578a name:ZooKeeperConnection Watcher:127.0.0.1:24335 got event WatchedEvent state:SyncConnected type:None path:null path:null type:None
   [junit4]   2> 1157366 T2851 oascc.ConnectionManager.waitForConnected Client is connected to ZooKeeper
   [junit4]   2> 1157384 T2851 oascsi.HttpClientUtil.createClient Creating new http client, config:maxConnections=500&maxConnectionsPerHost=16&socketTimeout=120000&connTimeout=15000
   [junit4]   2> 1157396 T2851 oascc.ConnectionManager.waitForConnected Waiting for client to connect to ZooKeeper
   [junit4]   2> 1157399 T2891 oascc.ConnectionManager.process Watcher org.apache.solr.common.cloud.ConnectionManager@652b99ed name:ZooKeeperConnection Watcher:127.0.0.1:24335/solr got event WatchedEvent state:SyncConnected type:None path:null path:null type:None
   [junit4]   2> 1157399 T2851 oascc.ConnectionManager.waitForConnected Client is connected to ZooKeeper
   [junit4]   2> 1157404 T2851 oascc.ZkStateReader.createClusterStateWatchersAndUpdate Updating cluster state from ZooKeeper... 
   [junit4]   2> 1158408 T2851 oasc.ZkController.createEphemeralLiveNode Register node as live in ZooKeeper:/live_nodes/127.0.0.1:24342_
   [junit4]   2> 1158419 T2851 oascc.SolrZkClient.makePath makePath: /live_nodes/127.0.0.1:24342_
   [junit4]   2> 1158423 T2873 oascc.ZkStateReader$3.process Updating live nodes... (2)
   [junit4]   2> 1158423 T2891 oascc.ZkStateReader$3.process Updating live nodes... (2)
   [junit4]   2> 1158423 T2878 oascc.ZkStateReader$3.process Updating live nodes... (2)
   [junit4]   2> 1158430 T2851 oasc.CorePropertiesLocator.discover Looking for core definitions underneath /usr/home/hudson/hudson-slave/workspace/Lucene-Solr-NightlyTests-trunk/solr/build/solr-core/test/J1/./org.apache.solr.cloud.CollectionsAPIDistributedZkTest-jetty1-1375336758810
   [junit4]   2> 1158598 T2851 oasc.CorePropertiesLocator.discoverUnder Found core conf in /usr/home/hudson/hudson-slave/workspace/Lucene-Solr-NightlyTests-trunk/solr/build/solr-core/test/J1/./org.apache.solr.cloud.CollectionsAPIDistributedZkTest-jetty1-1375336758810/conf/
   [junit4]   2> 1158600 T2851 oasc.CorePropertiesLocator.discover Found 1 core definitions
   [junit4]   2> 1158601 T2851 oass.SolrDispatchFilter.init user.dir=/usr/home/hudson/hudson-slave/workspace/Lucene-Solr-NightlyTests-trunk/solr/build/solr-core/test/J1
   [junit4]   2> 1158601 T2851 oass.SolrDispatchFilter.init SolrDispatchFilter.init() done
   [junit4]   2> 1158602 T2851 oascsi.HttpClientUtil.createClient Creating new http client, config:maxConnections=128&maxConnectionsPerHost=32&followRedirects=false
   [junit4]   2> 1158885 T2851 oejs.Server.doStart jetty-8.1.10.v20130312
   [junit4]   2> 1158887 T2851 oejs.AbstractConnector.doStart Started SocketConnector@127.0.0.1:24345
   [junit4]   2> 1158888 T2851 oass.SolrDispatchFilter.init SolrDispatchFilter.init()
   [junit4]   2> 1158888 T2851 oasc.SolrResourceLoader.locateSolrHome JNDI not configured for solr (NoInitialContextEx)
   [junit4]   2> 1158889 T2851 oasc.SolrResourceLoader.locateSolrHome using system property solr.solr.home: /usr/home/hudson/hudson-slave/workspace/Lucene-Solr-NightlyTests-trunk/solr/build/solr-core/test/J1/./org.apache.solr.cloud.CollectionsAPIDistributedZkTest-jetty2-1375336760493
   [junit4]   2> 1158889 T2851 oasc.SolrResourceLoader.<init> new SolrResourceLoader for directory: '/usr/home/hudson/hudson-slave/workspace/Lucene-Solr-NightlyTests-trunk/solr/build/solr-core/test/J1/./org.apache.solr.cloud.CollectionsAPIDistributedZkTest-jetty2-1375336760493/'
   [junit4]   2> 1158925 T2851 oasc.ConfigSolr.fromFile Loading container configuration from /usr/home/hudson/hudson-slave/workspace/Lucene-Solr-NightlyTests-trunk/solr/build/solr-core/test/J1/./org.apache.solr.cloud.CollectionsAPIDistributedZkTest-jetty2-1375336760493/solr.xml
   [junit4]   2> 1159009 T2851 oasc.ConfigSolrXml.<init> Config-defined core root directory: 
   [junit4]   2> 1159010 T2851 oasc.CoreContainer.<init> New CoreContainer 323654633
   [junit4]   2> 1159011 T2851 oasc.CoreContainer.load Loading cores into CoreContainer [instanceDir=/usr/home/hudson/hudson-slave/workspace/Lucene-Solr-NightlyTests-trunk/solr/build/solr-core/test/J1/./org.apache.solr.cloud.CollectionsAPIDistributedZkTest-jetty2-1375336760493/]
   [junit4]   2> 1159012 T2851 oashc.HttpShardHandlerFactory.getParameter Setting socketTimeout to: 120000
   [junit4]   2> 1159013 T2851 oashc.HttpShardHandlerFactory.getParameter Setting urlScheme to: http://
   [junit4]   2> 1159013 T2851 oashc.HttpShardHandlerFactory.getParameter Setting connTimeout to: 15000
   [junit4]   2> 1159013 T2851 oashc.HttpShardHandlerFactory.getParameter Setting maxConnectionsPerHost to: 20
   [junit4]   2> 1159014 T2851 oashc.HttpShardHandlerFactory.getParameter Setting corePoolSize to: 0
   [junit4]   2> 1159014 T2851 oashc.HttpShardHandlerFactory.getParameter Setting maximumPoolSize to: 2147483647
   [junit4]   2> 1159015 T2851 oashc.HttpShardHandlerFactory.getParameter Setting maxThreadIdleTime to: 5
   [junit4]   2> 1159015 T2851 oashc.HttpShardHandlerFactory.getParameter Setting sizeOfQueue to: -1
   [junit4]   2> 1159015 T2851 oashc.HttpShardHandlerFactory.getParameter Setting fairnessPolicy to: false
   [junit4]   2> 1159016 T2851 oascsi.HttpClientUtil.createClient Creating new http client, config:maxConnectionsPerHost=20&maxConnections=10000&socketTimeout=120000&connTimeout=15000&retry=false
   [junit4]   2> 1159031 T2851 oasc.ZkContainer.initZooKeeper Zookeeper client=127.0.0.1:24335/solr
   [junit4]   2> 1159032 T2851 oasc.ZkController.checkChrootPath zkHost includes chroot
   [junit4]   2> 1159033 T2851 oascc.ConnectionManager.waitForConnected Waiting for client to connect to ZooKeeper
   [junit4]   2> 1159037 T2903 oascc.ConnectionManager.process Watcher org.apache.solr.common.cloud.ConnectionManager@1fba8a1c name:ZooKeeperConnection Watcher:127.0.0.1:24335 got event WatchedEvent state:SyncConnected type:None path:null path:null type:None
   [junit4]   2> 1159038 T2851 oascc.ConnectionManager.waitForConnected Client is connected to ZooKeeper
   [junit4]   2> 1159041 T2851 oascsi.HttpClientUtil.createClient Creating new http client, config:maxConnections=500&maxConnectionsPerHost=16&socketTimeout=120000&connTimeout=15000
   [junit4]   2> 1159051 T2851 oascc.ConnectionManager.waitForConnected Waiting for client to connect to ZooKeeper
   [junit4]   2> 1159053 T2905 oascc.ConnectionManager.process Watcher org.apache.solr.common.cloud.ConnectionManager@56430bd0 name:ZooKeeperConnection Watcher:127.0.0.1:24335/solr got event WatchedEvent state:SyncConnected type:None path:null path:null type:None
   [junit4]   2> 1159053 T2851 oascc.ConnectionManager.waitForConnected Client is connected to ZooKeeper
   [junit4]   2> 1159066 T2851 oascc.ZkStateReader.createClusterStateWatchersAndUpdate Updating cluster state from ZooKeeper... 
   [junit4]   2> 1160069 T2851 oasc.ZkController.createEphemeralLiveNode Register node as live in ZooKeeper:/live_nodes/127.0.0.1:24345_
   [junit4]   2> 1160080 T2851 oascc.SolrZkClient.makePath makePath: /live_nodes/127.0.0.1:24345_
   [junit4]   2> 1160084 T2891 oascc.ZkStateReader$3.process Updating live nodes... (3)
   [junit4]   2> 1160084 T2873 oascc.ZkStateReader$3.process Updating live nodes... (3)
   [junit4]   2> 1160084 T2905 oascc.ZkStateReader$3.process Updating live nodes... (3)
   [junit4]   2> 1160084 T2878 oascc.ZkStateReader$3.process Updating live nodes... (3)
   [junit4]   2> 1160100 T2851 oasc.CorePropertiesLocator.discover Looking for core definitions underneath /usr/home/hudson/hudson-slave/workspace/Lucene-Solr-NightlyTests-trunk/solr/build/solr-core/test/J1/./org.apache.solr.cloud.CollectionsAPIDistributedZkTest-jetty2-1375336760493
   [junit4]   2> 1160108 T2851 oasc.CorePropertiesLocator.discoverUnder Found core conf in /usr/home/hudson/hudson-slave/workspace/Lucene-Solr-NightlyTests-trunk/solr/build/solr-core/test/J1/./org.apache.solr.cloud.CollectionsAPIDistributedZkTest-jetty2-1375336760493/conf/
   [junit4]   2> 1160270 T2851 oasc.CorePropertiesLocator.discover Found 1 core definitions
   [junit4]   2> 1160271 T2851 oass.SolrDispatchFilter.init user.dir=/usr/home/hudson/hudson-slave/workspace/Lucene-Solr-NightlyTests-trunk/solr/build/solr-core/test/J1
   [junit4]   2> 1160272 T2851 oass.SolrDispatchFilter.init SolrDispatchFilter.init() done
   [junit4]   2> 1160272 T2851 oascsi.HttpClientUtil.createClient Creating new http client, config:maxConnections=128&maxConnectionsPerHost=32&followRedirects=false
   [junit4]   2> 1160550 T2851 oejs.Server.doStart jetty-8.1.10.v20130312
   [junit4]   2> 1160553 T2851 oejs.AbstractConnector.doStart Started SocketConnector@127.0.0.1:24348
   [junit4]   2> 1160554 T2851 oass.SolrDispatchFilter.init SolrDispatchFilter.init()
   [junit4]   2> 1160554 T2851 oasc.SolrResourceLoader.locateSolrHome JNDI not configured for solr (NoInitialContextEx)
   [junit4]   2> 1160555 T2851 oasc.SolrResourceLoader.locateSolrHome using system property solr.solr.home: /usr/home/hudson/hudson-slave/workspace/Lucene-Solr-NightlyTests-trunk/solr/build/solr-core/test/J1/./org.apache.solr.cloud.CollectionsAPIDistributedZkTest-jetty3-1375336762163
   [junit4]   2> 1160555 T2851 oasc.SolrResourceLoader.<init> new SolrResourceLoader for directory: '/usr/home/hudson/hudson-slave/workspace/Lucene-Solr-NightlyTests-trunk/solr/build/solr-core/test/J1/./org.apache.solr.cloud.CollectionsAPIDistributedZkTest-jetty3-1375336762163/'
   [junit4]   2> 1160591 T2851 oasc.ConfigSolr.fromFile Loading container configuration from /usr/home/hudson/hudson-slave/workspace/Lucene-Solr-NightlyTests-trunk/solr/build/solr-core/test/J1/./org.apache.solr.cloud.CollectionsAPIDistributedZkTest-jetty3-1375336762163/solr.xml
   [junit4]   2> 1160658 T2851 oasc.ConfigSolrXml.<init> Config-defined core root directory: 
   [junit4]   2> 1160659 T2851 oasc.CoreContainer.<init> New CoreContainer 789772577
   [junit4]   2> 1160659 T2851 oasc.CoreContainer.load Loading cores into CoreContainer [instanceDir=/usr/home/hudson/hudson-slave/workspace/Lucene-Solr-NightlyTests-trunk/solr/build/solr-core/test/J1/./org.apache.solr.cloud.CollectionsAPIDistributedZkTest-jetty3-1375336762163/]
   [junit4]   2> 1160660 T2851 oashc.HttpShardHandlerFactory.getParameter Setting socketTimeout to: 120000
   [junit4]   2> 1160660 T2851 oashc.HttpShardHandlerFactory.getParameter Setting urlScheme to: http://
   [junit4]   2> 1160660 T2851 oashc.HttpShardHandlerFactory.getParameter Setting connTimeout to: 15000
   [junit4]   2> 1160661 T2851 oashc.HttpShardHandlerFactory.getParameter Setting maxConnectionsPerHost to: 20
   [junit4]   2> 1160661 T2851 oashc.HttpShardHandlerFactory.getParameter Setting corePoolSize to: 0
   [junit4]   2> 1160661 T2851 oashc.HttpShardHandlerFactory.getParameter Setting maximumPoolSize to: 2147483647
   [junit4]   2> 1160662 T2851 oashc.HttpShardHandlerFactory.getParameter Setting maxThreadIdleTime to: 5
   [junit4]   2> 1160662 T2851 oashc.HttpShardHandlerFactory.getParameter Setting sizeOfQueue to: -1
   [junit4]   2> 1160662 T2851 oashc.HttpShardHandlerFactory.getParameter Setting fairnessPolicy to: false
   [junit4]   2> 1160662 T2851 oascsi.HttpClientUtil.createClient Creating new http client, config:maxConnectionsPerHost=20&maxConnections=10000&socketTimeout=120000&connTimeout=15000&retry=false
   [junit4]   2> 1160673 T2851 oasc.ZkContainer.initZooKeeper Zookeeper client=127.0.0.1:24335/solr
   [junit4]   2> 1160673 T2851 oasc.ZkController.checkChrootPath zkHost includes chroot
   [junit4]   2> 1160674 T2851 oascc.ConnectionManager.waitForConnected Waiting for client to connect to ZooKeeper
   [junit4]   2> 1160676 T2917 oascc.ConnectionManager.process Watcher org.apache.solr.common.cloud.ConnectionManager@40a02083 name:ZooKeeperConnection Watcher:127.0.0.1:24335 got event WatchedEvent state:SyncConnected type:None path:null path:null type:None
   [junit4]   2> 1160676 T2851 oascc.ConnectionManager.waitForConnected Client is connected to ZooKeeper
   [junit4]   2> 1160679 T2851 oascsi.HttpClientUtil.createClient Creating new http client, config:maxConnections=500&maxConnectionsPerHost=16&socketTimeout=120000&connTimeout=15000
   [junit4]   2> 1160690 T2851 oascc.ConnectionManager.waitForConnected Waiting for client to connect to ZooKeeper
   [junit4]   2> 1160692 T2919 oascc.ConnectionManager.process Watcher org.apache.solr.common.cloud.ConnectionManager@4eacbbc9 name:ZooKeeperConnection Watcher:127.0.0.1:24335/solr got event WatchedEvent state:SyncConnected type:None path:null path:null type:None
   [junit4]   2> 1160692 T2851 oascc.ConnectionManager.waitForConnected Client is connected to ZooKeeper
   [junit4]   2> 1160704 T2851 oascc.ZkStateReader.createClusterStateWatchersAndUpdate Updating cluster state from ZooKeeper... 
   [junit4]   2> 1161708 T2851 oasc.ZkController.createEphemeralLiveNode Register node as live in ZooKeeper:/live_nodes/127.0.0.1:24348_
   [junit4]   2> 1161718 T2851 oascc.SolrZkClient.makePath makePath: /live_nodes/127.0.0.1:24348_
   [junit4]   2> 1161776 T2905 oascc.ZkStateReader$3.process Updating live nodes... (4)
   [junit4]   2> 1161776 T2919 oascc.ZkStateReader$3.process Updating live nodes... (4)
   [junit4]   2> 1161776 T2891 oascc.ZkStateReader$3.process Updating live nodes... (4)
   [junit4]   2> 1161776 T2873 oascc.ZkStateReader$3.process Updating live nodes... (4)
   [junit4]   2> 1161776 T2878 oascc.ZkStateReader$3.process Updating live nodes... (4)
   [junit4]   2> 1161784 T2851 oasc.CorePropertiesLocator.discover Looking for core definitions underneath /usr/home/hudson/hudson-slave/workspace/Lucene-Solr-NightlyTests-trunk/solr/build/solr-core/test/J1/./org.apache.solr.cloud.CollectionsAPIDistributedZkTest-jetty3-1375336762163
   [junit4]   2> 1161951 T2851 oasc.CorePropertiesLocator.discoverUnder Found core conf in /usr/home/hudson/hudson-slave/workspace/Lucene-Solr-NightlyTests-trunk/solr/build/solr-core/test/J1/./org.apache.solr.cloud.CollectionsAPIDistributedZkTest-jetty3-1375336762163/conf/
   [junit4]   2> 1161955 T2851 oasc.CorePropertiesLocator.discover Found 1 core definitions
   [junit4]   2> 1161956 T2851 oass.SolrDispatchFilter.init user.dir=/usr/home/hudson/hudson-slave/workspace/Lucene-Solr-NightlyTests-trunk/solr/build/solr-core/test/J1
   [junit4]   2> 1161956 T2851 oass.SolrDispatchFilter.init SolrDispatchFilter.init() done
   [junit4]   2> 1161957 T2851 oascsi.HttpClientUtil.createClient Creating new http client, config:maxConnections=128&maxConnectionsPerHost=32&followRedirects=false
   [junit4]   2> 1162237 T2851 oejs.Server.doStart jetty-8.1.10.v20130312
   [junit4]   2> 1162240 T2851 oejs.AbstractConnector.doStart Started SocketConnector@127.0.0.1:59108
   [junit4]   2> 1162241 T2851 oass.SolrDispatchFilter.init SolrDispatchFilter.init()
   [junit4]   2> 1162241 T2851 oasc.SolrResourceLoader.locateSolrHome JNDI not configured for solr (NoInitialContextEx)
   [junit4]   2> 1162241 T2851 oasc.SolrResourceLoader.locateSolrHome using system property solr.solr.home: /usr/home/hudson/hudson-slave/workspace/Lucene-Solr-NightlyTests-trunk/solr/build/solr-core/test/J1/./org.apache.solr.cloud.CollectionsAPIDistributedZkTest-jetty4-1375336763848
   [junit4]   2> 1162242 T2851 oasc.SolrResourceLoader.<init> new SolrResourceLoader for directory: '/usr/home/hudson/hudson-slave/workspace/Lucene-Solr-NightlyTests-trunk/solr/build/solr-core/test/J1/./org.apache.solr.cloud.CollectionsAPIDistributedZkTest-jetty4-1375336763848/'
   [junit4]   2> 1162278 T2851 oasc.ConfigSolr.fromFile Loading container configuration from /usr/home/hudson/hudson-slave/workspace/Lucene-Solr-NightlyTests-trunk/solr/build/solr-core/test/J1/./org.apache.solr.cloud.CollectionsAPIDistributedZkTest-jetty4-1375336763848/solr.xml
   [junit4]   2> 1162363 T2851 oasc.ConfigSolrXml.<init> Config-defined core root directory: 
   [junit4]   2> 1162364 T2851 oasc.CoreContainer.<init> New CoreContainer 1618799893
   [junit4]   2> 1162364 T2851 oasc.CoreContainer.load Loading cores into CoreContainer [instanceDir=/usr/home/hudson/hudson-slave/workspace/Lucene-Solr-NightlyTests-trunk/solr/build/solr-core/test/J1/./org.apache.solr.cloud.CollectionsAPIDistributedZkTest-jetty4-1375336763848/]
   [junit4]   2> 1162366 T2851 oashc.HttpShardHandlerFactory.getParameter Setting socketTimeout to: 120000
   [junit4]   2> 1162366 T2851 oashc.HttpShardHandlerFactory.getParameter Setting urlScheme to: http://
   [junit4]   2> 1162367 T2851 oashc.HttpShardHandlerFactory.getParameter Setting connTimeout to: 15000
   [junit4]   2> 1162367 T2851 oashc.HttpShardHandlerFactory.getParameter Setting maxConnectionsPerHost to: 20
   [junit4]   2> 1162367 T2851 oashc.HttpShardHandlerFactory.getParameter Setting corePoolSize to: 0
   [junit4]   2> 1162368 T2851 oashc.HttpShardHandlerFactory.getParameter Setting maximumPoolSize to: 2147483647
   [junit4]   2> 1162368 T2851 oashc.HttpShardHandlerFactory.getParameter Setting maxThreadIdleTime to: 5
   [junit4]   2> 1162369 T2851 oashc.HttpShardHandlerFactory.getParameter Setting sizeOfQueue to: -1
   [junit4]   2> 1162369 T2851 oashc.HttpShardHandlerFactory.getParameter Setting fairnessPolicy to: false
   [junit4]   2> 1162369 T2851 oascsi.HttpClientUtil.createClient Creating new http client, config:maxConnectionsPerHost=20&maxConnections=10000&socketTimeout=120000&connTimeout=15000&retry=false
   [junit4]   2> 1162387 T2851 oasc.ZkContainer.initZooKeeper Zookeeper client=127.0.0.1:24335/solr
   [junit4]   2> 1162387 T2851 oasc.ZkController.checkChrootPath zkHost includes chroot
   [junit4]   2> 1162388 T2851 oascc.ConnectionManager.waitForConnected Waiting for client to connect to ZooKeeper
   [junit4]   2> 1162416 T2931 oascc.ConnectionManager.process Watcher org.apache.solr.common.cloud.ConnectionManager@5c1a3983 name:ZooKeeperConnection Watcher:127.0.0.1:24335 got event WatchedEvent state:SyncConnected type:None path:null path:null type:None
   [junit4]   2> 1162416 T2851 oascc.ConnectionManager.waitForConnected Client is connected to ZooKeeper
   [junit4]   2> 1162420 T2851 oascsi.HttpClientUtil.createClient Creating new http client, config:maxConnections=500&maxConnectionsPerHost=16&socketTimeout=120000&connTimeout=15000
   [junit4]   2> 1162432 T2851 oascc.ConnectionManager.waitForConnected Waiting for client to connect to ZooKeeper
   [junit4]   2> 1162434 T2933 oascc.ConnectionManager.process Watcher org.apache.solr.common.cloud.ConnectionManager@258259ab name:ZooKeeperConnection Watcher:127.0.0.1:24335/solr got event WatchedEvent state:SyncConnected type:None path:null path:null type:None
   [junit4]   2> 1162434 T2851 oascc.ConnectionManager.waitForConnected Client is connected to ZooKeeper
   [junit4]   2> 1162447 T2851 oascc.ZkStateReader.createClusterStateWatchersAndUpdate Updating cluster state from ZooKeeper... 
   [junit4]   2> 1163450 T2851 oasc.ZkController.createEphemeralLiveNode Register node as live in ZooKeeper:/live_nodes/127.0.0.1:59108_
   [junit4]   2> 1163461 T2851 oascc.SolrZkClient.makePath makePath: /live_nodes/127.0.0.1:59108_
   [junit4]   2> 1163465 T2919 oascc.ZkStateReader$3.process Updating live nodes... (5)
   [junit4]   2> 1163466 T2891 oascc.ZkStateReader$3.process Updating live nodes... (5)
   [junit4]   2> 1163466 T2873 oascc.ZkStateReader$3.process Updating live nodes... (5)
   [junit4]   2> 1163466 T2933 oascc.ZkStateReader$3.process Updating live nodes... (5)
   [junit4]   2> 1163466 T2905 oascc.ZkStateReader$3.process Updating live nodes... (5)
   [junit4]   2> 1163466 T2878 oascc.ZkStateReader$3.process Updating live nodes... (5)
   [junit4]   2> 1163481 T2851 oasc.CorePropertiesLocator.discover Looking for core definitions underneath /usr/home/hudson/hudson-slave/workspace/Lucene-Solr-NightlyTests-trunk/solr/build/solr-core/test/J1/./org.apache.solr.cloud.CollectionsAPIDistributedZkTest-jetty4-1375336763848
   [junit4]   2> 1163650 T2851 oasc.CorePropertiesLocator.discoverUnder Found core conf in /usr/home/hudson/hudson-slave/workspace/Lucene-Solr-NightlyTests-trunk/solr/build/solr-core/test/J1/./org.apache.solr.cloud.CollectionsAPIDistributedZkTest-jetty4-1375336763848/conf/
   [junit4]   2> 1163651 T2851 oasc.CorePropertiesLocator.discover Found 1 core definitions
   [junit4]   2> 1163652 T2851 oass.SolrDispatchFilter.init user.dir=/usr/home/hudson/hudson-slave/workspace/Lucene-Solr-NightlyTests-trunk/solr/build/solr-core/test/J1
   [junit4]   2> 1163652 T2851 oass.SolrDispatchFilter.init SolrDispatchFilter.init() done
   [junit4]   2> 1163653 T2851 oascsi.HttpClientUtil.createClient Creating new http client, config:maxConnections=128&maxConnectionsPerHost=32&followRedirects=false
   [junit4]   2> 1163668 T2851 oascsi.HttpClientUtil.createClient Creating new http client, config:maxConnections=128&maxConnectionsPerHost=32&followRedirects=false
   [junit4]   2> 1163679 T2881 oasha.CollectionsHandler.handleCreateAction Creating Collection : numShards=2&name=nodes_used_collection&replicationFactor=2&action=CREATE&wt=javabin&version=2
   [junit4]   2> 1163682 T2873 oasc.DistributedQueue$LatchChildWatcher.process Watcher fired on path: /overseer/collection-queue-work state: SyncConnected type NodeChildrenChanged
   [junit4]   2> 1163683 T2875 oasc.OverseerCollectionProcessor.run Overseer Collection Processor: Get the message id:/overseer/collection-queue-work/qn-0000000000 message:{
   [junit4]   2> 	  "operation":"createcollection",
   [junit4]   2> 	  "numShards":"2",
   [junit4]   2> 	  "name":"nodes_used_collection",
   [junit4]   2> 	  "replicationFactor":"2"}
   [junit4]   2> 1163684 T2875 oasc.OverseerCollectionProcessor.processMessage WARN OverseerCollectionProcessor.processMessage : createcollection , {
   [junit4]   2> 	  "operation":"createcollection",
   [junit4]   2> 	  "numShards":"2",
   [junit4]   2> 	  "name":"nodes_used_collection",
   [junit4]   2> 	  "replicationFactor":"2"}
   [junit4]   2> 1164240 T2874 oascc.ZkStateReader.updateClusterState Updating cloud state from ZooKeeper... 
   [junit4]   2> 1164240 T2874 oasc.Overseer$ClusterStateUpdater.buildCollection building a new collection: nodes_used_collection
   [junit4]   2> 1164241 T2874 oasc.Overseer$ClusterStateUpdater.createCollection Create collection nodes_used_collection with shards [shard1, shard2]
   [junit4]   2> 1164255 T2933 oascc.ZkStateReader$2.process A cluster state change: WatchedEvent state:SyncConnected type:NodeDataChanged path:/clusterstate.json, has occurred - updating... (live nodes size: 5)
   [junit4]   2> 1164255 T2873 oascc.ZkStateReader$2.process A cluster state change: WatchedEvent state:SyncConnected type:NodeDataChanged path:/clusterstate.json, has occurred - updating... (live nodes size: 5)
   [junit4]   2> 1164255 T2891 oascc.ZkStateReader$2.process A cluster state change: WatchedEvent state:SyncConnected type:NodeDataChanged path:/clusterstate.json, has occurred - updating... (live nodes size: 5)
   [junit4]   2> 1164255 T2878 oascc.ZkStateReader$2.process A cluster state change: WatchedEvent state:SyncConnected type:NodeDataChanged path:/clusterstate.json, has occurred - updating... (live nodes size: 5)
   [junit4]   2> 1164255 T2905 oascc.ZkStateReader$2.process A cluster state change: WatchedEvent state:SyncConnected type:NodeDataChanged path:/clusterstate.json, has occurred - updating... (live nodes size: 5)
   [junit4]   2> 1164255 T2919 oascc.ZkStateReader$2.process A cluster state change: WatchedEvent state:SyncConnected type:NodeDataChanged path:/clusterstate.json, has occurred - updating... (live nodes size: 5)
   [junit4]   2> 1164301 T2875 oasc.OverseerCollectionProcessor.createCollection going to create cores replicas shardNames [shard1, shard2] , repFactor : 2
   [junit4]   2> 1164301 T2875 oasc.OverseerCollectionProcessor.createCollection Creating shard nodes_used_collection_shard1_replica1 as part of slice shard1 of collection nodes_used_collection on 127.0.0.1:24345_
   [junit4]   2> 1164302 T2875 oasc.OverseerCollectionProcessor.createCollection Creating shard nodes_used_collection_shard1_replica2 as part of slice shard1 of collection nodes_used_collection on 127.0.0.1:24338_
   [junit4]   2> 1164303 T2875 oasc.OverseerCollectionProcessor.createCollection Creating shard nodes_used_collection_shard2_replica1 as part of slice shard2 of collection nodes_used_collection on 127.0.0.1:24342_
   [junit4]   2> 1164313 T2875 oasc.OverseerCollectionProcessor.createCollection Creating shard nodes_used_collection_shard2_replica2 as part of slice shard2 of collection nodes_used_collection on 127.0.0.1:59108_
   [junit4]   2> 1164316 T2895 oasc.ZkController.publish publishing core=nodes_used_collection_shard1_replica1 state=down
   [junit4]   2> 1164316 T2863 oasc.ZkController.publish publishing core=nodes_used_collection_shard1_replica2 state=down
   [junit4]   2> 1164316 T2882 oasc.ZkController.publish publishing core=nodes_used_collection_shard2_replica1 state=down
   [junit4]   2> 1164317 T2923 oasc.ZkController.publish publishing core=nodes_used_collection_shard2_replica2 state=down
   [junit4]   2> 1164318 T2895 oasc.ZkController.waitForCoreNodeName look for our core node name
   [junit4]   2> 1164319 T2863 oasc.ZkController.waitForCoreNodeName look for our core node name
   [junit4]   2> 1164319 T2923 oasc.ZkController.waitForCoreNodeName look for our core node name
   [junit4]   2> 1164319 T2882 oasc.ZkController.waitForCoreNodeName look for our core node name
   [junit4]   2> 1165761 T2874 oascc.ZkStateReader.updateClusterState Updating cloud state from ZooKeeper... 
   [junit4]   2> 1165762 T2874 oasc.Overseer$ClusterStateUpdater.updateState WARN Could not find collection node for nodes_used_collection, skipping publish state
   [junit4]   2> 1165762 T2874 oasc.Overseer$ClusterStateUpdater.updateState Update state numShards=2 message={
   [junit4]   2> 	  "operation":"state",
   [junit4]   2> 	  "core_node_name":"core_node1",
   [junit4]   2> 	  "numShards":"2",
   [junit4]   2> 	  "shard":"shard1",
   [junit4]   2> 	  "roles":null,
   [junit4]   2> 	  "state":"down",
   [junit4]   2> 	  "shard_state":"active",
   [junit4]   2> 	  "core":"nodes_used_collection_shard1_replica1",
   [junit4]   2> 	  "collection":"nodes_used_collection",
   [junit4]   2> 	  "shard_range":null,
   [junit4]   2> 	  "node_name":"127.0.0.1:24345_",
   [junit4]   2> 	  "base_url":"http://127.0.0.1:24345"}
   [junit4]   2> 1165767 T2874 oasc.Overseer$ClusterStateUpdater.updateState WARN Could not find collection node for nodes_used_collection, skipping publish state
   [junit4]   2> 1165767 T2874 oasc.Overseer$ClusterStateUpdater.updateState Update state numShards=2 message={
   [junit4]   2> 	  "operation":"state",
   [junit4]   2> 	  "core_node_name":"core_node2",
   [junit4]   2> 	  "numShards":"2",
   [junit4]   2> 	  "shard":"shard1",
   [junit4]   2> 	  "roles":null,
   [junit4]   2> 	  "state":"down",
   [junit4]   2> 	  "shard_state":"active",
   [junit4]   2> 	  "core":"nodes_used_collection_shard1_replica2",
   [junit4]   2> 	  "collection":"nodes_used_collection",
   [junit4]   2> 	  "shard_range":null,
   [junit4]   2> 	  "node_name":"127.0.0.1:24338_",
   [junit4]   2> 	  "base_url":"http://127.0.0.1:24338"}
   [junit4]   2> 1165781 T2874 oasc.Overseer$ClusterStateUpdater.updateState WARN Could not find collection node for nodes_used_collection, skipping publish state
   [junit4]   2> 1165781 T2874 oasc.Overseer$ClusterStateUpdater.updateState Update state numShards=2 message={
   [junit4]   2> 	  "operation":"state",
   [junit4]   2> 	  "core_node_name":"core_node3",
   [junit4]   2> 	  "numShards":"2",
   [junit4]   2> 	  "shard":"shard2",
   [junit4]   2> 	  "roles":null,
   [junit4]   2> 	  "state":"down",
   [junit4]   2> 	  "shard_state":"active",
   [junit4]   2> 	  "core":"nodes_used_collection_shard2_replica1",
   [junit4]   2> 	  "collection":"nodes_used_collection",
   [junit4]   2> 	  "shard_range":null,
   [junit4]   2> 	  "node_name":"127.0.0.1:24342_",
   [junit4]   2> 	  "base_url":"http://127.0.0.1:24342"}
   [junit4]   2> 1165785 T2874 oasc.Overseer$ClusterStateUpdater.updateState WARN Could not find collection node for nodes_used_collection, skipping publish state
   [junit4]   2> 1165785 T2874 oasc.Overseer$ClusterStateUpdater.updateState Update state numShards=2 message={
   [junit4]   2> 	  "operation":"state",
   [junit4]   2> 	  "core_node_name":"core_node4",
   [junit4]   2> 	  "numShards":"2",
   [junit4]   2> 	  "shard":"shard2",
   [junit4]   2> 	  "roles":null,
   [junit4]   2> 	  "state":"down",
   [junit4]   2> 	  "shard_state":"active",
   [junit4]   2> 	  "core":"nodes_used_collection_shard2_replica2",
   [junit4]   2> 	  "collection":"nodes_used_collection",
   [junit4]   2> 	  "shard_range":null,
   [junit4]   2> 	  "node_name":"127.0.0.1:59108_",
   [junit4]   2> 	  "base_url":"http://127.0.0.1:59108"}
   [junit4]   2> 1165790 T2933 oascc.ZkStateReader$2.process A cluster state change: WatchedEvent state:SyncConnected type:NodeDataChanged path:/clusterstate.json, has occurred - updating... (live nodes size: 5)
   [junit4]   2> 1165790 T2891 oascc.ZkStateReader$2.process A cluster state change: WatchedEvent state:SyncConnected type:NodeDataChanged path:/clusterstate.json, has occurred - updating... (live nodes size: 5)
   [junit4]   2> 1165790 T2873 oascc.ZkStateReader$2.process A cluster state change: WatchedEvent state:SyncConnected type:NodeDataChanged path:/clusterstate.json, has occurred - updating... (live nodes size: 5)
   [junit4]   2> 1165790 T2905 oascc.ZkStateReader$2.process A cluster state change: WatchedEvent state:SyncConnected type:NodeDataChanged path:/clusterstate.json, has occurred - updating... (live nodes size: 5)
   [junit4]   2> 1165790 T2919 oascc.ZkStateReader$2.process A cluster state change: WatchedEvent state:SyncConnected type:NodeDataChanged path:/clusterstate.json, has occurred - updating... (live nodes size: 5)
   [junit4]   2> 1165790 T2878 oascc.ZkStateReader$2.process A cluster state change: WatchedEvent state:SyncConnected type:NodeDataChanged path:/clusterstate.json, has occurred - updating... (live nodes size: 5)
   [junit4]   2> 1166320 T2895 oasc.ZkController.waitForShardId waiting to find shard id in clusterstate for nodes_used_collection_shard1_replica1
   [junit4]   2> 1166321 T2863 oasc.ZkController.waitForShardId waiting to find shard id in clusterstate for nodes_used_collection_shard1_replica2
   [junit4]   2> 1166321 T2882 oasc.ZkController.waitForShardId waiting to find shard id in clusterstate for nodes_used_collection_shard2_replica1
   [junit4]   2> 1166321 T2923 oasc.ZkController.waitForShardId waiting to find shard id in clusterstate for nodes_used_collection_shard2_replica2
   [junit4]   2> 1166321 T2895 oasc.CorePropertiesLocator.writePropertiesFile ERROR Couldn't persist core properties to /usr/home/hudson/hudson-slave/workspace/Lucene-Solr-NightlyTests-trunk/solr/build/solr-core/test/J1/./org.apache.solr.cloud.CollectionsAPIDistributedZkTest-jetty2-1375336760493/nodes_used_collection_shard1_replica1/core.properties: java.io.FileNotFoundException: /usr/home/hudson/hudson-slave/workspace/Lucene-Solr-NightlyTests-trunk/solr/build/solr-core/test/J1/./org.apache.solr.cloud.CollectionsAPIDistributedZkTest-jetty2-1375336760493/nodes_used_collection_shard1_replica1/core.properties (No such file or directory)
   [junit4]   2> 1166322 T2863 oasc.CorePropertiesLocator.writePropertiesFile ERROR Couldn't persist core properties to /usr/home/hudson/hudson-slave/workspace/Lucene-Solr-NightlyTests-trunk/solr/build/solr-core/test/J1/./org.apache.solr.cloud.CollectionsAPIDistributedZkTest-controljetty-1375336757778/nodes_used_collection_shard1_replica2/core.properties: java.io.FileNotFoundException: /usr/home/hudson/hudson-slave/workspace/Lucene-Solr-NightlyTests-trunk/solr/build/solr-core/test/J1/./org.apache.solr.cloud.CollectionsAPIDistributedZkTest-controljetty-1375336757778/nodes_used_collection_shard1_replica2/core.properties (No such file or directory)
   [junit4]   2> 1166323 T2923 oasc.CorePropertiesLocator.writePropertiesFile ERROR Couldn't persist core properties to /usr/home/hudson/hudson-slave/workspace/Lucene-Solr-NightlyTests-trunk/solr/build/solr-core/test/J1/./org.apache.solr.cloud.CollectionsAPIDistributedZkTest-jetty4-1375336763848/nodes_used_collection_shard2_replica2/core.properties: java.io.FileNotFoundException: /usr/home/hudson/hudson-slave/workspace/Lucene-Solr-NightlyTests-trunk/solr/build/solr-core/test/J1/./org.apache.solr.cloud.CollectionsAPIDistributedZkTest-jetty4-1375336763848/nodes_used_collection_shard2_replica2/core.properties (No such file or directory)
   [junit4]   2> 1166322 T2882 oasc.CorePropertiesLocator.writePropertiesFile ERROR Couldn't persist core properties to /usr/home/hudson/hudson-slave/workspace/Lucene-Solr-NightlyTests-trunk/solr/build/solr-core/test/J1/./org.apache.solr.cloud.CollectionsAPIDistributedZkTest-jetty1-1375336758810/nodes_used_collection_shard2_replica1/core.properties: java.io.FileNotFoundException: /usr/home/hudson/hudson-slave/workspace/Lucene-Solr-NightlyTests-trunk/solr/build/solr-core/test/J1/./org.apache.solr.cloud.CollectionsAPIDistributedZkTest-jetty1-1375336758810/nodes_used_collection_shard2_replica1/core.properties (No such file or directory)
   [junit4]   2> 1166322 T2895 oasc.CoreContainer.create Creating SolrCore 'nodes_used_collection_shard1_replica1' using instanceDir: /usr/home/hudson/hudson-slave/workspace/Lucene-Solr-NightlyTests-trunk/solr/build/solr-core/test/J1/./org.apache.solr.cloud.CollectionsAPIDistributedZkTest-jetty2-1375336760493/nodes_used_collection_shard1_replica1
   [junit4]   2> 1166324 T2895 oasc.ZkController.createCollectionZkNode Check for collection zkNode:nodes_used_collection
   [junit4]   2> 1166323 T2882 oasc.CoreContainer.create Creating SolrCore 'nodes_used_collection_shard2_replica1' using instanceDir: /usr/home/hudson/hudson-slave/workspace/Lucene-Solr-NightlyTests-trunk/solr/build/solr-core/test/J1/./org.apache.solr.cloud.CollectionsAPIDistributedZkTest-jetty1-1375336758810/nodes_used_collection_shard2_replica1
   [junit4]   2> 1166324 T2882 oasc.ZkController.createCollectionZkNode Check for collection zkNode:nodes_used_collection
   [junit4]   2> 1166323 T2923 oasc.CoreContainer.create Creating SolrCore 'nodes_used_collection_shard2_replica2' using instanceDir: /usr/home/hudson/hudson-slave/workspace/Lucene-Solr-NightlyTests-trunk/solr/build/solr-core/test/J1/./org.apache.solr.cloud.CollectionsAPIDistributedZkTest-jetty4-1375336763848/nodes_used_collection_shard2_replica2
   [junit4]   2> 1166325 T2923 oasc.ZkController.createCollectionZkNode Check for collection zkNode:nodes_used_collection
   [junit4]   2> 1166323 T2863 oasc.CoreContainer.create Creating SolrCore 'nodes_used_collection_shard1_replica2' using instanceDir: /usr/home/hudson/hudson-slave/workspace/Lucene-Solr-NightlyTests-trunk/solr/build/solr-core/test/J1/./org.apache.solr.cloud.CollectionsAPIDistributedZkTest-controljetty-1375336757778/nodes_used_collection_shard1_replica2
   [junit4]   2> 1166326 T2863 oasc.ZkController.createCollectionZkNode Check for collection zkNode:nodes_used_collection
   [junit4]   2> 1166325 T2882 oasc.ZkController.createCollectionZkNode Creating collection in ZooKeeper:nodes_used_collection
   [junit4]   2> 1166325 T2895 oasc.ZkController.createCollectionZkNode Creating collection in ZooKeeper:nodes_used_collection
   [junit4]   2> 1166326 T2863 oasc.ZkController.createCollectionZkNode Creating collection in ZooKeeper:nodes_used_collection
   [junit4]   2> 1166326 T2882 oasc.ZkController.getConfName Looking for collection configName
   [junit4]   2> 1166326 T2923 oasc.ZkController.createCollectionZkNode Creating collection in ZooKeeper:nodes_used_collection
   [junit4]   2> 1166327 T2863 oasc.ZkController.getConfName Looking for collection configName
   [junit4]   2> 1166327 T2895 oasc.ZkController.getConfName Looking for collection configName
   [junit4]   2> 1166328 T2882 oasc.ZkController.getConfName Only one config set found in zk - using it:conf1
   [junit4]   2> 1166328 T2923 oasc.ZkController.getConfName Looking for collection configName
   [junit4]   2> 1166329 T2882 oascc.SolrZkClient.makePath makePath: /collections/nodes_used_collection
   [junit4]   2> 1166329 T2895 oasc.ZkController.getConfName Only one config set found in zk - using it:conf1
   [junit4]   2> 1166329 T2863 oasc.ZkController.getConfName Only one config set found in zk - using it:conf1
   [junit4]   2> 1166330 T2923 oasc.ZkController.getConfName Only one config set found in zk - using it:conf1
   [junit4]   2> 1166330 T2863 oascc.SolrZkClient.makePath makePath: /collections/nodes_used_collection
   [junit4]   2> 1166330 T2895 oascc.SolrZkClient.makePath makePath: /collections/nodes_used_collection
   [junit4]   2> 1166330 T2923 oascc.SolrZkClient.makePath makePath: /collections/nodes_used_collection
   [junit4]   2> 1166332 T2882 oasc.ZkController.readConfigName Load collection config from:/collections/nodes_used_collection
   [junit4]   2> 1166333 T2895 oasc.ZkController.readConfigName Load collection config from:/collections/nodes_used_collection
   [junit4]   2> 1166344 T2863 oasc.ZkController.readConfigName Load collection config from:/collections/nodes_used_collection
   [junit4]   2> 1166344 T2923 oasc.ZkController.readConfigName Load collection config from:/collections/nodes_used_collection
   [junit4]   2> 1166345 T2882 oasc.SolrResourceLoader.<init> new SolrResourceLoader for directory: '/usr/home/hudson/hudson-slave/workspace/Lucene-Solr-NightlyTests-trunk/solr/build/solr-core/test/J1/./org.apache.solr.cloud.CollectionsAPIDistributedZkTest-jetty1-1375336758810/nodes_used_collection_shard2_replica1/'
   [junit4]   2> 1166345 T2895 oasc.SolrResourceLoader.<init> new SolrResourceLoader for directory: '/usr/home/hudson/hudson-slave/workspace/Lucene-Solr-NightlyTests-trunk/solr/build/solr-core/test/J1/./org.apache.solr.cloud.CollectionsAPIDistributedZkTest-jetty2-1375336760493/nodes_used_collection_shard1_replica1/'
   [junit4]   2> 1166345 T2863 oasc.SolrResourceLoader.<init> new SolrResourceLoader for directory: '/usr/home/hudson/hudson-slave/workspace/Lucene-Solr-NightlyTests-trunk/solr/build/solr-core/test/J1/./org.apache.solr.cloud.CollectionsAPIDistributedZkTest-controljetty-1375336757778/nodes_used_collection_shard1_replica2/'
   [junit4]   2> 1166346 T2923 oasc.SolrResourceLoader.<init> new SolrResourceLoader for directory: '/usr/home/hudson/hudson-slave/workspace/Lucene-Solr-NightlyTests-trunk/solr/build/solr-core/test/J1/./org.apache.solr.cloud.CollectionsAPIDistributedZkTest-jetty4-1375336763848/nodes_used_collection_shard2_replica2/'
   [junit4]   2> 1166490 T2882 oasc.SolrConfig.<init> Using Lucene MatchVersion: LUCENE_50
   [junit4]   2> 1166491 T2923 oasc.SolrConfig.<init> Using Lucene MatchVersion: LUCENE_50
   [junit4]   2> 1166491 T2895 oasc.SolrConfig.<init> Using Lucene MatchVersion: LUCENE_50
   [junit4]   2> 1166490 T2863 oasc.SolrConfig.<init> Using Lucene MatchVersion: LUCENE_50
   [junit4]   2> 1166572 T2923 oasc.SolrConfig.<init> Loaded SolrConfig: solrconfig.xml
   [junit4]   2> 1166573 T2895 oasc.SolrConfig.<init> Loaded SolrConfig: solrconfig.xml
   [junit4]   2> 1166573 T2882 oasc.SolrConfig.<init> Loaded SolrConfig: solrconfig.xml
   [junit4]   2> 1166574 T2863 oasc.SolrConfig.<init> Loaded SolrConfig: solrconfig.xml
   [junit4]   2> 1166674 T2923 oass.IndexSchema.readSchema Reading Solr Schema from schema.xml
   [junit4]   2> 1166674 T2882 oass.IndexSchema.readSchema Reading Solr Schema from schema.xml
   [junit4]   2> 1166674 T2895 oass.IndexSchema.readSchema Reading Solr Schema from schema.xml
   [junit4]   2> 1166675 T2863 oass.IndexSchema.readSchema Reading Solr Schema from schema.xml
   [junit4]   2> 1166686 T2923 oass.IndexSchema.readSchema [nodes_used_collection_shard2_replica2] Schema name=test
   [junit4]   2> 1166686 T2895 oass.IndexSchema.readSchema [nodes_used_collection_shard1_replica1] Schema name=test
   [junit4]   2> 1166687 T2863 oass.IndexSchema.readSchema [nodes_used_collection_shard1_replica2] Schema name=test
   [junit4]   2> 1166687 T2882 oass.IndexSchema.readSchema [nodes_used_collection_shard2_replica1] Schema name=test
   [junit4]   2> 1167434 T2923 oass.OpenExchangeRatesOrgProvider.init Initialized with rates=open-exchange-rates.json, refreshInterval=1440.
   [junit4]   2> 1167434 T2863 oass.OpenExchangeRatesOrgProvider.init Initialized with rates=open-exchange-rates.json, refreshInterval=1440.
   [junit4]   2> 1167440 T2895 oass.OpenExchangeRatesOrgProvider.init Initialized with rates=open-exchange-rates.json, refreshInterval=1440.
   [junit4]   2> 1167441 T2882 oass.OpenExchangeRatesOrgProvider.init Initialized with rates=open-exchange-rates.json, refreshInterval=1440.
   [junit4]   2> 1167447 T2923 oass.IndexSchema.readSchema default search field in schema is text
   [junit4]   2> 1167448 T2863 oass.IndexSchema.readSchema default search field in schema is text
   [junit4]   2> 1167449 T2895 oass.IndexSchema.readSchema default search field in schema is text
   [junit4]   2> 1167449 T2882 oass.IndexSchema.readSchema default search field in schema is text
   [junit4]   2> 1167452 T2923 oass.IndexSchema.readSchema unique key field: id
   [junit4]   2> 1167452 T2863 oass.IndexSchema.readSchema unique key field: id
   [junit4]   2> 1167453 T2895 oass.IndexSchema.readSchema unique key field: id
   [junit4]   2> 1167454 T2882 oass.IndexSchema.readSchema unique key field: id
   [junit4]   2> 1167470 T2895 oass.FileExchangeRateProvider.reload Reloading exchange rates from file currency.xml
   [junit4]   2> 1167471 T2882 oass.FileExchangeRateProvider.reload Reloading exchange rates from file currency.xml
   [junit4]   2> 1167471 T2923 oass.FileExchangeRateProvider.reload Reloading exchange rates from file currency.xml
   [junit4]   2> 1167470 T2863 oass.FileExchangeRateProvider.reload Reloading exchange rates from file currency.xml
   [junit4]   2> 1167476 T2882 oass.FileExchangeRateProvider.reload Reloading exchange rates from file currency.xml
   [junit4]   2> 1167476 T2895 oass.FileExchangeRateProvider.reload Reloading exchange rates from file currency.xml
   [junit4]   2> 1167477 T2863 oass.FileExchangeRateProvider.reload Reloading exchange rates from file currency.xml
   [junit4]   2> 1167477 T2923 oass.FileExchangeRateProvider.reload Reloading exchange rates from file currency.xml
   [junit4]   2> 1167481 T2882 oass.OpenExchangeRatesOrgProvider.reload Reloading exchange rates from open-exchange-rates.json
   [junit4]   2> 1167482 T2895 oass.OpenExchangeRatesOrgProvider.reload Reloading exchange rates from open-exchange-rates.json
   [junit4]   2> 1167482 T2863 oass.OpenExchangeRatesOrgProvider.reload Reloading exchange rates from open-exchange-rates.json
   [junit4]   2> 1167482 T2923 oass.OpenExchangeRatesOrgProvider.reload Reloading exchange rates from open-exchange-rates.json
   [junit4]   2> 1167483 T2882 oass.OpenExchangeRatesOrgProvider$OpenExchangeRates.<init> WARN Unknown key IMPORTANT NOTE
   [junit4]   2> 1167483 T2895 oass.OpenExchangeRatesOrgProvider$OpenExchangeRates.<init> WARN Unknown key IMPORTANT NOTE
   [junit4]   2> 1167483 T2882 oass.OpenExchangeRatesOrgProvider$OpenExchangeRates.<init> WARN Expected key, got STRING
   [junit4]   2> 1167484 T2923 oass.OpenExchangeRatesOrgProvider$OpenExchangeRates.<init> WARN Unknown key IMPORTANT NOTE
   [junit4]   2> 1167484 T2863 oass.OpenExchangeRatesOrgProvider$OpenExchangeRates.<init> WARN Unknown key IMPORTANT NOTE
   [junit4]   2> 1167485 T2863 oass.OpenExchangeRatesOrgProvider$OpenExchangeRates.<init> WARN Expected key, got STRING
   [junit4]   2> 1167484 T2895 oass.OpenExchangeRatesOrgProvider$OpenExchangeRates.<init> WARN Expected key, got STRING
   [junit4]   2> 1167485 T2863 oass.OpenExchangeRatesOrgProvider.reload Reloading exchange rates from open-exchange-rates.json
   [junit4]   2> 1167484 T2923 oass.OpenExchangeRatesOrgProvider$OpenExchangeRates.<init> WARN Expected key, got STRING
   [junit4]   2> 1167484 T2882 oass.OpenExchangeRatesOrgProvider.reload Reloading exchange rates from open-exchange-rates.json
   [junit4]   2> 1167486 T2923 oass.OpenExchangeRatesOrgProvider.reload Reloading exchange rates from open-exchange-rates.json
   [junit4]   2> 1167487 T2863 oass.OpenExchangeRatesOrgProvider$OpenExchangeRates.<init> WARN Unknown key IMPORTANT NOTE
   [junit4]   2> 1167487 T2863 oass.OpenExchangeRatesOrgProvider$OpenExchangeRates.<init> WARN Expected key, got STRING
   [junit4]   2> 1167487 T2882 oass.OpenExchangeRatesOrgProvider$OpenExchangeRates.<init> WARN Unknown key IMPORTANT NOTE
   [junit4]   2> 1167488 T2882 oass.OpenExchangeRatesOrgProvider$OpenExchangeRates.<init> WARN Expected key, got STRING
   [junit4]   2> 1167485 T2895 oass.OpenExchangeRatesOrgProvider.reload Reloading exchange rates from open-exchange-rates.json
   [junit4]   2> 1167488 T2882 oasc.SolrCore.initDirectoryFactory org.apache.solr.core.MockDirectoryFactory
   [junit4]   2> 1167488 T2923 oass.OpenExchangeRatesOrgProvider$OpenExchangeRates.<init> WARN Unknown key IMPORTANT NOTE
   [junit4]   2> 1167489 T2923 oass.OpenExchangeRatesOrgProvider$OpenExchangeRates.<init> WARN Expected key, got STRING
   [junit4]   2> 1167488 T2863 oasc.SolrCore.initDirectoryFactory org.apache.solr.core.MockDirectoryFactory
   [junit4]   2> 1167490 T2923 oasc.SolrCore.initDirectoryFactory org.apache.solr.core.MockDirectoryFactory
   [junit4]   2> 1167489 T2895 oass.OpenExchangeRatesOrgProvider$OpenExchangeRates.<init> WARN Unknown key IMPORTANT NOTE
   [junit4]   2> 1167491 T2895 oass.OpenExchangeRatesOrgProvider$OpenExchangeRates.<init> WARN Expected key, got STRING
   [junit4]   2> 1167489 T2882 oasc.SolrCore.<init> [nodes_used_collection_shard2_replica1] Opening new SolrCore at /usr/home/hudson/hudson-slave/workspace/Lucene-Solr-NightlyTests-trunk/solr/build/solr-core/test/J1/./org.apache.solr.cloud.CollectionsAPIDistributedZkTest-jetty1-1375336758810/nodes_used_collection_shard2_replica1/, dataDir=/usr/home/hudson/hudson-slave/workspace/Lucene-Solr-NightlyTests-trunk/solr/build/solr-core/test/J1/./org.apache.solr.cloud.CollectionsAPIDistributedZkTest-jetty1-1375336758810//nodes_used_collection_shard2_replica1/data/
   [junit4]   2> 1167491 T2895 oasc.SolrCore.initDirectoryFactory org.apache.solr.core.MockDirectoryFactory
   [junit4]   2> 1167490 T2923 oasc.SolrCore.<init> [nodes_used_collection_shard2_replica2] Opening new SolrCore at /usr/home/hudson/hudson-slave/workspace/Lucene-Solr-NightlyTests-trunk/solr/build/solr-core/test/J1/./org.apache.solr.cloud.CollectionsAPIDistributedZkTest-jetty4-1375336763848/nodes_used_collection_shard2_replica2/, dataDir=/usr/home/hudson/hudson-slave/workspace/Lucene-Solr-NightlyTests-trunk/solr/build/solr-core/test/J1/./org.apache.solr.cloud.CollectionsAPIDistributedZkTest-jetty4-1375336763848//nodes_used_collection_shard2_replica2/data/
   [junit4]   2> 1167490 T2863 oasc.SolrCore.<init> [nodes_used_collection_shard1_replica2] Opening new SolrCore at /usr/home/hudson/hudson-slave/workspace/Lucene-Solr-NightlyTests-trunk/solr/build/solr-core/test/J1/./org.apache.solr.cloud.CollectionsAPIDistributedZkTest-controljetty-1375336757778/nodes_used_collection_shard1_replica2/, dataDir=/usr/home/hudson/hudson-slave/workspace/Lucene-Solr-NightlyTests-trunk/solr/build/solr-core/test/J1/./org.apache.solr.cloud.CollectionsAPIDistributedZkTest-controljetty-1375336757778//nodes_used_collection_shard1_replica2/data/
   [junit4]   2> 1167492 T2923 oasc.JmxMonitoredMap.<init> JMX monitoring is enabled. Adding Solr mbeans to JMX Server: com.sun.jmx.mbeanserver.JmxMBeanServer@14445e4c
   [junit4]   2> 1167492 T2895 oasc.SolrCore.<init> [nodes_used_collection_shard1_replica1] Opening new SolrCore at /usr/home/hudson/hudson-slave/workspace/Lucene-Solr-NightlyTests-trunk/solr/build/solr-core/test/J1/./org.apache.solr.cloud.CollectionsAPIDistributedZkTest-jetty2-1375336760493/nodes_used_collection_shard1_replica1/, dataDir=/usr/home/hudson/hudson-slave/workspace/Lucene-Solr-NightlyTests-trunk/solr/build/solr-core/test/J1/./org.apache.solr.cloud.CollectionsAPIDistributedZkTest-jetty2-1375336760493//nodes_used_collection_shard1_replica1/data/
   [junit4]   2> 1167491 T2882 oasc.JmxMonitoredMap.<init> JMX monitoring is enabled. Adding Solr mbeans to JMX Server: com.sun.jmx.mbeanserver.JmxMBeanServer@14445e4c
   [junit4]   2> 1167493 T2895 oasc.JmxMonitoredMap.<init> JMX monitoring is enabled. Adding Solr mbeans to JMX Server: com.sun.jmx.mbeanserver.JmxMBeanServer@14445e4c
   [junit4]   2> 1167492 T2863 oasc.JmxMonitoredMap.<init> JMX monitoring is enabled. Adding Solr mbeans to JMX Server: com.sun.jmx.mbeanserver.JmxMBeanServer@14445e4c
   [junit4]   2> 1167494 T2923 oasc.CachingDirectoryFactory.get return new directory for /usr/home/hudson/hudson-slave/workspace/Lucene-Solr-NightlyTests-trunk/solr/build/solr-core/test/J1/./org.apache.solr.cloud.CollectionsAPIDistributedZkTest-jetty4-1375336763848//nodes_used_collection_shard2_replica2/data
   [junit4]   2> 1167494 T2882 oasc.CachingDirectoryFactory.get return new directory for /usr/home/hudson/hudson-slave/workspace/Lucene-Solr-NightlyTests-trunk/solr/build/solr-core/test/J1/./org.apache.solr.cloud.CollectionsAPIDistributedZkTest-jetty1-1375336758810//nodes_used_collection_shard2_replica1/data
   [junit4]   2> 1167494 T2923 oasc.SolrCore.getNewIndexDir New index directory detected: old=null new=/usr/home/hudson/hudson-slave/workspace/Lucene-Solr-NightlyTests-trunk/solr/build/solr-core/test/J1/./org.apache.solr.cloud.CollectionsAPIDistributedZkTest-jetty4-1375336763848//nodes_used_collection_shard2_replica2/data/index/
   [junit4]   2> 1167495 T2895 oasc.CachingDirectoryFactory.get return new directory for /usr/home/hudson/hudson-slave/workspace/Lucene-Solr-NightlyTests-trunk/solr/build/solr-core/test/J1/./org.apache.solr.cloud.CollectionsAPIDistributedZkTest-jetty2-1375336760493//nodes_used_collection_shard1_replica1/data
   [junit4]   2> 1167495 T2863 oasc.CachingDirectoryFactory.get return new directory for /usr/home/hudson/hudson-slave/workspace/Lucene-Solr-NightlyTests-trunk/solr/build/solr-core/test/J1/./org.apache.solr.cloud.CollectionsAPIDistributedZkTest-controljetty-1375336757778//nodes_used_collection_shard1_replica2/data
   [junit4]   2> 1167495 T2882 oasc.SolrCore.getNewIndexDir New index directory detected: old=null new=/usr/home/hudson/hudson-slave/workspace/Lucene-Solr-NightlyTests-trunk/solr/build/solr-core/test/J1/./org.apache.solr.cloud.CollectionsAPIDistributedZkTest-jetty1-1375336758810//nodes_used_collection_shard2_replica1/data/index/
   [junit4]   2> 1167496 T2863 oasc.SolrCore.getNewIndexDir New index directory detected: old=null new=/usr/home/hudson/hudson-slave/workspace/Lucene-Solr-NightlyTests-trunk/solr/build/solr-core/test/J1/./org.apache.solr.cloud.CollectionsAPIDistributedZkTest-controljetty-1375336757778//nodes_used_collection_shard1_replica2/data/index/
   [junit4]   2> 1167495 T2895 oasc.SolrCore.getNewIndexDir New index directory detected: old=null new=/usr/home/hudson/hudson-slave/workspace/Lucene-Solr-NightlyTests-trunk/solr/build/solr-core/test/J1/./org.apache.solr.cloud.CollectionsAPIDistributedZkTest-jetty2-1375336760493//nodes_used_collection_shard1_replica1/data/index/
   [junit4]   2> 1167495 T2923 oasc.SolrCore.initIndex WARN [nodes_used_collection_shard2_replica2] Solr index directory '/usr/home/hudson/hudson-slave/workspace/Lucene-Solr-NightlyTests-trunk/solr/build/solr-core/test/J1/./org.apache.solr.cloud.CollectionsAPIDistributedZkTest-jetty4-1375336763848/nodes_used_collection_shard2_replica2/data/index' doesn't exist. Creating new index...
   [junit4]   2> 1167497 T2895 oasc.SolrCore.initIndex WARN [nodes_used_collection_shard1_replica1] Solr index directory '/usr/home/hudson/hudson-slave/workspace/Lucene-Solr-NightlyTests-trunk/solr/build/solr-core/test/J1/./org.apache.solr.cloud.CollectionsAPIDistributedZkTest-jetty2-1375336760493/nodes_used_collection_shard1_replica1/data/index' doesn't exist. Creating new index...
   [junit4]   2> 1167496 T2863 oasc.SolrCore.initIndex WARN [nodes_used_collection_shard1_replica2] Solr index directory '/usr/home/hudson/hudson-slave/workspace/Lucene-Solr-NightlyTests-trunk/solr/build/solr-core/test/J1/./org.apache.solr.cloud.CollectionsAPIDistributedZkTest-controljetty-1375336757778/nodes_used_collection_shard1_replica2/data/index' doesn't exist. Creating new index...
   [junit4]   2> 1167496 T2882 oasc.SolrCore.initIndex WARN [nodes_used_collection_shard2_replica1] Solr index directory '/usr/home/hudson/hudson-slave/workspace/Lucene-Solr-NightlyTests-trunk/solr/build/solr-core/test/J1/./org.apache.solr.cloud.CollectionsAPIDistributedZkTest-jetty1-1375336758810/nodes_used_collection_shard2_replica1/data/index' doesn't exist. Creating new index...
   [junit4]   2> 1167498 T2863 oasc.CachingDirectoryFactory.get return new directory for /usr/home/hudson/hudson-slave/workspace/Lucene-Solr-NightlyTests-trunk/solr/build/solr-core/test/J1/./org.apache.solr.cloud.CollectionsAPIDistributedZkTest-controljetty-1375336757778//nodes_used_collection_shard1_replica2/data/index
   [junit4]   2> 1167498 T2895 oasc.CachingDirectoryFactory.get return new directory for /usr/home/hudson/hudson-slave/workspace/Lucene-Solr-NightlyTests-trunk/solr/build/solr-core/test/J1/./org.apache.solr.cloud.CollectionsAPIDistributedZkTest-jetty2-1375336760493//nodes_used_collection_shard1_replica1/data/index
   [junit4]   2> 1167497 T2923 oasc.CachingDirectoryFactory.get return new directory for /usr/home/hudson/hudson-slave/workspace/Lucene-Solr-NightlyTests-trunk/solr/build/solr-core/test/J1/./org.apache.solr.cloud.CollectionsAPIDistributedZkTest-jetty4-1375336763848//nodes_used_collection_shard2_replica2/data/index
   [junit4]   2> 1167499 T2882 oasc.CachingDirectoryFactory.get return new directory for /usr/home/hudson/hudson-slave/workspace/Lucene-Solr-NightlyTests-trunk/solr/build/solr-core/test/J1/./org.apache.solr.cloud.CollectionsAPIDistributedZkTest-jetty1-1375336758810//nodes_used_collection_shard2_replica1/data/index
   [junit4]   2> 1167505 T2863 oasc.SolrDeletionPolicy.onCommit SolrDeletionPolicy.onCommit: commits: num=1
   [junit4]   2> 		commit{dir=MockDirWrapper(org.apache.lucene.store.RAMDirectory@1798beff lockFactory=org.apache.lucene.store.NativeFSLockFactory@5aeaa5a4),segFN=segments_1,generation=1}
   [junit4]   2> 1167506 T2895 oasc.SolrDeletionPolicy.onCommit SolrDeletionPolicy.onCommit: commits: num=1
   [junit4]   2> 		commit{dir=MockDirWrapper(org.apache.lucene.store.RAMDirectory@1e3050ae lockFactory=org.apache.lucene.store.NativeFSLockFactory@105ad9d8),segFN=segments_1,generation=1}
   [junit4]   2> 1167506 T2863 oasc.SolrDeletionPolicy.updateCommits newest commit generation = 1
   [junit4]   2> 1167506 T2882 oasc.SolrDeletionPolicy.onCommit SolrDeletionPolicy.onCommit: commits: num=1
   [junit4]   2> 		commit{dir=MockDirWrapper(org.apache.lucene.store.RAMDirectory@37a9643 lockFactory=org.apache.lucene.store.NativeFSLockFactory@5c645172),segFN=segments_1,generation=1}
   [junit4]   2> 1167506 T2895 oasc.SolrDeletionPolicy.updateCommits newest commit generation = 1
   [junit4]   2> 1167507 T2882 oasc.SolrDeletionPolicy.updateCommits newest commit generation = 1
   [junit4]   2> 1167506 T2923 oasc.SolrDeletionPolicy.onCommit SolrDeletionPolicy.onCommit: commits: num=1
   [junit4]   2> 		commit{dir=MockDirWrapper(org.apache.lucene.store.RAMDirectory@3625c236 lockFactory=org.apache.lucene.store.NativeFSLockFactory@201ec89),segFN=segments_1,generation=1}
   [junit4]   2> 1167508 T2923 oasc.SolrDeletionPolicy.updateCommits newest commit generation = 1
   [junit4]   2> 1167512 T2863 oasup.UpdateRequestProcessorChain.init inserting DistributedUpdateProcessorFactory into updateRequestProcessorChain "dedupe"
   [junit4]   2> 1167512 T2863 oasup.UpdateRequestProcessorChain.init inserting DistributedUpdateProcessorFactory into updateRequestProcessorChain "stored_sig"
   [junit4]   2> 1167513 T2895 oasup.UpdateRequestProcessorChain.init inserting DistributedUpdateProcessorFactory into updateRequestProcessorChain "dedupe"
   [junit4]   2> 1167513 T2863 oasup.UpdateRequestProcessorChain.init inserting DistributedUpdateProcessorFactory into updateRequestProcessorChain "distrib-dup-test-chain-implicit"
   [junit4]   2> 1167513 T2895 oasup.UpdateRequestProcessorChain.init inserting DistributedUpdateProcessorFactory into updateRequestProcessorChain "stored_sig"
   [junit4]   2> 1167513 T2882 oasup.UpdateRequestProcessorChain.init inserting DistributedUpdateProcessorFactory into updateRequestProcessorChain "dedupe"
   [junit4]   2> 1167514 T2863 oasc.RequestHandlers.initHandlersFromConfig created standard: solr.StandardRequestHandler
   [junit4]   2> 1167514 T2923 oasup.UpdateRequestProcessorChain.init inserting DistributedUpdateProcessorFactory into updateRequestProcessorChain "dedupe"
   [junit4]   2> 1167515 T2863 oasc.RequestHandlers.initHandlersFromConfig created /get: solr.RealTimeGetHandler
   [junit4]   2> 1167514 T2882 oasup.UpdateRequestProcessorChain.init inserting DistributedUpdateProcessorFactory into updateRequestProcessorChain "stored_sig"
   [junit4]   2> 1167514 T2895 oasup.UpdateRequestProcessorChain.init inserting DistributedUpdateProcessorFactory into updateRequestProcessorChain "distrib-dup-test-chain-implicit"
   [junit4]   2> 1167515 T2863 oasc.RequestHandlers.initHandlersFromConfig adding lazy requestHandler: solr.ReplicationHandler
   [junit4]   2> 1167515 T2923 oasup.UpdateRequestProcessorChain.init inserting DistributedUpdateProcessorFactory into updateRequestProcessorChain "stored_sig"
   [junit4]   2> 1167516 T2863 oasc.RequestHandlers.initHandlersFromConfig created /replication: solr.ReplicationHandler
   [junit4]   2> 1167516 T2895 oasc.RequestHandlers.initHandlersFromConfig created standard: solr.StandardRequestHandler
   [junit4]   2> 1167516 T2882 oasup.UpdateRequestProcessorChain.init inserting DistributedUpdateProcessorFactory into updateRequestProcessorChain "distrib-dup-test-chain-implicit"
   [junit4]   2> 1167517 T2895 oasc.RequestHandlers.initHandlersFromConfig created /get: solr.RealTimeGetHandler
   [junit4]   2> 1167517 T2863 oasc.RequestHandlers.initHandlersFromConfig created /update: solr.UpdateRequestHandler
   [junit4]   2> 1167517 T2923 oasup.UpdateRequestProcessorChain.init inserting DistributedUpdateProcessorFactory into updateRequestProcessorChain "distrib-dup-test-chain-implicit"
   [junit4]   2> 1167518 T2863 oasc.RequestHandlers.initHandlersFromConfig created /admin/: org.apache.solr.handler.admin.AdminHandlers
   [junit4]   2> 1167518 T2882 oasc.RequestHandlers.initHandlersFromConfig created standard: solr.StandardRequestHandler
   [junit4]   2> 1167518 T2895 oasc.RequestHandlers.initHandlersFromConfig adding lazy requestHandler: solr.ReplicationHandler
   [junit4]   2> 1167519 T2923 oasc.RequestHandlers.initHandlersFromConfig created standard: solr.StandardRequestHandler
   [junit4]   2> 1167519 T2895 oasc.RequestHandlers.initHandlersFromConfig created /replication: solr.ReplicationHandler
   [junit4]   2> 1167519 T2882 oasc.RequestHandlers.initHandlersFromConfig created /get: solr.RealTimeGetHandler
   [junit4]   2> 1167520 T2895 oasc.RequestHandlers.initHandlersFromConfig created /update: solr.UpdateRequestHandler
   [junit4]   2> 1167520 T2923 oasc.RequestHandlers.initHandlersFromConfig created /get: solr.RealTimeGetHandler
   [junit4]   2> 1167521 T2895 oasc.RequestHandlers.initHandlersFromConfig created /admin/: org.apache.solr.handler.admin.AdminHandlers
   [junit4]   2> 1167520 T2882 oasc.RequestHandlers.initHandlersFromConfig adding lazy requestHandler: solr.ReplicationHandler
   [junit4]   2> 1167521 T2923 oasc.RequestHandlers.initHandlersFromConfig adding lazy requestHandler: solr.ReplicationHandler
   [junit4]   2> 1167522 T2882 oasc.RequestHandlers.initHandlersFromConfig created /replication: solr.ReplicationHandler
   [junit4]   2> 1167522 T2923 oasc.RequestHandlers.initHandlersFromConfig created /replication: solr.ReplicationHandler
   [junit4]   2> 1167522 T2882 oasc.RequestHandlers.initHandlersFromConfig created /update: solr.UpdateRequestHandler
   [junit4]   2> 1167523 T2923 oasc.RequestHandlers.initHandlersFromConfig created /update: solr.UpdateRequestHandler
   [junit4]   2> 1167523 T2882 oasc.RequestHandlers.initHandlersFromConfig created /admin/: org.apache.solr.handler.admin.AdminHandlers
   [junit4]   2> 1167523 T2923 oasc.RequestHandlers.initHandlersFromConfig created /admin/: org.apache.solr.handler.admin.AdminHandlers
   [junit4]   2> 1167544 T2895 oashl.XMLLoader.init xsltCacheLifetimeSeconds=60
   [junit4]   2> 1167544 T2863 oashl.XMLLoader.init xsltCacheLifetimeSeconds=60
   [junit4]   2> 1167545 T2923 oashl.XMLLoader.init xsltCacheLifetimeSeconds=60
   [junit4]   2> 1167545 T2882 oashl.XMLLoader.init xsltCacheLifetimeSeconds=60
   [junit4]   2> 1167555 T2895 oass.SolrIndexSearcher.<init> Opening Searcher@55102126 main
   [junit4]   2> 1167555 T2863 oass.SolrIndexSearcher.<init> Opening Searcher@1be84579 main
   [junit4]   2> 1167555 T2923 oass.SolrIndexSearcher.<init> Opening Searcher@5ca6330d main
   [junit4]   2> 1167556 T2882 oass.SolrIndexSearcher.<init> Opening Searcher@cb6ca6e main
   [junit4]   2> 1167557 T2895 oasu.CommitTracker.<init> Hard AutoCommit: disabled
   [junit4]   2> 1167557 T2863 oasu.CommitTracker.<init> Hard AutoCommit: disabled
   [junit4]   2> 1167557 T2923 oasu.CommitTracker.<init> Hard AutoCommit: disabled
   [junit4]   2> 1167557 T2895 oasu.CommitTracker.<init> Soft AutoCommit: disabled
   [junit4]   2> 1167558 T2882 oasu.CommitTracker.<init> Hard AutoCommit: disabled
   [junit4]   2> 1167558 T2923 oasu.CommitTracker.<init> Soft AutoCommit: disabled
   [junit4]   2> 1167558 T2863 oasu.CommitTracker.<init> Soft AutoCommit: disabled
   [junit4]   2> 1167559 T2882 oasu.CommitTracker.<init> Soft AutoCommit: disabled
   [junit4]   2> 1167562 T2939 oasc.SolrCore.registerSearcher [nodes_used_collection_shard1_replica1] Registered new searcher Searcher@55102126 main{StandardDirectoryReader(segments_1:1)}
   [junit4]   2> 1167563 T2940 oasc.SolrCore.registerSearcher [nodes_used_collection_shard2_replica2] Registered new searcher Searcher@5ca6330d main{StandardDirectoryReader(segments_1:1)}
   [junit4]   2> 1167563 T2941 oasc.SolrCore.registerSearcher [nodes_used_collection_shard1_replica2] Registered new searcher Searcher@1be84579 main{StandardDirectoryReader(segments_1:1)}
   [junit4]   2> 1167563 T2942 oasc.SolrCore.registerSearcher [nodes_used_collection_shard2_replica1] Registered new searcher Searcher@cb6ca6e main{StandardDirectoryReader(segments_1:1)}
   [junit4]   2> 1167564 T2895 oasc.CoreContainer.registerCore registering core: nodes_used_collection_shard1_replica1
   [junit4]   2> 1167565 T2895 oasc.ZkController.register Register replica - core:nodes_used_collection_shard1_replica1 address:http://127.0.0.1:24345 collection:nodes_used_collection shard:shard1
   [junit4]   2> 1167565 T2923 oasc.CoreContainer.registerCore registering core: nodes_used_collection_shard2_replica2
   [junit4]   2> 1167565 T2863 oasc.CoreContainer.registerCore registering core: nodes_used_collection_shard1_replica2
   [junit4]   2> 1167565 T2895 oascsi.HttpClientUtil.createClient Creating new http client, config:maxConnections=10000&maxConnectionsPerHost=20&connTimeout=15000&socketTimeout=30000&retry=false
   [junit4]   2> 1167566 T2863 oasc.ZkController.register Register replica - core:nodes_used_collection_shard1_replica2 address:http://127.0.0.1:24338 collection:nodes_used_collection shard:shard1
   [junit4]   2> 1167566 T2882 oasc.CoreContainer.registerCore registering core: nodes_used_collection_shard2_replica1
   [junit4]   2> 1167565 T2923 oasc.ZkController.register Register replica - core:nodes_used_collection_shard2_replica2 address:http://127.0.0.1:59108 collection:nodes_used_collection shard:shard2
   [junit4]   2> 1167567 T2882 oasc.ZkController.register Register replica - core:nodes_used_collection_shard2_replica1 address:http://127.0.0.1:24342 collection:nodes_used_collection shard:shard2
   [junit4]   2> 1167566 T2863 oascsi.HttpClientUtil.createClient Creating new http client, config:maxConnections=10000&maxConnectionsPerHost=20&connTimeout=15000&socketTimeout=30000&retry=false
   [junit4]   2> 1167567 T2882 oascsi.HttpClientUtil.createClient Creating new http client, config:maxConnections=10000&maxConnectionsPerHost=20&connTimeout=15000&socketTimeout=30000&retry=false
   [junit4]   2> 1167567 T2923 oascsi.HttpClientUtil.createClient Creating new http client, config:maxConnections=10000&maxConnectionsPerHost=20&connTimeout=15000&socketTimeout=30000&retry=false
   [junit4]   2> 1167592 T2895 oascc.SolrZkClient.makePath makePath: /collections/nodes_used_collection/leader_elect/shard1/election
   [junit4]   2> 1167593 T2882 oascc.SolrZkClient.makePath makePath: /collections/nodes_used_collection/leader_elect/shard2/election
   [junit4]   2> 1167593 T2863 oascc.SolrZkClient.makePath makePath: /collections/nodes_used_collection/leader_elect/shard1/election
   [junit4]   2> 1167592 T2923 oascc.SolrZkClient.makePath makePath: /collections/nodes_used_collection/leader_elect/shard2/election
   [junit4]   2> 1167623 T2895 oasc.ShardLeaderElectionContext.runLeaderProcess Running the leader process for shard shard1
   [junit4]   2> 1167623 T2923 oasc.ShardLeaderElectionContext.runLeaderProcess Running the leader process for shard shard2
   [junit4]   2> 1167626 T2895 oasc.ShardLeaderElectionContext.waitForReplicasToComeUp Enough replicas found to continue.
   [junit4]   2> 1167627 T2923 oasc.ShardLeaderElectionContext.waitForReplicasToComeUp Enough replicas found to continue.
   [junit4]   2> 1167627 T2895 oasc.ShardLeaderElectionContext.runLeaderProcess I may be the new leader - try and sync
   [junit4]   2> 1167627 T2923 oasc.ShardLeaderElectionContext.runLeaderProcess I may be the new leader - try and sync
   [junit4]   2> 1167627 T2895 oasc.SyncStrategy.sync Sync replicas to http://127.0.0.1:24345/nodes_used_collection_shard1_replica1/
   [junit4]   2> 1167628 T2923 oasc.SyncStrategy.sync Sync replicas to http://127.0.0.1:59108/nodes_used_collection_shard2_replica2/
   [junit4]   2> 1167628 T2895 oasu.PeerSync.sync PeerSync: core=nodes_used_collection_shard1_replica1 url=http://127.0.0.1:24345 START replicas=[http://127.0.0.1:24338/nodes_used_collection_shard1_replica2/] nUpdates=100
   [junit4]   2> 1167628 T2923 oasu.PeerSync.sync PeerSync: core=nodes_used_collection_shard2_replica2 url=http://127.0.0.1:59108 START replicas=[http://127.0.0.1:24342/nodes_used_collection_shard2_replica1/] nUpdates=100
   [junit4]   2> 1167629 T2895 oasu.PeerSync.sync PeerSync: core=nodes_used_collection_shard1_replica1 url=http://127.0.0.1:24345 DONE.  We have no versions.  sync failed.
   [junit4]   2> 1167629 T2923 oasu.PeerSync.sync PeerSync: core=nodes_used_collection_shard2_replica2 url=http://127.0.0.1:59108 DONE.  We have no versions.  sync failed.
   [junit4]   2> 1167631 T2923 oasc.SyncStrategy.syncReplicas Leader's attempt to sync with shard failed, moving to the next candidate
   [junit4]   2> 1167629 T2895 oasc.SyncStrategy.syncReplicas Leader's attempt to sync with shard failed, moving to the next candidate
   [junit4]   2> 1167631 T2923 oasc.ShardLeaderElectionContext.runLeaderProcess We failed sync, but we have no versions - we can't sync in that case - we were active before, so become leader anyway
   [junit4]   2> 1167632 T2895 oasc.ShardLeaderElectionContext.runLeaderProcess We failed sync, but we have no versions - we can't sync in that case - we we

[...truncated too long message...]

ds=0,cumulative_deletesById=0,cumulative_deletesByQuery=0,cumulative_errors=0}
   [junit4]   2> 1307022 T2851 oasu.SolrCoreState.decrefSolrCoreState Closing SolrCoreState
   [junit4]   2> 1307022 T2851 oasu.DefaultSolrCoreState.closeIndexWriter SolrCoreState ref count has reached 0 - closing IndexWriter
   [junit4]   2> 1307022 T2851 oasu.DefaultSolrCoreState.closeIndexWriter closing IndexWriter with IndexWriterCloser
   [junit4]   2> 1307024 T2851 oasc.SolrCore.closeSearcher [new_implicit_coll_1_a_replica1] Closing main searcher on request.
   [junit4]   2> 1307024 T2851 oasc.CachingDirectoryFactory.close Closing MockDirectoryFactory - 2 directories currently being tracked
   [junit4]   2> 1307025 T2851 oasc.CachingDirectoryFactory.closeCacheValue looking to close /usr/home/hudson/hudson-slave/workspace/Lucene-Solr-NightlyTests-trunk/solr/build/solr-core/test/J1/./org.apache.solr.cloud.CollectionsAPIDistributedZkTest-jetty4-1375336763848//new_implicit_coll_1_a_replica1/data [CachedDir<<refCount=0;path=/usr/home/hudson/hudson-slave/workspace/Lucene-Solr-NightlyTests-trunk/solr/build/solr-core/test/J1/./org.apache.solr.cloud.CollectionsAPIDistributedZkTest-jetty4-1375336763848//new_implicit_coll_1_a_replica1/data;done=false>>]
   [junit4]   2> 1307025 T2851 oasc.CachingDirectoryFactory.close Closing directory: /usr/home/hudson/hudson-slave/workspace/Lucene-Solr-NightlyTests-trunk/solr/build/solr-core/test/J1/./org.apache.solr.cloud.CollectionsAPIDistributedZkTest-jetty4-1375336763848//new_implicit_coll_1_a_replica1/data
   [junit4]   2> 1307025 T2851 oasc.CachingDirectoryFactory.closeCacheValue looking to close /usr/home/hudson/hudson-slave/workspace/Lucene-Solr-NightlyTests-trunk/solr/build/solr-core/test/J1/./org.apache.solr.cloud.CollectionsAPIDistributedZkTest-jetty4-1375336763848//new_implicit_coll_1_a_replica1/data/index [CachedDir<<refCount=0;path=/usr/home/hudson/hudson-slave/workspace/Lucene-Solr-NightlyTests-trunk/solr/build/solr-core/test/J1/./org.apache.solr.cloud.CollectionsAPIDistributedZkTest-jetty4-1375336763848//new_implicit_coll_1_a_replica1/data/index;done=false>>]
   [junit4]   2> 1307026 T2851 oasc.CachingDirectoryFactory.close Closing directory: /usr/home/hudson/hudson-slave/workspace/Lucene-Solr-NightlyTests-trunk/solr/build/solr-core/test/J1/./org.apache.solr.cloud.CollectionsAPIDistributedZkTest-jetty4-1375336763848//new_implicit_coll_1_a_replica1/data/index
   [junit4]   2> 1307027 T3414 oasc.Overseer$ClusterStateUpdater.amILeader According to ZK I (id=90134069735653388-127.0.0.1:59108_-n_0000000004) am no longer a leader.
   [junit4]   2> 1307034 T2851 oejsh.ContextHandler.doStop stopped o.e.j.s.ServletContextHandler{/,null}
   [junit4]   2> 1307089 T2851 oas.SolrTestCaseJ4.tearDown ###Ending testDistribSearch
   [junit4]   2> 1307092 T2851 oasc.ZkTestServer.send4LetterWord connecting to 127.0.0.1:24335 24335
   [junit4]   1> client port:0.0.0.0/0.0.0.0:0
   [junit4]   2> NOTE: download the large Jenkins line-docs file by running 'ant get-jenkins-line-docs' in the lucene directory.
   [junit4]   2> NOTE: reproduce with: ant test  -Dtestcase=CollectionsAPIDistributedZkTest -Dtests.method=testDistribSearch -Dtests.seed=C94B1CED4B992327 -Dtests.multiplier=2 -Dtests.nightly=true -Dtests.slow=true -Dtests.linedocsfile=/home/hudson/lucene-data/enwiki.random.lines.txt -Dtests.locale=es_PY -Dtests.timezone=America/St_Thomas -Dtests.file.encoding=US-ASCII
   [junit4] ERROR    152s J1 | CollectionsAPIDistributedZkTest.testDistribSearch <<<
   [junit4]    > Throwable #1: org.apache.solr.client.solrj.SolrServerException: IOException occured when talking to server at: http://127.0.0.1:24342
   [junit4]    > 	at __randomizedtesting.SeedInfo.seed([C94B1CED4B992327:48AD92F53CC6431B]:0)
   [junit4]    > 	at org.apache.solr.client.solrj.impl.HttpSolrServer.request(HttpSolrServer.java:435)
   [junit4]    > 	at org.apache.solr.client.solrj.impl.HttpSolrServer.request(HttpSolrServer.java:180)
   [junit4]    > 	at org.apache.solr.cloud.AbstractFullDistribZkTestBase.createCollection(AbstractFullDistribZkTestBase.java:1535)
   [junit4]    > 	at org.apache.solr.cloud.CollectionsAPIDistributedZkTest.testCustomCollectionsAPI(CollectionsAPIDistributedZkTest.java:677)
   [junit4]    > 	at org.apache.solr.cloud.CollectionsAPIDistributedZkTest.doTest(CollectionsAPIDistributedZkTest.java:159)
   [junit4]    > 	at org.apache.solr.BaseDistributedSearchTestCase.testDistribSearch(BaseDistributedSearchTestCase.java:835)
   [junit4]    > 	at java.lang.Thread.run(Thread.java:724)
   [junit4]    > Caused by: org.apache.http.conn.ConnectTimeoutException: Connect to 127.0.0.1:24342 timed out
   [junit4]    > 	at org.apache.http.conn.scheme.PlainSocketFactory.connectSocket(PlainSocketFactory.java:129)
   [junit4]    > 	at org.apache.http.impl.conn.DefaultClientConnectionOperator.openConnection(DefaultClientConnectionOperator.java:180)
   [junit4]    > 	at org.apache.http.impl.conn.ManagedClientConnectionImpl.open(ManagedClientConnectionImpl.java:294)
   [junit4]    > 	at org.apache.http.impl.client.DefaultRequestDirector.tryConnect(DefaultRequestDirector.java:645)
   [junit4]    > 	at org.apache.http.impl.client.DefaultRequestDirector.execute(DefaultRequestDirector.java:480)
   [junit4]    > 	at org.apache.http.impl.client.AbstractHttpClient.execute(AbstractHttpClient.java:906)
   [junit4]    > 	at org.apache.http.impl.client.AbstractHttpClient.execute(AbstractHttpClient.java:805)
   [junit4]    > 	at org.apache.http.impl.client.AbstractHttpClient.execute(AbstractHttpClient.java:784)
   [junit4]    > 	at org.apache.solr.client.solrj.impl.HttpSolrServer.request(HttpSolrServer.java:365)
   [junit4]    > 	... 45 more
   [junit4]   2> 1307219 T2851 oas.SolrTestCaseJ4.deleteCore ###deleteCore
   [junit4]   2> 151676 T2850 ccr.ThreadLeakControl.checkThreadLeaks WARNING Will linger awaiting termination of 1 leaked thread(s).
   [junit4]   2> 1308334 T2933 oascc.ZkStateReader$3.process WARN ZooKeeper watch triggered, but Solr cannot talk to ZK
   [junit4]   2> 1308334 T2933 oascc.ZkStateReader$2.process A cluster state change: WatchedEvent state:SyncConnected type:NodeChildrenChanged path:/live_nodes, has occurred - updating... (live nodes size: 1)
   [junit4]   2> 1308334 T2933 oascc.ZkStateReader$2.process WARN ZooKeeper watch triggered, but Solr cannot talk to ZK
   [junit4]   2> NOTE: test params are: codec=DummyCompressingStoredFields(storedFieldsFormat=CompressingStoredFieldsFormat(compressionMode=DUMMY, chunkSize=469), termVectorsFormat=CompressingTermVectorsFormat(compressionMode=DUMMY, chunkSize=469)), sim=DefaultSimilarity, locale=es_PY, timezone=America/St_Thomas
   [junit4]   2> NOTE: FreeBSD 9.1-RELEASE-p3 amd64/Oracle Corporation 1.7.0_25 (64-bit)/cpus=16,threads=5,free=202118088,total=413728768
   [junit4]   2> NOTE: All tests run in this JVM: [TestCSVResponseWriter, TestPropInject, TestWordDelimiterFilterFactory, TestQuerySenderNoQuery, TestAtomicUpdateErrorCases, URLClassifyProcessorTest, TestUtils, DefaultValueUpdateProcessorTest, TestInfoStreamLogging, ShardRoutingCustomTest, TestReload, TestMultiCoreConfBootstrap, ZkSolrClientTest, TestSchemaResource, TestLMJelinekMercerSimilarityFactory, TestRangeQuery, HighlighterTest, CoreAdminCreateDiscoverTest, SolrIndexConfigTest, TestArbitraryIndexDir, TestSolrJ, TestAnalyzedSuggestions, BadIndexSchemaTest, SpellPossibilityIteratorTest, TestMergePolicyConfig, TestJmxMonitoredMap, HighlighterConfigTest, JSONWriterTest, TestCloudManagedSchema, TestRandomMergePolicy, DateMathParserTest, EchoParamsTest, TestRecovery, QueryResultKeyTest, TestDistributedGrouping, TestPartialUpdateDeduplication, TestCoreDiscovery, OpenExchangeRatesOrgProviderTest, ClusterStateTest, HdfsCollectionsAPIDistributedZkTest, TestIndexingPerformance, TestDefaultSimilarityFactory, TestManagedSchemaFieldResource, FieldAnalysisRequestHandlerTest, TestReloadAndDeleteDocs, TestJmxIntegration, DeleteShardTest, UpdateParamsTest, NoCacheHeaderTest, HardAutoCommitTest, IndexSchemaRuntimeFieldTest, DebugComponentTest, TestRandomFaceting, IndexBasedSpellCheckerTest, TestRecoveryHdfs, CurrencyFieldOpenExchangeTest, BasicZkTest, DirectUpdateHandlerTest, HdfsLockFactoryTest, OutputWriterTest, DirectSolrSpellCheckerTest, DistanceFunctionTest, TestQueryTypes, PathHierarchyTokenizerFactoryTest, CurrencyFieldXmlFileTest, RequiredFieldsTest, TestFastOutputStream, TestSolr4Spatial, SuggesterWFSTTest, SolrCmdDistributorTest, XsltUpdateRequestHandlerTest, UniqFieldsUpdateProcessorFactoryTest, ChaosMonkeySafeLeaderTest, BasicDistributedZk2Test, CollectionsAPIDistributedZkTest]
   [junit4] Completed on J1 in 152.97s, 1 test, 1 error <<< FAILURES!

[...truncated 598 lines...]
BUILD FAILED
/usr/home/hudson/hudson-slave/workspace/Lucene-Solr-NightlyTests-trunk/build.xml:396: The following error occurred while executing this line:
/usr/home/hudson/hudson-slave/workspace/Lucene-Solr-NightlyTests-trunk/build.xml:369: The following error occurred while executing this line:
/usr/home/hudson/hudson-slave/workspace/Lucene-Solr-NightlyTests-trunk/build.xml:39: The following error occurred while executing this line:
/usr/home/hudson/hudson-slave/workspace/Lucene-Solr-NightlyTests-trunk/solr/build.xml:181: The following error occurred while executing this line:
/usr/home/hudson/hudson-slave/workspace/Lucene-Solr-NightlyTests-trunk/solr/common-build.xml:449: The following error occurred while executing this line:
/usr/home/hudson/hudson-slave/workspace/Lucene-Solr-NightlyTests-trunk/lucene/common-build.xml:1230: The following error occurred while executing this line:
/usr/home/hudson/hudson-slave/workspace/Lucene-Solr-NightlyTests-trunk/lucene/common-build.xml:873: There were test failures: 320 suites, 1345 tests, 1 error, 32 ignored (4 assumptions)

Total time: 116 minutes 45 seconds
Build step 'Invoke Ant' marked build as failure
Archiving artifacts
Recording test results
Email was triggered for: Failure
Sending email for trigger: Failure



Mime
View raw message