lucene-dev mailing list archives

Site index · List index
Message view « Date » · « Thread »
Top « Date » · « Thread »
From Apache Jenkins Server <jenk...@builds.apache.org>
Subject [JENKINS] Lucene-Solr-NightlyTests-trunk - Build # 339 - Still Failing
Date Sat, 03 Aug 2013 05:48:22 GMT
Build: https://builds.apache.org/job/Lucene-Solr-NightlyTests-trunk/339/

1 tests failed.
FAILED:  org.apache.solr.cloud.CollectionsAPIDistributedZkTest.testDistribSearch

Error Message:
IOException occured when talking to server at: http://127.0.0.1:14388/bx

Stack Trace:
org.apache.solr.client.solrj.SolrServerException: IOException occured when talking to server at: http://127.0.0.1:14388/bx
	at __randomizedtesting.SeedInfo.seed([DC3786E2E67445B7:5DD108FA912B258B]:0)
	at org.apache.solr.client.solrj.impl.HttpSolrServer.request(HttpSolrServer.java:435)
	at org.apache.solr.client.solrj.impl.HttpSolrServer.request(HttpSolrServer.java:180)
	at org.apache.solr.cloud.CollectionsAPIDistributedZkTest.testCustomCollectionsAPI(CollectionsAPIDistributedZkTest.java:764)
	at org.apache.solr.cloud.CollectionsAPIDistributedZkTest.doTest(CollectionsAPIDistributedZkTest.java:159)
	at org.apache.solr.BaseDistributedSearchTestCase.testDistribSearch(BaseDistributedSearchTestCase.java:835)
	at sun.reflect.NativeMethodAccessorImpl.invoke0(Native Method)
	at sun.reflect.NativeMethodAccessorImpl.invoke(NativeMethodAccessorImpl.java:57)
	at sun.reflect.DelegatingMethodAccessorImpl.invoke(DelegatingMethodAccessorImpl.java:43)
	at java.lang.reflect.Method.invoke(Method.java:606)
	at com.carrotsearch.randomizedtesting.RandomizedRunner.invoke(RandomizedRunner.java:1559)
	at com.carrotsearch.randomizedtesting.RandomizedRunner.access$600(RandomizedRunner.java:79)
	at com.carrotsearch.randomizedtesting.RandomizedRunner$6.evaluate(RandomizedRunner.java:737)
	at com.carrotsearch.randomizedtesting.RandomizedRunner$7.evaluate(RandomizedRunner.java:773)
	at com.carrotsearch.randomizedtesting.RandomizedRunner$8.evaluate(RandomizedRunner.java:787)
	at com.carrotsearch.randomizedtesting.rules.SystemPropertiesRestoreRule$1.evaluate(SystemPropertiesRestoreRule.java:53)
	at org.apache.lucene.util.TestRuleSetupTeardownChained$1.evaluate(TestRuleSetupTeardownChained.java:50)
	at org.apache.lucene.util.TestRuleFieldCacheSanity$1.evaluate(TestRuleFieldCacheSanity.java:51)
	at org.apache.lucene.util.AbstractBeforeAfterRule$1.evaluate(AbstractBeforeAfterRule.java:46)
	at com.carrotsearch.randomizedtesting.rules.SystemPropertiesInvariantRule$1.evaluate(SystemPropertiesInvariantRule.java:55)
	at org.apache.lucene.util.TestRuleThreadAndTestName$1.evaluate(TestRuleThreadAndTestName.java:49)
	at org.apache.lucene.util.TestRuleIgnoreAfterMaxFailures$1.evaluate(TestRuleIgnoreAfterMaxFailures.java:70)
	at org.apache.lucene.util.TestRuleMarkFailure$1.evaluate(TestRuleMarkFailure.java:48)
	at com.carrotsearch.randomizedtesting.rules.StatementAdapter.evaluate(StatementAdapter.java:36)
	at com.carrotsearch.randomizedtesting.ThreadLeakControl$StatementRunner.run(ThreadLeakControl.java:358)
	at com.carrotsearch.randomizedtesting.ThreadLeakControl.forkTimeoutingTask(ThreadLeakControl.java:782)
	at com.carrotsearch.randomizedtesting.ThreadLeakControl$3.evaluate(ThreadLeakControl.java:442)
	at com.carrotsearch.randomizedtesting.RandomizedRunner.runSingleTest(RandomizedRunner.java:746)
	at com.carrotsearch.randomizedtesting.RandomizedRunner$3.evaluate(RandomizedRunner.java:648)
	at com.carrotsearch.randomizedtesting.RandomizedRunner$4.evaluate(RandomizedRunner.java:682)
	at com.carrotsearch.randomizedtesting.RandomizedRunner$5.evaluate(RandomizedRunner.java:693)
	at com.carrotsearch.randomizedtesting.rules.StatementAdapter.evaluate(StatementAdapter.java:36)
	at com.carrotsearch.randomizedtesting.rules.SystemPropertiesRestoreRule$1.evaluate(SystemPropertiesRestoreRule.java:53)
	at org.apache.lucene.util.AbstractBeforeAfterRule$1.evaluate(AbstractBeforeAfterRule.java:46)
	at org.apache.lucene.util.TestRuleStoreClassName$1.evaluate(TestRuleStoreClassName.java:42)
	at com.carrotsearch.randomizedtesting.rules.SystemPropertiesInvariantRule$1.evaluate(SystemPropertiesInvariantRule.java:55)
	at com.carrotsearch.randomizedtesting.rules.NoShadowingOrOverridesOnMethodsRule$1.evaluate(NoShadowingOrOverridesOnMethodsRule.java:39)
	at com.carrotsearch.randomizedtesting.rules.NoShadowingOrOverridesOnMethodsRule$1.evaluate(NoShadowingOrOverridesOnMethodsRule.java:39)
	at com.carrotsearch.randomizedtesting.rules.StatementAdapter.evaluate(StatementAdapter.java:36)
	at org.apache.lucene.util.TestRuleAssertionsRequired$1.evaluate(TestRuleAssertionsRequired.java:43)
	at org.apache.lucene.util.TestRuleMarkFailure$1.evaluate(TestRuleMarkFailure.java:48)
	at org.apache.lucene.util.TestRuleIgnoreAfterMaxFailures$1.evaluate(TestRuleIgnoreAfterMaxFailures.java:70)
	at org.apache.lucene.util.TestRuleIgnoreTestSuites$1.evaluate(TestRuleIgnoreTestSuites.java:55)
	at com.carrotsearch.randomizedtesting.rules.StatementAdapter.evaluate(StatementAdapter.java:36)
	at com.carrotsearch.randomizedtesting.ThreadLeakControl$StatementRunner.run(ThreadLeakControl.java:358)
	at java.lang.Thread.run(Thread.java:724)
Caused by: org.apache.http.conn.ConnectTimeoutException: Connect to 127.0.0.1:14388 timed out
	at org.apache.http.conn.scheme.PlainSocketFactory.connectSocket(PlainSocketFactory.java:129)
	at org.apache.http.impl.conn.DefaultClientConnectionOperator.openConnection(DefaultClientConnectionOperator.java:180)
	at org.apache.http.impl.conn.ManagedClientConnectionImpl.open(ManagedClientConnectionImpl.java:294)
	at org.apache.http.impl.client.DefaultRequestDirector.tryConnect(DefaultRequestDirector.java:645)
	at org.apache.http.impl.client.DefaultRequestDirector.execute(DefaultRequestDirector.java:480)
	at org.apache.http.impl.client.AbstractHttpClient.execute(AbstractHttpClient.java:906)
	at org.apache.http.impl.client.AbstractHttpClient.execute(AbstractHttpClient.java:805)
	at org.apache.http.impl.client.AbstractHttpClient.execute(AbstractHttpClient.java:784)
	at org.apache.solr.client.solrj.impl.HttpSolrServer.request(HttpSolrServer.java:365)
	... 44 more




Build Log:
[...truncated 9722 lines...]
   [junit4] Suite: org.apache.solr.cloud.CollectionsAPIDistributedZkTest
   [junit4]   2> 1350279 T2665 oas.BaseDistributedSearchTestCase.initHostContext Setting hostContext system property: /bx/
   [junit4]   2> 1350285 T2665 oas.SolrTestCaseJ4.setUp ###Starting testDistribSearch
   [junit4]   2> Creating dataDir: /usr/home/hudson/hudson-slave/workspace/Lucene-Solr-NightlyTests-trunk/solr/build/solr-core/test/J0/./solrtest-CollectionsAPIDistributedZkTest-1375507419992
   [junit4]   2> 1350286 T2665 oasc.ZkTestServer.run STARTING ZK TEST SERVER
   [junit4]   2> 1350287 T2666 oasc.ZkTestServer$ZKServerMain.runFromConfig Starting server
   [junit4]   2> 1350388 T2665 oasc.ZkTestServer.run start zk server on port:14380
   [junit4]   2> 1350389 T2665 oascc.ConnectionManager.waitForConnected Waiting for client to connect to ZooKeeper
   [junit4]   2> 1350404 T2672 oascc.ConnectionManager.process Watcher org.apache.solr.common.cloud.ConnectionManager@427e8e81 name:ZooKeeperConnection Watcher:127.0.0.1:14380 got event WatchedEvent state:SyncConnected type:None path:null path:null type:None
   [junit4]   2> 1350404 T2665 oascc.ConnectionManager.waitForConnected Client is connected to ZooKeeper
   [junit4]   2> 1350404 T2665 oascc.SolrZkClient.makePath makePath: /solr
   [junit4]   2> 1350410 T2665 oascc.ConnectionManager.waitForConnected Waiting for client to connect to ZooKeeper
   [junit4]   2> 1350419 T2674 oascc.ConnectionManager.process Watcher org.apache.solr.common.cloud.ConnectionManager@1c5aaa58 name:ZooKeeperConnection Watcher:127.0.0.1:14380/solr got event WatchedEvent state:SyncConnected type:None path:null path:null type:None
   [junit4]   2> 1350420 T2665 oascc.ConnectionManager.waitForConnected Client is connected to ZooKeeper
   [junit4]   2> 1350420 T2665 oascc.SolrZkClient.makePath makePath: /collections/collection1
   [junit4]   2> 1350425 T2665 oascc.SolrZkClient.makePath makePath: /collections/collection1/shards
   [junit4]   2> 1350428 T2665 oascc.SolrZkClient.makePath makePath: /collections/control_collection
   [junit4]   2> 1350431 T2665 oascc.SolrZkClient.makePath makePath: /collections/control_collection/shards
   [junit4]   2> 1350438 T2665 oasc.AbstractZkTestCase.putConfig put /usr/home/hudson/hudson-slave/workspace/Lucene-Solr-NightlyTests-trunk/solr/build/solr-core/test-files/solr/collection1/conf/solrconfig-tlog.xml to /configs/conf1/solrconfig.xml
   [junit4]   2> 1350439 T2665 oascc.SolrZkClient.makePath makePath: /configs/conf1/solrconfig.xml
   [junit4]   2> 1350453 T2665 oasc.AbstractZkTestCase.putConfig put /usr/home/hudson/hudson-slave/workspace/Lucene-Solr-NightlyTests-trunk/solr/build/solr-core/test-files/solr/collection1/conf/schema.xml to /configs/conf1/schema.xml
   [junit4]   2> 1350454 T2665 oascc.SolrZkClient.makePath makePath: /configs/conf1/schema.xml
   [junit4]   2> 1350558 T2665 oasc.AbstractZkTestCase.putConfig put /usr/home/hudson/hudson-slave/workspace/Lucene-Solr-NightlyTests-trunk/solr/build/solr-core/test-files/solr/collection1/conf/stopwords.txt to /configs/conf1/stopwords.txt
   [junit4]   2> 1350559 T2665 oascc.SolrZkClient.makePath makePath: /configs/conf1/stopwords.txt
   [junit4]   2> 1350562 T2665 oasc.AbstractZkTestCase.putConfig put /usr/home/hudson/hudson-slave/workspace/Lucene-Solr-NightlyTests-trunk/solr/build/solr-core/test-files/solr/collection1/conf/protwords.txt to /configs/conf1/protwords.txt
   [junit4]   2> 1350562 T2665 oascc.SolrZkClient.makePath makePath: /configs/conf1/protwords.txt
   [junit4]   2> 1350566 T2665 oasc.AbstractZkTestCase.putConfig put /usr/home/hudson/hudson-slave/workspace/Lucene-Solr-NightlyTests-trunk/solr/build/solr-core/test-files/solr/collection1/conf/currency.xml to /configs/conf1/currency.xml
   [junit4]   2> 1350566 T2665 oascc.SolrZkClient.makePath makePath: /configs/conf1/currency.xml
   [junit4]   2> 1350577 T2665 oasc.AbstractZkTestCase.putConfig put /usr/home/hudson/hudson-slave/workspace/Lucene-Solr-NightlyTests-trunk/solr/build/solr-core/test-files/solr/collection1/conf/open-exchange-rates.json to /configs/conf1/open-exchange-rates.json
   [junit4]   2> 1350577 T2665 oascc.SolrZkClient.makePath makePath: /configs/conf1/open-exchange-rates.json
   [junit4]   2> 1350581 T2665 oasc.AbstractZkTestCase.putConfig put /usr/home/hudson/hudson-slave/workspace/Lucene-Solr-NightlyTests-trunk/solr/build/solr-core/test-files/solr/collection1/conf/mapping-ISOLatin1Accent.txt to /configs/conf1/mapping-ISOLatin1Accent.txt
   [junit4]   2> 1350581 T2665 oascc.SolrZkClient.makePath makePath: /configs/conf1/mapping-ISOLatin1Accent.txt
   [junit4]   2> 1350584 T2665 oasc.AbstractZkTestCase.putConfig put /usr/home/hudson/hudson-slave/workspace/Lucene-Solr-NightlyTests-trunk/solr/build/solr-core/test-files/solr/collection1/conf/old_synonyms.txt to /configs/conf1/old_synonyms.txt
   [junit4]   2> 1350585 T2665 oascc.SolrZkClient.makePath makePath: /configs/conf1/old_synonyms.txt
   [junit4]   2> 1350588 T2665 oasc.AbstractZkTestCase.putConfig put /usr/home/hudson/hudson-slave/workspace/Lucene-Solr-NightlyTests-trunk/solr/build/solr-core/test-files/solr/collection1/conf/synonyms.txt to /configs/conf1/synonyms.txt
   [junit4]   2> 1350588 T2665 oascc.SolrZkClient.makePath makePath: /configs/conf1/synonyms.txt
   [junit4]   2> 1350889 T2665 oejs.Server.doStart jetty-8.1.10.v20130312
   [junit4]   2> 1350893 T2665 oejs.AbstractConnector.doStart Started SocketConnector@127.0.0.1:14384
   [junit4]   2> 1350894 T2665 oass.SolrDispatchFilter.init SolrDispatchFilter.init()
   [junit4]   2> 1350894 T2665 oasc.SolrResourceLoader.locateSolrHome JNDI not configured for solr (NoInitialContextEx)
   [junit4]   2> 1350895 T2665 oasc.SolrResourceLoader.locateSolrHome using system property solr.solr.home: /usr/home/hudson/hudson-slave/workspace/Lucene-Solr-NightlyTests-trunk/solr/build/solr-core/test/J0/./org.apache.solr.cloud.CollectionsAPIDistributedZkTest-controljetty-1375507420305
   [junit4]   2> 1350895 T2665 oasc.SolrResourceLoader.<init> new SolrResourceLoader for directory: '/usr/home/hudson/hudson-slave/workspace/Lucene-Solr-NightlyTests-trunk/solr/build/solr-core/test/J0/./org.apache.solr.cloud.CollectionsAPIDistributedZkTest-controljetty-1375507420305/'
   [junit4]   2> 1350939 T2665 oasc.ConfigSolr.fromFile Loading container configuration from /usr/home/hudson/hudson-slave/workspace/Lucene-Solr-NightlyTests-trunk/solr/build/solr-core/test/J0/./org.apache.solr.cloud.CollectionsAPIDistributedZkTest-controljetty-1375507420305/solr.xml
   [junit4]   2> 1351042 T2665 oasc.ConfigSolrXml.<init> Config-defined core root directory: 
   [junit4]   2> 1351043 T2665 oasc.CoreContainer.<init> New CoreContainer 880880208
   [junit4]   2> 1351043 T2665 oasc.CoreContainer.load Loading cores into CoreContainer [instanceDir=/usr/home/hudson/hudson-slave/workspace/Lucene-Solr-NightlyTests-trunk/solr/build/solr-core/test/J0/./org.apache.solr.cloud.CollectionsAPIDistributedZkTest-controljetty-1375507420305/]
   [junit4]   2> 1351045 T2665 oashc.HttpShardHandlerFactory.getParameter Setting socketTimeout to: 120000
   [junit4]   2> 1351046 T2665 oashc.HttpShardHandlerFactory.getParameter Setting urlScheme to: http://
   [junit4]   2> 1351046 T2665 oashc.HttpShardHandlerFactory.getParameter Setting connTimeout to: 15000
   [junit4]   2> 1351046 T2665 oashc.HttpShardHandlerFactory.getParameter Setting maxConnectionsPerHost to: 20
   [junit4]   2> 1351047 T2665 oashc.HttpShardHandlerFactory.getParameter Setting corePoolSize to: 0
   [junit4]   2> 1351047 T2665 oashc.HttpShardHandlerFactory.getParameter Setting maximumPoolSize to: 2147483647
   [junit4]   2> 1351047 T2665 oashc.HttpShardHandlerFactory.getParameter Setting maxThreadIdleTime to: 5
   [junit4]   2> 1351048 T2665 oashc.HttpShardHandlerFactory.getParameter Setting sizeOfQueue to: -1
   [junit4]   2> 1351048 T2665 oashc.HttpShardHandlerFactory.getParameter Setting fairnessPolicy to: false
   [junit4]   2> 1351049 T2665 oascsi.HttpClientUtil.createClient Creating new http client, config:maxConnectionsPerHost=20&maxConnections=10000&socketTimeout=120000&connTimeout=15000&retry=false
   [junit4]   2> 1351064 T2665 oasc.ZkContainer.initZooKeeper Zookeeper client=127.0.0.1:14380/solr
   [junit4]   2> 1351065 T2665 oasc.ZkController.checkChrootPath zkHost includes chroot
   [junit4]   2> 1351066 T2665 oascc.ConnectionManager.waitForConnected Waiting for client to connect to ZooKeeper
   [junit4]   2> 1351068 T2685 oascc.ConnectionManager.process Watcher org.apache.solr.common.cloud.ConnectionManager@30c6d51d name:ZooKeeperConnection Watcher:127.0.0.1:14380 got event WatchedEvent state:SyncConnected type:None path:null path:null type:None
   [junit4]   2> 1351069 T2665 oascc.ConnectionManager.waitForConnected Client is connected to ZooKeeper
   [junit4]   2> 1351071 T2665 oascsi.HttpClientUtil.createClient Creating new http client, config:maxConnections=500&maxConnectionsPerHost=16&socketTimeout=120000&connTimeout=15000
   [junit4]   2> 1351081 T2665 oascc.ConnectionManager.waitForConnected Waiting for client to connect to ZooKeeper
   [junit4]   2> 1351083 T2687 oascc.ConnectionManager.process Watcher org.apache.solr.common.cloud.ConnectionManager@3dc9b5e0 name:ZooKeeperConnection Watcher:127.0.0.1:14380/solr got event WatchedEvent state:SyncConnected type:None path:null path:null type:None
   [junit4]   2> 1351084 T2665 oascc.ConnectionManager.waitForConnected Client is connected to ZooKeeper
   [junit4]   2> 1351086 T2665 oascc.SolrZkClient.makePath makePath: /overseer/queue
   [junit4]   2> 1351098 T2665 oascc.SolrZkClient.makePath makePath: /overseer/collection-queue-work
   [junit4]   2> 1351101 T2665 oascc.SolrZkClient.makePath makePath: /live_nodes
   [junit4]   2> 1351103 T2665 oasc.ZkController.createEphemeralLiveNode Register node as live in ZooKeeper:/live_nodes/127.0.0.1:14384_bx
   [junit4]   2> 1351111 T2665 oascc.SolrZkClient.makePath makePath: /live_nodes/127.0.0.1:14384_bx
   [junit4]   2> 1351114 T2665 oascc.SolrZkClient.makePath makePath: /overseer_elect/election
   [junit4]   2> 1351128 T2665 oascc.SolrZkClient.makePath makePath: /overseer_elect/leader
   [junit4]   2> 1351132 T2665 oasc.Overseer.start Overseer (id=90145254277054467-127.0.0.1:14384_bx-n_0000000000) starting
   [junit4]   2> 1351142 T2665 oascc.SolrZkClient.makePath makePath: /overseer/queue-work
   [junit4]   2> 1351153 T2689 oasc.OverseerCollectionProcessor.run Process current queue of collection creations
   [junit4]   2> 1351154 T2665 oascc.SolrZkClient.makePath makePath: /clusterstate.json
   [junit4]   2> 1351156 T2665 oascc.SolrZkClient.makePath makePath: /aliases.json
   [junit4]   2> 1351158 T2665 oascc.ZkStateReader.createClusterStateWatchersAndUpdate Updating cluster state from ZooKeeper... 
   [junit4]   2> 1351160 T2688 oasc.Overseer$ClusterStateUpdater.run Starting to work on the main queue
   [junit4]   2> 1351164 T2665 oasc.CorePropertiesLocator.discover Looking for core definitions underneath /usr/home/hudson/hudson-slave/workspace/Lucene-Solr-NightlyTests-trunk/solr/build/solr-core/test/J0/./org.apache.solr.cloud.CollectionsAPIDistributedZkTest-controljetty-1375507420305
   [junit4]   2> 1351361 T2665 oasc.CorePropertiesLocator.discoverUnder Found core conf in /usr/home/hudson/hudson-slave/workspace/Lucene-Solr-NightlyTests-trunk/solr/build/solr-core/test/J0/./org.apache.solr.cloud.CollectionsAPIDistributedZkTest-controljetty-1375507420305/conf/
   [junit4]   2> 1351368 T2665 oasc.CorePropertiesLocator.discover Found 1 core definitions
   [junit4]   2> 1351369 T2665 oass.SolrDispatchFilter.init user.dir=/usr/home/hudson/hudson-slave/workspace/Lucene-Solr-NightlyTests-trunk/solr/build/solr-core/test/J0
   [junit4]   2> 1351369 T2665 oass.SolrDispatchFilter.init SolrDispatchFilter.init() done
   [junit4]   2> 1351370 T2665 oascsi.HttpClientUtil.createClient Creating new http client, config:maxConnections=128&maxConnectionsPerHost=32&followRedirects=false
   [junit4]   2> 1351386 T2665 oascsi.HttpClientUtil.createClient Creating new http client, config:
   [junit4]   2> 1351387 T2665 oascc.ConnectionManager.waitForConnected Waiting for client to connect to ZooKeeper
   [junit4]   2> 1351390 T2692 oascc.ConnectionManager.process Watcher org.apache.solr.common.cloud.ConnectionManager@7744b140 name:ZooKeeperConnection Watcher:127.0.0.1:14380/solr got event WatchedEvent state:SyncConnected type:None path:null path:null type:None
   [junit4]   2> 1351390 T2665 oascc.ConnectionManager.waitForConnected Client is connected to ZooKeeper
   [junit4]   2> 1351393 T2665 oascc.ZkStateReader.createClusterStateWatchersAndUpdate Updating cluster state from ZooKeeper... 
   [junit4]   2> 1351395 T2665 oasc.ChaosMonkey.monkeyLog monkey: init - expire sessions:true cause connection loss:true
   [junit4]   2> 1351791 T2665 oejs.Server.doStart jetty-8.1.10.v20130312
   [junit4]   2> 1351794 T2665 oejs.AbstractConnector.doStart Started SocketConnector@127.0.0.1:14388
   [junit4]   2> 1351794 T2665 oass.SolrDispatchFilter.init SolrDispatchFilter.init()
   [junit4]   2> 1351795 T2665 oasc.SolrResourceLoader.locateSolrHome JNDI not configured for solr (NoInitialContextEx)
   [junit4]   2> 1351795 T2665 oasc.SolrResourceLoader.locateSolrHome using system property solr.solr.home: /usr/home/hudson/hudson-slave/workspace/Lucene-Solr-NightlyTests-trunk/solr/build/solr-core/test/J0/./org.apache.solr.cloud.CollectionsAPIDistributedZkTest-jetty1-1375507421101
   [junit4]   2> 1351795 T2665 oasc.SolrResourceLoader.<init> new SolrResourceLoader for directory: '/usr/home/hudson/hudson-slave/workspace/Lucene-Solr-NightlyTests-trunk/solr/build/solr-core/test/J0/./org.apache.solr.cloud.CollectionsAPIDistributedZkTest-jetty1-1375507421101/'
   [junit4]   2> 1351831 T2665 oasc.ConfigSolr.fromFile Loading container configuration from /usr/home/hudson/hudson-slave/workspace/Lucene-Solr-NightlyTests-trunk/solr/build/solr-core/test/J0/./org.apache.solr.cloud.CollectionsAPIDistributedZkTest-jetty1-1375507421101/solr.xml
   [junit4]   2> 1351925 T2665 oasc.ConfigSolrXml.<init> Config-defined core root directory: 
   [junit4]   2> 1351926 T2665 oasc.CoreContainer.<init> New CoreContainer 40796913
   [junit4]   2> 1351927 T2665 oasc.CoreContainer.load Loading cores into CoreContainer [instanceDir=/usr/home/hudson/hudson-slave/workspace/Lucene-Solr-NightlyTests-trunk/solr/build/solr-core/test/J0/./org.apache.solr.cloud.CollectionsAPIDistributedZkTest-jetty1-1375507421101/]
   [junit4]   2> 1351928 T2665 oashc.HttpShardHandlerFactory.getParameter Setting socketTimeout to: 120000
   [junit4]   2> 1351929 T2665 oashc.HttpShardHandlerFactory.getParameter Setting urlScheme to: http://
   [junit4]   2> 1351929 T2665 oashc.HttpShardHandlerFactory.getParameter Setting connTimeout to: 15000
   [junit4]   2> 1351929 T2665 oashc.HttpShardHandlerFactory.getParameter Setting maxConnectionsPerHost to: 20
   [junit4]   2> 1351930 T2665 oashc.HttpShardHandlerFactory.getParameter Setting corePoolSize to: 0
   [junit4]   2> 1351930 T2665 oashc.HttpShardHandlerFactory.getParameter Setting maximumPoolSize to: 2147483647
   [junit4]   2> 1351931 T2665 oashc.HttpShardHandlerFactory.getParameter Setting maxThreadIdleTime to: 5
   [junit4]   2> 1351931 T2665 oashc.HttpShardHandlerFactory.getParameter Setting sizeOfQueue to: -1
   [junit4]   2> 1351931 T2665 oashc.HttpShardHandlerFactory.getParameter Setting fairnessPolicy to: false
   [junit4]   2> 1351932 T2665 oascsi.HttpClientUtil.createClient Creating new http client, config:maxConnectionsPerHost=20&maxConnections=10000&socketTimeout=120000&connTimeout=15000&retry=false
   [junit4]   2> 1351950 T2665 oasc.ZkContainer.initZooKeeper Zookeeper client=127.0.0.1:14380/solr
   [junit4]   2> 1351950 T2665 oasc.ZkController.checkChrootPath zkHost includes chroot
   [junit4]   2> 1351952 T2665 oascc.ConnectionManager.waitForConnected Waiting for client to connect to ZooKeeper
   [junit4]   2> 1351955 T2703 oascc.ConnectionManager.process Watcher org.apache.solr.common.cloud.ConnectionManager@43c74b5f name:ZooKeeperConnection Watcher:127.0.0.1:14380 got event WatchedEvent state:SyncConnected type:None path:null path:null type:None
   [junit4]   2> 1351955 T2665 oascc.ConnectionManager.waitForConnected Client is connected to ZooKeeper
   [junit4]   2> 1351988 T2665 oascsi.HttpClientUtil.createClient Creating new http client, config:maxConnections=500&maxConnectionsPerHost=16&socketTimeout=120000&connTimeout=15000
   [junit4]   2> 1351998 T2665 oascc.ConnectionManager.waitForConnected Waiting for client to connect to ZooKeeper
   [junit4]   2> 1352001 T2705 oascc.ConnectionManager.process Watcher org.apache.solr.common.cloud.ConnectionManager@41f38fe name:ZooKeeperConnection Watcher:127.0.0.1:14380/solr got event WatchedEvent state:SyncConnected type:None path:null path:null type:None
   [junit4]   2> 1352001 T2665 oascc.ConnectionManager.waitForConnected Client is connected to ZooKeeper
   [junit4]   2> 1352072 T2665 oascc.ZkStateReader.createClusterStateWatchersAndUpdate Updating cluster state from ZooKeeper... 
   [junit4]   2> 1353076 T2665 oasc.ZkController.createEphemeralLiveNode Register node as live in ZooKeeper:/live_nodes/127.0.0.1:14388_bx
   [junit4]   2> 1353078 T2665 oascc.SolrZkClient.makePath makePath: /live_nodes/127.0.0.1:14388_bx
   [junit4]   2> 1353082 T2692 oascc.ZkStateReader$3.process Updating live nodes... (2)
   [junit4]   2> 1353082 T2705 oascc.ZkStateReader$3.process Updating live nodes... (2)
   [junit4]   2> 1353082 T2687 oascc.ZkStateReader$3.process Updating live nodes... (2)
   [junit4]   2> 1353099 T2665 oasc.CorePropertiesLocator.discover Looking for core definitions underneath /usr/home/hudson/hudson-slave/workspace/Lucene-Solr-NightlyTests-trunk/solr/build/solr-core/test/J0/./org.apache.solr.cloud.CollectionsAPIDistributedZkTest-jetty1-1375507421101
   [junit4]   2> 1353270 T2665 oasc.CorePropertiesLocator.discoverUnder Found core conf in /usr/home/hudson/hudson-slave/workspace/Lucene-Solr-NightlyTests-trunk/solr/build/solr-core/test/J0/./org.apache.solr.cloud.CollectionsAPIDistributedZkTest-jetty1-1375507421101/conf/
   [junit4]   2> 1353275 T2665 oasc.CorePropertiesLocator.discover Found 1 core definitions
   [junit4]   2> 1353275 T2665 oass.SolrDispatchFilter.init user.dir=/usr/home/hudson/hudson-slave/workspace/Lucene-Solr-NightlyTests-trunk/solr/build/solr-core/test/J0
   [junit4]   2> 1353276 T2665 oass.SolrDispatchFilter.init SolrDispatchFilter.init() done
   [junit4]   2> 1353276 T2665 oascsi.HttpClientUtil.createClient Creating new http client, config:maxConnections=128&maxConnectionsPerHost=32&followRedirects=false
   [junit4]   2> 1353571 T2665 oejs.Server.doStart jetty-8.1.10.v20130312
   [junit4]   2> 1353574 T2665 oejs.AbstractConnector.doStart Started SocketConnector@127.0.0.1:14391
   [junit4]   2> 1353575 T2665 oass.SolrDispatchFilter.init SolrDispatchFilter.init()
   [junit4]   2> 1353575 T2665 oasc.SolrResourceLoader.locateSolrHome JNDI not configured for solr (NoInitialContextEx)
   [junit4]   2> 1353575 T2665 oasc.SolrResourceLoader.locateSolrHome using system property solr.solr.home: /usr/home/hudson/hudson-slave/workspace/Lucene-Solr-NightlyTests-trunk/solr/build/solr-core/test/J0/./org.apache.solr.cloud.CollectionsAPIDistributedZkTest-jetty2-1375507422997
   [junit4]   2> 1353576 T2665 oasc.SolrResourceLoader.<init> new SolrResourceLoader for directory: '/usr/home/hudson/hudson-slave/workspace/Lucene-Solr-NightlyTests-trunk/solr/build/solr-core/test/J0/./org.apache.solr.cloud.CollectionsAPIDistributedZkTest-jetty2-1375507422997/'
   [junit4]   2> 1353613 T2665 oasc.ConfigSolr.fromFile Loading container configuration from /usr/home/hudson/hudson-slave/workspace/Lucene-Solr-NightlyTests-trunk/solr/build/solr-core/test/J0/./org.apache.solr.cloud.CollectionsAPIDistributedZkTest-jetty2-1375507422997/solr.xml
   [junit4]   2> 1353697 T2665 oasc.ConfigSolrXml.<init> Config-defined core root directory: 
   [junit4]   2> 1353698 T2665 oasc.CoreContainer.<init> New CoreContainer 1962252297
   [junit4]   2> 1353699 T2665 oasc.CoreContainer.load Loading cores into CoreContainer [instanceDir=/usr/home/hudson/hudson-slave/workspace/Lucene-Solr-NightlyTests-trunk/solr/build/solr-core/test/J0/./org.apache.solr.cloud.CollectionsAPIDistributedZkTest-jetty2-1375507422997/]
   [junit4]   2> 1353700 T2665 oashc.HttpShardHandlerFactory.getParameter Setting socketTimeout to: 120000
   [junit4]   2> 1353701 T2665 oashc.HttpShardHandlerFactory.getParameter Setting urlScheme to: http://
   [junit4]   2> 1353701 T2665 oashc.HttpShardHandlerFactory.getParameter Setting connTimeout to: 15000
   [junit4]   2> 1353701 T2665 oashc.HttpShardHandlerFactory.getParameter Setting maxConnectionsPerHost to: 20
   [junit4]   2> 1353702 T2665 oashc.HttpShardHandlerFactory.getParameter Setting corePoolSize to: 0
   [junit4]   2> 1353702 T2665 oashc.HttpShardHandlerFactory.getParameter Setting maximumPoolSize to: 2147483647
   [junit4]   2> 1353703 T2665 oashc.HttpShardHandlerFactory.getParameter Setting maxThreadIdleTime to: 5
   [junit4]   2> 1353703 T2665 oashc.HttpShardHandlerFactory.getParameter Setting sizeOfQueue to: -1
   [junit4]   2> 1353703 T2665 oashc.HttpShardHandlerFactory.getParameter Setting fairnessPolicy to: false
   [junit4]   2> 1353704 T2665 oascsi.HttpClientUtil.createClient Creating new http client, config:maxConnectionsPerHost=20&maxConnections=10000&socketTimeout=120000&connTimeout=15000&retry=false
   [junit4]   2> 1353720 T2665 oasc.ZkContainer.initZooKeeper Zookeeper client=127.0.0.1:14380/solr
   [junit4]   2> 1353720 T2665 oasc.ZkController.checkChrootPath zkHost includes chroot
   [junit4]   2> 1353721 T2665 oascc.ConnectionManager.waitForConnected Waiting for client to connect to ZooKeeper
   [junit4]   2> 1353724 T2717 oascc.ConnectionManager.process Watcher org.apache.solr.common.cloud.ConnectionManager@d22f2b8 name:ZooKeeperConnection Watcher:127.0.0.1:14380 got event WatchedEvent state:SyncConnected type:None path:null path:null type:None
   [junit4]   2> 1353724 T2665 oascc.ConnectionManager.waitForConnected Client is connected to ZooKeeper
   [junit4]   2> 1353727 T2665 oascsi.HttpClientUtil.createClient Creating new http client, config:maxConnections=500&maxConnectionsPerHost=16&socketTimeout=120000&connTimeout=15000
   [junit4]   2> 1353737 T2665 oascc.ConnectionManager.waitForConnected Waiting for client to connect to ZooKeeper
   [junit4]   2> 1353739 T2719 oascc.ConnectionManager.process Watcher org.apache.solr.common.cloud.ConnectionManager@bf02aec name:ZooKeeperConnection Watcher:127.0.0.1:14380/solr got event WatchedEvent state:SyncConnected type:None path:null path:null type:None
   [junit4]   2> 1353739 T2665 oascc.ConnectionManager.waitForConnected Client is connected to ZooKeeper
   [junit4]   2> 1353751 T2665 oascc.ZkStateReader.createClusterStateWatchersAndUpdate Updating cluster state from ZooKeeper... 
   [junit4]   2> 1354754 T2665 oasc.ZkController.createEphemeralLiveNode Register node as live in ZooKeeper:/live_nodes/127.0.0.1:14391_bx
   [junit4]   2> 1354757 T2665 oascc.SolrZkClient.makePath makePath: /live_nodes/127.0.0.1:14391_bx
   [junit4]   2> 1354760 T2692 oascc.ZkStateReader$3.process Updating live nodes... (3)
   [junit4]   2> 1354760 T2719 oascc.ZkStateReader$3.process Updating live nodes... (3)
   [junit4]   2> 1354760 T2687 oascc.ZkStateReader$3.process Updating live nodes... (3)
   [junit4]   2> 1354760 T2705 oascc.ZkStateReader$3.process Updating live nodes... (3)
   [junit4]   2> 1354773 T2665 oasc.CorePropertiesLocator.discover Looking for core definitions underneath /usr/home/hudson/hudson-slave/workspace/Lucene-Solr-NightlyTests-trunk/solr/build/solr-core/test/J0/./org.apache.solr.cloud.CollectionsAPIDistributedZkTest-jetty2-1375507422997
   [junit4]   2> 1354775 T2665 oasc.CorePropertiesLocator.discoverUnder Found core conf in /usr/home/hudson/hudson-slave/workspace/Lucene-Solr-NightlyTests-trunk/solr/build/solr-core/test/J0/./org.apache.solr.cloud.CollectionsAPIDistributedZkTest-jetty2-1375507422997/conf/
   [junit4]   2> 1354882 T2665 oasc.CorePropertiesLocator.discover Found 1 core definitions
   [junit4]   2> 1354883 T2665 oass.SolrDispatchFilter.init user.dir=/usr/home/hudson/hudson-slave/workspace/Lucene-Solr-NightlyTests-trunk/solr/build/solr-core/test/J0
   [junit4]   2> 1354883 T2665 oass.SolrDispatchFilter.init SolrDispatchFilter.init() done
   [junit4]   2> 1354884 T2665 oascsi.HttpClientUtil.createClient Creating new http client, config:maxConnections=128&maxConnectionsPerHost=32&followRedirects=false
   [junit4]   2> 1355117 T2665 oejs.Server.doStart jetty-8.1.10.v20130312
   [junit4]   2> 1355120 T2665 oejs.AbstractConnector.doStart Started SocketConnector@127.0.0.1:14394
   [junit4]   2> 1355121 T2665 oass.SolrDispatchFilter.init SolrDispatchFilter.init()
   [junit4]   2> 1355121 T2665 oasc.SolrResourceLoader.locateSolrHome JNDI not configured for solr (NoInitialContextEx)
   [junit4]   2> 1355122 T2665 oasc.SolrResourceLoader.locateSolrHome using system property solr.solr.home: /usr/home/hudson/hudson-slave/workspace/Lucene-Solr-NightlyTests-trunk/solr/build/solr-core/test/J0/./org.apache.solr.cloud.CollectionsAPIDistributedZkTest-jetty3-1375507424600
   [junit4]   2> 1355122 T2665 oasc.SolrResourceLoader.<init> new SolrResourceLoader for directory: '/usr/home/hudson/hudson-slave/workspace/Lucene-Solr-NightlyTests-trunk/solr/build/solr-core/test/J0/./org.apache.solr.cloud.CollectionsAPIDistributedZkTest-jetty3-1375507424600/'
   [junit4]   2> 1355159 T2665 oasc.ConfigSolr.fromFile Loading container configuration from /usr/home/hudson/hudson-slave/workspace/Lucene-Solr-NightlyTests-trunk/solr/build/solr-core/test/J0/./org.apache.solr.cloud.CollectionsAPIDistributedZkTest-jetty3-1375507424600/solr.xml
   [junit4]   2> 1355243 T2665 oasc.ConfigSolrXml.<init> Config-defined core root directory: 
   [junit4]   2> 1355244 T2665 oasc.CoreContainer.<init> New CoreContainer 61320966
   [junit4]   2> 1355244 T2665 oasc.CoreContainer.load Loading cores into CoreContainer [instanceDir=/usr/home/hudson/hudson-slave/workspace/Lucene-Solr-NightlyTests-trunk/solr/build/solr-core/test/J0/./org.apache.solr.cloud.CollectionsAPIDistributedZkTest-jetty3-1375507424600/]
   [junit4]   2> 1355246 T2665 oashc.HttpShardHandlerFactory.getParameter Setting socketTimeout to: 120000
   [junit4]   2> 1355246 T2665 oashc.HttpShardHandlerFactory.getParameter Setting urlScheme to: http://
   [junit4]   2> 1355247 T2665 oashc.HttpShardHandlerFactory.getParameter Setting connTimeout to: 15000
   [junit4]   2> 1355247 T2665 oashc.HttpShardHandlerFactory.getParameter Setting maxConnectionsPerHost to: 20
   [junit4]   2> 1355248 T2665 oashc.HttpShardHandlerFactory.getParameter Setting corePoolSize to: 0
   [junit4]   2> 1355248 T2665 oashc.HttpShardHandlerFactory.getParameter Setting maximumPoolSize to: 2147483647
   [junit4]   2> 1355249 T2665 oashc.HttpShardHandlerFactory.getParameter Setting maxThreadIdleTime to: 5
   [junit4]   2> 1355249 T2665 oashc.HttpShardHandlerFactory.getParameter Setting sizeOfQueue to: -1
   [junit4]   2> 1355249 T2665 oashc.HttpShardHandlerFactory.getParameter Setting fairnessPolicy to: false
   [junit4]   2> 1355250 T2665 oascsi.HttpClientUtil.createClient Creating new http client, config:maxConnectionsPerHost=20&maxConnections=10000&socketTimeout=120000&connTimeout=15000&retry=false
   [junit4]   2> 1355267 T2665 oasc.ZkContainer.initZooKeeper Zookeeper client=127.0.0.1:14380/solr
   [junit4]   2> 1355268 T2665 oasc.ZkController.checkChrootPath zkHost includes chroot
   [junit4]   2> 1355269 T2665 oascc.ConnectionManager.waitForConnected Waiting for client to connect to ZooKeeper
   [junit4]   2> 1355271 T2731 oascc.ConnectionManager.process Watcher org.apache.solr.common.cloud.ConnectionManager@22c86606 name:ZooKeeperConnection Watcher:127.0.0.1:14380 got event WatchedEvent state:SyncConnected type:None path:null path:null type:None
   [junit4]   2> 1355271 T2665 oascc.ConnectionManager.waitForConnected Client is connected to ZooKeeper
   [junit4]   2> 1355274 T2665 oascsi.HttpClientUtil.createClient Creating new http client, config:maxConnections=500&maxConnectionsPerHost=16&socketTimeout=120000&connTimeout=15000
   [junit4]   2> 1355286 T2665 oascc.ConnectionManager.waitForConnected Waiting for client to connect to ZooKeeper
   [junit4]   2> 1355288 T2733 oascc.ConnectionManager.process Watcher org.apache.solr.common.cloud.ConnectionManager@47ed0b52 name:ZooKeeperConnection Watcher:127.0.0.1:14380/solr got event WatchedEvent state:SyncConnected type:None path:null path:null type:None
   [junit4]   2> 1355288 T2665 oascc.ConnectionManager.waitForConnected Client is connected to ZooKeeper
   [junit4]   2> 1355300 T2665 oascc.ZkStateReader.createClusterStateWatchersAndUpdate Updating cluster state from ZooKeeper... 
   [junit4]   2> 1356303 T2665 oasc.ZkController.createEphemeralLiveNode Register node as live in ZooKeeper:/live_nodes/127.0.0.1:14394_bx
   [junit4]   2> 1356308 T2665 oascc.SolrZkClient.makePath makePath: /live_nodes/127.0.0.1:14394_bx
   [junit4]   2> 1356315 T2692 oascc.ZkStateReader$3.process Updating live nodes... (4)
   [junit4]   2> 1356315 T2687 oascc.ZkStateReader$3.process Updating live nodes... (4)
   [junit4]   2> 1356315 T2705 oascc.ZkStateReader$3.process Updating live nodes... (4)
   [junit4]   2> 1356315 T2733 oascc.ZkStateReader$3.process Updating live nodes... (4)
   [junit4]   2> 1356315 T2719 oascc.ZkStateReader$3.process Updating live nodes... (4)
   [junit4]   2> 1356325 T2665 oasc.CorePropertiesLocator.discover Looking for core definitions underneath /usr/home/hudson/hudson-slave/workspace/Lucene-Solr-NightlyTests-trunk/solr/build/solr-core/test/J0/./org.apache.solr.cloud.CollectionsAPIDistributedZkTest-jetty3-1375507424600
   [junit4]   2> 1356330 T2665 oasc.CorePropertiesLocator.discoverUnder Found core conf in /usr/home/hudson/hudson-slave/workspace/Lucene-Solr-NightlyTests-trunk/solr/build/solr-core/test/J0/./org.apache.solr.cloud.CollectionsAPIDistributedZkTest-jetty3-1375507424600/conf/
   [junit4]   2> 1356501 T2665 oasc.CorePropertiesLocator.discover Found 1 core definitions
   [junit4]   2> 1356502 T2665 oass.SolrDispatchFilter.init user.dir=/usr/home/hudson/hudson-slave/workspace/Lucene-Solr-NightlyTests-trunk/solr/build/solr-core/test/J0
   [junit4]   2> 1356502 T2665 oass.SolrDispatchFilter.init SolrDispatchFilter.init() done
   [junit4]   2> 1356503 T2665 oascsi.HttpClientUtil.createClient Creating new http client, config:maxConnections=128&maxConnectionsPerHost=32&followRedirects=false
   [junit4]   2> 1356800 T2665 oejs.Server.doStart jetty-8.1.10.v20130312
   [junit4]   2> 1356803 T2665 oejs.AbstractConnector.doStart Started SocketConnector@127.0.0.1:14397
   [junit4]   2> 1356803 T2665 oass.SolrDispatchFilter.init SolrDispatchFilter.init()
   [junit4]   2> 1356804 T2665 oasc.SolrResourceLoader.locateSolrHome JNDI not configured for solr (NoInitialContextEx)
   [junit4]   2> 1356804 T2665 oasc.SolrResourceLoader.locateSolrHome using system property solr.solr.home: /usr/home/hudson/hudson-slave/workspace/Lucene-Solr-NightlyTests-trunk/solr/build/solr-core/test/J0/./org.apache.solr.cloud.CollectionsAPIDistributedZkTest-jetty4-1375507426226
   [junit4]   2> 1356805 T2665 oasc.SolrResourceLoader.<init> new SolrResourceLoader for directory: '/usr/home/hudson/hudson-slave/workspace/Lucene-Solr-NightlyTests-trunk/solr/build/solr-core/test/J0/./org.apache.solr.cloud.CollectionsAPIDistributedZkTest-jetty4-1375507426226/'
   [junit4]   2> 1356841 T2665 oasc.ConfigSolr.fromFile Loading container configuration from /usr/home/hudson/hudson-slave/workspace/Lucene-Solr-NightlyTests-trunk/solr/build/solr-core/test/J0/./org.apache.solr.cloud.CollectionsAPIDistributedZkTest-jetty4-1375507426226/solr.xml
   [junit4]   2> 1356926 T2665 oasc.ConfigSolrXml.<init> Config-defined core root directory: 
   [junit4]   2> 1356927 T2665 oasc.CoreContainer.<init> New CoreContainer 1654166380
   [junit4]   2> 1356927 T2665 oasc.CoreContainer.load Loading cores into CoreContainer [instanceDir=/usr/home/hudson/hudson-slave/workspace/Lucene-Solr-NightlyTests-trunk/solr/build/solr-core/test/J0/./org.apache.solr.cloud.CollectionsAPIDistributedZkTest-jetty4-1375507426226/]
   [junit4]   2> 1356929 T2665 oashc.HttpShardHandlerFactory.getParameter Setting socketTimeout to: 120000
   [junit4]   2> 1356930 T2665 oashc.HttpShardHandlerFactory.getParameter Setting urlScheme to: http://
   [junit4]   2> 1356930 T2665 oashc.HttpShardHandlerFactory.getParameter Setting connTimeout to: 15000
   [junit4]   2> 1356930 T2665 oashc.HttpShardHandlerFactory.getParameter Setting maxConnectionsPerHost to: 20
   [junit4]   2> 1356931 T2665 oashc.HttpShardHandlerFactory.getParameter Setting corePoolSize to: 0
   [junit4]   2> 1356931 T2665 oashc.HttpShardHandlerFactory.getParameter Setting maximumPoolSize to: 2147483647
   [junit4]   2> 1356932 T2665 oashc.HttpShardHandlerFactory.getParameter Setting maxThreadIdleTime to: 5
   [junit4]   2> 1356932 T2665 oashc.HttpShardHandlerFactory.getParameter Setting sizeOfQueue to: -1
   [junit4]   2> 1356932 T2665 oashc.HttpShardHandlerFactory.getParameter Setting fairnessPolicy to: false
   [junit4]   2> 1356933 T2665 oascsi.HttpClientUtil.createClient Creating new http client, config:maxConnectionsPerHost=20&maxConnections=10000&socketTimeout=120000&connTimeout=15000&retry=false
   [junit4]   2> 1356953 T2665 oasc.ZkContainer.initZooKeeper Zookeeper client=127.0.0.1:14380/solr
   [junit4]   2> 1356953 T2665 oasc.ZkController.checkChrootPath zkHost includes chroot
   [junit4]   2> 1356954 T2665 oascc.ConnectionManager.waitForConnected Waiting for client to connect to ZooKeeper
   [junit4]   2> 1356956 T2745 oascc.ConnectionManager.process Watcher org.apache.solr.common.cloud.ConnectionManager@43157064 name:ZooKeeperConnection Watcher:127.0.0.1:14380 got event WatchedEvent state:SyncConnected type:None path:null path:null type:None
   [junit4]   2> 1356957 T2665 oascc.ConnectionManager.waitForConnected Client is connected to ZooKeeper
   [junit4]   2> 1356959 T2665 oascsi.HttpClientUtil.createClient Creating new http client, config:maxConnections=500&maxConnectionsPerHost=16&socketTimeout=120000&connTimeout=15000
   [junit4]   2> 1356971 T2665 oascc.ConnectionManager.waitForConnected Waiting for client to connect to ZooKeeper
   [junit4]   2> 1356973 T2747 oascc.ConnectionManager.process Watcher org.apache.solr.common.cloud.ConnectionManager@25b3070f name:ZooKeeperConnection Watcher:127.0.0.1:14380/solr got event WatchedEvent state:SyncConnected type:None path:null path:null type:None
   [junit4]   2> 1356973 T2665 oascc.ConnectionManager.waitForConnected Client is connected to ZooKeeper
   [junit4]   2> 1356985 T2665 oascc.ZkStateReader.createClusterStateWatchersAndUpdate Updating cluster state from ZooKeeper... 
   [junit4]   2> 1357988 T2665 oasc.ZkController.createEphemeralLiveNode Register node as live in ZooKeeper:/live_nodes/127.0.0.1:14397_bx
   [junit4]   2> 1357990 T2665 oascc.SolrZkClient.makePath makePath: /live_nodes/127.0.0.1:14397_bx
   [junit4]   2> 1357993 T2692 oascc.ZkStateReader$3.process Updating live nodes... (5)
   [junit4]   2> 1357993 T2733 oascc.ZkStateReader$3.process Updating live nodes... (5)
   [junit4]   2> 1357993 T2687 oascc.ZkStateReader$3.process Updating live nodes... (5)
   [junit4]   2> 1357993 T2747 oascc.ZkStateReader$3.process Updating live nodes... (5)
   [junit4]   2> 1357993 T2705 oascc.ZkStateReader$3.process Updating live nodes... (5)
   [junit4]   2> 1357993 T2719 oascc.ZkStateReader$3.process Updating live nodes... (5)
   [junit4]   2> 1358009 T2665 oasc.CorePropertiesLocator.discover Looking for core definitions underneath /usr/home/hudson/hudson-slave/workspace/Lucene-Solr-NightlyTests-trunk/solr/build/solr-core/test/J0/./org.apache.solr.cloud.CollectionsAPIDistributedZkTest-jetty4-1375507426226
   [junit4]   2> 1358203 T2665 oasc.CorePropertiesLocator.discoverUnder Found core conf in /usr/home/hudson/hudson-slave/workspace/Lucene-Solr-NightlyTests-trunk/solr/build/solr-core/test/J0/./org.apache.solr.cloud.CollectionsAPIDistributedZkTest-jetty4-1375507426226/conf/
   [junit4]   2> 1358205 T2665 oasc.CorePropertiesLocator.discover Found 1 core definitions
   [junit4]   2> 1358206 T2665 oass.SolrDispatchFilter.init user.dir=/usr/home/hudson/hudson-slave/workspace/Lucene-Solr-NightlyTests-trunk/solr/build/solr-core/test/J0
   [junit4]   2> 1358206 T2665 oass.SolrDispatchFilter.init SolrDispatchFilter.init() done
   [junit4]   2> 1358207 T2665 oascsi.HttpClientUtil.createClient Creating new http client, config:maxConnections=128&maxConnectionsPerHost=32&followRedirects=false
   [junit4]   2> 1358224 T2665 oascsi.HttpClientUtil.createClient Creating new http client, config:maxConnections=128&maxConnectionsPerHost=32&followRedirects=false
   [junit4]   2> 1358237 T2695 oasha.CollectionsHandler.handleCreateAction Creating Collection : numShards=2&name=nodes_used_collection&replicationFactor=2&action=CREATE&wt=javabin&version=2
   [junit4]   2> 1358239 T2687 oasc.DistributedQueue$LatchChildWatcher.process Watcher fired on path: /overseer/collection-queue-work state: SyncConnected type NodeChildrenChanged
   [junit4]   2> 1358240 T2689 oasc.OverseerCollectionProcessor.run Overseer Collection Processor: Get the message id:/overseer/collection-queue-work/qn-0000000000 message:{
   [junit4]   2> 	  "operation":"createcollection",
   [junit4]   2> 	  "numShards":"2",
   [junit4]   2> 	  "name":"nodes_used_collection",
   [junit4]   2> 	  "replicationFactor":"2"}
   [junit4]   2> 1358240 T2689 oasc.OverseerCollectionProcessor.processMessage WARN OverseerCollectionProcessor.processMessage : createcollection , {
   [junit4]   2> 	  "operation":"createcollection",
   [junit4]   2> 	  "numShards":"2",
   [junit4]   2> 	  "name":"nodes_used_collection",
   [junit4]   2> 	  "replicationFactor":"2"}
   [junit4]   2> 1358671 T2688 oascc.ZkStateReader.updateClusterState Updating cloud state from ZooKeeper... 
   [junit4]   2> 1358672 T2688 oasc.Overseer$ClusterStateUpdater.buildCollection building a new collection: nodes_used_collection
   [junit4]   2> 1358672 T2688 oasc.Overseer$ClusterStateUpdater.createCollection Create collection nodes_used_collection with shards [shard1, shard2]
   [junit4]   2> 1358685 T2692 oascc.ZkStateReader$2.process A cluster state change: WatchedEvent state:SyncConnected type:NodeDataChanged path:/clusterstate.json, has occurred - updating... (live nodes size: 5)
   [junit4]   2> 1358685 T2687 oascc.ZkStateReader$2.process A cluster state change: WatchedEvent state:SyncConnected type:NodeDataChanged path:/clusterstate.json, has occurred - updating... (live nodes size: 5)
   [junit4]   2> 1358685 T2705 oascc.ZkStateReader$2.process A cluster state change: WatchedEvent state:SyncConnected type:NodeDataChanged path:/clusterstate.json, has occurred - updating... (live nodes size: 5)
   [junit4]   2> 1358685 T2733 oascc.ZkStateReader$2.process A cluster state change: WatchedEvent state:SyncConnected type:NodeDataChanged path:/clusterstate.json, has occurred - updating... (live nodes size: 5)
   [junit4]   2> 1358685 T2747 oascc.ZkStateReader$2.process A cluster state change: WatchedEvent state:SyncConnected type:NodeDataChanged path:/clusterstate.json, has occurred - updating... (live nodes size: 5)
   [junit4]   2> 1358685 T2719 oascc.ZkStateReader$2.process A cluster state change: WatchedEvent state:SyncConnected type:NodeDataChanged path:/clusterstate.json, has occurred - updating... (live nodes size: 5)
   [junit4]   2> 1358756 T2689 oasc.OverseerCollectionProcessor.createCollection going to create cores replicas shardNames [shard1, shard2] , repFactor : 2
   [junit4]   2> 1358756 T2689 oasc.OverseerCollectionProcessor.createCollection Creating shard nodes_used_collection_shard1_replica1 as part of slice shard1 of collection nodes_used_collection on 127.0.0.1:14391_bx
   [junit4]   2> 1358756 T2689 oasc.OverseerCollectionProcessor.createCollection Creating shard nodes_used_collection_shard1_replica2 as part of slice shard1 of collection nodes_used_collection on 127.0.0.1:14394_bx
   [junit4]   2> 1358757 T2689 oasc.OverseerCollectionProcessor.createCollection Creating shard nodes_used_collection_shard2_replica1 as part of slice shard2 of collection nodes_used_collection on 127.0.0.1:14388_bx
   [junit4]   2> 1358758 T2689 oasc.OverseerCollectionProcessor.createCollection Creating shard nodes_used_collection_shard2_replica2 as part of slice shard2 of collection nodes_used_collection on 127.0.0.1:14397_bx
   [junit4]   2> 1358762 T2709 oasc.ZkController.publish publishing core=nodes_used_collection_shard1_replica1 state=down
   [junit4]   2> 1358762 T2723 oasc.ZkController.publish publishing core=nodes_used_collection_shard1_replica2 state=down
   [junit4]   2> 1358762 T2737 oasc.ZkController.publish publishing core=nodes_used_collection_shard2_replica2 state=down
   [junit4]   2> 1358762 T2696 oasc.ZkController.publish publishing core=nodes_used_collection_shard2_replica1 state=down
   [junit4]   2> 1358764 T2709 oasc.ZkController.waitForCoreNodeName look for our core node name
   [junit4]   2> 1358764 T2723 oasc.ZkController.waitForCoreNodeName look for our core node name
   [junit4]   2> 1358765 T2696 oasc.ZkController.waitForCoreNodeName look for our core node name
   [junit4]   2> 1358764 T2737 oasc.ZkController.waitForCoreNodeName look for our core node name
   [junit4]   2> 1360190 T2688 oascc.ZkStateReader.updateClusterState Updating cloud state from ZooKeeper... 
   [junit4]   2> 1360191 T2688 oasc.Overseer$ClusterStateUpdater.updateState WARN Could not find collection node for nodes_used_collection, skipping publish state
   [junit4]   2> 1360191 T2688 oasc.Overseer$ClusterStateUpdater.updateState Update state numShards=2 message={
   [junit4]   2> 	  "operation":"state",
   [junit4]   2> 	  "core_node_name":"core_node1",
   [junit4]   2> 	  "numShards":"2",
   [junit4]   2> 	  "shard":"shard1",
   [junit4]   2> 	  "roles":null,
   [junit4]   2> 	  "state":"down",
   [junit4]   2> 	  "shard_state":"active",
   [junit4]   2> 	  "core":"nodes_used_collection_shard1_replica1",
   [junit4]   2> 	  "collection":"nodes_used_collection",
   [junit4]   2> 	  "shard_range":null,
   [junit4]   2> 	  "node_name":"127.0.0.1:14391_bx",
   [junit4]   2> 	  "base_url":"http://127.0.0.1:14391/bx"}
   [junit4]   2> 1360196 T2688 oasc.Overseer$ClusterStateUpdater.updateState WARN Could not find collection node for nodes_used_collection, skipping publish state
   [junit4]   2> 1360196 T2688 oasc.Overseer$ClusterStateUpdater.updateState Update state numShards=2 message={
   [junit4]   2> 	  "operation":"state",
   [junit4]   2> 	  "core_node_name":"core_node2",
   [junit4]   2> 	  "numShards":"2",
   [junit4]   2> 	  "shard":"shard1",
   [junit4]   2> 	  "roles":null,
   [junit4]   2> 	  "state":"down",
   [junit4]   2> 	  "shard_state":"active",
   [junit4]   2> 	  "core":"nodes_used_collection_shard1_replica2",
   [junit4]   2> 	  "collection":"nodes_used_collection",
   [junit4]   2> 	  "shard_range":null,
   [junit4]   2> 	  "node_name":"127.0.0.1:14394_bx",
   [junit4]   2> 	  "base_url":"http://127.0.0.1:14394/bx"}
   [junit4]   2> 1360207 T2688 oasc.Overseer$ClusterStateUpdater.updateState WARN Could not find collection node for nodes_used_collection, skipping publish state
   [junit4]   2> 1360208 T2688 oasc.Overseer$ClusterStateUpdater.updateState Update state numShards=2 message={
   [junit4]   2> 	  "operation":"state",
   [junit4]   2> 	  "core_node_name":"core_node3",
   [junit4]   2> 	  "numShards":"2",
   [junit4]   2> 	  "shard":"shard2",
   [junit4]   2> 	  "roles":null,
   [junit4]   2> 	  "state":"down",
   [junit4]   2> 	  "shard_state":"active",
   [junit4]   2> 	  "core":"nodes_used_collection_shard2_replica2",
   [junit4]   2> 	  "collection":"nodes_used_collection",
   [junit4]   2> 	  "shard_range":null,
   [junit4]   2> 	  "node_name":"127.0.0.1:14397_bx",
   [junit4]   2> 	  "base_url":"http://127.0.0.1:14397/bx"}
   [junit4]   2> 1360216 T2688 oasc.Overseer$ClusterStateUpdater.updateState WARN Could not find collection node for nodes_used_collection, skipping publish state
   [junit4]   2> 1360216 T2688 oasc.Overseer$ClusterStateUpdater.updateState Update state numShards=2 message={
   [junit4]   2> 	  "operation":"state",
   [junit4]   2> 	  "core_node_name":"core_node4",
   [junit4]   2> 	  "numShards":"2",
   [junit4]   2> 	  "shard":"shard2",
   [junit4]   2> 	  "roles":null,
   [junit4]   2> 	  "state":"down",
   [junit4]   2> 	  "shard_state":"active",
   [junit4]   2> 	  "core":"nodes_used_collection_shard2_replica1",
   [junit4]   2> 	  "collection":"nodes_used_collection",
   [junit4]   2> 	  "shard_range":null,
   [junit4]   2> 	  "node_name":"127.0.0.1:14388_bx",
   [junit4]   2> 	  "base_url":"http://127.0.0.1:14388/bx"}
   [junit4]   2> 1360227 T2692 oascc.ZkStateReader$2.process A cluster state change: WatchedEvent state:SyncConnected type:NodeDataChanged path:/clusterstate.json, has occurred - updating... (live nodes size: 5)
   [junit4]   2> 1360228 T2705 oascc.ZkStateReader$2.process A cluster state change: WatchedEvent state:SyncConnected type:NodeDataChanged path:/clusterstate.json, has occurred - updating... (live nodes size: 5)
   [junit4]   2> 1360228 T2719 oascc.ZkStateReader$2.process A cluster state change: WatchedEvent state:SyncConnected type:NodeDataChanged path:/clusterstate.json, has occurred - updating... (live nodes size: 5)
   [junit4]   2> 1360227 T2687 oascc.ZkStateReader$2.process A cluster state change: WatchedEvent state:SyncConnected type:NodeDataChanged path:/clusterstate.json, has occurred - updating... (live nodes size: 5)
   [junit4]   2> 1360227 T2733 oascc.ZkStateReader$2.process A cluster state change: WatchedEvent state:SyncConnected type:NodeDataChanged path:/clusterstate.json, has occurred - updating... (live nodes size: 5)
   [junit4]   2> 1360227 T2747 oascc.ZkStateReader$2.process A cluster state change: WatchedEvent state:SyncConnected type:NodeDataChanged path:/clusterstate.json, has occurred - updating... (live nodes size: 5)
   [junit4]   2> 1360766 T2709 oasc.ZkController.waitForShardId waiting to find shard id in clusterstate for nodes_used_collection_shard1_replica1
   [junit4]   2> 1360767 T2696 oasc.ZkController.waitForShardId waiting to find shard id in clusterstate for nodes_used_collection_shard2_replica1
   [junit4]   2> 1360767 T2723 oasc.ZkController.waitForShardId waiting to find shard id in clusterstate for nodes_used_collection_shard1_replica2
   [junit4]   2> 1360767 T2737 oasc.ZkController.waitForShardId waiting to find shard id in clusterstate for nodes_used_collection_shard2_replica2
   [junit4]   2> 1360767 T2709 oasc.CorePropertiesLocator.writePropertiesFile ERROR Couldn't persist core properties to /usr/home/hudson/hudson-slave/workspace/Lucene-Solr-NightlyTests-trunk/solr/build/solr-core/test/J0/./org.apache.solr.cloud.CollectionsAPIDistributedZkTest-jetty2-1375507422997/nodes_used_collection_shard1_replica1/core.properties: java.io.FileNotFoundException: /usr/home/hudson/hudson-slave/workspace/Lucene-Solr-NightlyTests-trunk/solr/build/solr-core/test/J0/./org.apache.solr.cloud.CollectionsAPIDistributedZkTest-jetty2-1375507422997/nodes_used_collection_shard1_replica1/core.properties (No such file or directory)
   [junit4]   2> 1360768 T2709 oasc.CoreContainer.create Creating SolrCore 'nodes_used_collection_shard1_replica1' using instanceDir: /usr/home/hudson/hudson-slave/workspace/Lucene-Solr-NightlyTests-trunk/solr/build/solr-core/test/J0/./org.apache.solr.cloud.CollectionsAPIDistributedZkTest-jetty2-1375507422997/nodes_used_collection_shard1_replica1
   [junit4]   2> 1360768 T2696 oasc.CorePropertiesLocator.writePropertiesFile ERROR Couldn't persist core properties to /usr/home/hudson/hudson-slave/workspace/Lucene-Solr-NightlyTests-trunk/solr/build/solr-core/test/J0/./org.apache.solr.cloud.CollectionsAPIDistributedZkTest-jetty1-1375507421101/nodes_used_collection_shard2_replica1/core.properties: java.io.FileNotFoundException: /usr/home/hudson/hudson-slave/workspace/Lucene-Solr-NightlyTests-trunk/solr/build/solr-core/test/J0/./org.apache.solr.cloud.CollectionsAPIDistributedZkTest-jetty1-1375507421101/nodes_used_collection_shard2_replica1/core.properties (No such file or directory)
   [junit4]   2> 1360768 T2737 oasc.CorePropertiesLocator.writePropertiesFile ERROR Couldn't persist core properties to /usr/home/hudson/hudson-slave/workspace/Lucene-Solr-NightlyTests-trunk/solr/build/solr-core/test/J0/./org.apache.solr.cloud.CollectionsAPIDistributedZkTest-jetty4-1375507426226/nodes_used_collection_shard2_replica2/core.properties: java.io.FileNotFoundException: /usr/home/hudson/hudson-slave/workspace/Lucene-Solr-NightlyTests-trunk/solr/build/solr-core/test/J0/./org.apache.solr.cloud.CollectionsAPIDistributedZkTest-jetty4-1375507426226/nodes_used_collection_shard2_replica2/core.properties (No such file or directory)
   [junit4]   2> 1360768 T2723 oasc.CorePropertiesLocator.writePropertiesFile ERROR Couldn't persist core properties to /usr/home/hudson/hudson-slave/workspace/Lucene-Solr-NightlyTests-trunk/solr/build/solr-core/test/J0/./org.apache.solr.cloud.CollectionsAPIDistributedZkTest-jetty3-1375507424600/nodes_used_collection_shard1_replica2/core.properties: java.io.FileNotFoundException: /usr/home/hudson/hudson-slave/workspace/Lucene-Solr-NightlyTests-trunk/solr/build/solr-core/test/J0/./org.apache.solr.cloud.CollectionsAPIDistributedZkTest-jetty3-1375507424600/nodes_used_collection_shard1_replica2/core.properties (No such file or directory)
   [junit4]   2> 1360768 T2709 oasc.ZkController.createCollectionZkNode Check for collection zkNode:nodes_used_collection
   [junit4]   2> 1360769 T2723 oasc.CoreContainer.create Creating SolrCore 'nodes_used_collection_shard1_replica2' using instanceDir: /usr/home/hudson/hudson-slave/workspace/Lucene-Solr-NightlyTests-trunk/solr/build/solr-core/test/J0/./org.apache.solr.cloud.CollectionsAPIDistributedZkTest-jetty3-1375507424600/nodes_used_collection_shard1_replica2
   [junit4]   2> 1360769 T2737 oasc.CoreContainer.create Creating SolrCore 'nodes_used_collection_shard2_replica2' using instanceDir: /usr/home/hudson/hudson-slave/workspace/Lucene-Solr-NightlyTests-trunk/solr/build/solr-core/test/J0/./org.apache.solr.cloud.CollectionsAPIDistributedZkTest-jetty4-1375507426226/nodes_used_collection_shard2_replica2
   [junit4]   2> 1360769 T2737 oasc.ZkController.createCollectionZkNode Check for collection zkNode:nodes_used_collection
   [junit4]   2> 1360768 T2696 oasc.CoreContainer.create Creating SolrCore 'nodes_used_collection_shard2_replica1' using instanceDir: /usr/home/hudson/hudson-slave/workspace/Lucene-Solr-NightlyTests-trunk/solr/build/solr-core/test/J0/./org.apache.solr.cloud.CollectionsAPIDistributedZkTest-jetty1-1375507421101/nodes_used_collection_shard2_replica1
   [junit4]   2> 1360770 T2709 oasc.ZkController.createCollectionZkNode Creating collection in ZooKeeper:nodes_used_collection
   [junit4]   2> 1360769 T2723 oasc.ZkController.createCollectionZkNode Check for collection zkNode:nodes_used_collection
   [junit4]   2> 1360770 T2709 oasc.ZkController.getConfName Looking for collection configName
   [junit4]   2> 1360770 T2737 oasc.ZkController.createCollectionZkNode Creating collection in ZooKeeper:nodes_used_collection
   [junit4]   2> 1360770 T2696 oasc.ZkController.createCollectionZkNode Check for collection zkNode:nodes_used_collection
   [junit4]   2> 1360771 T2737 oasc.ZkController.getConfName Looking for collection configName
   [junit4]   2> 1360771 T2723 oasc.ZkController.createCollectionZkNode Creating collection in ZooKeeper:nodes_used_collection
   [junit4]   2> 1360771 T2696 oasc.ZkController.createCollectionZkNode Creating collection in ZooKeeper:nodes_used_collection
   [junit4]   2> 1360771 T2709 oasc.ZkController.getConfName Only one config set found in zk - using it:conf1
   [junit4]   2> 1360772 T2737 oasc.ZkController.getConfName Only one config set found in zk - using it:conf1
   [junit4]   2> 1360772 T2696 oasc.ZkController.getConfName Looking for collection configName
   [junit4]   2> 1360772 T2723 oasc.ZkController.getConfName Looking for collection configName
   [junit4]   2> 1360772 T2737 oascc.SolrZkClient.makePath makePath: /collections/nodes_used_collection
   [junit4]   2> 1360772 T2709 oascc.SolrZkClient.makePath makePath: /collections/nodes_used_collection
   [junit4]   2> 1360773 T2696 oasc.ZkController.getConfName Only one config set found in zk - using it:conf1
   [junit4]   2> 1360773 T2723 oasc.ZkController.getConfName Only one config set found in zk - using it:conf1
   [junit4]   2> 1360773 T2696 oascc.SolrZkClient.makePath makePath: /collections/nodes_used_collection
   [junit4]   2> 1360774 T2723 oascc.SolrZkClient.makePath makePath: /collections/nodes_used_collection
   [junit4]   2> 1360790 T2709 oasc.ZkController.readConfigName Load collection config from:/collections/nodes_used_collection
   [junit4]   2> 1360790 T2737 oasc.ZkController.readConfigName Load collection config from:/collections/nodes_used_collection
   [junit4]   2> 1360803 T2696 oasc.ZkController.readConfigName Load collection config from:/collections/nodes_used_collection
   [junit4]   2> 1360803 T2723 oasc.ZkController.readConfigName Load collection config from:/collections/nodes_used_collection
   [junit4]   2> 1360803 T2709 oasc.SolrResourceLoader.<init> new SolrResourceLoader for directory: '/usr/home/hudson/hudson-slave/workspace/Lucene-Solr-NightlyTests-trunk/solr/build/solr-core/test/J0/./org.apache.solr.cloud.CollectionsAPIDistributedZkTest-jetty2-1375507422997/nodes_used_collection_shard1_replica1/'
   [junit4]   2> 1360803 T2696 oasc.SolrResourceLoader.<init> new SolrResourceLoader for directory: '/usr/home/hudson/hudson-slave/workspace/Lucene-Solr-NightlyTests-trunk/solr/build/solr-core/test/J0/./org.apache.solr.cloud.CollectionsAPIDistributedZkTest-jetty1-1375507421101/nodes_used_collection_shard2_replica1/'
   [junit4]   2> 1360803 T2737 oasc.SolrResourceLoader.<init> new SolrResourceLoader for directory: '/usr/home/hudson/hudson-slave/workspace/Lucene-Solr-NightlyTests-trunk/solr/build/solr-core/test/J0/./org.apache.solr.cloud.CollectionsAPIDistributedZkTest-jetty4-1375507426226/nodes_used_collection_shard2_replica2/'
   [junit4]   2> 1360804 T2723 oasc.SolrResourceLoader.<init> new SolrResourceLoader for directory: '/usr/home/hudson/hudson-slave/workspace/Lucene-Solr-NightlyTests-trunk/solr/build/solr-core/test/J0/./org.apache.solr.cloud.CollectionsAPIDistributedZkTest-jetty3-1375507424600/nodes_used_collection_shard1_replica2/'
   [junit4]   2> 1360936 T2737 oasc.SolrConfig.<init> Using Lucene MatchVersion: LUCENE_50
   [junit4]   2> 1360936 T2723 oasc.SolrConfig.<init> Using Lucene MatchVersion: LUCENE_50
   [junit4]   2> 1360936 T2709 oasc.SolrConfig.<init> Using Lucene MatchVersion: LUCENE_50
   [junit4]   2> 1360936 T2696 oasc.SolrConfig.<init> Using Lucene MatchVersion: LUCENE_50
   [junit4]   2> 1360994 T2709 oasc.SolrConfig.<init> Loaded SolrConfig: solrconfig.xml
   [junit4]   2> 1360994 T2723 oasc.SolrConfig.<init> Loaded SolrConfig: solrconfig.xml
   [junit4]   2> 1360994 T2737 oasc.SolrConfig.<init> Loaded SolrConfig: solrconfig.xml
   [junit4]   2> 1360995 T2696 oasc.SolrConfig.<init> Loaded SolrConfig: solrconfig.xml
   [junit4]   2> 1361095 T2723 oass.IndexSchema.readSchema Reading Solr Schema from schema.xml
   [junit4]   2> 1361096 T2737 oass.IndexSchema.readSchema Reading Solr Schema from schema.xml
   [junit4]   2> 1361096 T2696 oass.IndexSchema.readSchema Reading Solr Schema from schema.xml
   [junit4]   2> 1361096 T2709 oass.IndexSchema.readSchema Reading Solr Schema from schema.xml
   [junit4]   2> 1361103 T2723 oass.IndexSchema.readSchema [nodes_used_collection_shard1_replica2] Schema name=test
   [junit4]   2> 1361103 T2737 oass.IndexSchema.readSchema [nodes_used_collection_shard2_replica2] Schema name=test
   [junit4]   2> 1361104 T2709 oass.IndexSchema.readSchema [nodes_used_collection_shard1_replica1] Schema name=test
   [junit4]   2> 1361104 T2696 oass.IndexSchema.readSchema [nodes_used_collection_shard2_replica1] Schema name=test
   [junit4]   2> 1361695 T2737 oass.OpenExchangeRatesOrgProvider.init Initialized with rates=open-exchange-rates.json, refreshInterval=1440.
   [junit4]   2> 1361706 T2737 oass.IndexSchema.readSchema default search field in schema is text
   [junit4]   2> 1361709 T2737 oass.IndexSchema.readSchema unique key field: id
   [junit4]   2> 1361742 T2737 oass.FileExchangeRateProvider.reload Reloading exchange rates from file currency.xml
   [junit4]   2> 1361747 T2737 oass.FileExchangeRateProvider.reload Reloading exchange rates from file currency.xml
   [junit4]   2> 1361751 T2737 oass.OpenExchangeRatesOrgProvider.reload Reloading exchange rates from open-exchange-rates.json
   [junit4]   2> 1361752 T2737 oass.OpenExchangeRatesOrgProvider$OpenExchangeRates.<init> WARN Unknown key IMPORTANT NOTE
   [junit4]   2> 1361753 T2737 oass.OpenExchangeRatesOrgProvider$OpenExchangeRates.<init> WARN Expected key, got STRING
   [junit4]   2> 1361753 T2737 oass.OpenExchangeRatesOrgProvider.reload Reloading exchange rates from open-exchange-rates.json
   [junit4]   2> 1361754 T2737 oass.OpenExchangeRatesOrgProvider$OpenExchangeRates.<init> WARN Unknown key IMPORTANT NOTE
   [junit4]   2> 1361754 T2737 oass.OpenExchangeRatesOrgProvider$OpenExchangeRates.<init> WARN Expected key, got STRING
   [junit4]   2> 1361754 T2737 oasc.SolrCore.initDirectoryFactory org.apache.solr.core.MockDirectoryFactory
   [junit4]   2> 1361755 T2737 oasc.SolrCore.<init> [nodes_used_collection_shard2_replica2] Opening new SolrCore at /usr/home/hudson/hudson-slave/workspace/Lucene-Solr-NightlyTests-trunk/solr/build/solr-core/test/J0/./org.apache.solr.cloud.CollectionsAPIDistributedZkTest-jetty4-1375507426226/nodes_used_collection_shard2_replica2/, dataDir=/usr/home/hudson/hudson-slave/workspace/Lucene-Solr-NightlyTests-trunk/solr/build/solr-core/test/J0/./org.apache.solr.cloud.CollectionsAPIDistributedZkTest-jetty4-1375507426226//nodes_used_collection_shard2_replica2/data/
   [junit4]   2> 1361755 T2737 oasc.JmxMonitoredMap.<init> JMX monitoring is enabled. Adding Solr mbeans to JMX Server: com.sun.jmx.mbeanserver.JmxMBeanServer@5cc52c62
   [junit4]   2> 1361756 T2737 oasc.CachingDirectoryFactory.get return new directory for /usr/home/hudson/hudson-slave/workspace/Lucene-Solr-NightlyTests-trunk/solr/build/solr-core/test/J0/./org.apache.solr.cloud.CollectionsAPIDistributedZkTest-jetty4-1375507426226//nodes_used_collection_shard2_replica2/data
   [junit4]   2> 1361756 T2737 oasc.SolrCore.getNewIndexDir New index directory detected: old=null new=/usr/home/hudson/hudson-slave/workspace/Lucene-Solr-NightlyTests-trunk/solr/build/solr-core/test/J0/./org.apache.solr.cloud.CollectionsAPIDistributedZkTest-jetty4-1375507426226//nodes_used_collection_shard2_replica2/data/index/
   [junit4]   2> 1361756 T2737 oasc.SolrCore.initIndex WARN [nodes_used_collection_shard2_replica2] Solr index directory '/usr/home/hudson/hudson-slave/workspace/Lucene-Solr-NightlyTests-trunk/solr/build/solr-core/test/J0/./org.apache.solr.cloud.CollectionsAPIDistributedZkTest-jetty4-1375507426226/nodes_used_collection_shard2_replica2/data/index' doesn't exist. Creating new index...
   [junit4]   2> 1361757 T2737 oasc.CachingDirectoryFactory.get return new directory for /usr/home/hudson/hudson-slave/workspace/Lucene-Solr-NightlyTests-trunk/solr/build/solr-core/test/J0/./org.apache.solr.cloud.CollectionsAPIDistributedZkTest-jetty4-1375507426226//nodes_used_collection_shard2_replica2/data/index
   [junit4]   2> 1361762 T2737 oasc.SolrDeletionPolicy.onCommit SolrDeletionPolicy.onCommit: commits: num=1
   [junit4]   2> 		commit{dir=MockDirWrapper(org.apache.lucene.store.RAMDirectory@5fa42f1f lockFactory=org.apache.lucene.store.NativeFSLockFactory@79422680),segFN=segments_1,generation=1}
   [junit4]   2> 1361762 T2737 oasc.SolrDeletionPolicy.updateCommits newest commit generation = 1
   [junit4]   2> 1361766 T2737 oasup.UpdateRequestProcessorChain.init inserting DistributedUpdateProcessorFactory into updateRequestProcessorChain "dedupe"
   [junit4]   2> 1361766 T2737 oasup.UpdateRequestProcessorChain.init inserting DistributedUpdateProcessorFactory into updateRequestProcessorChain "stored_sig"
   [junit4]   2> 1361767 T2737 oasup.UpdateRequestProcessorChain.init inserting DistributedUpdateProcessorFactory into updateRequestProcessorChain "distrib-dup-test-chain-implicit"
   [junit4]   2> 1361768 T2737 oasc.RequestHandlers.initHandlersFromConfig created standard: solr.StandardRequestHandler
   [junit4]   2> 1361768 T2737 oasc.RequestHandlers.initHandlersFromConfig created /get: solr.RealTimeGetHandler
   [junit4]   2> 1361768 T2737 oasc.RequestHandlers.initHandlersFromConfig adding lazy requestHandler: solr.ReplicationHandler
   [junit4]   2> 1361769 T2737 oasc.RequestHandlers.initHandlersFromConfig created /replication: solr.ReplicationHandler
   [junit4]   2> 1361769 T2737 oasc.RequestHandlers.initHandlersFromConfig created /update: solr.UpdateRequestHandler
   [junit4]   2> 1361769 T2737 oasc.RequestHandlers.initHandlersFromConfig created /admin/: org.apache.solr.handler.admin.AdminHandlers
   [junit4]   2> 1361779 T2709 oass.OpenExchangeRatesOrgProvider.init Initialized with rates=open-exchange-rates.json, refreshInterval=1440.
   [junit4]   2> 1361780 T2696 oass.OpenExchangeRatesOrgProvider.init Initialized with rates=open-exchange-rates.json, refreshInterval=1440.
   [junit4]   2> 1361786 T2737 oashl.XMLLoader.init xsltCacheLifetimeSeconds=60
   [junit4]   2> 1361789 T2723 oass.OpenExchangeRatesOrgProvider.init Initialized with rates=open-exchange-rates.json, refreshInterval=1440.
   [junit4]   2> 1361789 T2737 oass.SolrIndexSearcher.<init> Opening Searcher@54e5e10c main
   [junit4]   2> 1361789 T2709 oass.IndexSchema.readSchema default search field in schema is text
   [junit4]   2> 1361791 T2696 oass.IndexSchema.readSchema default search field in schema is text
   [junit4]   2> 1361791 T2737 oasu.CommitTracker.<init> Hard AutoCommit: disabled
   [junit4]   2> 1361791 T2737 oasu.CommitTracker.<init> Soft AutoCommit: disabled
   [junit4]   2> 1361793 T2709 oass.IndexSchema.readSchema unique key field: id
   [junit4]   2> 1361794 T2753 oasc.SolrCore.registerSearcher [nodes_used_collection_shard2_replica2] Registered new searcher Searcher@54e5e10c main{StandardDirectoryReader(segments_1:1)}
   [junit4]   2> 1361795 T2737 oasc.CoreContainer.registerCore registering core: nodes_used_collection_shard2_replica2
   [junit4]   2> 1361795 T2696 oass.IndexSchema.readSchema unique key field: id
   [junit4]   2> 1361795 T2737 oasc.ZkController.register Register replica - core:nodes_used_collection_shard2_replica2 address:http://127.0.0.1:14397/bx collection:nodes_used_collection shard:shard2
   [junit4]   2> 1361796 T2737 oascsi.HttpClientUtil.createClient Creating new http client, config:maxConnections=10000&maxConnectionsPerHost=20&connTimeout=15000&socketTimeout=30000&retry=false
   [junit4]   2> 1361797 T2723 oass.IndexSchema.readSchema default search field in schema is text
   [junit4]   2> 1361801 T2723 oass.IndexSchema.readSchema unique key field: id
   [junit4]   2> 1361805 T2709 oass.FileExchangeRateProvider.reload Reloading exchange rates from file currency.xml
   [junit4]   2> 1361807 T2696 oass.FileExchangeRateProvider.reload Reloading exchange rates from file currency.xml
   [junit4]   2> 1361811 T2737 oascc.SolrZkClient.makePath makePath: /collections/nodes_used_collection/leader_elect/shard2/election
   [junit4]   2> 1361824 T2709 oass.FileExchangeRateProvider.reload Reloading exchange rates from file currency.xml
   [junit4]   2> 1361824 T2696 oass.FileExchangeRateProvider.reload Reloading exchange rates from file currency.xml
   [junit4]   2> 1361920 T2709 oass.OpenExchangeRatesOrgProvider.reload Reloading exchange rates from open-exchange-rates.json
   [junit4]   2> 1361920 T2696 oass.OpenExchangeRatesOrgProvider.reload Reloading exchange rates from open-exchange-rates.json
   [junit4]   2> 1361924 T2709 oass.OpenExchangeRatesOrgProvider$OpenExchangeRates.<init> WARN Unknown key IMPORTANT NOTE
   [junit4]   2> 1361924 T2696 oass.OpenExchangeRatesOrgProvider$OpenExchangeRates.<init> WARN Unknown key IMPORTANT NOTE
   [junit4]   2> 1361925 T2723 oass.FileExchangeRateProvider.reload Reloading exchange rates from file currency.xml
   [junit4]   2> 1361925 T2709 oass.OpenExchangeRatesOrgProvider$OpenExchangeRates.<init> WARN Expected key, got STRING
   [junit4]   2> 1361925 T2696 oass.OpenExchangeRatesOrgProvider$OpenExchangeRates.<init> WARN Expected key, got STRING
   [junit4]   2> 1361925 T2709 oass.OpenExchangeRatesOrgProvider.reload Reloading exchange rates from open-exchange-rates.json
   [junit4]   2> 1361926 T2696 oass.OpenExchangeRatesOrgProvider.reload Reloading exchange rates from open-exchange-rates.json
   [junit4]   2> 1361932 T2696 oass.OpenExchangeRatesOrgProvider$OpenExchangeRates.<init> WARN Unknown key IMPORTANT NOTE
   [junit4]   2> 1361932 T2709 oass.OpenExchangeRatesOrgProvider$OpenExchangeRates.<init> WARN Unknown key IMPORTANT NOTE
   [junit4]   2> 1361932 T2696 oass.OpenExchangeRatesOrgProvider$OpenExchangeRates.<init> WARN Expected key, got STRING
   [junit4]   2> 1361933 T2709 oass.OpenExchangeRatesOrgProvider$OpenExchangeRates.<init> WARN Expected key, got STRING
   [junit4]   2> 1361933 T2696 oasc.SolrCore.initDirectoryFactory org.apache.solr.core.MockDirectoryFactory
   [junit4]   2> 1361933 T2709 oasc.SolrCore.initDirectoryFactory org.apache.solr.core.MockDirectoryFactory
   [junit4]   2> 1361933 T2696 oasc.SolrCore.<init> [nodes_used_collection_shard2_replica1] Opening new SolrCore at /usr/home/hudson/hudson-slave/workspace/Lucene-Solr-NightlyTests-trunk/solr/build/solr-core/test/J0/./org.apache.solr.cloud.CollectionsAPIDistributedZkTest-jetty1-1375507421101/nodes_used_collection_shard2_replica1/, dataDir=/usr/home/hudson/hudson-slave/workspace/Lucene-Solr-NightlyTests-trunk/solr/build/solr-core/test/J0/./org.apache.solr.cloud.CollectionsAPIDistributedZkTest-jetty1-1375507421101//nodes_used_collection_shard2_replica1/data/
   [junit4]   2> 1361934 T2709 oasc.SolrCore.<init> [nodes_used_collection_shard1_replica1] Opening new SolrCore at /usr/home/hudson/hudson-slave/workspace/Lucene-Solr-NightlyTests-trunk/solr/build/solr-core/test/J0/./org.apache.solr.cloud.CollectionsAPIDistributedZkTest-jetty2-1375507422997/nodes_used_collection_shard1_replica1/, dataDir=/usr/home/hudson/hudson-slave/workspace/Lucene-Solr-NightlyTests-trunk/solr/build/solr-core/test/J0/./org.apache.solr.cloud.CollectionsAPIDistributedZkTest-jetty2-1375507422997//nodes_used_collection_shard1_replica1/data/
   [junit4]   2> 1361934 T2696 oasc.JmxMonitoredMap.<init> JMX monitoring is enabled. Adding Solr mbeans to JMX Server: com.sun.jmx.mbeanserver.JmxMBeanServer@5cc52c62
   [junit4]   2> 1361934 T2709 oasc.JmxMonitoredMap.<init> JMX monitoring is enabled. Adding Solr mbeans to JMX Server: com.sun.jmx.mbeanserver.JmxMBeanServer@5cc52c62
   [junit4]   2> 1361935 T2696 oasc.CachingDirectoryFactory.get return new directory for /usr/home/hudson/hudson-slave/workspace/Lucene-Solr-NightlyTests-trunk/solr/build/solr-core/test/J0/./org.apache.solr.cloud.CollectionsAPIDistributedZkTest-jetty1-1375507421101//nodes_used_collection_shard2_replica1/data
   [junit4]   2> 1361935 T2709 oasc.CachingDirectoryFactory.get return new directory for /usr/home/hudson/hudson-slave/workspace/Lucene-Solr-NightlyTests-trunk/solr/build/solr-core/test/J0/./org.apache.solr.cloud.CollectionsAPIDistributedZkTest-jetty2-1375507422997//nodes_used_collection_shard1_replica1/data
   [junit4]   2> 1361935 T2696 oasc.SolrCore.getNewIndexDir New index directory detected: old=null new=/usr/home/hudson/hudson-slave/workspace/Lucene-Solr-NightlyTests-trunk/solr/build/solr-core/test/J0/./org.apache.solr.cloud.CollectionsAPIDistributedZkTest-jetty1-1375507421101//nodes_used_collection_shard2_replica1/data/index/
   [junit4]   2> 1361935 T2709 oasc.SolrCore.getNewIndexDir New index directory detected: old=null new=/usr/home/hudson/hudson-slave/workspace/Lucene-Solr-NightlyTests-trunk/solr/build/solr-core/test/J0/./org.apache.solr.cloud.CollectionsAPIDistributedZkTest-jetty2-1375507422997//nodes_used_collection_shard1_replica1/data/index/
   [junit4]   2> 1361936 T2696 oasc.SolrCore.initIndex WARN [nodes_used_collection_shard2_replica1] Solr index directory '/usr/home/hudson/hudson-slave/workspace/Lucene-Solr-NightlyTests-trunk/solr/build/solr-core/test/J0/./org.apache.solr.cloud.CollectionsAPIDistributedZkTest-jetty1-1375507421101/nodes_used_collection_shard2_replica1/data/index' doesn't exist. Creating new index...
   [junit4]   2> 1361936 T2709 oasc.SolrCore.initIndex WARN [nodes_used_collection_shard1_replica1] Solr index directory '/usr/home/hudson/hudson-slave/workspace/Lucene-Solr-NightlyTests-trunk/solr/build/solr-core/test/J0/./org.apache.solr.cloud.CollectionsAPIDistributedZkTest-jetty2-1375507422997/nodes_used_collection_shard1_replica1/data/index' doesn't exist. Creating new index...
   [junit4]   2> 1361936 T2696 oasc.CachingDirectoryFactory.get return new directory for /usr/home/hudson/hudson-slave/workspace/Lucene-Solr-NightlyTests-trunk/solr/build/solr-core/test/J0/./org.apache.solr.cloud.CollectionsAPIDistributedZkTest-jetty1-1375507421101//nodes_used_collection_shard2_replica1/data/index
   [junit4]   2> 1361937 T2709 oasc.CachingDirectoryFactory.get return new directory for /usr/home/hudson/hudson-slave/workspace/Lucene-Solr-NightlyTests-trunk/solr/build/solr-core/test/J0/./org.apache.solr.cloud.CollectionsAPIDistributedZkTest-jetty2-1375507422997//nodes_used_collection_shard1_replica1/data/index
   [junit4]   2> 1361936 T2723 oass.FileExchangeRateProvider.reload Reloading exchange rates from file currency.xml
   [junit4]   2> 1361940 T2709 oasc.SolrDeletionPolicy.onCommit SolrDeletionPolicy.onCommit: commits: num=1
   [junit4]   2> 		commit{dir=MockDirWrapper(org.apache.lucene.store.RAMDirectory@7dd51ac6 lockFactory=org.apache.lucene.store.NativeFSLockFactory@1a3f1e83),segFN=segments_1,generation=1}
   [junit4]   2> 1361940 T2696 oasc.SolrDeletionPolicy.onCommit SolrDeletionPolicy.onCommit: commits: num=1
   [junit4]   2> 		commit{dir=MockDirWrapper(org.apache.lucene.store.RAMDirectory@5f843147 lockFactory=org.apache.lucene.store.NativeFSLockFactory@6a16ae1e),segFN=segments_1,generation=1}
   [junit4]   2> 1361940 T2709 oasc.SolrDeletionPolicy.updateCommits newest commit generation = 1
   [junit4]   2> 1361940 T2696 oasc.SolrDeletionPolicy.updateCommits newest commit generation = 1
   [junit4]   2> 1361944 T2709 oasup.UpdateRequestProcessorChain.init inserting DistributedUpdateProcessorFactory into updateRequestProcessorChain "dedupe"
   [junit4]   2> 1361944 T2696 oasup.UpdateRequestProcessorChain.init inserting DistributedUpdateProcessorFactory into updateRequestProcessorChain "dedupe"
   [junit4]   2> 1361944 T2709 oasup.UpdateRequestProcessorChain.init inserting DistributedUpdateProcessorFactory into updateRequestProcessorChain "stored_sig"
   [junit4]   2> 1361944 T2696 oasup.UpdateRequestProcessorChain.init inserting DistributedUpdateProcessorFactory into updateRequestProcessorChain "stored_sig"
   [junit4]   2> 1361945 T2709 oasup.UpdateRequestProcessorChain.init inserting DistributedUpdateProcessorFactory into updateRequestProcessorChain "distrib-dup-test-chain-implicit"
   [junit4]   2> 1361945 T2696 oasup.UpdateRequestProcessorChain.init inserting DistributedUpdateProcessorFactory into updateRequestProcessorChain "distrib-dup-test-chain-implicit"
   [junit4]   2> 1361945 T2709 oasc.RequestHandlers.initHandlersFromConfig created standard: solr.StandardRequestHandler
   [junit4]   2> 1361945 T2696 oasc.RequestHandlers.initHandlersFromConfig created standard: solr.StandardRequestHandler
   [junit4]   2> 1361946 T2709 oasc.RequestHandlers.initHandlersFromConfig created /get: solr.RealTimeGetHandler
   [junit4]   2> 1361946 T2709 oasc.RequestHandlers.initHandlersFromConfig adding lazy requestHandler: solr.ReplicationHandler
   [junit4]   2> 1361946 T2696 oasc.RequestHandlers.initHandlersFromConfig created /get: solr.RealTimeGetHandler
   [junit4]   2> 1361946 T2709 oasc.RequestHandlers.initHandlersFromConfig created /replication: solr.ReplicationHandler
   [junit4]   2> 1361946 T2696 oasc.RequestHandlers.initHandlersFromConfig adding lazy requestHandler: solr.ReplicationHandler
   [junit4]   2> 1361947 T2709 oasc.RequestHandlers.initHandlersFromConfig created /update: solr.UpdateRequestHandler
   [junit4]   2> 1361947 T2696 oasc.RequestHandlers.initHandlersFromConfig created /replication: solr.ReplicationHandler
   [junit4]   2> 1361947 T2709 oasc.RequestHandlers.initHandlersFromConfig created /admin/: org.apache.solr.handler.admin.AdminHandlers
   [junit4]   2> 1361954 T2696 oasc.RequestHandlers.initHandlersFromConfig created /update: solr.UpdateRequestHandler
   [junit4]   2> 1361954 T2696 oasc.RequestHandlers.initHandlersFromConfig created /admin/: org.apache.solr.handler.admin.AdminHandlers
   [junit4]   2> 1361973 T2696 oashl.XMLLoader.init xsltCacheLifetimeSeconds=60
   [junit4]   2> 1361974 T2709 oashl.XMLLoader.init xsltCacheLifetimeSeconds=60
   [junit4]   2> 1361979 T2696 oass.SolrIndexSearcher.<init> Opening Searcher@2bf12341 main
   [junit4]   2> 1361980 T2709 oass.SolrIndexSearcher.<init> Opening Searcher@258dfee7 main
   [junit4]   2> 1361981 T2696 oasu.CommitTracker.<init> Hard AutoCommit: disabled
   [junit4]   2> 1361981 T2696 oasu.CommitTracker.<init> Soft AutoCommit: disabled
   [junit4]   2> 1361982 T2709 oasu.CommitTracker.<init> Hard AutoCommit: disabled
   [junit4]   2> 1361982 T2709 oasu.CommitTracker.<init> Soft AutoCommit: disabled
   [junit4]   2> 1361984 T2754 oasc.SolrCore.registerSearcher [nodes_used_collection_shard2_replica1] Registered new searcher Searcher@2bf12341 main{StandardDirectoryReader(segments_1:1)}
   [junit4]   2> 1361984 T2696 oasc.CoreContainer.registerCore registering core: nodes_used_collection_shard2_replica1
   [junit4]   2> 1361985 T2696 oasc.ZkController.register Register replica - core:nodes_used_collection_shard2_replica1 address:http://127.0.0.1:14388/bx collection:nodes_used_collection shard:shard2
   [junit4]   2> 1361985 T2696 oascsi.HttpClientUtil.createClient Creating new http client, config:maxConnections=10000&maxConnectionsPerHost=20&connTimeout=15000&socketTimeout=30000&retry=false
   [junit4]   2> 1361986 T2755 oasc.SolrCore.registerSearcher [nodes_used_collection_shard1_replica1] Registered new searcher Searcher@258dfee7 main{StandardDirectoryReader(segments_1:1)}
   [junit4]   2> 1361988 T2709 oasc.CoreContainer.registerCore registering core: nodes_used_collection_shard1_replica1
   [junit4]   2> 1361988 T2709 oasc.ZkController.register Register replica - core:nodes_used_collection_shard1_replica1 address:http://127.0.0.1:14391/bx collection:nodes_used_collection shard:shard1
   [junit4]   2> 1361988 T2709 oascsi.HttpClientUtil.createClient Creating new http client, config:maxConnections=10000&maxConnectionsPerHost=20&connTimeout=15000&socketTimeout=30000&retry=false
   [junit4]   2> 1361992 T2737 oasc.ShardLeaderElectionContext.runLeaderProcess Running the leader process for shard shard2
   [junit4]   2> 1362008 T2723 oass.OpenExchangeRatesOrgProvider.reload Reloading exchange rates from open-exchange-rates.json
   [junit4]   2> 1362019 T2709 oascc.SolrZkClient.makePath makePath: /collections/nodes_used_collection/leader_elect/shard1/election
   [junit4]   2> 1362020 T2723 oass.OpenExchangeRatesOrgProvider$OpenExchangeRates.<init> WARN Unknown key IMPORTANT NOTE
   [junit4]   2> 1362020 T2723 oass.OpenExchangeRatesOrgProvider$OpenExchangeRates.<init> WARN Expected key, got STRING
   [junit4]   2> 1362021 T2723 oass.OpenExchangeRatesOrgProvider.reload Reloading exchange rates from open-exchange-rates.json
   [junit4]   2> 1362083 T2737 oasc.ShardLeaderElectionContext.waitForReplicasToComeUp Enough replicas found to continue.
   [junit4]   2> 1362083 T2723 oass.OpenExchangeRatesOrgProvider$OpenExchangeRates.<init> WARN Unknown key IMPORTANT NOTE
   [junit4]   2> 1362083 T2737 oasc.ShardLeaderElectionContext.runLeaderProcess I may be the new leader - try and sync
   [junit4]   2> 1362083 T2723 oass.OpenExchangeRatesOrgProvider$OpenExchangeRates.<init> WARN Expected key, got STRING
   [junit4]   2> 1362084 T2737 oasc.SyncStrategy.sync Sync replicas to http://127.0.0.1:14397/bx/nodes_used_collection_shard2_replica2/
   [junit4]   2> 1362084 T2723 oasc.SolrCore.initDirectoryFactory org.apache.solr.core.MockDirectoryFactory
   [junit4]   2> 1362084 T2737 oasu.PeerSync.sync PeerSync: core=nodes_used_collection_shard2_replica2 url=http://127.0.0.1:14397/bx START replicas=[http://127.0.0.1:14388/bx/nodes_used_collection_shard2_replica1/] nUpdates=100
   [junit4]   2> 1362084 T2723 oasc.SolrCore.<init> [nodes_used_collection_shard1_replica2] Opening new SolrCore at /usr/home/hudson/hudson-slave/workspace/Lucene-Solr-NightlyTests-trunk/solr/build/solr-core/test/J0/./org.apache.solr.cloud.CollectionsAPIDistributedZkTest-jetty3-1375507424600/nodes_used_collection_shard1_replica2/, dataDir=/usr/home/hudson/hudson-slave/workspace/Lucene-Solr-NightlyTests-trunk/solr/build/solr-core/test/J0/./org.apache.solr.cloud.CollectionsAPIDistributedZkTest-jetty3-1375507424600//nodes_used_collection_shard1_replica2/data/
   [junit4]   2> 1362085 T2737 oasu.PeerSync.sync PeerSync: core=nodes_used_collection_shard2_replica2 url=http://127.0.0.1:14397/bx DONE.  We have no versions.  sync failed.
   [junit4]   2> 1362085 T2737 oasc.SyncStrategy.syncReplicas Leader's attempt to sync with shard failed, moving to the next candidate
   [junit4]   2> 1362085 T2723 oasc.JmxMonitoredMap.<init> JMX monitoring is enabled. Adding Solr mbeans to JMX Server: com.sun.jmx.mbeanserver.JmxMBeanServer@5cc52c62
   [junit4]   2> 1362085 T2737 oasc.ShardLeaderElectionContext.runLeaderProcess We failed sync, but we have no versions - we can't sync in that case - we were active before, so become leader anyway
   [junit4]   2> 1362086 T2737 oasc.ShardLeaderElectionContext.runLeaderProcess I am the new leader: http://127.0.0.1:14397/bx/nodes_used_collection_shard2_replica2/ shard2
   [junit4]   2> 1362086 T2737 oascc.SolrZkClient.makePath makePath: /collections/nodes_used_collection/leaders/shard2
   [junit4]   2> 1362086 T2723 oasc.CachingDirectoryFactory.get return new directory for /usr/home/hudson/hudson-slave/workspace/Lucene-Solr-NightlyTests-trunk/solr/build/solr-core/test/J0/./org.apache.solr.cloud.CollectionsAPIDistributedZkTest-jetty3-1375507424600//nodes_used_collection_shard1_replica2/data
   [junit4]   2> 1362086 T2723 oasc.SolrCore.getNewIndexDir New index directory detected: old=null new=/usr/home/hudson/hudson-slave/workspace/Lucene-Solr-NightlyTests-trunk/solr/build/solr-core/test/J0/./org.apache.solr.cloud.CollectionsAPIDistributedZkTest-jetty3-1375507424600//nodes_used_collection_shard1_replica2/data/index/
   [junit4]   2> 1362087 T2723 oasc.SolrCore.initIndex WARN [nodes_used_collection_shard1_replica2] Solr index directory '/usr/home/hudson/hudson-slave/workspace/Lucene-Solr-NightlyTests-trunk/solr/build/solr-core/test/J0/./org.apache.solr.cloud.CollectionsAPIDistributedZkTest-jetty3-1375507424600/nodes_used_collection_shard1_replica2/data/index' doesn't exist. Creating new index...
   [junit4]   2> 1362087 T2723 oasc.CachingDirectoryFactory.get return new directory for /usr/home/hudson/hudson-slave/workspace/Lucene-Solr-NightlyTests-trunk/solr/build/solr-core/test/J0/./org.apache.solr.cloud.CollectionsAPIDistributedZkTest-jetty3-1375507424600//nodes_used_collection_shard1_replica2/data/index
   [junit4]   2> 1362091 T2723 oasc.SolrDeletionPolicy.onCommit SolrDeletionPolicy.onCommit: commits: num=1
   [junit4]   2> 		commit{dir=MockDirWrapper(org.apache.lucene.store.RAMDirectory@48de9086 lockFactory=org.apache.lucene.store.NativeFSLockFactory@149c0694),segFN=segments_1,generation=1}
   [junit4]   2> 1362091 T2723 oasc.SolrDeletionPolicy.updateCommits newest commit generation = 1
   [junit4]   2> 1362094 T2723 oasup.UpdateRequestProcessorChain.init inserting DistributedUpdateProcessorFactory into updateRequestProcessorChain "dedupe"
   [junit4]   2> 1362095 T2723 oasup.UpdateRequestProcessorChain.init inserting DistributedUpdateProcessorFactory into updateRequestProcessorChain "stored_sig"
   [junit4]   2> 1362095 T2723 oasup.UpdateRequestProcessorChain.init inserting DistributedUpdateProcessorFactory into updateRequestProcessorChain "distrib-dup-test-chain-implicit"
   [junit4]   2> 1362096 T2723 oasc.RequestHandlers.initHandlersFromConfig created standard: solr.StandardRequestHandler
   [junit4]   2> 1362096 T2723 oasc.RequestHandlers.initHandlersFromConfig created /get: solr.RealTimeGetHandler
   [junit4]   2> 1362096 T2723 oasc.RequestHandlers.initHandlersFromConfig adding lazy requestHandler: solr.ReplicationHandler
   [junit4]   2> 1362097 T2723 oasc.RequestHandlers.initHandlersFromConfig created /replication: solr.ReplicationHandler
   [junit4]   2> 1362097 T2723 oasc.RequestHandlers.initHandlersFromConfig created /update: solr.UpdateRequestHandler
   [junit4]   2> ASYNC  NEW_CORE C801 name=nodes_used_collection_shard2_replica1 org.apache.solr.core.SolrCore@17720441 url=http://127.0.0.1:14388/bx/nodes_used_collection_shard2_replica1 node=127.0.0.1:14388_bx C801_STATE=coll:nodes_used_collection core:nodes_used_collection_shard2_replica1 props:{state=down, core=nodes_used_collection_shard2_replica1, node_name=127.0.0.1:14388_bx, base_url=http://127.0.0.1:14388/bx}
   [junit4]   2> 1362098 T2697 C801 P14388 oasc.SolrCore.execute [nodes_used_collection_shard2_replica1] webapp=/bx path=/get params={getVersions=100&distrib=false&wt=javabin&qt=/get&version=2} status=0 QTime=1 
   [junit4]   2> 1362098 T2723 oasc.RequestHandlers.initHandlersFromConfig created /admin/: org.apache.solr.handler.admin.AdminHandlers
   [junit4]   2> 1362109 T2723 oashl.XMLLoader.init xsltCacheLifetimeSeconds=60
   [junit4]   2> 1362112 T2723 oass.SolrIndexSearcher.<init> Opening Searcher@75e0a17a main
   [junit4]   2> 1362113 T2723 oasu.CommitTracker.<init> Hard AutoCommit: disabled
   [junit4]   2> 1362113 T2723 oasu.CommitTracker.<init> Soft AutoCommit: disabled
   [junit4]   2> 1362116 T2757 oasc.SolrCore.registerSearcher [nodes_used_collection_shard1_replica2] Registered new searcher Searcher@75e0a17a main{StandardDirectoryReader(segments_1:1)}
   [junit4]   2> 1362117 T2723 oasc.CoreContainer.registerCore registering core: nodes_used_collection_shard1_replica2
   [junit4]   2> 1362117 T2723 oasc.ZkController.register Register replica - core:nodes_used_collection_shard1_replica2 address:http://127.0.0.1:14394/bx collection:nodes_used_collection shard:shard1
   [junit4]   2> 1362117 T2723 oascsi.HttpClientUtil.createClient Creating new http client, config:maxConnections=10000&maxConnectionsPerHost=20&connTimeout=15000&socketTimeout=30000&retry=false
   [junit4]   2> 1362212 T2723 oasc.ShardLeaderElectionContext.runLeaderProcess Running the leader process for shard shard1
   [junit4]   2> 1362232 T2723 oasc.ShardLeaderElectionContext.waitForReplicasToComeUp Enough replicas found to continue.
   [junit4]   2> 1362233 T2723 oasc.ShardLeaderElectionContext.runLeaderProcess I may be the new leader - try and sync
   [junit4]   2> 1362233 T2723 oasc.SyncStrategy.sync Sync replicas to http://127.0.0.1:14394/bx/nodes_used_collection_shard1_replica2/
   [junit4]   2> 1362233 T2723 oasu.PeerSync.sync PeerSync: core=nodes_used_collection_shard1_replica2 url=http://127.

[...truncated too long message...]

org.apache.solr.common.cloud.ZkCmdExecutor.retryOperation(ZkCmdExecutor.java:65)
   [junit4]   2> 	at org.apache.solr.common.cloud.SolrZkClient.getChildren(SolrZkClient.java:232)
   [junit4]   2> 	at org.apache.solr.cloud.LeaderElector.checkIfIamLeader(LeaderElector.java:84)
   [junit4]   2> 	at org.apache.solr.cloud.LeaderElector.access$000(LeaderElector.java:55)
   [junit4]   2> 	at org.apache.solr.cloud.LeaderElector$1.process(LeaderElector.java:129)
   [junit4]   2> 	at org.apache.zookeeper.ClientCnxn$EventThread.processEvent(ClientCnxn.java:519)
   [junit4]   2> 	at org.apache.zookeeper.ClientCnxn$EventThread.run(ClientCnxn.java:495)
   [junit4]   2> 
   [junit4]   2> 1535640 T2747 oascc.ZkStateReader$2.process A cluster state change: WatchedEvent state:SyncConnected type:NodeDataChanged path:/clusterstate.json, has occurred - updating... (live nodes size: 3)
   [junit4]   2> 1535640 T2747 oascc.ZkStateReader$2.process WARN ZooKeeper watch triggered, but Solr cannot talk to ZK
   [junit4]   2> 1535641 T2747 oasc.LeaderElector$1.process WARN  org.apache.zookeeper.KeeperException$SessionExpiredException: KeeperErrorCode = Session expired for /collections/new_implicit_coll_0/leader_elect/b/election
   [junit4]   2> 	at org.apache.zookeeper.KeeperException.create(KeeperException.java:127)
   [junit4]   2> 	at org.apache.zookeeper.KeeperException.create(KeeperException.java:51)
   [junit4]   2> 	at org.apache.zookeeper.ZooKeeper.getChildren(ZooKeeper.java:1468)
   [junit4]   2> 	at org.apache.solr.common.cloud.SolrZkClient$6.execute(SolrZkClient.java:235)
   [junit4]   2> 	at org.apache.solr.common.cloud.SolrZkClient$6.execute(SolrZkClient.java:232)
   [junit4]   2> 	at org.apache.solr.common.cloud.ZkCmdExecutor.retryOperation(ZkCmdExecutor.java:65)
   [junit4]   2> 	at org.apache.solr.common.cloud.SolrZkClient.getChildren(SolrZkClient.java:232)
   [junit4]   2> 	at org.apache.solr.cloud.LeaderElector.checkIfIamLeader(LeaderElector.java:84)
   [junit4]   2> 	at org.apache.solr.cloud.LeaderElector.access$000(LeaderElector.java:55)
   [junit4]   2> 	at org.apache.solr.cloud.LeaderElector$1.process(LeaderElector.java:129)
   [junit4]   2> 	at org.apache.zookeeper.ClientCnxn$EventThread.processEvent(ClientCnxn.java:519)
   [junit4]   2> 	at org.apache.zookeeper.ClientCnxn$EventThread.run(ClientCnxn.java:495)
   [junit4]   2> 
   [junit4]   2> 1535641 T2747 oasc.LeaderElector$1.process WARN  org.apache.zookeeper.KeeperException$SessionExpiredException: KeeperErrorCode = Session expired for /collections/new_implicit_coll_1/leader_elect/c/election
   [junit4]   2> 	at org.apache.zookeeper.KeeperException.create(KeeperException.java:127)
   [junit4]   2> 	at org.apache.zookeeper.KeeperException.create(KeeperException.java:51)
   [junit4]   2> 	at org.apache.zookeeper.ZooKeeper.getChildren(ZooKeeper.java:1468)
   [junit4]   2> 	at org.apache.solr.common.cloud.SolrZkClient$6.execute(SolrZkClient.java:235)
   [junit4]   2> 	at org.apache.solr.common.cloud.SolrZkClient$6.execute(SolrZkClient.java:232)
   [junit4]   2> 	at org.apache.solr.common.cloud.ZkCmdExecutor.retryOperation(ZkCmdExecutor.java:65)
   [junit4]   2> 	at org.apache.solr.common.cloud.SolrZkClient.getChildren(SolrZkClient.java:232)
   [junit4]   2> 	at org.apache.solr.cloud.LeaderElector.checkIfIamLeader(LeaderElector.java:84)
   [junit4]   2> 	at org.apache.solr.cloud.LeaderElector.access$000(LeaderElector.java:55)
   [junit4]   2> 	at org.apache.solr.cloud.LeaderElector$1.process(LeaderElector.java:129)
   [junit4]   2> 	at org.apache.zookeeper.ClientCnxn$EventThread.processEvent(ClientCnxn.java:519)
   [junit4]   2> 	at org.apache.zookeeper.ClientCnxn$EventThread.run(ClientCnxn.java:495)
   [junit4]   2> 
   [junit4]   2> 1535642 T2747 oasc.LeaderElector$1.process WARN  org.apache.zookeeper.KeeperException$SessionExpiredException: KeeperErrorCode = Session expired for /overseer_elect/election
   [junit4]   2> 	at org.apache.zookeeper.KeeperException.create(KeeperException.java:127)
   [junit4]   2> 	at org.apache.zookeeper.KeeperException.create(KeeperException.java:51)
   [junit4]   2> 	at org.apache.zookeeper.ZooKeeper.getChildren(ZooKeeper.java:1468)
   [junit4]   2> 	at org.apache.solr.common.cloud.SolrZkClient$6.execute(SolrZkClient.java:235)
   [junit4]   2> 	at org.apache.solr.common.cloud.SolrZkClient$6.execute(SolrZkClient.java:232)
   [junit4]   2> 	at org.apache.solr.common.cloud.ZkCmdExecutor.retryOperation(ZkCmdExecutor.java:65)
   [junit4]   2> 	at org.apache.solr.common.cloud.SolrZkClient.getChildren(SolrZkClient.java:232)
   [junit4]   2> 	at org.apache.solr.cloud.LeaderElector.checkIfIamLeader(LeaderElector.java:84)
   [junit4]   2> 	at org.apache.solr.cloud.LeaderElector.access$000(LeaderElector.java:55)
   [junit4]   2> 	at org.apache.solr.cloud.LeaderElector$1.process(LeaderElector.java:129)
   [junit4]   2> 	at org.apache.zookeeper.ClientCnxn$EventThread.processEvent(ClientCnxn.java:519)
   [junit4]   2> 	at org.apache.zookeeper.ClientCnxn$EventThread.run(ClientCnxn.java:495)
   [junit4]   2> 
   [junit4]   2> 1535642 T2747 oasc.LeaderElector$1.process WARN  org.apache.zookeeper.KeeperException$SessionExpiredException: KeeperErrorCode = Session expired for /collections/new_implicit_coll_1/leader_elect/c/election
   [junit4]   2> 	at org.apache.zookeeper.KeeperException.create(KeeperException.java:127)
   [junit4]   2> 	at org.apache.zookeeper.KeeperException.create(KeeperException.java:51)
   [junit4]   2> 	at org.apache.zookeeper.ZooKeeper.getChildren(ZooKeeper.java:1468)
   [junit4]   2> 	at org.apache.solr.common.cloud.SolrZkClient$6.execute(SolrZkClient.java:235)
   [junit4]   2> 	at org.apache.solr.common.cloud.SolrZkClient$6.execute(SolrZkClient.java:232)
   [junit4]   2> 	at org.apache.solr.common.cloud.ZkCmdExecutor.retryOperation(ZkCmdExecutor.java:65)
   [junit4]   2> 	at org.apache.solr.common.cloud.SolrZkClient.getChildren(SolrZkClient.java:232)
   [junit4]   2> 	at org.apache.solr.cloud.LeaderElector.checkIfIamLeader(LeaderElector.java:84)
   [junit4]   2> 	at org.apache.solr.cloud.LeaderElector.access$000(LeaderElector.java:55)
   [junit4]   2> 	at org.apache.solr.cloud.LeaderElector$1.process(LeaderElector.java:129)
   [junit4]   2> 	at org.apache.zookeeper.ClientCnxn$EventThread.processEvent(ClientCnxn.java:519)
   [junit4]   2> 	at org.apache.zookeeper.ClientCnxn$EventThread.run(ClientCnxn.java:495)
   [junit4]   2> 
   [junit4]   2> NOTE: test params are: codec=Lucene41, sim=RandomSimilarityProvider(queryNorm=true,coord=crazy): {}, locale=en_GB, timezone=America/Indianapolis
   [junit4]   2> NOTE: FreeBSD 9.1-RELEASE-p3 amd64/Oracle Corporation 1.7.0_25 (64-bit)/cpus=16,threads=4,free=147748984,total=375455744
   [junit4]   2> NOTE: All tests run in this JVM: [SyncSliceTest, TestWriterPerf, TestDocSet, TestLRUCache, ZkControllerTest, TestCharFilters, InfoHandlerTest, ResponseLogComponentTest, SearchHandlerTest, TestSolrQueryParserDefaultOperatorResource, PolyFieldTest, RecoveryZkTest, LegacyHTMLStripCharFilterTest, HdfsBasicDistributedZkTest, QueryParsingTest, CoreAdminHandlerTest, BasicDistributedZkTest, AlternateDirectoryTest, TestSweetSpotSimilarityFactory, BinaryUpdateRequestHandlerTest, TestCoreContainer, BlockDirectoryTest, TestConfig, TestShardHandlerFactory, DistributedQueryElevationComponentTest, FileBasedSpellCheckerTest, AliasIntegrationTest, WordBreakSolrSpellCheckerTest, SolrTestCaseJ4Test, TestSchemaNameResource, TestExtendedDismaxParser, DirectUpdateHandlerOptimizeTest, SpatialFilterTest, HdfsChaosMonkeySafeLeaderTest, TestCloudManagedSchemaAddField, SOLR749Test, TestValueSourceCache, SoftAutoCommitTest, TestFaceting, ResourceLoaderTest, AutoCommitTest, TestFieldResource, TestDocumentBuilder, SimpleFacetsTest, TestRemoteStreaming, TestSolrIndexConfig, ScriptEngineTest, PreAnalyzedUpdateProcessorTest, TestQueryUtils, TestPropInjectDefaults, TestFuzzyAnalyzedSuggestions, TestSearchPerf, CacheHeaderTest, IndexSchemaTest, PrimUtilsTest, OverseerCollectionProcessorTest, MoreLikeThisHandlerTest, PrimitiveFieldTypeTest, TestDynamicFieldCollectionResource, DirectSolrConnectionTest, DocValuesTest, TestJoin, PreAnalyzedFieldTest, ParsingFieldUpdateProcessorsTest, SolrIndexSplitterTest, TestPluginEnable, PeerSyncTest, DocumentBuilderTest, TestRandomDVFaceting, CSVRequestHandlerTest, TestSolrXmlPersistence, SuggesterTest, TestSurroundQueryParser, TestSolrDeletionPolicy2, FastVectorHighlighterTest, UpdateRequestProcessorFactoryTest, CoreMergeIndexesAdminHandlerTest, TestBadConfig, BasicDistributedZk2Test, UnloadDistributedZkTest, CollectionsAPIDistributedZkTest]
   [junit4] Completed on J0 in 186.23s, 1 test, 1 error <<< FAILURES!

[...truncated 573 lines...]
BUILD FAILED
/usr/home/hudson/hudson-slave/workspace/Lucene-Solr-NightlyTests-trunk/build.xml:396: The following error occurred while executing this line:
/usr/home/hudson/hudson-slave/workspace/Lucene-Solr-NightlyTests-trunk/build.xml:369: The following error occurred while executing this line:
/usr/home/hudson/hudson-slave/workspace/Lucene-Solr-NightlyTests-trunk/build.xml:39: The following error occurred while executing this line:
/usr/home/hudson/hudson-slave/workspace/Lucene-Solr-NightlyTests-trunk/solr/build.xml:181: The following error occurred while executing this line:
/usr/home/hudson/hudson-slave/workspace/Lucene-Solr-NightlyTests-trunk/solr/common-build.xml:449: The following error occurred while executing this line:
/usr/home/hudson/hudson-slave/workspace/Lucene-Solr-NightlyTests-trunk/lucene/common-build.xml:1230: The following error occurred while executing this line:
/usr/home/hudson/hudson-slave/workspace/Lucene-Solr-NightlyTests-trunk/lucene/common-build.xml:873: There were test failures: 320 suites, 1347 tests, 1 error, 32 ignored (4 assumptions)

Total time: 110 minutes 5 seconds
Build step 'Invoke Ant' marked build as failure
Archiving artifacts
Recording test results
Email was triggered for: Failure
Sending email for trigger: Failure



Mime
View raw message