lucene-dev mailing list archives

Site index · List index
Message view « Date » · « Thread »
Top « Date » · « Thread »
From Apache Jenkins Server <jenk...@builds.apache.org>
Subject [JENKINS] Lucene-Solr-Tests-4.x-Java6 - Build # 1866 - Still Failing
Date Sat, 03 Aug 2013 00:01:09 GMT
Build: https://builds.apache.org/job/Lucene-Solr-Tests-4.x-Java6/1866/

1 tests failed.
FAILED:  org.apache.solr.cloud.CollectionsAPIDistributedZkTest.testDistribSearch

Error Message:
IOException occured when talking to server at: http://127.0.0.1:63897/jd

Stack Trace:
org.apache.solr.client.solrj.SolrServerException: IOException occured when talking to server at: http://127.0.0.1:63897/jd
	at __randomizedtesting.SeedInfo.seed([A7354B2EE839FD01:26D3C5369F669D3D]:0)
	at org.apache.solr.client.solrj.impl.HttpSolrServer.request(HttpSolrServer.java:435)
	at org.apache.solr.client.solrj.impl.HttpSolrServer.request(HttpSolrServer.java:180)
	at org.apache.solr.cloud.CollectionsAPIDistributedZkTest.testCustomCollectionsAPI(CollectionsAPIDistributedZkTest.java:764)
	at org.apache.solr.cloud.CollectionsAPIDistributedZkTest.doTest(CollectionsAPIDistributedZkTest.java:159)
	at org.apache.solr.BaseDistributedSearchTestCase.testDistribSearch(BaseDistributedSearchTestCase.java:835)
	at sun.reflect.NativeMethodAccessorImpl.invoke0(Native Method)
	at sun.reflect.NativeMethodAccessorImpl.invoke(NativeMethodAccessorImpl.java:57)
	at sun.reflect.DelegatingMethodAccessorImpl.invoke(DelegatingMethodAccessorImpl.java:43)
	at java.lang.reflect.Method.invoke(Method.java:616)
	at com.carrotsearch.randomizedtesting.RandomizedRunner.invoke(RandomizedRunner.java:1559)
	at com.carrotsearch.randomizedtesting.RandomizedRunner.access$600(RandomizedRunner.java:79)
	at com.carrotsearch.randomizedtesting.RandomizedRunner$6.evaluate(RandomizedRunner.java:737)
	at com.carrotsearch.randomizedtesting.RandomizedRunner$7.evaluate(RandomizedRunner.java:773)
	at com.carrotsearch.randomizedtesting.RandomizedRunner$8.evaluate(RandomizedRunner.java:787)
	at com.carrotsearch.randomizedtesting.rules.SystemPropertiesRestoreRule$1.evaluate(SystemPropertiesRestoreRule.java:53)
	at org.apache.lucene.util.TestRuleSetupTeardownChained$1.evaluate(TestRuleSetupTeardownChained.java:50)
	at org.apache.lucene.util.TestRuleFieldCacheSanity$1.evaluate(TestRuleFieldCacheSanity.java:51)
	at org.apache.lucene.util.AbstractBeforeAfterRule$1.evaluate(AbstractBeforeAfterRule.java:46)
	at com.carrotsearch.randomizedtesting.rules.SystemPropertiesInvariantRule$1.evaluate(SystemPropertiesInvariantRule.java:55)
	at org.apache.lucene.util.TestRuleThreadAndTestName$1.evaluate(TestRuleThreadAndTestName.java:49)
	at org.apache.lucene.util.TestRuleIgnoreAfterMaxFailures$1.evaluate(TestRuleIgnoreAfterMaxFailures.java:70)
	at org.apache.lucene.util.TestRuleMarkFailure$1.evaluate(TestRuleMarkFailure.java:48)
	at com.carrotsearch.randomizedtesting.rules.StatementAdapter.evaluate(StatementAdapter.java:36)
	at com.carrotsearch.randomizedtesting.ThreadLeakControl$StatementRunner.run(ThreadLeakControl.java:358)
	at com.carrotsearch.randomizedtesting.ThreadLeakControl.forkTimeoutingTask(ThreadLeakControl.java:782)
	at com.carrotsearch.randomizedtesting.ThreadLeakControl$3.evaluate(ThreadLeakControl.java:442)
	at com.carrotsearch.randomizedtesting.RandomizedRunner.runSingleTest(RandomizedRunner.java:746)
	at com.carrotsearch.randomizedtesting.RandomizedRunner$3.evaluate(RandomizedRunner.java:648)
	at com.carrotsearch.randomizedtesting.RandomizedRunner$4.evaluate(RandomizedRunner.java:682)
	at com.carrotsearch.randomizedtesting.RandomizedRunner$5.evaluate(RandomizedRunner.java:693)
	at com.carrotsearch.randomizedtesting.rules.StatementAdapter.evaluate(StatementAdapter.java:36)
	at com.carrotsearch.randomizedtesting.rules.SystemPropertiesRestoreRule$1.evaluate(SystemPropertiesRestoreRule.java:53)
	at org.apache.lucene.util.AbstractBeforeAfterRule$1.evaluate(AbstractBeforeAfterRule.java:46)
	at org.apache.lucene.util.TestRuleStoreClassName$1.evaluate(TestRuleStoreClassName.java:42)
	at com.carrotsearch.randomizedtesting.rules.SystemPropertiesInvariantRule$1.evaluate(SystemPropertiesInvariantRule.java:55)
	at com.carrotsearch.randomizedtesting.rules.NoShadowingOrOverridesOnMethodsRule$1.evaluate(NoShadowingOrOverridesOnMethodsRule.java:39)
	at com.carrotsearch.randomizedtesting.rules.NoShadowingOrOverridesOnMethodsRule$1.evaluate(NoShadowingOrOverridesOnMethodsRule.java:39)
	at com.carrotsearch.randomizedtesting.rules.StatementAdapter.evaluate(StatementAdapter.java:36)
	at org.apache.lucene.util.TestRuleAssertionsRequired$1.evaluate(TestRuleAssertionsRequired.java:43)
	at org.apache.lucene.util.TestRuleMarkFailure$1.evaluate(TestRuleMarkFailure.java:48)
	at org.apache.lucene.util.TestRuleIgnoreAfterMaxFailures$1.evaluate(TestRuleIgnoreAfterMaxFailures.java:70)
	at org.apache.lucene.util.TestRuleIgnoreTestSuites$1.evaluate(TestRuleIgnoreTestSuites.java:55)
	at com.carrotsearch.randomizedtesting.rules.StatementAdapter.evaluate(StatementAdapter.java:36)
	at com.carrotsearch.randomizedtesting.ThreadLeakControl$StatementRunner.run(ThreadLeakControl.java:358)
	at java.lang.Thread.run(Thread.java:679)
Caused by: org.apache.http.conn.ConnectTimeoutException: Connect to 127.0.0.1:63897 timed out
	at org.apache.http.conn.scheme.PlainSocketFactory.connectSocket(PlainSocketFactory.java:129)
	at org.apache.http.impl.conn.DefaultClientConnectionOperator.openConnection(DefaultClientConnectionOperator.java:180)
	at org.apache.http.impl.conn.ManagedClientConnectionImpl.open(ManagedClientConnectionImpl.java:294)
	at org.apache.http.impl.client.DefaultRequestDirector.tryConnect(DefaultRequestDirector.java:645)
	at org.apache.http.impl.client.DefaultRequestDirector.execute(DefaultRequestDirector.java:480)
	at org.apache.http.impl.client.AbstractHttpClient.execute(AbstractHttpClient.java:906)
	at org.apache.http.impl.client.AbstractHttpClient.execute(AbstractHttpClient.java:805)
	at org.apache.http.impl.client.AbstractHttpClient.execute(AbstractHttpClient.java:784)
	at org.apache.solr.client.solrj.impl.HttpSolrServer.request(HttpSolrServer.java:365)
	... 44 more




Build Log:
[...truncated 9178 lines...]
   [junit4] Suite: org.apache.solr.cloud.CollectionsAPIDistributedZkTest
   [junit4]   2> 823960 T1265 oas.BaseDistributedSearchTestCase.initHostContext Setting hostContext system property: /jd/
   [junit4]   2> 823965 T1265 oas.SolrTestCaseJ4.setUp ###Starting testDistribSearch
   [junit4]   2> Creating dataDir: /usr/home/hudson/hudson-slave/workspace/Lucene-Solr-Tests-4.x-Java6/solr/build/solr-core/test/J1/./solrtest-CollectionsAPIDistributedZkTest-1375486881087
   [junit4]   2> 823966 T1265 oasc.ZkTestServer.run STARTING ZK TEST SERVER
   [junit4]   2> 823966 T1266 oasc.ZkTestServer$ZKServerMain.runFromConfig Starting server
   [junit4]   2> 824067 T1265 oasc.ZkTestServer.run start zk server on port:63888
   [junit4]   2> 824073 T1265 oascc.ConnectionManager.waitForConnected Waiting for client to connect to ZooKeeper
   [junit4]   2> 824096 T1272 oascc.ConnectionManager.process Watcher org.apache.solr.common.cloud.ConnectionManager@12e6d8aa name:ZooKeeperConnection Watcher:127.0.0.1:63888 got event WatchedEvent state:SyncConnected type:None path:null path:null type:None
   [junit4]   2> 824097 T1265 oascc.ConnectionManager.waitForConnected Client is connected to ZooKeeper
   [junit4]   2> 824097 T1265 oascc.SolrZkClient.makePath makePath: /solr
   [junit4]   2> 824136 T1265 oascc.ConnectionManager.waitForConnected Waiting for client to connect to ZooKeeper
   [junit4]   2> 824140 T1274 oascc.ConnectionManager.process Watcher org.apache.solr.common.cloud.ConnectionManager@71bae7fd name:ZooKeeperConnection Watcher:127.0.0.1:63888/solr got event WatchedEvent state:SyncConnected type:None path:null path:null type:None
   [junit4]   2> 824140 T1265 oascc.ConnectionManager.waitForConnected Client is connected to ZooKeeper
   [junit4]   2> 824141 T1265 oascc.SolrZkClient.makePath makePath: /collections/collection1
   [junit4]   2> 824153 T1265 oascc.SolrZkClient.makePath makePath: /collections/collection1/shards
   [junit4]   2> 824163 T1265 oascc.SolrZkClient.makePath makePath: /collections/control_collection
   [junit4]   2> 824165 T1265 oascc.SolrZkClient.makePath makePath: /collections/control_collection/shards
   [junit4]   2> 824169 T1265 oasc.AbstractZkTestCase.putConfig put /usr/home/hudson/hudson-slave/workspace/Lucene-Solr-Tests-4.x-Java6/solr/build/solr-core/test-files/solr/collection1/conf/solrconfig-tlog.xml to /configs/conf1/solrconfig.xml
   [junit4]   2> 824170 T1265 oascc.SolrZkClient.makePath makePath: /configs/conf1/solrconfig.xml
   [junit4]   2> 824183 T1265 oasc.AbstractZkTestCase.putConfig put /usr/home/hudson/hudson-slave/workspace/Lucene-Solr-Tests-4.x-Java6/solr/build/solr-core/test-files/solr/collection1/conf/schema.xml to /configs/conf1/schema.xml
   [junit4]   2> 824183 T1265 oascc.SolrZkClient.makePath makePath: /configs/conf1/schema.xml
   [junit4]   2> 824287 T1265 oasc.AbstractZkTestCase.putConfig put /usr/home/hudson/hudson-slave/workspace/Lucene-Solr-Tests-4.x-Java6/solr/build/solr-core/test-files/solr/collection1/conf/stopwords.txt to /configs/conf1/stopwords.txt
   [junit4]   2> 824288 T1265 oascc.SolrZkClient.makePath makePath: /configs/conf1/stopwords.txt
   [junit4]   2> 824309 T1265 oasc.AbstractZkTestCase.putConfig put /usr/home/hudson/hudson-slave/workspace/Lucene-Solr-Tests-4.x-Java6/solr/build/solr-core/test-files/solr/collection1/conf/protwords.txt to /configs/conf1/protwords.txt
   [junit4]   2> 824309 T1265 oascc.SolrZkClient.makePath makePath: /configs/conf1/protwords.txt
   [junit4]   2> 824312 T1265 oasc.AbstractZkTestCase.putConfig put /usr/home/hudson/hudson-slave/workspace/Lucene-Solr-Tests-4.x-Java6/solr/build/solr-core/test-files/solr/collection1/conf/currency.xml to /configs/conf1/currency.xml
   [junit4]   2> 824313 T1265 oascc.SolrZkClient.makePath makePath: /configs/conf1/currency.xml
   [junit4]   2> 824324 T1265 oasc.AbstractZkTestCase.putConfig put /usr/home/hudson/hudson-slave/workspace/Lucene-Solr-Tests-4.x-Java6/solr/build/solr-core/test-files/solr/collection1/conf/open-exchange-rates.json to /configs/conf1/open-exchange-rates.json
   [junit4]   2> 824325 T1265 oascc.SolrZkClient.makePath makePath: /configs/conf1/open-exchange-rates.json
   [junit4]   2> 824332 T1265 oasc.AbstractZkTestCase.putConfig put /usr/home/hudson/hudson-slave/workspace/Lucene-Solr-Tests-4.x-Java6/solr/build/solr-core/test-files/solr/collection1/conf/mapping-ISOLatin1Accent.txt to /configs/conf1/mapping-ISOLatin1Accent.txt
   [junit4]   2> 824333 T1265 oascc.SolrZkClient.makePath makePath: /configs/conf1/mapping-ISOLatin1Accent.txt
   [junit4]   2> 824335 T1265 oasc.AbstractZkTestCase.putConfig put /usr/home/hudson/hudson-slave/workspace/Lucene-Solr-Tests-4.x-Java6/solr/build/solr-core/test-files/solr/collection1/conf/old_synonyms.txt to /configs/conf1/old_synonyms.txt
   [junit4]   2> 824336 T1265 oascc.SolrZkClient.makePath makePath: /configs/conf1/old_synonyms.txt
   [junit4]   2> 824344 T1265 oasc.AbstractZkTestCase.putConfig put /usr/home/hudson/hudson-slave/workspace/Lucene-Solr-Tests-4.x-Java6/solr/build/solr-core/test-files/solr/collection1/conf/synonyms.txt to /configs/conf1/synonyms.txt
   [junit4]   2> 824345 T1265 oascc.SolrZkClient.makePath makePath: /configs/conf1/synonyms.txt
   [junit4]   2> 824548 T1265 oejs.Server.doStart jetty-8.1.10.v20130312
   [junit4]   2> 824551 T1265 oejs.AbstractConnector.doStart Started SocketConnector@127.0.0.1:63893
   [junit4]   2> 824552 T1265 oass.SolrDispatchFilter.init SolrDispatchFilter.init()
   [junit4]   2> 824552 T1265 oasc.SolrResourceLoader.locateSolrHome JNDI not configured for solr (NoInitialContextEx)
   [junit4]   2> 824553 T1265 oasc.SolrResourceLoader.locateSolrHome using system property solr.solr.home: /usr/home/hudson/hudson-slave/workspace/Lucene-Solr-Tests-4.x-Java6/solr/build/solr-core/test/J1/./org.apache.solr.cloud.CollectionsAPIDistributedZkTest-controljetty-1375486881484
   [junit4]   2> 824553 T1265 oasc.SolrResourceLoader.<init> new SolrResourceLoader for directory: '/usr/home/hudson/hudson-slave/workspace/Lucene-Solr-Tests-4.x-Java6/solr/build/solr-core/test/J1/./org.apache.solr.cloud.CollectionsAPIDistributedZkTest-controljetty-1375486881484/'
   [junit4]   2> 824580 T1265 oasc.ConfigSolr.fromFile Loading container configuration from /usr/home/hudson/hudson-slave/workspace/Lucene-Solr-Tests-4.x-Java6/solr/build/solr-core/test/J1/./org.apache.solr.cloud.CollectionsAPIDistributedZkTest-controljetty-1375486881484/solr.xml
   [junit4]   2> 824630 T1265 oasc.ConfigSolrXml.<init> Config-defined core root directory: 
   [junit4]   2> 824631 T1265 oasc.CoreContainer.<init> New CoreContainer 1447987089
   [junit4]   2> 824631 T1265 oasc.CoreContainer.load Loading cores into CoreContainer [instanceDir=/usr/home/hudson/hudson-slave/workspace/Lucene-Solr-Tests-4.x-Java6/solr/build/solr-core/test/J1/./org.apache.solr.cloud.CollectionsAPIDistributedZkTest-controljetty-1375486881484/]
   [junit4]   2> 824632 T1265 oashc.HttpShardHandlerFactory.getParameter Setting socketTimeout to: 120000
   [junit4]   2> 824633 T1265 oashc.HttpShardHandlerFactory.getParameter Setting urlScheme to: http://
   [junit4]   2> 824633 T1265 oashc.HttpShardHandlerFactory.getParameter Setting connTimeout to: 15000
   [junit4]   2> 824633 T1265 oashc.HttpShardHandlerFactory.getParameter Setting maxConnectionsPerHost to: 20
   [junit4]   2> 824634 T1265 oashc.HttpShardHandlerFactory.getParameter Setting corePoolSize to: 0
   [junit4]   2> 824634 T1265 oashc.HttpShardHandlerFactory.getParameter Setting maximumPoolSize to: 2147483647
   [junit4]   2> 824634 T1265 oashc.HttpShardHandlerFactory.getParameter Setting maxThreadIdleTime to: 5
   [junit4]   2> 824635 T1265 oashc.HttpShardHandlerFactory.getParameter Setting sizeOfQueue to: -1
   [junit4]   2> 824635 T1265 oashc.HttpShardHandlerFactory.getParameter Setting fairnessPolicy to: false
   [junit4]   2> 824635 T1265 oascsi.HttpClientUtil.createClient Creating new http client, config:maxConnectionsPerHost=20&maxConnections=10000&socketTimeout=120000&connTimeout=15000&retry=false
   [junit4]   2> 824646 T1265 oasc.ZkContainer.initZooKeeper Zookeeper client=127.0.0.1:63888/solr
   [junit4]   2> 824647 T1265 oasc.ZkController.checkChrootPath zkHost includes chroot
   [junit4]   2> 824648 T1265 oascc.ConnectionManager.waitForConnected Waiting for client to connect to ZooKeeper
   [junit4]   2> 824650 T1285 oascc.ConnectionManager.process Watcher org.apache.solr.common.cloud.ConnectionManager@3da66cdb name:ZooKeeperConnection Watcher:127.0.0.1:63888 got event WatchedEvent state:SyncConnected type:None path:null path:null type:None
   [junit4]   2> 824651 T1265 oascc.ConnectionManager.waitForConnected Client is connected to ZooKeeper
   [junit4]   2> 824666 T1265 oascsi.HttpClientUtil.createClient Creating new http client, config:maxConnections=500&maxConnectionsPerHost=16&socketTimeout=120000&connTimeout=15000
   [junit4]   2> 824674 T1265 oascc.ConnectionManager.waitForConnected Waiting for client to connect to ZooKeeper
   [junit4]   2> 824676 T1287 oascc.ConnectionManager.process Watcher org.apache.solr.common.cloud.ConnectionManager@577493c3 name:ZooKeeperConnection Watcher:127.0.0.1:63888/solr got event WatchedEvent state:SyncConnected type:None path:null path:null type:None
   [junit4]   2> 824676 T1265 oascc.ConnectionManager.waitForConnected Client is connected to ZooKeeper
   [junit4]   2> 824683 T1265 oascc.SolrZkClient.makePath makePath: /overseer/queue
   [junit4]   2> 824686 T1265 oascc.SolrZkClient.makePath makePath: /overseer/collection-queue-work
   [junit4]   2> 824694 T1265 oascc.SolrZkClient.makePath makePath: /live_nodes
   [junit4]   2> 824696 T1265 oasc.ZkController.createEphemeralLiveNode Register node as live in ZooKeeper:/live_nodes/127.0.0.1:63893_jd
   [junit4]   2> 824698 T1265 oascc.SolrZkClient.makePath makePath: /live_nodes/127.0.0.1:63893_jd
   [junit4]   2> 824708 T1265 oascc.SolrZkClient.makePath makePath: /overseer_elect/election
   [junit4]   2> 824719 T1265 oascc.SolrZkClient.makePath makePath: /overseer_elect/leader
   [junit4]   2> 824726 T1265 oasc.Overseer.start Overseer (id=90143908239245315-127.0.0.1:63893_jd-n_0000000000) starting
   [junit4]   2> 824730 T1265 oascc.SolrZkClient.makePath makePath: /overseer/queue-work
   [junit4]   2> 824743 T1289 oasc.OverseerCollectionProcessor.run Process current queue of collection creations
   [junit4]   2> 824744 T1265 oascc.SolrZkClient.makePath makePath: /clusterstate.json
   [junit4]   2> 824746 T1265 oascc.SolrZkClient.makePath makePath: /aliases.json
   [junit4]   2> 824754 T1265 oascc.ZkStateReader.createClusterStateWatchersAndUpdate Updating cluster state from ZooKeeper... 
   [junit4]   2> 824756 T1288 oasc.Overseer$ClusterStateUpdater.run Starting to work on the main queue
   [junit4]   2> 824764 T1265 oasc.CorePropertiesLocator.discover Looking for core definitions underneath /usr/home/hudson/hudson-slave/workspace/Lucene-Solr-Tests-4.x-Java6/solr/build/solr-core/test/J1/./org.apache.solr.cloud.CollectionsAPIDistributedZkTest-controljetty-1375486881484
   [junit4]   2> 824766 T1265 oasc.CorePropertiesLocator.discoverUnder Found core conf in /usr/home/hudson/hudson-slave/workspace/Lucene-Solr-Tests-4.x-Java6/solr/build/solr-core/test/J1/./org.apache.solr.cloud.CollectionsAPIDistributedZkTest-controljetty-1375486881484/conf/
   [junit4]   2> 824873 T1265 oasc.CorePropertiesLocator.discover Found 1 core definitions
   [junit4]   2> 824873 T1265 oass.SolrDispatchFilter.init user.dir=/usr/home/hudson/hudson-slave/workspace/Lucene-Solr-Tests-4.x-Java6/solr/build/solr-core/test/J1
   [junit4]   2> 824873 T1265 oass.SolrDispatchFilter.init SolrDispatchFilter.init() done
   [junit4]   2> 824874 T1265 oascsi.HttpClientUtil.createClient Creating new http client, config:maxConnections=128&maxConnectionsPerHost=32&followRedirects=false
   [junit4]   2> 824885 T1265 oascsi.HttpClientUtil.createClient Creating new http client, config:
   [junit4]   2> 824886 T1265 oascc.ConnectionManager.waitForConnected Waiting for client to connect to ZooKeeper
   [junit4]   2> 824888 T1292 oascc.ConnectionManager.process Watcher org.apache.solr.common.cloud.ConnectionManager@5de49ad4 name:ZooKeeperConnection Watcher:127.0.0.1:63888/solr got event WatchedEvent state:SyncConnected type:None path:null path:null type:None
   [junit4]   2> 824888 T1265 oascc.ConnectionManager.waitForConnected Client is connected to ZooKeeper
   [junit4]   2> 824890 T1265 oascc.ZkStateReader.createClusterStateWatchersAndUpdate Updating cluster state from ZooKeeper... 
   [junit4]   2> 824892 T1265 oasc.ChaosMonkey.monkeyLog monkey: init - expire sessions:true cause connection loss:true
   [junit4]   2> 825175 T1265 oejs.Server.doStart jetty-8.1.10.v20130312
   [junit4]   2> 825177 T1265 oejs.AbstractConnector.doStart Started SocketConnector@127.0.0.1:63897
   [junit4]   2> 825178 T1265 oass.SolrDispatchFilter.init SolrDispatchFilter.init()
   [junit4]   2> 825178 T1265 oasc.SolrResourceLoader.locateSolrHome JNDI not configured for solr (NoInitialContextEx)
   [junit4]   2> 825179 T1265 oasc.SolrResourceLoader.locateSolrHome using system property solr.solr.home: /usr/home/hudson/hudson-slave/workspace/Lucene-Solr-Tests-4.x-Java6/solr/build/solr-core/test/J1/./org.apache.solr.cloud.CollectionsAPIDistributedZkTest-jetty1-1375486882013
   [junit4]   2> 825179 T1265 oasc.SolrResourceLoader.<init> new SolrResourceLoader for directory: '/usr/home/hudson/hudson-slave/workspace/Lucene-Solr-Tests-4.x-Java6/solr/build/solr-core/test/J1/./org.apache.solr.cloud.CollectionsAPIDistributedZkTest-jetty1-1375486882013/'
   [junit4]   2> 825206 T1265 oasc.ConfigSolr.fromFile Loading container configuration from /usr/home/hudson/hudson-slave/workspace/Lucene-Solr-Tests-4.x-Java6/solr/build/solr-core/test/J1/./org.apache.solr.cloud.CollectionsAPIDistributedZkTest-jetty1-1375486882013/solr.xml
   [junit4]   2> 825256 T1265 oasc.ConfigSolrXml.<init> Config-defined core root directory: 
   [junit4]   2> 825257 T1265 oasc.CoreContainer.<init> New CoreContainer 1493859723
   [junit4]   2> 825257 T1265 oasc.CoreContainer.load Loading cores into CoreContainer [instanceDir=/usr/home/hudson/hudson-slave/workspace/Lucene-Solr-Tests-4.x-Java6/solr/build/solr-core/test/J1/./org.apache.solr.cloud.CollectionsAPIDistributedZkTest-jetty1-1375486882013/]
   [junit4]   2> 825258 T1265 oashc.HttpShardHandlerFactory.getParameter Setting socketTimeout to: 120000
   [junit4]   2> 825259 T1265 oashc.HttpShardHandlerFactory.getParameter Setting urlScheme to: http://
   [junit4]   2> 825259 T1265 oashc.HttpShardHandlerFactory.getParameter Setting connTimeout to: 15000
   [junit4]   2> 825259 T1265 oashc.HttpShardHandlerFactory.getParameter Setting maxConnectionsPerHost to: 20
   [junit4]   2> 825260 T1265 oashc.HttpShardHandlerFactory.getParameter Setting corePoolSize to: 0
   [junit4]   2> 825260 T1265 oashc.HttpShardHandlerFactory.getParameter Setting maximumPoolSize to: 2147483647
   [junit4]   2> 825260 T1265 oashc.HttpShardHandlerFactory.getParameter Setting maxThreadIdleTime to: 5
   [junit4]   2> 825261 T1265 oashc.HttpShardHandlerFactory.getParameter Setting sizeOfQueue to: -1
   [junit4]   2> 825261 T1265 oashc.HttpShardHandlerFactory.getParameter Setting fairnessPolicy to: false
   [junit4]   2> 825261 T1265 oascsi.HttpClientUtil.createClient Creating new http client, config:maxConnectionsPerHost=20&maxConnections=10000&socketTimeout=120000&connTimeout=15000&retry=false
   [junit4]   2> 825273 T1265 oasc.ZkContainer.initZooKeeper Zookeeper client=127.0.0.1:63888/solr
   [junit4]   2> 825273 T1265 oasc.ZkController.checkChrootPath zkHost includes chroot
   [junit4]   2> 825275 T1265 oascc.ConnectionManager.waitForConnected Waiting for client to connect to ZooKeeper
   [junit4]   2> 825277 T1303 oascc.ConnectionManager.process Watcher org.apache.solr.common.cloud.ConnectionManager@613a0416 name:ZooKeeperConnection Watcher:127.0.0.1:63888 got event WatchedEvent state:SyncConnected type:None path:null path:null type:None
   [junit4]   2> 825278 T1265 oascc.ConnectionManager.waitForConnected Client is connected to ZooKeeper
   [junit4]   2> 825293 T1265 oascsi.HttpClientUtil.createClient Creating new http client, config:maxConnections=500&maxConnectionsPerHost=16&socketTimeout=120000&connTimeout=15000
   [junit4]   2> 825303 T1265 oascc.ConnectionManager.waitForConnected Waiting for client to connect to ZooKeeper
   [junit4]   2> 825304 T1305 oascc.ConnectionManager.process Watcher org.apache.solr.common.cloud.ConnectionManager@28cc85a8 name:ZooKeeperConnection Watcher:127.0.0.1:63888/solr got event WatchedEvent state:SyncConnected type:None path:null path:null type:None
   [junit4]   2> 825305 T1265 oascc.ConnectionManager.waitForConnected Client is connected to ZooKeeper
   [junit4]   2> 825314 T1265 oascc.ZkStateReader.createClusterStateWatchersAndUpdate Updating cluster state from ZooKeeper... 
   [junit4]   2> 826317 T1265 oasc.ZkController.createEphemeralLiveNode Register node as live in ZooKeeper:/live_nodes/127.0.0.1:63897_jd
   [junit4]   2> 826319 T1265 oascc.SolrZkClient.makePath makePath: /live_nodes/127.0.0.1:63897_jd
   [junit4]   2> 826323 T1292 oascc.ZkStateReader$3.process Updating live nodes... (2)
   [junit4]   2> 826323 T1287 oascc.ZkStateReader$3.process Updating live nodes... (2)
   [junit4]   2> 826323 T1305 oascc.ZkStateReader$3.process Updating live nodes... (2)
   [junit4]   2> 826335 T1265 oasc.CorePropertiesLocator.discover Looking for core definitions underneath /usr/home/hudson/hudson-slave/workspace/Lucene-Solr-Tests-4.x-Java6/solr/build/solr-core/test/J1/./org.apache.solr.cloud.CollectionsAPIDistributedZkTest-jetty1-1375486882013
   [junit4]   2> 826504 T1265 oasc.CorePropertiesLocator.discoverUnder Found core conf in /usr/home/hudson/hudson-slave/workspace/Lucene-Solr-Tests-4.x-Java6/solr/build/solr-core/test/J1/./org.apache.solr.cloud.CollectionsAPIDistributedZkTest-jetty1-1375486882013/conf/
   [junit4]   2> 826507 T1265 oasc.CorePropertiesLocator.discover Found 1 core definitions
   [junit4]   2> 826508 T1265 oass.SolrDispatchFilter.init user.dir=/usr/home/hudson/hudson-slave/workspace/Lucene-Solr-Tests-4.x-Java6/solr/build/solr-core/test/J1
   [junit4]   2> 826509 T1265 oass.SolrDispatchFilter.init SolrDispatchFilter.init() done
   [junit4]   2> 826509 T1265 oascsi.HttpClientUtil.createClient Creating new http client, config:maxConnections=128&maxConnectionsPerHost=32&followRedirects=false
   [junit4]   2> 826802 T1265 oejs.Server.doStart jetty-8.1.10.v20130312
   [junit4]   2> 826805 T1265 oejs.AbstractConnector.doStart Started SocketConnector@127.0.0.1:63900
   [junit4]   2> 826806 T1265 oass.SolrDispatchFilter.init SolrDispatchFilter.init()
   [junit4]   2> 826807 T1265 oasc.SolrResourceLoader.locateSolrHome JNDI not configured for solr (NoInitialContextEx)
   [junit4]   2> 826807 T1265 oasc.SolrResourceLoader.locateSolrHome using system property solr.solr.home: /usr/home/hudson/hudson-slave/workspace/Lucene-Solr-Tests-4.x-Java6/solr/build/solr-core/test/J1/./org.apache.solr.cloud.CollectionsAPIDistributedZkTest-jetty2-1375486883645
   [junit4]   2> 826808 T1265 oasc.SolrResourceLoader.<init> new SolrResourceLoader for directory: '/usr/home/hudson/hudson-slave/workspace/Lucene-Solr-Tests-4.x-Java6/solr/build/solr-core/test/J1/./org.apache.solr.cloud.CollectionsAPIDistributedZkTest-jetty2-1375486883645/'
   [junit4]   2> 826846 T1265 oasc.ConfigSolr.fromFile Loading container configuration from /usr/home/hudson/hudson-slave/workspace/Lucene-Solr-Tests-4.x-Java6/solr/build/solr-core/test/J1/./org.apache.solr.cloud.CollectionsAPIDistributedZkTest-jetty2-1375486883645/solr.xml
   [junit4]   2> 826919 T1265 oasc.ConfigSolrXml.<init> Config-defined core root directory: 
   [junit4]   2> 826920 T1265 oasc.CoreContainer.<init> New CoreContainer 1245005271
   [junit4]   2> 826921 T1265 oasc.CoreContainer.load Loading cores into CoreContainer [instanceDir=/usr/home/hudson/hudson-slave/workspace/Lucene-Solr-Tests-4.x-Java6/solr/build/solr-core/test/J1/./org.apache.solr.cloud.CollectionsAPIDistributedZkTest-jetty2-1375486883645/]
   [junit4]   2> 826922 T1265 oashc.HttpShardHandlerFactory.getParameter Setting socketTimeout to: 120000
   [junit4]   2> 826923 T1265 oashc.HttpShardHandlerFactory.getParameter Setting urlScheme to: http://
   [junit4]   2> 826923 T1265 oashc.HttpShardHandlerFactory.getParameter Setting connTimeout to: 15000
   [junit4]   2> 826924 T1265 oashc.HttpShardHandlerFactory.getParameter Setting maxConnectionsPerHost to: 20
   [junit4]   2> 826924 T1265 oashc.HttpShardHandlerFactory.getParameter Setting corePoolSize to: 0
   [junit4]   2> 826925 T1265 oashc.HttpShardHandlerFactory.getParameter Setting maximumPoolSize to: 2147483647
   [junit4]   2> 826925 T1265 oashc.HttpShardHandlerFactory.getParameter Setting maxThreadIdleTime to: 5
   [junit4]   2> 826926 T1265 oashc.HttpShardHandlerFactory.getParameter Setting sizeOfQueue to: -1
   [junit4]   2> 826926 T1265 oashc.HttpShardHandlerFactory.getParameter Setting fairnessPolicy to: false
   [junit4]   2> 826927 T1265 oascsi.HttpClientUtil.createClient Creating new http client, config:maxConnectionsPerHost=20&maxConnections=10000&socketTimeout=120000&connTimeout=15000&retry=false
   [junit4]   2> 826942 T1265 oasc.ZkContainer.initZooKeeper Zookeeper client=127.0.0.1:63888/solr
   [junit4]   2> 826942 T1265 oasc.ZkController.checkChrootPath zkHost includes chroot
   [junit4]   2> 826944 T1265 oascc.ConnectionManager.waitForConnected Waiting for client to connect to ZooKeeper
   [junit4]   2> 826947 T1317 oascc.ConnectionManager.process Watcher org.apache.solr.common.cloud.ConnectionManager@6f7c4c50 name:ZooKeeperConnection Watcher:127.0.0.1:63888 got event WatchedEvent state:SyncConnected type:None path:null path:null type:None
   [junit4]   2> 826947 T1265 oascc.ConnectionManager.waitForConnected Client is connected to ZooKeeper
   [junit4]   2> 826950 T1265 oascsi.HttpClientUtil.createClient Creating new http client, config:maxConnections=500&maxConnectionsPerHost=16&socketTimeout=120000&connTimeout=15000
   [junit4]   2> 826961 T1265 oascc.ConnectionManager.waitForConnected Waiting for client to connect to ZooKeeper
   [junit4]   2> 826985 T1319 oascc.ConnectionManager.process Watcher org.apache.solr.common.cloud.ConnectionManager@6b0b5b69 name:ZooKeeperConnection Watcher:127.0.0.1:63888/solr got event WatchedEvent state:SyncConnected type:None path:null path:null type:None
   [junit4]   2> 826985 T1265 oascc.ConnectionManager.waitForConnected Client is connected to ZooKeeper
   [junit4]   2> 826990 T1265 oascc.ZkStateReader.createClusterStateWatchersAndUpdate Updating cluster state from ZooKeeper... 
   [junit4]   2> 827994 T1265 oasc.ZkController.createEphemeralLiveNode Register node as live in ZooKeeper:/live_nodes/127.0.0.1:63900_jd
   [junit4]   2> 827996 T1265 oascc.SolrZkClient.makePath makePath: /live_nodes/127.0.0.1:63900_jd
   [junit4]   2> 828000 T1319 oascc.ZkStateReader$3.process Updating live nodes... (3)
   [junit4]   2> 828000 T1287 oascc.ZkStateReader$3.process Updating live nodes... (3)
   [junit4]   2> 828000 T1292 oascc.ZkStateReader$3.process Updating live nodes... (3)
   [junit4]   2> 828000 T1305 oascc.ZkStateReader$3.process Updating live nodes... (3)
   [junit4]   2> 828016 T1265 oasc.CorePropertiesLocator.discover Looking for core definitions underneath /usr/home/hudson/hudson-slave/workspace/Lucene-Solr-Tests-4.x-Java6/solr/build/solr-core/test/J1/./org.apache.solr.cloud.CollectionsAPIDistributedZkTest-jetty2-1375486883645
   [junit4]   2> 828182 T1265 oasc.CorePropertiesLocator.discoverUnder Found core conf in /usr/home/hudson/hudson-slave/workspace/Lucene-Solr-Tests-4.x-Java6/solr/build/solr-core/test/J1/./org.apache.solr.cloud.CollectionsAPIDistributedZkTest-jetty2-1375486883645/conf/
   [junit4]   2> 828183 T1265 oasc.CorePropertiesLocator.discover Found 1 core definitions
   [junit4]   2> 828184 T1265 oass.SolrDispatchFilter.init user.dir=/usr/home/hudson/hudson-slave/workspace/Lucene-Solr-Tests-4.x-Java6/solr/build/solr-core/test/J1
   [junit4]   2> 828184 T1265 oass.SolrDispatchFilter.init SolrDispatchFilter.init() done
   [junit4]   2> 828185 T1265 oascsi.HttpClientUtil.createClient Creating new http client, config:maxConnections=128&maxConnectionsPerHost=32&followRedirects=false
   [junit4]   2> 828477 T1265 oejs.Server.doStart jetty-8.1.10.v20130312
   [junit4]   2> 828480 T1265 oejs.AbstractConnector.doStart Started SocketConnector@127.0.0.1:63906
   [junit4]   2> 828481 T1265 oass.SolrDispatchFilter.init SolrDispatchFilter.init()
   [junit4]   2> 828482 T1265 oasc.SolrResourceLoader.locateSolrHome JNDI not configured for solr (NoInitialContextEx)
   [junit4]   2> 828482 T1265 oasc.SolrResourceLoader.locateSolrHome using system property solr.solr.home: /usr/home/hudson/hudson-slave/workspace/Lucene-Solr-Tests-4.x-Java6/solr/build/solr-core/test/J1/./org.apache.solr.cloud.CollectionsAPIDistributedZkTest-jetty3-1375486885321
   [junit4]   2> 828483 T1265 oasc.SolrResourceLoader.<init> new SolrResourceLoader for directory: '/usr/home/hudson/hudson-slave/workspace/Lucene-Solr-Tests-4.x-Java6/solr/build/solr-core/test/J1/./org.apache.solr.cloud.CollectionsAPIDistributedZkTest-jetty3-1375486885321/'
   [junit4]   2> 828517 T1265 oasc.ConfigSolr.fromFile Loading container configuration from /usr/home/hudson/hudson-slave/workspace/Lucene-Solr-Tests-4.x-Java6/solr/build/solr-core/test/J1/./org.apache.solr.cloud.CollectionsAPIDistributedZkTest-jetty3-1375486885321/solr.xml
   [junit4]   2> 828567 T1265 oasc.ConfigSolrXml.<init> Config-defined core root directory: 
   [junit4]   2> 828568 T1265 oasc.CoreContainer.<init> New CoreContainer 1191770908
   [junit4]   2> 828568 T1265 oasc.CoreContainer.load Loading cores into CoreContainer [instanceDir=/usr/home/hudson/hudson-slave/workspace/Lucene-Solr-Tests-4.x-Java6/solr/build/solr-core/test/J1/./org.apache.solr.cloud.CollectionsAPIDistributedZkTest-jetty3-1375486885321/]
   [junit4]   2> 828569 T1265 oashc.HttpShardHandlerFactory.getParameter Setting socketTimeout to: 120000
   [junit4]   2> 828570 T1265 oashc.HttpShardHandlerFactory.getParameter Setting urlScheme to: http://
   [junit4]   2> 828570 T1265 oashc.HttpShardHandlerFactory.getParameter Setting connTimeout to: 15000
   [junit4]   2> 828570 T1265 oashc.HttpShardHandlerFactory.getParameter Setting maxConnectionsPerHost to: 20
   [junit4]   2> 828570 T1265 oashc.HttpShardHandlerFactory.getParameter Setting corePoolSize to: 0
   [junit4]   2> 828571 T1265 oashc.HttpShardHandlerFactory.getParameter Setting maximumPoolSize to: 2147483647
   [junit4]   2> 828571 T1265 oashc.HttpShardHandlerFactory.getParameter Setting maxThreadIdleTime to: 5
   [junit4]   2> 828571 T1265 oashc.HttpShardHandlerFactory.getParameter Setting sizeOfQueue to: -1
   [junit4]   2> 828572 T1265 oashc.HttpShardHandlerFactory.getParameter Setting fairnessPolicy to: false
   [junit4]   2> 828572 T1265 oascsi.HttpClientUtil.createClient Creating new http client, config:maxConnectionsPerHost=20&maxConnections=10000&socketTimeout=120000&connTimeout=15000&retry=false
   [junit4]   2> 828582 T1265 oasc.ZkContainer.initZooKeeper Zookeeper client=127.0.0.1:63888/solr
   [junit4]   2> 828582 T1265 oasc.ZkController.checkChrootPath zkHost includes chroot
   [junit4]   2> 828583 T1265 oascc.ConnectionManager.waitForConnected Waiting for client to connect to ZooKeeper
   [junit4]   2> 828585 T1331 oascc.ConnectionManager.process Watcher org.apache.solr.common.cloud.ConnectionManager@1e9e0fb3 name:ZooKeeperConnection Watcher:127.0.0.1:63888 got event WatchedEvent state:SyncConnected type:None path:null path:null type:None
   [junit4]   2> 828586 T1265 oascc.ConnectionManager.waitForConnected Client is connected to ZooKeeper
   [junit4]   2> 828589 T1265 oascsi.HttpClientUtil.createClient Creating new http client, config:maxConnections=500&maxConnectionsPerHost=16&socketTimeout=120000&connTimeout=15000
   [junit4]   2> 828599 T1265 oascc.ConnectionManager.waitForConnected Waiting for client to connect to ZooKeeper
   [junit4]   2> 828601 T1333 oascc.ConnectionManager.process Watcher org.apache.solr.common.cloud.ConnectionManager@6c46215 name:ZooKeeperConnection Watcher:127.0.0.1:63888/solr got event WatchedEvent state:SyncConnected type:None path:null path:null type:None
   [junit4]   2> 828601 T1265 oascc.ConnectionManager.waitForConnected Client is connected to ZooKeeper
   [junit4]   2> 828613 T1265 oascc.ZkStateReader.createClusterStateWatchersAndUpdate Updating cluster state from ZooKeeper... 
   [junit4]   2> 829616 T1265 oasc.ZkController.createEphemeralLiveNode Register node as live in ZooKeeper:/live_nodes/127.0.0.1:63906_jd
   [junit4]   2> 829618 T1265 oascc.SolrZkClient.makePath makePath: /live_nodes/127.0.0.1:63906_jd
   [junit4]   2> 829622 T1333 oascc.ZkStateReader$3.process Updating live nodes... (4)
   [junit4]   2> 829622 T1305 oascc.ZkStateReader$3.process Updating live nodes... (4)
   [junit4]   2> 829622 T1287 oascc.ZkStateReader$3.process Updating live nodes... (4)
   [junit4]   2> 829622 T1319 oascc.ZkStateReader$3.process Updating live nodes... (4)
   [junit4]   2> 829622 T1292 oascc.ZkStateReader$3.process Updating live nodes... (4)
   [junit4]   2> 829634 T1265 oasc.CorePropertiesLocator.discover Looking for core definitions underneath /usr/home/hudson/hudson-slave/workspace/Lucene-Solr-Tests-4.x-Java6/solr/build/solr-core/test/J1/./org.apache.solr.cloud.CollectionsAPIDistributedZkTest-jetty3-1375486885321
   [junit4]   2> 829640 T1265 oasc.CorePropertiesLocator.discoverUnder Found core conf in /usr/home/hudson/hudson-slave/workspace/Lucene-Solr-Tests-4.x-Java6/solr/build/solr-core/test/J1/./org.apache.solr.cloud.CollectionsAPIDistributedZkTest-jetty3-1375486885321/conf/
   [junit4]   2> 829803 T1265 oasc.CorePropertiesLocator.discover Found 1 core definitions
   [junit4]   2> 829804 T1265 oass.SolrDispatchFilter.init user.dir=/usr/home/hudson/hudson-slave/workspace/Lucene-Solr-Tests-4.x-Java6/solr/build/solr-core/test/J1
   [junit4]   2> 829805 T1265 oass.SolrDispatchFilter.init SolrDispatchFilter.init() done
   [junit4]   2> 829805 T1265 oascsi.HttpClientUtil.createClient Creating new http client, config:maxConnections=128&maxConnectionsPerHost=32&followRedirects=false
   [junit4]   2> 830090 T1265 oejs.Server.doStart jetty-8.1.10.v20130312
   [junit4]   2> 830092 T1265 oejs.AbstractConnector.doStart Started SocketConnector@127.0.0.1:63911
   [junit4]   2> 830093 T1265 oass.SolrDispatchFilter.init SolrDispatchFilter.init()
   [junit4]   2> 830094 T1265 oasc.SolrResourceLoader.locateSolrHome JNDI not configured for solr (NoInitialContextEx)
   [junit4]   2> 830094 T1265 oasc.SolrResourceLoader.locateSolrHome using system property solr.solr.home: /usr/home/hudson/hudson-slave/workspace/Lucene-Solr-Tests-4.x-Java6/solr/build/solr-core/test/J1/./org.apache.solr.cloud.CollectionsAPIDistributedZkTest-jetty4-1375486886941
   [junit4]   2> 830095 T1265 oasc.SolrResourceLoader.<init> new SolrResourceLoader for directory: '/usr/home/hudson/hudson-slave/workspace/Lucene-Solr-Tests-4.x-Java6/solr/build/solr-core/test/J1/./org.apache.solr.cloud.CollectionsAPIDistributedZkTest-jetty4-1375486886941/'
   [junit4]   2> 830133 T1265 oasc.ConfigSolr.fromFile Loading container configuration from /usr/home/hudson/hudson-slave/workspace/Lucene-Solr-Tests-4.x-Java6/solr/build/solr-core/test/J1/./org.apache.solr.cloud.CollectionsAPIDistributedZkTest-jetty4-1375486886941/solr.xml
   [junit4]   2> 830205 T1265 oasc.ConfigSolrXml.<init> Config-defined core root directory: 
   [junit4]   2> 830206 T1265 oasc.CoreContainer.<init> New CoreContainer 374427357
   [junit4]   2> 830207 T1265 oasc.CoreContainer.load Loading cores into CoreContainer [instanceDir=/usr/home/hudson/hudson-slave/workspace/Lucene-Solr-Tests-4.x-Java6/solr/build/solr-core/test/J1/./org.apache.solr.cloud.CollectionsAPIDistributedZkTest-jetty4-1375486886941/]
   [junit4]   2> 830209 T1265 oashc.HttpShardHandlerFactory.getParameter Setting socketTimeout to: 120000
   [junit4]   2> 830209 T1265 oashc.HttpShardHandlerFactory.getParameter Setting urlScheme to: http://
   [junit4]   2> 830210 T1265 oashc.HttpShardHandlerFactory.getParameter Setting connTimeout to: 15000
   [junit4]   2> 830210 T1265 oashc.HttpShardHandlerFactory.getParameter Setting maxConnectionsPerHost to: 20
   [junit4]   2> 830210 T1265 oashc.HttpShardHandlerFactory.getParameter Setting corePoolSize to: 0
   [junit4]   2> 830211 T1265 oashc.HttpShardHandlerFactory.getParameter Setting maximumPoolSize to: 2147483647
   [junit4]   2> 830211 T1265 oashc.HttpShardHandlerFactory.getParameter Setting maxThreadIdleTime to: 5
   [junit4]   2> 830212 T1265 oashc.HttpShardHandlerFactory.getParameter Setting sizeOfQueue to: -1
   [junit4]   2> 830212 T1265 oashc.HttpShardHandlerFactory.getParameter Setting fairnessPolicy to: false
   [junit4]   2> 830213 T1265 oascsi.HttpClientUtil.createClient Creating new http client, config:maxConnectionsPerHost=20&maxConnections=10000&socketTimeout=120000&connTimeout=15000&retry=false
   [junit4]   2> 830229 T1265 oasc.ZkContainer.initZooKeeper Zookeeper client=127.0.0.1:63888/solr
   [junit4]   2> 830230 T1265 oasc.ZkController.checkChrootPath zkHost includes chroot
   [junit4]   2> 830231 T1265 oascc.ConnectionManager.waitForConnected Waiting for client to connect to ZooKeeper
   [junit4]   2> 830259 T1345 oascc.ConnectionManager.process Watcher org.apache.solr.common.cloud.ConnectionManager@34109a9d name:ZooKeeperConnection Watcher:127.0.0.1:63888 got event WatchedEvent state:SyncConnected type:None path:null path:null type:None
   [junit4]   2> 830259 T1265 oascc.ConnectionManager.waitForConnected Client is connected to ZooKeeper
   [junit4]   2> 830274 T1265 oascsi.HttpClientUtil.createClient Creating new http client, config:maxConnections=500&maxConnectionsPerHost=16&socketTimeout=120000&connTimeout=15000
   [junit4]   2> 830286 T1265 oascc.ConnectionManager.waitForConnected Waiting for client to connect to ZooKeeper
   [junit4]   2> 830300 T1347 oascc.ConnectionManager.process Watcher org.apache.solr.common.cloud.ConnectionManager@7c403381 name:ZooKeeperConnection Watcher:127.0.0.1:63888/solr got event WatchedEvent state:SyncConnected type:None path:null path:null type:None
   [junit4]   2> 830300 T1265 oascc.ConnectionManager.waitForConnected Client is connected to ZooKeeper
   [junit4]   2> 830316 T1265 oascc.ZkStateReader.createClusterStateWatchersAndUpdate Updating cluster state from ZooKeeper... 
   [junit4]   2> 831319 T1265 oasc.ZkController.createEphemeralLiveNode Register node as live in ZooKeeper:/live_nodes/127.0.0.1:63911_jd
   [junit4]   2> 831330 T1265 oascc.SolrZkClient.makePath makePath: /live_nodes/127.0.0.1:63911_jd
   [junit4]   2> 831334 T1333 oascc.ZkStateReader$3.process Updating live nodes... (5)
   [junit4]   2> 831334 T1347 oascc.ZkStateReader$3.process Updating live nodes... (5)
   [junit4]   2> 831335 T1287 oascc.ZkStateReader$3.process Updating live nodes... (5)
   [junit4]   2> 831335 T1292 oascc.ZkStateReader$3.process Updating live nodes... (5)
   [junit4]   2> 831334 T1319 oascc.ZkStateReader$3.process Updating live nodes... (5)
   [junit4]   2> 831335 T1305 oascc.ZkStateReader$3.process Updating live nodes... (5)
   [junit4]   2> 831341 T1265 oasc.CorePropertiesLocator.discover Looking for core definitions underneath /usr/home/hudson/hudson-slave/workspace/Lucene-Solr-Tests-4.x-Java6/solr/build/solr-core/test/J1/./org.apache.solr.cloud.CollectionsAPIDistributedZkTest-jetty4-1375486886941
   [junit4]   2> 831348 T1265 oasc.CorePropertiesLocator.discoverUnder Found core conf in /usr/home/hudson/hudson-slave/workspace/Lucene-Solr-Tests-4.x-Java6/solr/build/solr-core/test/J1/./org.apache.solr.cloud.CollectionsAPIDistributedZkTest-jetty4-1375486886941/conf/
   [junit4]   2> 831514 T1265 oasc.CorePropertiesLocator.discover Found 1 core definitions
   [junit4]   2> 831515 T1265 oass.SolrDispatchFilter.init user.dir=/usr/home/hudson/hudson-slave/workspace/Lucene-Solr-Tests-4.x-Java6/solr/build/solr-core/test/J1
   [junit4]   2> 831515 T1265 oass.SolrDispatchFilter.init SolrDispatchFilter.init() done
   [junit4]   2> 831516 T1265 oascsi.HttpClientUtil.createClient Creating new http client, config:maxConnections=128&maxConnectionsPerHost=32&followRedirects=false
   [junit4]   2> 831537 T1265 oascsi.HttpClientUtil.createClient Creating new http client, config:maxConnections=128&maxConnectionsPerHost=32&followRedirects=false
   [junit4]   2> 831554 T1295 oasha.CollectionsHandler.handleCreateAction Creating Collection : numShards=2&name=nodes_used_collection&replicationFactor=2&action=CREATE&wt=javabin&version=2
   [junit4]   2> 831556 T1287 oasc.DistributedQueue$LatchChildWatcher.process Watcher fired on path: /overseer/collection-queue-work state: SyncConnected type NodeChildrenChanged
   [junit4]   2> 831558 T1289 oasc.OverseerCollectionProcessor.run Overseer Collection Processor: Get the message id:/overseer/collection-queue-work/qn-0000000000 message:{
   [junit4]   2> 	  "operation":"createcollection",
   [junit4]   2> 	  "numShards":"2",
   [junit4]   2> 	  "name":"nodes_used_collection",
   [junit4]   2> 	  "replicationFactor":"2"}
   [junit4]   2> 831558 T1289 oasc.OverseerCollectionProcessor.processMessage WARN OverseerCollectionProcessor.processMessage : createcollection , {
   [junit4]   2> 	  "operation":"createcollection",
   [junit4]   2> 	  "numShards":"2",
   [junit4]   2> 	  "name":"nodes_used_collection",
   [junit4]   2> 	  "replicationFactor":"2"}
   [junit4]   2> 832274 T1288 oascc.ZkStateReader.updateClusterState Updating cloud state from ZooKeeper... 
   [junit4]   2> 832274 T1288 oasc.Overseer$ClusterStateUpdater.buildCollection building a new collection: nodes_used_collection
   [junit4]   2> 832275 T1288 oasc.Overseer$ClusterStateUpdater.createCollection Create collection nodes_used_collection with shards [shard1, shard2]
   [junit4]   2> 832289 T1333 oascc.ZkStateReader$2.process A cluster state change: WatchedEvent state:SyncConnected type:NodeDataChanged path:/clusterstate.json, has occurred - updating... (live nodes size: 5)
   [junit4]   2> 832289 T1292 oascc.ZkStateReader$2.process A cluster state change: WatchedEvent state:SyncConnected type:NodeDataChanged path:/clusterstate.json, has occurred - updating... (live nodes size: 5)
   [junit4]   2> 832289 T1305 oascc.ZkStateReader$2.process A cluster state change: WatchedEvent state:SyncConnected type:NodeDataChanged path:/clusterstate.json, has occurred - updating... (live nodes size: 5)
   [junit4]   2> 832289 T1287 oascc.ZkStateReader$2.process A cluster state change: WatchedEvent state:SyncConnected type:NodeDataChanged path:/clusterstate.json, has occurred - updating... (live nodes size: 5)
   [junit4]   2> 832289 T1347 oascc.ZkStateReader$2.process A cluster state change: WatchedEvent state:SyncConnected type:NodeDataChanged path:/clusterstate.json, has occurred - updating... (live nodes size: 5)
   [junit4]   2> 832289 T1319 oascc.ZkStateReader$2.process A cluster state change: WatchedEvent state:SyncConnected type:NodeDataChanged path:/clusterstate.json, has occurred - updating... (live nodes size: 5)
   [junit4]   2> 832380 T1289 oasc.OverseerCollectionProcessor.createCollection going to create cores replicas shardNames [shard1, shard2] , repFactor : 2
   [junit4]   2> 832380 T1289 oasc.OverseerCollectionProcessor.createCollection Creating shard nodes_used_collection_shard1_replica1 as part of slice shard1 of collection nodes_used_collection on 127.0.0.1:63900_jd
   [junit4]   2> 832381 T1289 oasc.OverseerCollectionProcessor.createCollection Creating shard nodes_used_collection_shard1_replica2 as part of slice shard1 of collection nodes_used_collection on 127.0.0.1:63906_jd
   [junit4]   2> 832381 T1289 oasc.OverseerCollectionProcessor.createCollection Creating shard nodes_used_collection_shard2_replica1 as part of slice shard2 of collection nodes_used_collection on 127.0.0.1:63897_jd
   [junit4]   2> 832382 T1289 oasc.OverseerCollectionProcessor.createCollection Creating shard nodes_used_collection_shard2_replica2 as part of slice shard2 of collection nodes_used_collection on 127.0.0.1:63911_jd
   [junit4]   2> 832386 T1296 oasc.ZkController.publish publishing core=nodes_used_collection_shard2_replica1 state=down
   [junit4]   2> 832386 T1323 oasc.ZkController.publish publishing core=nodes_used_collection_shard1_replica2 state=down
   [junit4]   2> 832386 T1309 oasc.ZkController.publish publishing core=nodes_used_collection_shard1_replica1 state=down
   [junit4]   2> 832386 T1337 oasc.ZkController.publish publishing core=nodes_used_collection_shard2_replica2 state=down
   [junit4]   2> 832389 T1296 oasc.ZkController.waitForCoreNodeName look for our core node name
   [junit4]   2> 832395 T1323 oasc.ZkController.waitForCoreNodeName look for our core node name
   [junit4]   2> 832395 T1337 oasc.ZkController.waitForCoreNodeName look for our core node name
   [junit4]   2> 832395 T1309 oasc.ZkController.waitForCoreNodeName look for our core node name
   [junit4]   2> 833808 T1288 oascc.ZkStateReader.updateClusterState Updating cloud state from ZooKeeper... 
   [junit4]   2> 833809 T1288 oasc.Overseer$ClusterStateUpdater.updateState WARN Could not find collection node for nodes_used_collection, skipping publish state
   [junit4]   2> 833809 T1288 oasc.Overseer$ClusterStateUpdater.updateState Update state numShards=2 message={
   [junit4]   2> 	  "operation":"state",
   [junit4]   2> 	  "core_node_name":"core_node1",
   [junit4]   2> 	  "numShards":"2",
   [junit4]   2> 	  "shard":"shard2",
   [junit4]   2> 	  "roles":null,
   [junit4]   2> 	  "state":"down",
   [junit4]   2> 	  "shard_state":"active",
   [junit4]   2> 	  "core":"nodes_used_collection_shard2_replica1",
   [junit4]   2> 	  "collection":"nodes_used_collection",
   [junit4]   2> 	  "shard_range":null,
   [junit4]   2> 	  "node_name":"127.0.0.1:63897_jd",
   [junit4]   2> 	  "base_url":"http://127.0.0.1:63897/jd"}
   [junit4]   2> 833813 T1288 oasc.Overseer$ClusterStateUpdater.updateState WARN Could not find collection node for nodes_used_collection, skipping publish state
   [junit4]   2> 833814 T1288 oasc.Overseer$ClusterStateUpdater.updateState Update state numShards=2 message={
   [junit4]   2> 	  "operation":"state",
   [junit4]   2> 	  "core_node_name":"core_node2",
   [junit4]   2> 	  "numShards":"2",
   [junit4]   2> 	  "shard":"shard1",
   [junit4]   2> 	  "roles":null,
   [junit4]   2> 	  "state":"down",
   [junit4]   2> 	  "shard_state":"active",
   [junit4]   2> 	  "core":"nodes_used_collection_shard1_replica2",
   [junit4]   2> 	  "collection":"nodes_used_collection",
   [junit4]   2> 	  "shard_range":null,
   [junit4]   2> 	  "node_name":"127.0.0.1:63906_jd",
   [junit4]   2> 	  "base_url":"http://127.0.0.1:63906/jd"}
   [junit4]   2> 833827 T1288 oasc.Overseer$ClusterStateUpdater.updateState WARN Could not find collection node for nodes_used_collection, skipping publish state
   [junit4]   2> 833828 T1288 oasc.Overseer$ClusterStateUpdater.updateState Update state numShards=2 message={
   [junit4]   2> 	  "operation":"state",
   [junit4]   2> 	  "core_node_name":"core_node3",
   [junit4]   2> 	  "numShards":"2",
   [junit4]   2> 	  "shard":"shard1",
   [junit4]   2> 	  "roles":null,
   [junit4]   2> 	  "state":"down",
   [junit4]   2> 	  "shard_state":"active",
   [junit4]   2> 	  "core":"nodes_used_collection_shard1_replica1",
   [junit4]   2> 	  "collection":"nodes_used_collection",
   [junit4]   2> 	  "shard_range":null,
   [junit4]   2> 	  "node_name":"127.0.0.1:63900_jd",
   [junit4]   2> 	  "base_url":"http://127.0.0.1:63900/jd"}
   [junit4]   2> 833832 T1288 oasc.Overseer$ClusterStateUpdater.updateState WARN Could not find collection node for nodes_used_collection, skipping publish state
   [junit4]   2> 833832 T1288 oasc.Overseer$ClusterStateUpdater.updateState Update state numShards=2 message={
   [junit4]   2> 	  "operation":"state",
   [junit4]   2> 	  "core_node_name":"core_node4",
   [junit4]   2> 	  "numShards":"2",
   [junit4]   2> 	  "shard":"shard2",
   [junit4]   2> 	  "roles":null,
   [junit4]   2> 	  "state":"down",
   [junit4]   2> 	  "shard_state":"active",
   [junit4]   2> 	  "core":"nodes_used_collection_shard2_replica2",
   [junit4]   2> 	  "collection":"nodes_used_collection",
   [junit4]   2> 	  "shard_range":null,
   [junit4]   2> 	  "node_name":"127.0.0.1:63911_jd",
   [junit4]   2> 	  "base_url":"http://127.0.0.1:63911/jd"}
   [junit4]   2> 833836 T1319 oascc.ZkStateReader$2.process A cluster state change: WatchedEvent state:SyncConnected type:NodeDataChanged path:/clusterstate.json, has occurred - updating... (live nodes size: 5)
   [junit4]   2> 833836 T1292 oascc.ZkStateReader$2.process A cluster state change: WatchedEvent state:SyncConnected type:NodeDataChanged path:/clusterstate.json, has occurred - updating... (live nodes size: 5)
   [junit4]   2> 833836 T1287 oascc.ZkStateReader$2.process A cluster state change: WatchedEvent state:SyncConnected type:NodeDataChanged path:/clusterstate.json, has occurred - updating... (live nodes size: 5)
   [junit4]   2> 833836 T1305 oascc.ZkStateReader$2.process A cluster state change: WatchedEvent state:SyncConnected type:NodeDataChanged path:/clusterstate.json, has occurred - updating... (live nodes size: 5)
   [junit4]   2> 833836 T1347 oascc.ZkStateReader$2.process A cluster state change: WatchedEvent state:SyncConnected type:NodeDataChanged path:/clusterstate.json, has occurred - updating... (live nodes size: 5)
   [junit4]   2> 833836 T1333 oascc.ZkStateReader$2.process A cluster state change: WatchedEvent state:SyncConnected type:NodeDataChanged path:/clusterstate.json, has occurred - updating... (live nodes size: 5)
   [junit4]   2> 834391 T1296 oasc.ZkController.waitForShardId waiting to find shard id in clusterstate for nodes_used_collection_shard2_replica1
   [junit4]   2> 834392 T1296 oasc.CorePropertiesLocator.writePropertiesFile ERROR Couldn't persist core properties to /usr/home/hudson/hudson-slave/workspace/Lucene-Solr-Tests-4.x-Java6/solr/build/solr-core/test/J1/./org.apache.solr.cloud.CollectionsAPIDistributedZkTest-jetty1-1375486882013/nodes_used_collection_shard2_replica1/core.properties: java.io.FileNotFoundException: /usr/home/hudson/hudson-slave/workspace/Lucene-Solr-Tests-4.x-Java6/solr/build/solr-core/test/J1/./org.apache.solr.cloud.CollectionsAPIDistributedZkTest-jetty1-1375486882013/nodes_used_collection_shard2_replica1/core.properties (No such file or directory)
   [junit4]   2> 834392 T1296 oasc.CoreContainer.create Creating SolrCore 'nodes_used_collection_shard2_replica1' using instanceDir: /usr/home/hudson/hudson-slave/workspace/Lucene-Solr-Tests-4.x-Java6/solr/build/solr-core/test/J1/./org.apache.solr.cloud.CollectionsAPIDistributedZkTest-jetty1-1375486882013/nodes_used_collection_shard2_replica1
   [junit4]   2> 834393 T1296 oasc.ZkController.createCollectionZkNode Check for collection zkNode:nodes_used_collection
   [junit4]   2> 834394 T1296 oasc.ZkController.createCollectionZkNode Creating collection in ZooKeeper:nodes_used_collection
   [junit4]   2> 834394 T1296 oasc.ZkController.getConfName Looking for collection configName
   [junit4]   2> 834395 T1296 oasc.ZkController.getConfName Only one config set found in zk - using it:conf1
   [junit4]   2> 834396 T1296 oascc.SolrZkClient.makePath makePath: /collections/nodes_used_collection
   [junit4]   2> 834397 T1337 oasc.ZkController.waitForShardId waiting to find shard id in clusterstate for nodes_used_collection_shard2_replica2
   [junit4]   2> 834397 T1323 oasc.ZkController.waitForShardId waiting to find shard id in clusterstate for nodes_used_collection_shard1_replica2
   [junit4]   2> 834398 T1309 oasc.ZkController.waitForShardId waiting to find shard id in clusterstate for nodes_used_collection_shard1_replica1
   [junit4]   2> 834398 T1337 oasc.CorePropertiesLocator.writePropertiesFile ERROR Couldn't persist core properties to /usr/home/hudson/hudson-slave/workspace/Lucene-Solr-Tests-4.x-Java6/solr/build/solr-core/test/J1/./org.apache.solr.cloud.CollectionsAPIDistributedZkTest-jetty4-1375486886941/nodes_used_collection_shard2_replica2/core.properties: java.io.FileNotFoundException: /usr/home/hudson/hudson-slave/workspace/Lucene-Solr-Tests-4.x-Java6/solr/build/solr-core/test/J1/./org.apache.solr.cloud.CollectionsAPIDistributedZkTest-jetty4-1375486886941/nodes_used_collection_shard2_replica2/core.properties (No such file or directory)
   [junit4]   2> 834398 T1337 oasc.CoreContainer.create Creating SolrCore 'nodes_used_collection_shard2_replica2' using instanceDir: /usr/home/hudson/hudson-slave/workspace/Lucene-Solr-Tests-4.x-Java6/solr/build/solr-core/test/J1/./org.apache.solr.cloud.CollectionsAPIDistributedZkTest-jetty4-1375486886941/nodes_used_collection_shard2_replica2
   [junit4]   2> 834399 T1309 oasc.CorePropertiesLocator.writePropertiesFile ERROR Couldn't persist core properties to /usr/home/hudson/hudson-slave/workspace/Lucene-Solr-Tests-4.x-Java6/solr/build/solr-core/test/J1/./org.apache.solr.cloud.CollectionsAPIDistributedZkTest-jetty2-1375486883645/nodes_used_collection_shard1_replica1/core.properties: java.io.FileNotFoundException: /usr/home/hudson/hudson-slave/workspace/Lucene-Solr-Tests-4.x-Java6/solr/build/solr-core/test/J1/./org.apache.solr.cloud.CollectionsAPIDistributedZkTest-jetty2-1375486883645/nodes_used_collection_shard1_replica1/core.properties (No such file or directory)
   [junit4]   2> 834399 T1296 oasc.ZkController.readConfigName Load collection config from:/collections/nodes_used_collection
   [junit4]   2> 834398 T1323 oasc.CorePropertiesLocator.writePropertiesFile ERROR Couldn't persist core properties to /usr/home/hudson/hudson-slave/workspace/Lucene-Solr-Tests-4.x-Java6/solr/build/solr-core/test/J1/./org.apache.solr.cloud.CollectionsAPIDistributedZkTest-jetty3-1375486885321/nodes_used_collection_shard1_replica2/core.properties: java.io.FileNotFoundException: /usr/home/hudson/hudson-slave/workspace/Lucene-Solr-Tests-4.x-Java6/solr/build/solr-core/test/J1/./org.apache.solr.cloud.CollectionsAPIDistributedZkTest-jetty3-1375486885321/nodes_used_collection_shard1_replica2/core.properties (No such file or directory)
   [junit4]   2> 834399 T1309 oasc.CoreContainer.create Creating SolrCore 'nodes_used_collection_shard1_replica1' using instanceDir: /usr/home/hudson/hudson-slave/workspace/Lucene-Solr-Tests-4.x-Java6/solr/build/solr-core/test/J1/./org.apache.solr.cloud.CollectionsAPIDistributedZkTest-jetty2-1375486883645/nodes_used_collection_shard1_replica1
   [junit4]   2> 834400 T1309 oasc.ZkController.createCollectionZkNode Check for collection zkNode:nodes_used_collection
   [junit4]   2> 834399 T1337 oasc.ZkController.createCollectionZkNode Check for collection zkNode:nodes_used_collection
   [junit4]   2> 834400 T1296 oasc.SolrResourceLoader.<init> new SolrResourceLoader for directory: '/usr/home/hudson/hudson-slave/workspace/Lucene-Solr-Tests-4.x-Java6/solr/build/solr-core/test/J1/./org.apache.solr.cloud.CollectionsAPIDistributedZkTest-jetty1-1375486882013/nodes_used_collection_shard2_replica1/'
   [junit4]   2> 834400 T1323 oasc.CoreContainer.create Creating SolrCore 'nodes_used_collection_shard1_replica2' using instanceDir: /usr/home/hudson/hudson-slave/workspace/Lucene-Solr-Tests-4.x-Java6/solr/build/solr-core/test/J1/./org.apache.solr.cloud.CollectionsAPIDistributedZkTest-jetty3-1375486885321/nodes_used_collection_shard1_replica2
   [junit4]   2> 834402 T1337 oasc.ZkController.createCollectionZkNode Collection zkNode exists
   [junit4]   2> 834402 T1337 oasc.ZkController.readConfigName Load collection config from:/collections/nodes_used_collection
   [junit4]   2> 834401 T1309 oasc.ZkController.createCollectionZkNode Collection zkNode exists
   [junit4]   2> 834403 T1309 oasc.ZkController.readConfigName Load collection config from:/collections/nodes_used_collection
   [junit4]   2> 834402 T1323 oasc.ZkController.createCollectionZkNode Check for collection zkNode:nodes_used_collection
   [junit4]   2> 834403 T1337 oasc.SolrResourceLoader.<init> new SolrResourceLoader for directory: '/usr/home/hudson/hudson-slave/workspace/Lucene-Solr-Tests-4.x-Java6/solr/build/solr-core/test/J1/./org.apache.solr.cloud.CollectionsAPIDistributedZkTest-jetty4-1375486886941/nodes_used_collection_shard2_replica2/'
   [junit4]   2> 834404 T1323 oasc.ZkController.createCollectionZkNode Collection zkNode exists
   [junit4]   2> 834404 T1309 oasc.SolrResourceLoader.<init> new SolrResourceLoader for directory: '/usr/home/hudson/hudson-slave/workspace/Lucene-Solr-Tests-4.x-Java6/solr/build/solr-core/test/J1/./org.apache.solr.cloud.CollectionsAPIDistributedZkTest-jetty2-1375486883645/nodes_used_collection_shard1_replica1/'
   [junit4]   2> 834405 T1323 oasc.ZkController.readConfigName Load collection config from:/collections/nodes_used_collection
   [junit4]   2> 834406 T1323 oasc.SolrResourceLoader.<init> new SolrResourceLoader for directory: '/usr/home/hudson/hudson-slave/workspace/Lucene-Solr-Tests-4.x-Java6/solr/build/solr-core/test/J1/./org.apache.solr.cloud.CollectionsAPIDistributedZkTest-jetty3-1375486885321/nodes_used_collection_shard1_replica2/'
   [junit4]   2> 834529 T1296 oasc.SolrConfig.<init> Using Lucene MatchVersion: LUCENE_45
   [junit4]   2> 834530 T1323 oasc.SolrConfig.<init> Using Lucene MatchVersion: LUCENE_45
   [junit4]   2> 834530 T1337 oasc.SolrConfig.<init> Using Lucene MatchVersion: LUCENE_45
   [junit4]   2> 834531 T1309 oasc.SolrConfig.<init> Using Lucene MatchVersion: LUCENE_45
   [junit4]   2> 834605 T1296 oasc.SolrConfig.<init> Loaded SolrConfig: solrconfig.xml
   [junit4]   2> 834606 T1337 oasc.SolrConfig.<init> Loaded SolrConfig: solrconfig.xml
   [junit4]   2> 834605 T1323 oasc.SolrConfig.<init> Loaded SolrConfig: solrconfig.xml
   [junit4]   2> 834607 T1309 oasc.SolrConfig.<init> Loaded SolrConfig: solrconfig.xml
   [junit4]   2> 834707 T1296 oass.IndexSchema.readSchema Reading Solr Schema from schema.xml
   [junit4]   2> 834707 T1337 oass.IndexSchema.readSchema Reading Solr Schema from schema.xml
   [junit4]   2> 834708 T1309 oass.IndexSchema.readSchema Reading Solr Schema from schema.xml
   [junit4]   2> 834708 T1323 oass.IndexSchema.readSchema Reading Solr Schema from schema.xml
   [junit4]   2> 834723 T1296 oass.IndexSchema.readSchema [nodes_used_collection_shard2_replica1] Schema name=test
   [junit4]   2> 834723 T1309 oass.IndexSchema.readSchema [nodes_used_collection_shard1_replica1] Schema name=test
   [junit4]   2> 834723 T1337 oass.IndexSchema.readSchema [nodes_used_collection_shard2_replica2] Schema name=test
   [junit4]   2> 834723 T1323 oass.IndexSchema.readSchema [nodes_used_collection_shard1_replica2] Schema name=test
   [junit4]   2> 835518 T1309 oass.ByteField.init WARN ByteField is deprecated and will be removed in 5.0. You should use TrieIntField instead.
   [junit4]   2> 835519 T1323 oass.ByteField.init WARN ByteField is deprecated and will be removed in 5.0. You should use TrieIntField instead.
   [junit4]   2> 835519 T1296 oass.ByteField.init WARN ByteField is deprecated and will be removed in 5.0. You should use TrieIntField instead.
   [junit4]   2> 835518 T1337 oass.ByteField.init WARN ByteField is deprecated and will be removed in 5.0. You should use TrieIntField instead.
   [junit4]   2> 835520 T1296 oass.ShortField.init WARN ShortField is deprecated and will be removed in 5.0. You should use TrieIntField instead.
   [junit4]   2> 835519 T1323 oass.ShortField.init WARN ShortField is deprecated and will be removed in 5.0. You should use TrieIntField instead.
   [junit4]   2> 835519 T1309 oass.ShortField.init WARN ShortField is deprecated and will be removed in 5.0. You should use TrieIntField instead.
   [junit4]   2> 835521 T1296 oass.OpenExchangeRatesOrgProvider.init Initialized with rates=open-exchange-rates.json, refreshInterval=1440.
   [junit4]   2> 835520 T1337 oass.ShortField.init WARN ShortField is deprecated and will be removed in 5.0. You should use TrieIntField instead.
   [junit4]   2> 835522 T1309 oass.OpenExchangeRatesOrgProvider.init Initialized with rates=open-exchange-rates.json, refreshInterval=1440.
   [junit4]   2> 835522 T1323 oass.OpenExchangeRatesOrgProvider.init Initialized with rates=open-exchange-rates.json, refreshInterval=1440.
   [junit4]   2> 835523 T1337 oass.OpenExchangeRatesOrgProvider.init Initialized with rates=open-exchange-rates.json, refreshInterval=1440.
   [junit4]   2> 835536 T1309 oass.IndexSchema.readSchema default search field in schema is text
   [junit4]   2> 835536 T1296 oass.IndexSchema.readSchema default search field in schema is text
   [junit4]   2> 835538 T1337 oass.IndexSchema.readSchema default search field in schema is text
   [junit4]   2> 835538 T1323 oass.IndexSchema.readSchema default search field in schema is text
   [junit4]   2> 835541 T1309 oass.IndexSchema.readSchema unique key field: id
   [junit4]   2> 835541 T1296 oass.IndexSchema.readSchema unique key field: id
   [junit4]   2> 835542 T1337 oass.IndexSchema.readSchema unique key field: id
   [junit4]   2> 835543 T1323 oass.IndexSchema.readSchema unique key field: id
   [junit4]   2> 835566 T1296 oass.FileExchangeRateProvider.reload Reloading exchange rates from file currency.xml
   [junit4]   2> 835566 T1309 oass.FileExchangeRateProvider.reload Reloading exchange rates from file currency.xml
   [junit4]   2> 835567 T1323 oass.FileExchangeRateProvider.reload Reloading exchange rates from file currency.xml
   [junit4]   2> 835567 T1337 oass.FileExchangeRateProvider.reload Reloading exchange rates from file currency.xml
   [junit4]   2> 835572 T1296 oass.FileExchangeRateProvider.reload Reloading exchange rates from file currency.xml
   [junit4]   2> 835573 T1309 oass.FileExchangeRateProvider.reload Reloading exchange rates from file currency.xml
   [junit4]   2> 835573 T1323 oass.FileExchangeRateProvider.reload Reloading exchange rates from file currency.xml
   [junit4]   2> 835573 T1337 oass.FileExchangeRateProvider.reload Reloading exchange rates from file currency.xml
   [junit4]   2> 835577 T1296 oass.OpenExchangeRatesOrgProvider.reload Reloading exchange rates from open-exchange-rates.json
   [junit4]   2> 835578 T1309 oass.OpenExchangeRatesOrgProvider.reload Reloading exchange rates from open-exchange-rates.json
   [junit4]   2> 835578 T1296 oass.OpenExchangeRatesOrgProvider$OpenExchangeRates.<init> WARN Unknown key IMPORTANT NOTE
   [junit4]   2> 835579 T1337 oass.OpenExchangeRatesOrgProvider.reload Reloading exchange rates from open-exchange-rates.json
   [junit4]   2> 835579 T1323 oass.OpenExchangeRatesOrgProvider.reload Reloading exchange rates from open-exchange-rates.json
   [junit4]   2> 835579 T1309 oass.OpenExchangeRatesOrgProvider$OpenExchangeRates.<init> WARN Unknown key IMPORTANT NOTE
   [junit4]   2> 835580 T1309 oass.OpenExchangeRatesOrgProvider$OpenExchangeRates.<init> WARN Expected key, got STRING
   [junit4]   2> 835579 T1296 oass.OpenExchangeRatesOrgProvider$OpenExchangeRates.<init> WARN Expected key, got STRING
   [junit4]   2> 835581 T1323 oass.OpenExchangeRatesOrgProvider$OpenExchangeRates.<init> WARN Unknown key IMPORTANT NOTE
   [junit4]   2> 835581 T1323 oass.OpenExchangeRatesOrgProvider$OpenExchangeRates.<init> WARN Expected key, got STRING
   [junit4]   2> 835580 T1309 oass.OpenExchangeRatesOrgProvider.reload Reloading exchange rates from open-exchange-rates.json
   [junit4]   2> 835580 T1337 oass.OpenExchangeRatesOrgProvider$OpenExchangeRates.<init> WARN Unknown key IMPORTANT NOTE
   [junit4]   2> 835582 T1323 oass.OpenExchangeRatesOrgProvider.reload Reloading exchange rates from open-exchange-rates.json
   [junit4]   2> 835581 T1296 oass.OpenExchangeRatesOrgProvider.reload Reloading exchange rates from open-exchange-rates.json
   [junit4]   2> 835583 T1309 oass.OpenExchangeRatesOrgProvider$OpenExchangeRates.<init> WARN Unknown key IMPORTANT NOTE
   [junit4]   2> 835584 T1309 oass.OpenExchangeRatesOrgProvider$OpenExchangeRates.<init> WARN Expected key, got STRING
   [junit4]   2> 835582 T1337 oass.OpenExchangeRatesOrgProvider$OpenExchangeRates.<init> WARN Expected key, got STRING
   [junit4]   2> 835584 T1309 oasc.SolrCore.initDirectoryFactory org.apache.solr.core.MockDirectoryFactory
   [junit4]   2> 835584 T1296 oass.OpenExchangeRatesOrgProvider$OpenExchangeRates.<init> WARN Unknown key IMPORTANT NOTE
   [junit4]   2> 835584 T1323 oass.OpenExchangeRatesOrgProvider$OpenExchangeRates.<init> WARN Unknown key IMPORTANT NOTE
   [junit4]   2> 835586 T1323 oass.OpenExchangeRatesOrgProvider$OpenExchangeRates.<init> WARN Expected key, got STRING
   [junit4]   2> 835585 T1296 oass.OpenExchangeRatesOrgProvider$OpenExchangeRates.<init> WARN Expected key, got STRING
   [junit4]   2> 835585 T1309 oasc.SolrCore.<init> [nodes_used_collection_shard1_replica1] Opening new SolrCore at /usr/home/hudson/hudson-slave/workspace/Lucene-Solr-Tests-4.x-Java6/solr/build/solr-core/test/J1/./org.apache.solr.cloud.CollectionsAPIDistributedZkTest-jetty2-1375486883645/nodes_used_collection_shard1_replica1/, dataDir=/usr/home/hudson/hudson-slave/workspace/Lucene-Solr-Tests-4.x-Java6/solr/build/solr-core/test/J1/./org.apache.solr.cloud.CollectionsAPIDistributedZkTest-jetty2-1375486883645//nodes_used_collection_shard1_replica1/data/
   [junit4]   2> 835584 T1337 oass.OpenExchangeRatesOrgProvider.reload Reloading exchange rates from open-exchange-rates.json
   [junit4]   2> 835587 T1309 oasc.JmxMonitoredMap.<init> JMX monitoring is enabled. Adding Solr mbeans to JMX Server: com.sun.jmx.mbeanserver.JmxMBeanServer@6af2f0d0
   [junit4]   2> 835587 T1296 oasc.SolrCore.initDirectoryFactory org.apache.solr.core.MockDirectoryFactory
   [junit4]   2> 835586 T1323 oasc.SolrCore.initDirectoryFactory org.apache.solr.core.MockDirectoryFactory
   [junit4]   2> 835588 T1296 oasc.SolrCore.<init> [nodes_used_collection_shard2_replica1] Opening new SolrCore at /usr/home/hudson/hudson-slave/workspace/Lucene-Solr-Tests-4.x-Java6/solr/build/solr-core/test/J1/./org.apache.solr.cloud.CollectionsAPIDistributedZkTest-jetty1-1375486882013/nodes_used_collection_shard2_replica1/, dataDir=/usr/home/hudson/hudson-slave/workspace/Lucene-Solr-Tests-4.x-Java6/solr/build/solr-core/test/J1/./org.apache.solr.cloud.CollectionsAPIDistributedZkTest-jetty1-1375486882013//nodes_used_collection_shard2_replica1/data/
   [junit4]   2> 835588 T1337 oass.OpenExchangeRatesOrgProvider$OpenExchangeRates.<init> WARN Unknown key IMPORTANT NOTE
   [junit4]   2> 835589 T1337 oass.OpenExchangeRatesOrgProvider$OpenExchangeRates.<init> WARN Expected key, got STRING
   [junit4]   2> 835589 T1296 oasc.JmxMonitoredMap.<init> JMX monitoring is enabled. Adding Solr mbeans to JMX Server: com.sun.jmx.mbeanserver.JmxMBeanServer@6af2f0d0
   [junit4]   2> 835589 T1309 oasc.CachingDirectoryFactory.get return new directory for /usr/home/hudson/hudson-slave/workspace/Lucene-Solr-Tests-4.x-Java6/solr/build/solr-core/test/J1/./org.apache.solr.cloud.CollectionsAPIDistributedZkTest-jetty2-1375486883645//nodes_used_collection_shard1_replica1/data
   [junit4]   2> 835589 T1323 oasc.SolrCore.<init> [nodes_used_collection_shard1_replica2] Opening new SolrCore at /usr/home/hudson/hudson-slave/workspace/Lucene-Solr-Tests-4.x-Java6/solr/build/solr-core/test/J1/./org.apache.solr.cloud.CollectionsAPIDistributedZkTest-jetty3-1375486885321/nodes_used_collection_shard1_replica2/, dataDir=/usr/home/hudson/hudson-slave/workspace/Lucene-Solr-Tests-4.x-Java6/solr/build/solr-core/test/J1/./org.apache.solr.cloud.CollectionsAPIDistributedZkTest-jetty3-1375486885321//nodes_used_collection_shard1_replica2/data/
   [junit4]   2> 835591 T1296 oasc.CachingDirectoryFactory.get return new directory for /usr/home/hudson/hudson-slave/workspace/Lucene-Solr-Tests-4.x-Java6/solr/build/solr-core/test/J1/./org.apache.solr.cloud.CollectionsAPIDistributedZkTest-jetty1-1375486882013//nodes_used_collection_shard2_replica1/data
   [junit4]   2> 835591 T1323 oasc.JmxMonitoredMap.<init> JMX monitoring is enabled. Adding Solr mbeans to JMX Server: com.sun.jmx.mbeanserver.JmxMBeanServer@6af2f0d0
   [junit4]   2> 835590 T1309 oasc.SolrCore.getNewIndexDir New index directory detected: old=null new=/usr/home/hudson/hudson-slave/workspace/Lucene-Solr-Tests-4.x-Java6/solr/build/solr-core/test/J1/./org.apache.solr.cloud.CollectionsAPIDistributedZkTest-jetty2-1375486883645//nodes_used_collection_shard1_replica1/data/index/
   [junit4]   2> 835590 T1337 oasc.SolrCore.initDirectoryFactory org.apache.solr.core.MockDirectoryFactory
   [junit4]   2> 835592 T1309 oasc.SolrCore.initIndex WARN [nodes_used_collection_shard1_replica1] Solr index directory '/usr/home/hudson/hudson-slave/workspace/Lucene-Solr-Tests-4.x-Java6/solr/build/solr-core/test/J1/./org.apache.solr.cloud.CollectionsAPIDistributedZkTest-jetty2-1375486883645/nodes_used_collection_shard1_replica1/data/index' doesn't exist. Creating new index...
   [junit4]   2> 835591 T1296 oasc.SolrCore.getNewIndexDir New index directory detected: old=null new=/usr/home/hudson/hudson-slave/workspace/Lucene-Solr-Tests-4.x-Java6/solr/build/solr-core/test/J1/./org.apache.solr.cloud.CollectionsAPIDistributedZkTest-jetty1-1375486882013//nodes_used_collection_shard2_replica1/data/index/
   [junit4]   2> 835593 T1309 oasc.CachingDirectoryFactory.get return new directory for /usr/home/hudson/hudson-slave/workspace/Lucene-Solr-Tests-4.x-Java6/solr/build/solr-core/test/J1/./org.apache.solr.cloud.CollectionsAPIDistributedZkTest-jetty2-1375486883645//nodes_used_collection_shard1_replica1/data/index
   [junit4]   2> 835593 T1296 oasc.SolrCore.initIndex WARN [nodes_used_collection_shard2_replica1] Solr index directory '/usr/home/hudson/hudson-slave/workspace/Lucene-Solr-Tests-4.x-Java6/solr/build/solr-core/test/J1/./org.apache.solr.cloud.CollectionsAPIDistributedZkTest-jetty1-1375486882013/nodes_used_collection_shard2_replica1/data/index' doesn't exist. Creating new index...
   [junit4]   2> 835592 T1337 oasc.SolrCore.<init> [nodes_used_collection_shard2_replica2] Opening new SolrCore at /usr/home/hudson/hudson-slave/workspace/Lucene-Solr-Tests-4.x-Java6/solr/build/solr-core/test/J1/./org.apache.solr.cloud.CollectionsAPIDistributedZkTest-jetty4-1375486886941/nodes_used_collection_shard2_replica2/, dataDir=/usr/home/hudson/hudson-slave/workspace/Lucene-Solr-Tests-4.x-Java6/solr/build/solr-core/test/J1/./org.apache.solr.cloud.CollectionsAPIDistributedZkTest-jetty4-1375486886941//nodes_used_collection_shard2_replica2/data/
   [junit4]   2> 835592 T1323 oasc.CachingDirectoryFactory.get return new directory for /usr/home/hudson/hudson-slave/workspace/Lucene-Solr-Tests-4.x-Java6/solr/build/solr-core/test/J1/./org.apache.solr.cloud.CollectionsAPIDistributedZkTest-jetty3-1375486885321//nodes_used_collection_shard1_replica2/data
   [junit4]   2> 835594 T1337 oasc.JmxMonitoredMap.<init> JMX monitoring is enabled. Adding Solr mbeans to JMX Server: com.sun.jmx.mbeanserver.JmxMBeanServer@6af2f0d0
   [junit4]   2> 835594 T1296 oasc.CachingDirectoryFactory.get return new directory for /usr/home/hudson/hudson-slave/workspace/Lucene-Solr-Tests-4.x-Java6/solr/build/solr-core/test/J1/./org.apache.solr.cloud.CollectionsAPIDistributedZkTest-jetty1-1375486882013//nodes_used_collection_shard2_replica1/data/index
   [junit4]   2> 835595 T1323 oasc.SolrCore.getNewIndexDir New index directory detected: old=null new=/usr/home/hudson/hudson-slave/workspace/Lucene-Solr-Tests-4.x-Java6/solr/build/solr-core/test/J1/./org.apache.solr.cloud.CollectionsAPIDistributedZkTest-jetty3-1375486885321//nodes_used_collection_shard1_replica2/data/index/
   [junit4]   2> 835596 T1337 oasc.CachingDirectoryFactory.get return new directory for /usr/home/hudson/hudson-slave/workspace/Lucene-Solr-Tests-4.x-Java6/solr/build/solr-core/test/J1/./org.apache.solr.cloud.CollectionsAPIDistributedZkTest-jetty4-1375486886941//nodes_used_collection_shard2_replica2/data
   [junit4]   2> 835596 T1323 oasc.SolrCore.initIndex WARN [nodes_used_collection_shard1_replica2] Solr index directory '/usr/home/hudson/hudson-slave/workspace/Lucene-Solr-Tests-4.x-Java6/solr/build/solr-core/test/J1/./org.apache.solr.cloud.CollectionsAPIDistributedZkTest-jetty3-1375486885321/nodes_used_collection_shard1_replica2/data/index' doesn't exist. Creating new index...
   [junit4]   2> 835596 T1337 oasc.SolrCore.getNewIndexDir New index directory detected: old=null new=/usr/home/hudson/hudson-slave/workspace/Lucene-Solr-Tests-4.x-Java6/solr/build/solr-core/test/J1/./org.apache.solr.cloud.CollectionsAPIDistributedZkTest-jetty4-1375486886941//nodes_used_collection_shard2_replica2/data/index/
   [junit4]   2> 835597 T1323 oasc.CachingDirectoryFactory.get return new directory for /usr/home/hudson/hudson-slave/workspace/Lucene-Solr-Tests-4.x-Java6/solr/build/solr-core/test/J1/./org.apache.solr.cloud.CollectionsAPIDistributedZkTest-jetty3-1375486885321//nodes_used_collection_shard1_replica2/data/index
   [junit4]   2> 835597 T1337 oasc.SolrCore.initIndex WARN [nodes_used_collection_shard2_replica2] Solr index directory '/usr/home/hudson/hudson-slave/workspace/Lucene-Solr-Tests-4.x-Java6/solr/build/solr-core/test/J1/./org.apache.solr.cloud.CollectionsAPIDistributedZkTest-jetty4-1375486886941/nodes_used_collection_shard2_replica2/data/index' doesn't exist. Creating new index...
   [junit4]   2> 835598 T1337 oasc.CachingDirectoryFactory.get return new directory for /usr/home/hudson/hudson-slave/workspace/Lucene-Solr-Tests-4.x-Java6/solr/build/solr-core/test/J1/./org.apache.solr.cloud.CollectionsAPIDistributedZkTest-jetty4-1375486886941//nodes_used_collection_shard2_replica2/data/index
   [junit4]   2> 835599 T1309 oasc.SolrDeletionPolicy.onCommit SolrDeletionPolicy.onCommit: commits: num=1
   [junit4]   2> 		commit{dir=MockDirWrapper(org.apache.lucene.store.RAMDirectory@1334212d lockFactory=org.apache.lucene.store.NativeFSLockFactory@7328027c),segFN=segments_1,generation=1}
   [junit4]   2> 835599 T1309 oasc.SolrDeletionPolicy.updateCommits newest commit generation = 1
   [junit4]   2> 835601 T1296 oasc.SolrDeletionPolicy.onCommit SolrDeletionPolicy.onCommit: commits: num=1
   [junit4]   2> 		commit{dir=MockDirWrapper(org.apache.lucene.store.RAMDirectory@5c082af6 lockFactory=org.apache.lucene.store.NativeFSLockFactory@3b2de2b3),segFN=segments_1,generation=1}
   [junit4]   2> 835602 T1296 oasc.SolrDeletionPolicy.updateCommits newest commit generation = 1
   [junit4]   2> 835603 T1323 oasc.SolrDeletionPolicy.onCommit SolrDeletionPolicy.onCommit: commits: num=1
   [junit4]   2> 		commit{dir=MockDirWrapper(org.apache.lucene.store.RAMDirectory@68caf1a0 lockFactory=org.apache.lucene.store.NativeFSLockFactory@36ece580),segFN=segments_1,generation=1}
   [junit4]   2> 835604 T1323 oasc.SolrDeletionPolicy.updateCommits newest commit generation = 1
   [junit4]   2> 835605 T1309 oasup.UpdateRequestProcessorChain.init inserting DistributedUpdateProcessorFactory into updateRequestProcessorChain "dedupe"
   [junit4]   2> 835605 T1337 oasc.SolrDeletionPolicy.onCommit SolrDeletionPolicy.onCommit: commits: num=1
   [junit4]   2> 		commit{dir=MockDirWrapper(org.apache.lucene.store.RAMDirectory@413c978a lockFactory=org.apache.lucene.store.NativeFSLockFactory@471e3a5a),segFN=segments_1,generation=1}
   [junit4]   2> 835605 T1309 oasup.UpdateRequestProcessorChain.init inserting DistributedUpdateProcessorFactory into updateRequestProcessorChain "stored_sig"
   [junit4]   2> 835606 T1337 oasc.SolrDeletionPolicy.updateCommits newest commit generation = 1
   [junit4]   2> 835606 T1309 oasup.UpdateRequestProcessorChain.init inserting DistributedUpdateProcessorFactory into updateRequestProcessorChain "distrib-dup-test-chain-implicit"
   [junit4]   2> 835607 T1296 oasup.UpdateRequestProcessorChain.init inserting DistributedUpdateProcessorFactory into updateRequestProcessorChain "dedupe"
   [junit4]   2> 835607 T1309 oasc.RequestHandlers.initHandlersFromConfig created standard: solr.StandardRequestHandler
   [junit4]   2> 835607 T1296 oasup.UpdateRequestProcessorChain.init inserting DistributedUpdateProcessorFactory into updateRequestProcessorChain "stored_sig"
   [junit4]   2> 835608 T1309 oasc.RequestHandlers.initHandlersFromConfig created /get: solr.RealTimeGetHandler
   [junit4]   2> 835608 T1323 oasup.UpdateRequestProcessorChain.init inserting DistributedUpdateProcessorFactory into updateRequestProcessorChain "dedupe"
   [junit4]   2> 835608 T1296 oasup.UpdateRequestProcessorChain.init inserting DistributedUpdateProcessorFactory into updateRequestProcessorChain "distrib-dup-test-chain-implicit"
   [junit4]   2> 835608 T1309 oasc.RequestHandlers.initHandlersFromConfig adding lazy requestHandler: solr.ReplicationHandler
   [junit4]   2> 835609 T1323 oasup.UpdateRequestProcessorChain.init inserting DistributedUpdateProcessorFactory into updateRequestProcessorChain "stored_sig"
   [junit4]   2> 835610 T1309 oasc.RequestHandlers.initHandlersFromConfig created /replication: solr.ReplicationHandler
   [junit4]   2> 835610 T1296 oasc.RequestHandlers.initHandlersFromConfig created standard: solr.StandardRequestHandler
   [junit4]   2> 835611 T1309 oasc.RequestHandlers.initHandlersFromConfig created /update: solr.UpdateRequestHandler
   [junit4]   2> 835611 T1337 oasup.UpdateRequestProcessorChain.init inserting DistributedUpdateProcessorFactory into updateRequestProcessorChain "dedupe"
   [junit4]   2> 835611 T1309 oasc.RequestHandlers.initHandlersFromConfig created /admin/: org.apache.solr.handler.admin.AdminHandlers
   [junit4]   2> 835611 T1296 oasc.RequestHandlers.initHandlersFromConfig created /get: solr.RealTimeGetHandler
   [junit4]   2> 835610 T1323 oasup.UpdateRequestProcessorChain.init inserting DistributedUpdateProcessorFactory into updateRequestProcessorChain "distrib-dup-test-chain-implicit"
   [junit4]   2> 835612 T1296 oasc.RequestHandlers.initHandlersFromConfig adding lazy requestHandler: solr.ReplicationHandler
   [junit4]   2> 835613 T1323 oasc.RequestHandlers.initHandlersFromConfig created standard: solr.StandardRequestHandler
   [junit4]   2> 835612 T1337 oasup.UpdateRequestProcessorChain.init inserting DistributedUpdateProcessorFactory into updateRequestProcessorChain "stored_sig"
   [junit4]   2> 835614 T1323 oasc.RequestHandlers.initHandlersFromConfig created /get: solr.RealTimeGetHandler
   [junit4]   2> 835614 T1323 oasc.RequestHandlers.initHandlersFromConfig adding lazy requestHandler: solr.ReplicationHandler
   [junit4]   2> 835613 T1296 oasc.RequestHandlers.initHandlersFromConfig created /replication: solr.ReplicationHandler
   [junit4]   2> 835615 T1323 oasc.RequestHandlers.initHandlersFromConfig created /replication: solr.ReplicationHandler
   [junit4]   2> 835615 T1296 oasc.RequestHandlers.initHandlersFromConfig created /update: solr.UpdateRequestHandler
   [junit4]   2> 835615 T1323 oasc.RequestHandlers.initHandlersFromConfig created /update: solr.UpdateRequestHandler
   [junit4]   2> 835614 T1337 oasup.UpdateRequestProcessorChain.init inserting DistributedUpdateProcessorFactory into updateRequestProcessorChain "distrib-dup-test-chain-implicit"
   [junit4]   2> 835616 T1323 oasc.RequestHandlers.initHandlersFromConfig created /admin/: org.apache.solr.handler.admin.AdminHandlers
   [junit4]   2> 835617 T1337 oasc.RequestHandlers.initHandlersFromConfig created standard: solr.StandardRequestHandler
   [junit4]   2> 835616 T1296 oasc.RequestHandlers.initHandlersFromConfig created /admin/: org.apache.solr.handler.admin.AdminHandlers
   [junit4]   2> 835617 T1337 oasc.RequestHandlers.initHandlersFromConfig created /get: solr.RealTimeGetHandler
   [junit4]   2> 835618 T1337 oasc.RequestHandlers.initHandlersFromConfig adding lazy requestHandler: solr.ReplicationHandler
   [junit4]   2> 835618 T1337 oasc.RequestHandlers.initHandlersFromConfig created /replication: solr.ReplicationHandler
   [junit4]   2> 835619 T1337 oasc.RequestHandlers.initHandlersFromConfig created /update: solr.UpdateRequestHandler
   [junit4]   2> 835619 T1337 oasc.RequestHandlers.initHandlersFromConfig created /admin/: org.apache.solr.handler.admin.AdminHandlers
   [junit4]   2> 835625 T1296 oashl.XMLLoader.init xsltCacheLifetimeSeconds=60
   [junit4]   2> 835625 T1323 oashl.XMLLoader.init xsltCacheLifetimeSeconds=60
   [junit4]   2> 835625 T1337 oashl.XMLLoader.init xsltCacheLifetimeSeconds=60
   [junit4]   2> 835625 T1309 oashl.XMLLoader.init xsltCacheLifetimeSeconds=60
   [junit4]   2> 835636 T1337 oass.SolrIndexSearcher.<init> Opening Searcher@4bd282fd main
   [junit4]   2> 835636 T1296 oass.SolrIndexSearcher.<init> Opening Searcher@6c51d969 main
   [junit4]   2> 835636 T1323 oass.SolrIndexSearcher.<init> Opening Searcher@3f412250 main
   [junit4]   2> 835636 T1309 oass.SolrIndexSearcher.<init> Opening Searcher@64503824 main
   [junit4]   2> 835637 T1337 oasu.CommitTracker.<init> Hard AutoCommit: disabled
   [junit4]   2> 835638 T1296 oasu.CommitTracker.<init> Hard AutoCommit: disabled
   [junit4]   2> 835638 T1323 oasu.CommitTracker.<init> Hard AutoCommit: disabled
   [junit4]   2> 835639 T1309 oasu.CommitTracker.<init> Hard AutoCommit: disabled
   [junit4]   2> 835638 T1337 oasu.CommitTracker.<init> Soft AutoCommit: disabled
   [junit4]   2> 835639 T1309 oasu.CommitTracker.<init> Soft AutoCommit: disabled
   [junit4]   2> 835639 T1323 oasu.CommitTracker.<init> Soft AutoCommit: disabled
   [junit4]   2> 835638 T1296 oasu.CommitTracker.<init> Soft AutoCommit: disabled
   [junit4]   2> 835643 T1353 oasc.SolrCore.registerSearcher [nodes_used_collection_shard2_replica2] Registered new searcher Searcher@4bd282fd main{StandardDirectoryReader(segments_1:1)}
   [junit4]   2> 835643 T1355 oasc.SolrCore.registerSearcher [nodes_used_collection_shard1_replica1] Registered new searcher Searcher@64503824 main{StandardDirectoryReader(segments_1:1)}
   [junit4]   2> 835644 T1356 oasc.SolrCore.registerSearcher [nodes_used_collection_shard1_replica2] Registered new searcher Searcher@3f412250 main{StandardDirectoryReader(segments_1:1)}
   [junit4]   2> 835644 T1354 oasc.SolrCore.registerSearcher [nodes_used_collection_shard2_replica1] Registered new searcher Searcher@6c51d969 main{StandardDirectoryReader(segments_1:1)}
   [junit4]   2> 835645 T1337 oasc.CoreContainer.registerCore registering core: nodes_used_collection_shard2_replica2
   [junit4]   2> 835645 T1309 oasc.CoreContainer.registerCore registering core: nodes_used_collection_shard1_replica1
   [junit4]   2> 835645 T1337 oasc.ZkController.register Register replica - core:nodes_used_collection_shard2_replica2 address:http://127.0.0.1:63911/jd collection:nodes_used_collection shard:shard2
   [junit4]   2> 835646 T1296 oasc.CoreContainer.registerCore registering core: nodes_used_collection_shard2_replica1
   [junit4]   2> 835646 T1337 oascsi.HttpClientUtil.createClient Creating new http client, config:maxConnections=10000&maxConnectionsPerHost=20&connTimeout=15000&socketTimeout=30000&retry=false
   [junit4]   2> 835646 T1323 oasc.CoreContainer.registerCore registering core: nodes_used_collection_shard1_replica2
   [junit4]   2> 835646 T1309 oasc.ZkController.register Register replica - core:nodes_used_collection_shard1_replica1 address:http://127.0.0.1:63900/jd collection:nodes_used_collection shard:shard1
   [junit4]   2> 835647 T1323 oasc.ZkController.register Register replica - core:nodes_used_collection_shard1_replica2 address:http://127.0.0.1:63906/jd collection:nodes_used_collection shard:shard1
   [junit4]   2> 835647 T1296 oasc.ZkController.register Register replica - core:nodes_used_collection_shard2_replica1 address:http://127.0.0.1:63897/jd collection:nodes_used_collection shard:shard2
   [junit4]   2> 835648 T1323 oascsi.HttpClientUtil.createClient Creating new http client, config:maxConnections=10000&maxConnectionsPerHost=20&connTimeout=15000&socketTimeout=30000&retry=false
   [junit4]   2> 835648 T1309 oascsi.HttpClientUtil.createClient Creating new http client, config:maxConnections=10000&maxConnectionsPerHost=20&connTimeout=15000&socketTimeout=30000&retry=false
   [junit4]   2> 835649 T1296 oascsi.HttpClientUtil.createClient Creating new http client, config:maxConnections=10000&maxConnectionsPerHost=20&connTimeout=15000&socketTimeout=30000&retry=false
   [junit4]   2> 835673 T1337 oascc.SolrZkClient.makePath makePath: /collections/nodes_used_collection/leader_elect/shard2/election
   [junit4]   2> 835673 T1309 oascc.SolrZkClient.makePath makePath: /collections/nodes_used_collection/leader_elect/shard1/election
   [junit4]   2> 835673 T1296 oascc.SolrZkClient.makePath makePath: /collections/nodes_used_collection/leader_elect/shard2/election
   [junit4]   2> 835673 T1323 oascc.SolrZkClient.makePath makePath: /collections/nodes_used_collection/leader_elect/shard1/election
   [junit4]   2> 835707 T1296 oasc.ShardLeaderElectionContext.runLeaderProcess Running the leader process for shard shard2
   [junit4]   2> 835707 T1323 oasc.ShardLeaderElectionContext.runLeaderProcess Running the leader process for shard shard1
   [junit4]   2> 835723 T1296 oasc.ShardLeaderElectionContext.waitForReplicasToComeUp Enough replicas found to continue.
   [junit4]   2> 835723 T1323 oasc.ShardLeaderElectionContext.waitForReplicasToComeUp Enough replicas found to continue.
   [junit4]   2> 835724 T1323 oasc.ShardLeaderElectionContext.runLeaderProcess I may be the new leader - try and sync
   [junit4]   2> 835723 T1296 oasc.ShardLeaderElectionContext.runLeaderProcess I may be the new leader - try and sync
   [junit4]   2> 835724 T1323 oasc.SyncStrategy.sync Sync replicas to http://127.0.0.1:63906/jd/nodes_used_collection_shard1_replica2/
   [junit4]   2> 835725 T1296 oasc.SyncStrategy.sync Sync replicas to http://127.0.0.1:63897/jd/nodes_used_collection_shard2_replica1/
   [junit4]   2> 835725 T1323 oasu.PeerSync.sync PeerSync: core=nodes_used_collection_shard1_replica2 url=http://127.0.0.1:63906/jd START replicas=[http://127.0.0.1:63900/jd/nodes_used_collection_shard1_replica1/] nUpdates=100
   [junit4]   2> 835725 T1296 oasu.PeerSync.sync PeerSync: core=nodes_used_collection_shard2_replica1 url=http://127.0.0.1:63897/jd START replicas=[http://127.0.0.1:63911/jd/nodes_used_collection_shard2_replica2/] nUpdates=100
   [junit4]   2> 835726 T1323 oasu.PeerSync.sync PeerSync: core=nodes_used_collection_shard1_replica2 url=http://127.0.0.1:63906/jd DONE.  We have no versions.  sync failed.
   [junit4]   2> 835727 T1323 oasc.SyncStrategy.syncReplicas Leader's attempt to sync with shard failed, moving to the next candidate
   [junit4]   2> 835726 T1296 oasu.PeerSync.sync PeerSync: core=nodes_used_collection_shard2_replica1 url=http://127.0.0.1:63897/jd DONE.  We have no versions.  sync failed.
   [junit4]   2> 835728 T1296 oasc.SyncStrategy.syncReplicas Leader's attempt to sync with shard failed, moving to the next candidate
   [junit4]   2> 835727 T1323 oasc.ShardLeaderElectionContext.runLeaderProcess We failed sync, but we have no versions - we can't sync in that case - we were active before, so become leader anyway
   [junit4]   2> 835729 T1296 oasc.ShardLeaderElectionContext.runLeaderProcess We failed sync, but we have no versions - we can't sync in that case - we were active before, so become leader anyway
   [junit4]   2> 835729 T1323 oasc.ShardLeaderElectionContext.runLeaderProcess I am the new leader: http://127.0.0.1:63906/jd/nodes_used_collection_shard1_replica2/ shard1
   [junit4]   2> 835729 T1296 oasc.ShardLeaderElectionContext.runLeaderProcess I am the new leader: http://127.0.0.1:63897/jd/nodes_used_collection_shard2_replica1/ shard2
   [junit4]   2> 835730 T1323 oascc.SolrZkClient.makePath makePath: /collections/nodes_used_collection/leaders/shard1
   [junit4]   2> 835730 T1296 oascc.SolrZkClient.makePath makePath: /collections/nodes_used_collection/leaders/shard2
   [junit4]   2> ASYNC  NEW_CORE C289 name=nodes_used_collection_shard2_replica2 org.a

[...truncated too long message...]

.apache.solr.common.cloud.SolrZkClient$6.execute(SolrZkClient.java:232)
   [junit4]   2> 	at org.apache.solr.common.cloud.ZkCmdExecutor.retryOperation(ZkCmdExecutor.java:65)
   [junit4]   2> 	at org.apache.solr.common.cloud.SolrZkClient.getChildren(SolrZkClient.java:232)
   [junit4]   2> 	at org.apache.solr.cloud.LeaderElector.checkIfIamLeader(LeaderElector.java:84)
   [junit4]   2> 	at org.apache.solr.cloud.LeaderElector.access$000(LeaderElector.java:55)
   [junit4]   2> 	at org.apache.solr.cloud.LeaderElector$1.process(LeaderElector.java:129)
   [junit4]   2> 	at org.apache.zookeeper.ClientCnxn$EventThread.processEvent(ClientCnxn.java:519)
   [junit4]   2> 	at org.apache.zookeeper.ClientCnxn$EventThread.run(ClientCnxn.java:495)
   [junit4]   2> 
   [junit4]   2> 1004259 T1347 oasc.LeaderElector$1.process WARN  org.apache.zookeeper.KeeperException$SessionExpiredException: KeeperErrorCode = Session expired for /collections/new_implicit_coll_1/leader_elect/d/election
   [junit4]   2> 	at org.apache.zookeeper.KeeperException.create(KeeperException.java:127)
   [junit4]   2> 	at org.apache.zookeeper.KeeperException.create(KeeperException.java:51)
   [junit4]   2> 	at org.apache.zookeeper.ZooKeeper.getChildren(ZooKeeper.java:1468)
   [junit4]   2> 	at org.apache.solr.common.cloud.SolrZkClient$6.execute(SolrZkClient.java:235)
   [junit4]   2> 	at org.apache.solr.common.cloud.SolrZkClient$6.execute(SolrZkClient.java:232)
   [junit4]   2> 	at org.apache.solr.common.cloud.ZkCmdExecutor.retryOperation(ZkCmdExecutor.java:65)
   [junit4]   2> 	at org.apache.solr.common.cloud.SolrZkClient.getChildren(SolrZkClient.java:232)
   [junit4]   2> 	at org.apache.solr.cloud.LeaderElector.checkIfIamLeader(LeaderElector.java:84)
   [junit4]   2> 	at org.apache.solr.cloud.LeaderElector.access$000(LeaderElector.java:55)
   [junit4]   2> 	at org.apache.solr.cloud.LeaderElector$1.process(LeaderElector.java:129)
   [junit4]   2> 	at org.apache.zookeeper.ClientCnxn$EventThread.processEvent(ClientCnxn.java:519)
   [junit4]   2> 	at org.apache.zookeeper.ClientCnxn$EventThread.run(ClientCnxn.java:495)
   [junit4]   2> 
   [junit4]   2> 180678 T1264 ccr.ThreadLeakControl.checkThreadLeaks WARNING Will linger awaiting termination of 2 leaked thread(s).
   [junit4]   2> 1019242 T1881 oasc.SolrException.log ERROR http://127.0.0.1:63911/jd/new_implicit_coll_0_b_replica4/: Could not tell a replica to recover:org.apache.solr.client.solrj.SolrServerException: IOException occured when talking to server at: http://127.0.0.1:63906/jd
   [junit4]   2> 		at org.apache.solr.client.solrj.impl.HttpSolrServer.request(HttpSolrServer.java:435)
   [junit4]   2> 		at org.apache.solr.client.solrj.impl.HttpSolrServer.request(HttpSolrServer.java:180)
   [junit4]   2> 		at org.apache.solr.cloud.SyncStrategy$1.run(SyncStrategy.java:291)
   [junit4]   2> 		at java.util.concurrent.ThreadPoolExecutor.runWorker(ThreadPoolExecutor.java:1146)
   [junit4]   2> 		at java.util.concurrent.ThreadPoolExecutor$Worker.run(ThreadPoolExecutor.java:615)
   [junit4]   2> 		at java.lang.Thread.run(Thread.java:679)
   [junit4]   2> 	Caused by: org.apache.http.conn.ConnectTimeoutException: Connect to 127.0.0.1:63906 timed out
   [junit4]   2> 		at org.apache.http.conn.scheme.PlainSocketFactory.connectSocket(PlainSocketFactory.java:129)
   [junit4]   2> 		at org.apache.http.impl.conn.DefaultClientConnectionOperator.openConnection(DefaultClientConnectionOperator.java:180)
   [junit4]   2> 		at org.apache.http.impl.conn.ManagedClientConnectionImpl.open(ManagedClientConnectionImpl.java:294)
   [junit4]   2> 		at org.apache.http.impl.client.DefaultRequestDirector.tryConnect(DefaultRequestDirector.java:645)
   [junit4]   2> 		at org.apache.http.impl.client.DefaultRequestDirector.execute(DefaultRequestDirector.java:480)
   [junit4]   2> 		at org.apache.http.impl.client.AbstractHttpClient.execute(AbstractHttpClient.java:906)
   [junit4]   2> 		at org.apache.http.impl.client.AbstractHttpClient.execute(AbstractHttpClient.java:805)
   [junit4]   2> 		at org.apache.http.impl.client.AbstractHttpClient.execute(AbstractHttpClient.java:784)
   [junit4]   2> 		at org.apache.solr.client.solrj.impl.HttpSolrServer.request(HttpSolrServer.java:365)
   [junit4]   2> 		... 5 more
   [junit4]   2> 	
   [junit4]   2> 1019242 T1883 oasc.SolrException.log ERROR http://127.0.0.1:63911/jd/new_implicit_coll_0_b_replica4/: Could not tell a replica to recover:org.apache.solr.client.solrj.SolrServerException: IOException occured when talking to server at: http://127.0.0.1:63893/jd
   [junit4]   2> 		at org.apache.solr.client.solrj.impl.HttpSolrServer.request(HttpSolrServer.java:435)
   [junit4]   2> 		at org.apache.solr.client.solrj.impl.HttpSolrServer.request(HttpSolrServer.java:180)
   [junit4]   2> 		at org.apache.solr.cloud.SyncStrategy$1.run(SyncStrategy.java:291)
   [junit4]   2> 		at java.util.concurrent.ThreadPoolExecutor.runWorker(ThreadPoolExecutor.java:1146)
   [junit4]   2> 		at java.util.concurrent.ThreadPoolExecutor$Worker.run(ThreadPoolExecutor.java:615)
   [junit4]   2> 		at java.lang.Thread.run(Thread.java:679)
   [junit4]   2> 	Caused by: org.apache.http.conn.ConnectTimeoutException: Connect to 127.0.0.1:63893 timed out
   [junit4]   2> 		at org.apache.http.conn.scheme.PlainSocketFactory.connectSocket(PlainSocketFactory.java:129)
   [junit4]   2> 		at org.apache.http.impl.conn.DefaultClientConnectionOperator.openConnection(DefaultClientConnectionOperator.java:180)
   [junit4]   2> 		at org.apache.http.impl.conn.ManagedClientConnectionImpl.open(ManagedClientConnectionImpl.java:294)
   [junit4]   2> 		at org.apache.http.impl.client.DefaultRequestDirector.tryConnect(DefaultRequestDirector.java:645)
   [junit4]   2> 		at org.apache.http.impl.client.DefaultRequestDirector.execute(DefaultRequestDirector.java:480)
   [junit4]   2> 		at org.apache.http.impl.client.AbstractHttpClient.execute(AbstractHttpClient.java:906)
   [junit4]   2> 		at org.apache.http.impl.client.AbstractHttpClient.execute(AbstractHttpClient.java:805)
   [junit4]   2> 		at org.apache.http.impl.client.AbstractHttpClient.execute(AbstractHttpClient.java:784)
   [junit4]   2> 		at org.apache.solr.client.solrj.impl.HttpSolrServer.request(HttpSolrServer.java:365)
   [junit4]   2> 		... 5 more
   [junit4]   2> 	
   [junit4]   2> NOTE: test params are: codec=Lucene42: {range_facet_l=Pulsing41(freqCutoff=20 minBlockSize=55 maxBlockSize=128), _route_=PostingsFormat(name=MockRandom), text=PostingsFormat(name=MockRandom), _version_=PostingsFormat(name=Memory doPackFST= false), intDefault=PostingsFormat(name=Memory doPackFST= false), id=Lucene41(blocksize=128), timestamp=Pulsing41(freqCutoff=20 minBlockSize=55 maxBlockSize=128), a_t=Pulsing41(freqCutoff=20 minBlockSize=55 maxBlockSize=128), range_facet_sl=Lucene41(blocksize=128), range_facet_si=Pulsing41(freqCutoff=20 minBlockSize=55 maxBlockSize=128), other_tl1=PostingsFormat(name=Memory doPackFST= false), multiDefault=Pulsing41(freqCutoff=20 minBlockSize=55 maxBlockSize=128), a_si=PostingsFormat(name=Memory doPackFST= false)}, docValues:{}, sim=DefaultSimilarity, locale=es, timezone=ROK
   [junit4]   2> NOTE: FreeBSD 9.1-RELEASE-p3 amd64/Sun Microsystems Inc. 1.6.0_32 (64-bit)/cpus=16,threads=1,free=190100264,total=470548480
   [junit4]   2> NOTE: All tests run in this JVM: [CoreAdminCreateDiscoverTest, DirectSolrSpellCheckerTest, NotRequiredUniqueKeyTest, ConvertedLegacyTest, BasicDistributedZk2Test, TestReloadAndDeleteDocs, DefaultValueUpdateProcessorTest, BasicZkTest, SpellCheckCollatorTest, TestJmxMonitoredMap, ZkSolrClientTest, CurrencyFieldXmlFileTest, TestLazyCores, QueryResultKeyTest, TestStressReorder, TestSchemaResource, DirectUpdateHandlerTest, JSONWriterTest, TestWordDelimiterFilterFactory, TestCollationField, TestInfoStreamLogging, LeaderElectionIntegrationTest, TestAddFieldRealTimeGet, TestCloudManagedSchema, TestCoreDiscovery, SpellPossibilityIteratorTest, XmlUpdateRequestHandlerTest, SortByFunctionTest, UniqFieldsUpdateProcessorFactoryTest, TestDFRSimilarityFactory, DebugComponentTest, OpenExchangeRatesOrgProviderTest, TestRecovery, SignatureUpdateProcessorFactoryTest, PathHierarchyTokenizerFactoryTest, TestQueryTypes, DisMaxRequestHandlerTest, CurrencyFieldOpenExchangeTest, TestSchemaVersionResource, HdfsLockFactoryTest, StandardRequestHandlerTest, OutputWriterTest, TestZkChroot, SolrRequestParserTest, DistanceFunctionTest, TimeZoneUtilsTest, TestLMJelinekMercerSimilarityFactory, TestDefaultSimilarityFactory, TestMultiCoreConfBootstrap, RequiredFieldsTest, TestCodecSupport, SolrCmdDistributorTest, TestIndexingPerformance, CollectionsAPIDistributedZkTest]
   [junit4] Completed on J1 in 200.33s, 1 test, 1 error <<< FAILURES!

[...truncated 588 lines...]
BUILD FAILED
/usr/home/hudson/hudson-slave/workspace/Lucene-Solr-Tests-4.x-Java6/build.xml:395: The following error occurred while executing this line:
/usr/home/hudson/hudson-slave/workspace/Lucene-Solr-Tests-4.x-Java6/build.xml:375: The following error occurred while executing this line:
/usr/home/hudson/hudson-slave/workspace/Lucene-Solr-Tests-4.x-Java6/build.xml:39: The following error occurred while executing this line:
/usr/home/hudson/hudson-slave/workspace/Lucene-Solr-Tests-4.x-Java6/solr/build.xml:181: The following error occurred while executing this line:
/usr/home/hudson/hudson-slave/workspace/Lucene-Solr-Tests-4.x-Java6/solr/common-build.xml:449: The following error occurred while executing this line:
/usr/home/hudson/hudson-slave/workspace/Lucene-Solr-Tests-4.x-Java6/lucene/common-build.xml:1233: The following error occurred while executing this line:
/usr/home/hudson/hudson-slave/workspace/Lucene-Solr-Tests-4.x-Java6/lucene/common-build.xml:876: There were test failures: 321 suites, 1352 tests, 1 error, 34 ignored (6 assumptions)

Total time: 54 minutes 14 seconds
Build step 'Invoke Ant' marked build as failure
Archiving artifacts
Recording test results
Email was triggered for: Failure
Sending email for trigger: Failure



Mime
View raw message