lucene-dev mailing list archives

Site index · List index
Message view « Date » · « Thread »
Top « Date » · « Thread »
From Policeman Jenkins Server <jenk...@thetaphi.de>
Subject [JENKINS] Lucene-Solr-trunk-Linux (64bit/jdk1.7.0_25) - Build # 6836 - Failure!
Date Fri, 02 Aug 2013 00:31:25 GMT
Build: http://jenkins.thetaphi.de/job/Lucene-Solr-trunk-Linux/6836/
Java: 64bit/jdk1.7.0_25 -XX:+UseCompressedOops -XX:+UseParallelGC

1 tests failed.
FAILED:  org.apache.solr.cloud.CollectionsAPIDistributedZkTest.testDistribSearch

Error Message:
Server refused connection at: http://127.0.0.1:43622

Stack Trace:
org.apache.solr.client.solrj.SolrServerException: Server refused connection at: http://127.0.0.1:43622
	at __randomizedtesting.SeedInfo.seed([F9F80CC4E86C5A6B:781E82DC9F333A57]:0)
	at org.apache.solr.client.solrj.impl.HttpSolrServer.request(HttpSolrServer.java:428)
	at org.apache.solr.client.solrj.impl.HttpSolrServer.request(HttpSolrServer.java:180)
	at org.apache.solr.cloud.AbstractFullDistribZkTestBase.createCollection(AbstractFullDistribZkTestBase.java:1535)
	at org.apache.solr.cloud.CollectionsAPIDistributedZkTest.testCustomCollectionsAPI(CollectionsAPIDistributedZkTest.java:677)
	at org.apache.solr.cloud.CollectionsAPIDistributedZkTest.doTest(CollectionsAPIDistributedZkTest.java:159)
	at org.apache.solr.BaseDistributedSearchTestCase.testDistribSearch(BaseDistributedSearchTestCase.java:835)
	at sun.reflect.NativeMethodAccessorImpl.invoke0(Native Method)
	at sun.reflect.NativeMethodAccessorImpl.invoke(NativeMethodAccessorImpl.java:57)
	at sun.reflect.DelegatingMethodAccessorImpl.invoke(DelegatingMethodAccessorImpl.java:43)
	at java.lang.reflect.Method.invoke(Method.java:606)
	at com.carrotsearch.randomizedtesting.RandomizedRunner.invoke(RandomizedRunner.java:1559)
	at com.carrotsearch.randomizedtesting.RandomizedRunner.access$600(RandomizedRunner.java:79)
	at com.carrotsearch.randomizedtesting.RandomizedRunner$6.evaluate(RandomizedRunner.java:737)
	at com.carrotsearch.randomizedtesting.RandomizedRunner$7.evaluate(RandomizedRunner.java:773)
	at com.carrotsearch.randomizedtesting.RandomizedRunner$8.evaluate(RandomizedRunner.java:787)
	at com.carrotsearch.randomizedtesting.rules.SystemPropertiesRestoreRule$1.evaluate(SystemPropertiesRestoreRule.java:53)
	at org.apache.lucene.util.TestRuleSetupTeardownChained$1.evaluate(TestRuleSetupTeardownChained.java:50)
	at org.apache.lucene.util.TestRuleFieldCacheSanity$1.evaluate(TestRuleFieldCacheSanity.java:51)
	at org.apache.lucene.util.AbstractBeforeAfterRule$1.evaluate(AbstractBeforeAfterRule.java:46)
	at com.carrotsearch.randomizedtesting.rules.SystemPropertiesInvariantRule$1.evaluate(SystemPropertiesInvariantRule.java:55)
	at org.apache.lucene.util.TestRuleThreadAndTestName$1.evaluate(TestRuleThreadAndTestName.java:49)
	at org.apache.lucene.util.TestRuleIgnoreAfterMaxFailures$1.evaluate(TestRuleIgnoreAfterMaxFailures.java:70)
	at org.apache.lucene.util.TestRuleMarkFailure$1.evaluate(TestRuleMarkFailure.java:48)
	at com.carrotsearch.randomizedtesting.rules.StatementAdapter.evaluate(StatementAdapter.java:36)
	at com.carrotsearch.randomizedtesting.ThreadLeakControl$StatementRunner.run(ThreadLeakControl.java:358)
	at com.carrotsearch.randomizedtesting.ThreadLeakControl.forkTimeoutingTask(ThreadLeakControl.java:782)
	at com.carrotsearch.randomizedtesting.ThreadLeakControl$3.evaluate(ThreadLeakControl.java:442)
	at com.carrotsearch.randomizedtesting.RandomizedRunner.runSingleTest(RandomizedRunner.java:746)
	at com.carrotsearch.randomizedtesting.RandomizedRunner$3.evaluate(RandomizedRunner.java:648)
	at com.carrotsearch.randomizedtesting.RandomizedRunner$4.evaluate(RandomizedRunner.java:682)
	at com.carrotsearch.randomizedtesting.RandomizedRunner$5.evaluate(RandomizedRunner.java:693)
	at com.carrotsearch.randomizedtesting.rules.StatementAdapter.evaluate(StatementAdapter.java:36)
	at com.carrotsearch.randomizedtesting.rules.SystemPropertiesRestoreRule$1.evaluate(SystemPropertiesRestoreRule.java:53)
	at org.apache.lucene.util.AbstractBeforeAfterRule$1.evaluate(AbstractBeforeAfterRule.java:46)
	at org.apache.lucene.util.TestRuleStoreClassName$1.evaluate(TestRuleStoreClassName.java:42)
	at com.carrotsearch.randomizedtesting.rules.SystemPropertiesInvariantRule$1.evaluate(SystemPropertiesInvariantRule.java:55)
	at com.carrotsearch.randomizedtesting.rules.NoShadowingOrOverridesOnMethodsRule$1.evaluate(NoShadowingOrOverridesOnMethodsRule.java:39)
	at com.carrotsearch.randomizedtesting.rules.NoShadowingOrOverridesOnMethodsRule$1.evaluate(NoShadowingOrOverridesOnMethodsRule.java:39)
	at com.carrotsearch.randomizedtesting.rules.StatementAdapter.evaluate(StatementAdapter.java:36)
	at org.apache.lucene.util.TestRuleAssertionsRequired$1.evaluate(TestRuleAssertionsRequired.java:43)
	at org.apache.lucene.util.TestRuleMarkFailure$1.evaluate(TestRuleMarkFailure.java:48)
	at org.apache.lucene.util.TestRuleIgnoreAfterMaxFailures$1.evaluate(TestRuleIgnoreAfterMaxFailures.java:70)
	at org.apache.lucene.util.TestRuleIgnoreTestSuites$1.evaluate(TestRuleIgnoreTestSuites.java:55)
	at com.carrotsearch.randomizedtesting.rules.StatementAdapter.evaluate(StatementAdapter.java:36)
	at com.carrotsearch.randomizedtesting.ThreadLeakControl$StatementRunner.run(ThreadLeakControl.java:358)
	at java.lang.Thread.run(Thread.java:724)
Caused by: org.apache.http.conn.HttpHostConnectException: Connection to http://127.0.0.1:43622 refused
	at org.apache.http.impl.conn.DefaultClientConnectionOperator.openConnection(DefaultClientConnectionOperator.java:190)
	at org.apache.http.impl.conn.ManagedClientConnectionImpl.open(ManagedClientConnectionImpl.java:294)
	at org.apache.http.impl.client.DefaultRequestDirector.tryConnect(DefaultRequestDirector.java:645)
	at org.apache.http.impl.client.DefaultRequestDirector.execute(DefaultRequestDirector.java:480)
	at org.apache.http.impl.client.AbstractHttpClient.execute(AbstractHttpClient.java:906)
	at org.apache.http.impl.client.AbstractHttpClient.execute(AbstractHttpClient.java:805)
	at org.apache.http.impl.client.AbstractHttpClient.execute(AbstractHttpClient.java:784)
	at org.apache.solr.client.solrj.impl.HttpSolrServer.request(HttpSolrServer.java:365)
	... 45 more
Caused by: java.net.ConnectException: Connection refused
	at java.net.PlainSocketImpl.socketConnect(Native Method)
	at java.net.AbstractPlainSocketImpl.doConnect(AbstractPlainSocketImpl.java:339)
	at java.net.AbstractPlainSocketImpl.connectToAddress(AbstractPlainSocketImpl.java:200)
	at java.net.AbstractPlainSocketImpl.connect(AbstractPlainSocketImpl.java:182)
	at java.net.SocksSocketImpl.connect(SocksSocketImpl.java:392)
	at java.net.Socket.connect(Socket.java:579)
	at org.apache.http.conn.scheme.PlainSocketFactory.connectSocket(PlainSocketFactory.java:127)
	at org.apache.http.impl.conn.DefaultClientConnectionOperator.openConnection(DefaultClientConnectionOperator.java:180)
	... 52 more




Build Log:
[...truncated 9497 lines...]
   [junit4] Suite: org.apache.solr.cloud.CollectionsAPIDistributedZkTest
   [junit4]   2> 38175 T160 oas.BaseDistributedSearchTestCase.initHostContext Setting hostContext system property: /
   [junit4]   2> 38180 T160 oas.SolrTestCaseJ4.setUp ###Starting testDistribSearch
   [junit4]   2> Creating dataDir: /mnt/ssd/jenkins/workspace/Lucene-Solr-trunk-Linux/solr/build/solr-core/test/J1/./solrtest-CollectionsAPIDistributedZkTest-1375402238724
   [junit4]   2> 38180 T160 oasc.ZkTestServer.run STARTING ZK TEST SERVER
   [junit4]   2> 38181 T161 oasc.ZkTestServer$ZKServerMain.runFromConfig Starting server
   [junit4]   2> 38281 T160 oasc.ZkTestServer.run start zk server on port:40058
   [junit4]   2> 38282 T160 oascc.ConnectionManager.waitForConnected Waiting for client to connect to ZooKeeper
   [junit4]   2> 38305 T167 oascc.ConnectionManager.process Watcher org.apache.solr.common.cloud.ConnectionManager@3281e48a name:ZooKeeperConnection Watcher:127.0.0.1:40058 got event WatchedEvent state:SyncConnected type:None path:null path:null type:None
   [junit4]   2> 38305 T160 oascc.ConnectionManager.waitForConnected Client is connected to ZooKeeper
   [junit4]   2> 38305 T160 oascc.SolrZkClient.makePath makePath: /solr
   [junit4]   2> 38312 T160 oascc.ConnectionManager.waitForConnected Waiting for client to connect to ZooKeeper
   [junit4]   2> 38320 T169 oascc.ConnectionManager.process Watcher org.apache.solr.common.cloud.ConnectionManager@4de2c090 name:ZooKeeperConnection Watcher:127.0.0.1:40058/solr got event WatchedEvent state:SyncConnected type:None path:null path:null type:None
   [junit4]   2> 38321 T160 oascc.ConnectionManager.waitForConnected Client is connected to ZooKeeper
   [junit4]   2> 38321 T160 oascc.SolrZkClient.makePath makePath: /collections/collection1
   [junit4]   2> 38326 T160 oascc.SolrZkClient.makePath makePath: /collections/collection1/shards
   [junit4]   2> 38331 T160 oascc.SolrZkClient.makePath makePath: /collections/control_collection
   [junit4]   2> 38335 T160 oascc.SolrZkClient.makePath makePath: /collections/control_collection/shards
   [junit4]   2> 38339 T160 oasc.AbstractZkTestCase.putConfig put /mnt/ssd/jenkins/workspace/Lucene-Solr-trunk-Linux/solr/build/solr-core/test-files/solr/collection1/conf/solrconfig-tlog.xml to /configs/conf1/solrconfig.xml
   [junit4]   2> 38340 T160 oascc.SolrZkClient.makePath makePath: /configs/conf1/solrconfig.xml
   [junit4]   2> 38346 T160 oasc.AbstractZkTestCase.putConfig put /mnt/ssd/jenkins/workspace/Lucene-Solr-trunk-Linux/solr/build/solr-core/test-files/solr/collection1/conf/schema.xml to /configs/conf1/schema.xml
   [junit4]   2> 38347 T160 oascc.SolrZkClient.makePath makePath: /configs/conf1/schema.xml
   [junit4]   2> 38352 T160 oasc.AbstractZkTestCase.putConfig put /mnt/ssd/jenkins/workspace/Lucene-Solr-trunk-Linux/solr/build/solr-core/test-files/solr/collection1/conf/stopwords.txt to /configs/conf1/stopwords.txt
   [junit4]   2> 38353 T160 oascc.SolrZkClient.makePath makePath: /configs/conf1/stopwords.txt
   [junit4]   2> 38357 T160 oasc.AbstractZkTestCase.putConfig put /mnt/ssd/jenkins/workspace/Lucene-Solr-trunk-Linux/solr/build/solr-core/test-files/solr/collection1/conf/protwords.txt to /configs/conf1/protwords.txt
   [junit4]   2> 38358 T160 oascc.SolrZkClient.makePath makePath: /configs/conf1/protwords.txt
   [junit4]   2> 38363 T160 oasc.AbstractZkTestCase.putConfig put /mnt/ssd/jenkins/workspace/Lucene-Solr-trunk-Linux/solr/build/solr-core/test-files/solr/collection1/conf/currency.xml to /configs/conf1/currency.xml
   [junit4]   2> 38364 T160 oascc.SolrZkClient.makePath makePath: /configs/conf1/currency.xml
   [junit4]   2> 38368 T160 oasc.AbstractZkTestCase.putConfig put /mnt/ssd/jenkins/workspace/Lucene-Solr-trunk-Linux/solr/build/solr-core/test-files/solr/collection1/conf/open-exchange-rates.json to /configs/conf1/open-exchange-rates.json
   [junit4]   2> 38369 T160 oascc.SolrZkClient.makePath makePath: /configs/conf1/open-exchange-rates.json
   [junit4]   2> 38373 T160 oasc.AbstractZkTestCase.putConfig put /mnt/ssd/jenkins/workspace/Lucene-Solr-trunk-Linux/solr/build/solr-core/test-files/solr/collection1/conf/mapping-ISOLatin1Accent.txt to /configs/conf1/mapping-ISOLatin1Accent.txt
   [junit4]   2> 38374 T160 oascc.SolrZkClient.makePath makePath: /configs/conf1/mapping-ISOLatin1Accent.txt
   [junit4]   2> 38378 T160 oasc.AbstractZkTestCase.putConfig put /mnt/ssd/jenkins/workspace/Lucene-Solr-trunk-Linux/solr/build/solr-core/test-files/solr/collection1/conf/old_synonyms.txt to /configs/conf1/old_synonyms.txt
   [junit4]   2> 38379 T160 oascc.SolrZkClient.makePath makePath: /configs/conf1/old_synonyms.txt
   [junit4]   2> 38383 T160 oasc.AbstractZkTestCase.putConfig put /mnt/ssd/jenkins/workspace/Lucene-Solr-trunk-Linux/solr/build/solr-core/test-files/solr/collection1/conf/synonyms.txt to /configs/conf1/synonyms.txt
   [junit4]   2> 38384 T160 oascc.SolrZkClient.makePath makePath: /configs/conf1/synonyms.txt
   [junit4]   2> 38507 T160 oejs.Server.doStart jetty-8.1.10.v20130312
   [junit4]   2> 38532 T160 oejs.AbstractConnector.doStart Started SelectChannelConnector@127.0.0.1:40091
   [junit4]   2> 38533 T160 oass.SolrDispatchFilter.init SolrDispatchFilter.init()
   [junit4]   2> 38533 T160 oasc.SolrResourceLoader.locateSolrHome JNDI not configured for solr (NoInitialContextEx)
   [junit4]   2> 38534 T160 oasc.SolrResourceLoader.locateSolrHome using system property solr.solr.home: /mnt/ssd/jenkins/workspace/Lucene-Solr-trunk-Linux/solr/build/solr-core/test/J1/./org.apache.solr.cloud.CollectionsAPIDistributedZkTest-controljetty-1375402238933
   [junit4]   2> 38534 T160 oasc.SolrResourceLoader.<init> new SolrResourceLoader for directory: '/mnt/ssd/jenkins/workspace/Lucene-Solr-trunk-Linux/solr/build/solr-core/test/J1/./org.apache.solr.cloud.CollectionsAPIDistributedZkTest-controljetty-1375402238933/'
   [junit4]   2> 38549 T160 oasc.ConfigSolr.fromFile Loading container configuration from /mnt/ssd/jenkins/workspace/Lucene-Solr-trunk-Linux/solr/build/solr-core/test/J1/./org.apache.solr.cloud.CollectionsAPIDistributedZkTest-controljetty-1375402238933/solr.xml
   [junit4]   2> 38584 T160 oasc.ConfigSolrXml.<init> Config-defined core root directory: 
   [junit4]   2> 38585 T160 oasc.CoreContainer.<init> New CoreContainer 735795475
   [junit4]   2> 38585 T160 oasc.CoreContainer.load Loading cores into CoreContainer [instanceDir=/mnt/ssd/jenkins/workspace/Lucene-Solr-trunk-Linux/solr/build/solr-core/test/J1/./org.apache.solr.cloud.CollectionsAPIDistributedZkTest-controljetty-1375402238933/]
   [junit4]   2> 38586 T160 oashc.HttpShardHandlerFactory.getParameter Setting socketTimeout to: 120000
   [junit4]   2> 38586 T160 oashc.HttpShardHandlerFactory.getParameter Setting urlScheme to: http://
   [junit4]   2> 38587 T160 oashc.HttpShardHandlerFactory.getParameter Setting connTimeout to: 15000
   [junit4]   2> 38587 T160 oashc.HttpShardHandlerFactory.getParameter Setting maxConnectionsPerHost to: 20
   [junit4]   2> 38587 T160 oashc.HttpShardHandlerFactory.getParameter Setting corePoolSize to: 0
   [junit4]   2> 38588 T160 oashc.HttpShardHandlerFactory.getParameter Setting maximumPoolSize to: 2147483647
   [junit4]   2> 38588 T160 oashc.HttpShardHandlerFactory.getParameter Setting maxThreadIdleTime to: 5
   [junit4]   2> 38588 T160 oashc.HttpShardHandlerFactory.getParameter Setting sizeOfQueue to: -1
   [junit4]   2> 38589 T160 oashc.HttpShardHandlerFactory.getParameter Setting fairnessPolicy to: false
   [junit4]   2> 38589 T160 oascsi.HttpClientUtil.createClient Creating new http client, config:maxConnectionsPerHost=20&maxConnections=10000&socketTimeout=120000&connTimeout=15000&retry=false
   [junit4]   2> 38593 T160 oasc.ZkContainer.initZooKeeper Zookeeper client=127.0.0.1:40058/solr
   [junit4]   2> 38601 T160 oasc.ZkController.checkChrootPath zkHost includes chroot
   [junit4]   2> 38602 T160 oascc.ConnectionManager.waitForConnected Waiting for client to connect to ZooKeeper
   [junit4]   2> 38606 T180 oascc.ConnectionManager.process Watcher org.apache.solr.common.cloud.ConnectionManager@5452fc62 name:ZooKeeperConnection Watcher:127.0.0.1:40058 got event WatchedEvent state:SyncConnected type:None path:null path:null type:None
   [junit4]   2> 38606 T160 oascc.ConnectionManager.waitForConnected Client is connected to ZooKeeper
   [junit4]   2> 38610 T160 oascsi.HttpClientUtil.createClient Creating new http client, config:maxConnections=500&maxConnectionsPerHost=16&socketTimeout=120000&connTimeout=15000
   [junit4]   2> 38615 T160 oascc.ConnectionManager.waitForConnected Waiting for client to connect to ZooKeeper
   [junit4]   2> 38616 T182 oascc.ConnectionManager.process Watcher org.apache.solr.common.cloud.ConnectionManager@3caa3588 name:ZooKeeperConnection Watcher:127.0.0.1:40058/solr got event WatchedEvent state:SyncConnected type:None path:null path:null type:None
   [junit4]   2> 38617 T160 oascc.ConnectionManager.waitForConnected Client is connected to ZooKeeper
   [junit4]   2> 38622 T160 oascc.SolrZkClient.makePath makePath: /overseer/queue
   [junit4]   2> 38628 T160 oascc.SolrZkClient.makePath makePath: /overseer/collection-queue-work
   [junit4]   2> 38636 T160 oascc.SolrZkClient.makePath makePath: /live_nodes
   [junit4]   2> 38639 T160 oasc.ZkController.createEphemeralLiveNode Register node as live in ZooKeeper:/live_nodes/127.0.0.1:40091_
   [junit4]   2> 38640 T160 oascc.SolrZkClient.makePath makePath: /live_nodes/127.0.0.1:40091_
   [junit4]   2> 38645 T160 oascc.SolrZkClient.makePath makePath: /overseer_elect/election
   [junit4]   2> 38652 T160 oascc.SolrZkClient.makePath makePath: /overseer_elect/leader
   [junit4]   2> 38656 T160 oasc.Overseer.start Overseer (id=90138361117212675-127.0.0.1:40091_-n_0000000000) starting
   [junit4]   2> 38666 T160 oascc.SolrZkClient.makePath makePath: /overseer/queue-work
   [junit4]   2> 38677 T184 oasc.OverseerCollectionProcessor.run Process current queue of collection creations
   [junit4]   2> 38677 T160 oascc.SolrZkClient.makePath makePath: /clusterstate.json
   [junit4]   2> 38682 T160 oascc.SolrZkClient.makePath makePath: /aliases.json
   [junit4]   2> 38685 T160 oascc.ZkStateReader.createClusterStateWatchersAndUpdate Updating cluster state from ZooKeeper... 
   [junit4]   2> 38696 T183 oasc.Overseer$ClusterStateUpdater.run Starting to work on the main queue
   [junit4]   2> 38702 T160 oasc.CorePropertiesLocator.discover Looking for core definitions underneath /mnt/ssd/jenkins/workspace/Lucene-Solr-trunk-Linux/solr/build/solr-core/test/J1/./org.apache.solr.cloud.CollectionsAPIDistributedZkTest-controljetty-1375402238933
   [junit4]   2> 38726 T160 oasc.CorePropertiesLocator.discoverUnder Found core conf in /mnt/ssd/jenkins/workspace/Lucene-Solr-trunk-Linux/solr/build/solr-core/test/J1/./org.apache.solr.cloud.CollectionsAPIDistributedZkTest-controljetty-1375402238933/conf/
   [junit4]   2> 38726 T160 oasc.CorePropertiesLocator.discover Found 1 core definitions
   [junit4]   2> 38727 T160 oass.SolrDispatchFilter.init user.dir=/mnt/ssd/jenkins/workspace/Lucene-Solr-trunk-Linux/solr/build/solr-core/test/J1
   [junit4]   2> 38727 T160 oass.SolrDispatchFilter.init SolrDispatchFilter.init() done
   [junit4]   2> 38741 T160 oascsi.HttpClientUtil.createClient Creating new http client, config:maxConnections=128&maxConnectionsPerHost=32&followRedirects=false
   [junit4]   2> 38747 T160 oascsi.HttpClientUtil.createClient Creating new http client, config:
   [junit4]   2> 38750 T160 oascc.ConnectionManager.waitForConnected Waiting for client to connect to ZooKeeper
   [junit4]   2> 38752 T187 oascc.ConnectionManager.process Watcher org.apache.solr.common.cloud.ConnectionManager@589b4a74 name:ZooKeeperConnection Watcher:127.0.0.1:40058/solr got event WatchedEvent state:SyncConnected type:None path:null path:null type:None
   [junit4]   2> 38752 T160 oascc.ConnectionManager.waitForConnected Client is connected to ZooKeeper
   [junit4]   2> 38754 T160 oascc.ZkStateReader.createClusterStateWatchersAndUpdate Updating cluster state from ZooKeeper... 
   [junit4]   2> 38758 T160 oasc.ChaosMonkey.monkeyLog monkey: init - expire sessions:true cause connection loss:true
   [junit4]   2> 38829 T160 oejs.Server.doStart jetty-8.1.10.v20130312
   [junit4]   2> 38831 T160 oejs.AbstractConnector.doStart Started SelectChannelConnector@127.0.0.1:43622
   [junit4]   2> 38832 T160 oass.SolrDispatchFilter.init SolrDispatchFilter.init()
   [junit4]   2> 38832 T160 oasc.SolrResourceLoader.locateSolrHome JNDI not configured for solr (NoInitialContextEx)
   [junit4]   2> 38833 T160 oasc.SolrResourceLoader.locateSolrHome using system property solr.solr.home: /mnt/ssd/jenkins/workspace/Lucene-Solr-trunk-Linux/solr/build/solr-core/test/J1/./org.apache.solr.cloud.CollectionsAPIDistributedZkTest-jetty1-1375402239303
   [junit4]   2> 38833 T160 oasc.SolrResourceLoader.<init> new SolrResourceLoader for directory: '/mnt/ssd/jenkins/workspace/Lucene-Solr-trunk-Linux/solr/build/solr-core/test/J1/./org.apache.solr.cloud.CollectionsAPIDistributedZkTest-jetty1-1375402239303/'
   [junit4]   2> 38844 T160 oasc.ConfigSolr.fromFile Loading container configuration from /mnt/ssd/jenkins/workspace/Lucene-Solr-trunk-Linux/solr/build/solr-core/test/J1/./org.apache.solr.cloud.CollectionsAPIDistributedZkTest-jetty1-1375402239303/solr.xml
   [junit4]   2> 38874 T160 oasc.ConfigSolrXml.<init> Config-defined core root directory: 
   [junit4]   2> 38875 T160 oasc.CoreContainer.<init> New CoreContainer 1062136070
   [junit4]   2> 38875 T160 oasc.CoreContainer.load Loading cores into CoreContainer [instanceDir=/mnt/ssd/jenkins/workspace/Lucene-Solr-trunk-Linux/solr/build/solr-core/test/J1/./org.apache.solr.cloud.CollectionsAPIDistributedZkTest-jetty1-1375402239303/]
   [junit4]   2> 38876 T160 oashc.HttpShardHandlerFactory.getParameter Setting socketTimeout to: 120000
   [junit4]   2> 38876 T160 oashc.HttpShardHandlerFactory.getParameter Setting urlScheme to: http://
   [junit4]   2> 38877 T160 oashc.HttpShardHandlerFactory.getParameter Setting connTimeout to: 15000
   [junit4]   2> 38877 T160 oashc.HttpShardHandlerFactory.getParameter Setting maxConnectionsPerHost to: 20
   [junit4]   2> 38877 T160 oashc.HttpShardHandlerFactory.getParameter Setting corePoolSize to: 0
   [junit4]   2> 38878 T160 oashc.HttpShardHandlerFactory.getParameter Setting maximumPoolSize to: 2147483647
   [junit4]   2> 38878 T160 oashc.HttpShardHandlerFactory.getParameter Setting maxThreadIdleTime to: 5
   [junit4]   2> 38878 T160 oashc.HttpShardHandlerFactory.getParameter Setting sizeOfQueue to: -1
   [junit4]   2> 38879 T160 oashc.HttpShardHandlerFactory.getParameter Setting fairnessPolicy to: false
   [junit4]   2> 38879 T160 oascsi.HttpClientUtil.createClient Creating new http client, config:maxConnectionsPerHost=20&maxConnections=10000&socketTimeout=120000&connTimeout=15000&retry=false
   [junit4]   2> 38883 T160 oasc.ZkContainer.initZooKeeper Zookeeper client=127.0.0.1:40058/solr
   [junit4]   2> 38884 T160 oasc.ZkController.checkChrootPath zkHost includes chroot
   [junit4]   2> 38884 T160 oascc.ConnectionManager.waitForConnected Waiting for client to connect to ZooKeeper
   [junit4]   2> 38886 T198 oascc.ConnectionManager.process Watcher org.apache.solr.common.cloud.ConnectionManager@628621cf name:ZooKeeperConnection Watcher:127.0.0.1:40058 got event WatchedEvent state:SyncConnected type:None path:null path:null type:None
   [junit4]   2> 38887 T160 oascc.ConnectionManager.waitForConnected Client is connected to ZooKeeper
   [junit4]   2> 38889 T160 oascsi.HttpClientUtil.createClient Creating new http client, config:maxConnections=500&maxConnectionsPerHost=16&socketTimeout=120000&connTimeout=15000
   [junit4]   2> 38894 T160 oascc.ConnectionManager.waitForConnected Waiting for client to connect to ZooKeeper
   [junit4]   2> 38896 T200 oascc.ConnectionManager.process Watcher org.apache.solr.common.cloud.ConnectionManager@584bf21b name:ZooKeeperConnection Watcher:127.0.0.1:40058/solr got event WatchedEvent state:SyncConnected type:None path:null path:null type:None
   [junit4]   2> 38897 T160 oascc.ConnectionManager.waitForConnected Client is connected to ZooKeeper
   [junit4]   2> 38904 T160 oascc.ZkStateReader.createClusterStateWatchersAndUpdate Updating cluster state from ZooKeeper... 
   [junit4]   2> 39909 T160 oasc.ZkController.createEphemeralLiveNode Register node as live in ZooKeeper:/live_nodes/127.0.0.1:43622_
   [junit4]   2> 39915 T160 oascc.SolrZkClient.makePath makePath: /live_nodes/127.0.0.1:43622_
   [junit4]   2> 39919 T187 oascc.ZkStateReader$3.process Updating live nodes... (2)
   [junit4]   2> 39919 T182 oascc.ZkStateReader$3.process Updating live nodes... (2)
   [junit4]   2> 39920 T200 oascc.ZkStateReader$3.process Updating live nodes... (2)
   [junit4]   2> 39929 T160 oasc.CorePropertiesLocator.discover Looking for core definitions underneath /mnt/ssd/jenkins/workspace/Lucene-Solr-trunk-Linux/solr/build/solr-core/test/J1/./org.apache.solr.cloud.CollectionsAPIDistributedZkTest-jetty1-1375402239303
   [junit4]   2> 39955 T160 oasc.CorePropertiesLocator.discoverUnder Found core conf in /mnt/ssd/jenkins/workspace/Lucene-Solr-trunk-Linux/solr/build/solr-core/test/J1/./org.apache.solr.cloud.CollectionsAPIDistributedZkTest-jetty1-1375402239303/conf/
   [junit4]   2> 39956 T160 oasc.CorePropertiesLocator.discover Found 1 core definitions
   [junit4]   2> 39956 T160 oass.SolrDispatchFilter.init user.dir=/mnt/ssd/jenkins/workspace/Lucene-Solr-trunk-Linux/solr/build/solr-core/test/J1
   [junit4]   2> 39957 T160 oass.SolrDispatchFilter.init SolrDispatchFilter.init() done
   [junit4]   2> 39957 T160 oascsi.HttpClientUtil.createClient Creating new http client, config:maxConnections=128&maxConnectionsPerHost=32&followRedirects=false
   [junit4]   2> 40048 T160 oejs.Server.doStart jetty-8.1.10.v20130312
   [junit4]   2> 40050 T160 oejs.AbstractConnector.doStart Started SelectChannelConnector@127.0.0.1:43907
   [junit4]   2> 40051 T160 oass.SolrDispatchFilter.init SolrDispatchFilter.init()
   [junit4]   2> 40052 T160 oasc.SolrResourceLoader.locateSolrHome JNDI not configured for solr (NoInitialContextEx)
   [junit4]   2> 40052 T160 oasc.SolrResourceLoader.locateSolrHome using system property solr.solr.home: /mnt/ssd/jenkins/workspace/Lucene-Solr-trunk-Linux/solr/build/solr-core/test/J1/./org.apache.solr.cloud.CollectionsAPIDistributedZkTest-jetty2-1375402240505
   [junit4]   2> 40052 T160 oasc.SolrResourceLoader.<init> new SolrResourceLoader for directory: '/mnt/ssd/jenkins/workspace/Lucene-Solr-trunk-Linux/solr/build/solr-core/test/J1/./org.apache.solr.cloud.CollectionsAPIDistributedZkTest-jetty2-1375402240505/'
   [junit4]   2> 40063 T160 oasc.ConfigSolr.fromFile Loading container configuration from /mnt/ssd/jenkins/workspace/Lucene-Solr-trunk-Linux/solr/build/solr-core/test/J1/./org.apache.solr.cloud.CollectionsAPIDistributedZkTest-jetty2-1375402240505/solr.xml
   [junit4]   2> 40102 T160 oasc.ConfigSolrXml.<init> Config-defined core root directory: 
   [junit4]   2> 40102 T160 oasc.CoreContainer.<init> New CoreContainer 1663001813
   [junit4]   2> 40103 T160 oasc.CoreContainer.load Loading cores into CoreContainer [instanceDir=/mnt/ssd/jenkins/workspace/Lucene-Solr-trunk-Linux/solr/build/solr-core/test/J1/./org.apache.solr.cloud.CollectionsAPIDistributedZkTest-jetty2-1375402240505/]
   [junit4]   2> 40104 T160 oashc.HttpShardHandlerFactory.getParameter Setting socketTimeout to: 120000
   [junit4]   2> 40104 T160 oashc.HttpShardHandlerFactory.getParameter Setting urlScheme to: http://
   [junit4]   2> 40104 T160 oashc.HttpShardHandlerFactory.getParameter Setting connTimeout to: 15000
   [junit4]   2> 40105 T160 oashc.HttpShardHandlerFactory.getParameter Setting maxConnectionsPerHost to: 20
   [junit4]   2> 40105 T160 oashc.HttpShardHandlerFactory.getParameter Setting corePoolSize to: 0
   [junit4]   2> 40105 T160 oashc.HttpShardHandlerFactory.getParameter Setting maximumPoolSize to: 2147483647
   [junit4]   2> 40106 T160 oashc.HttpShardHandlerFactory.getParameter Setting maxThreadIdleTime to: 5
   [junit4]   2> 40106 T160 oashc.HttpShardHandlerFactory.getParameter Setting sizeOfQueue to: -1
   [junit4]   2> 40106 T160 oashc.HttpShardHandlerFactory.getParameter Setting fairnessPolicy to: false
   [junit4]   2> 40107 T160 oascsi.HttpClientUtil.createClient Creating new http client, config:maxConnectionsPerHost=20&maxConnections=10000&socketTimeout=120000&connTimeout=15000&retry=false
   [junit4]   2> 40111 T160 oasc.ZkContainer.initZooKeeper Zookeeper client=127.0.0.1:40058/solr
   [junit4]   2> 40111 T160 oasc.ZkController.checkChrootPath zkHost includes chroot
   [junit4]   2> 40112 T160 oascc.ConnectionManager.waitForConnected Waiting for client to connect to ZooKeeper
   [junit4]   2> 40114 T212 oascc.ConnectionManager.process Watcher org.apache.solr.common.cloud.ConnectionManager@5c845ce9 name:ZooKeeperConnection Watcher:127.0.0.1:40058 got event WatchedEvent state:SyncConnected type:None path:null path:null type:None
   [junit4]   2> 40114 T160 oascc.ConnectionManager.waitForConnected Client is connected to ZooKeeper
   [junit4]   2> 40116 T160 oascsi.HttpClientUtil.createClient Creating new http client, config:maxConnections=500&maxConnectionsPerHost=16&socketTimeout=120000&connTimeout=15000
   [junit4]   2> 40122 T160 oascc.ConnectionManager.waitForConnected Waiting for client to connect to ZooKeeper
   [junit4]   2> 40123 T214 oascc.ConnectionManager.process Watcher org.apache.solr.common.cloud.ConnectionManager@2b427032 name:ZooKeeperConnection Watcher:127.0.0.1:40058/solr got event WatchedEvent state:SyncConnected type:None path:null path:null type:None
   [junit4]   2> 40124 T160 oascc.ConnectionManager.waitForConnected Client is connected to ZooKeeper
   [junit4]   2> 40129 T160 oascc.ZkStateReader.createClusterStateWatchersAndUpdate Updating cluster state from ZooKeeper... 
   [junit4]   2> 41134 T160 oasc.ZkController.createEphemeralLiveNode Register node as live in ZooKeeper:/live_nodes/127.0.0.1:43907_
   [junit4]   2> 41135 T160 oascc.SolrZkClient.makePath makePath: /live_nodes/127.0.0.1:43907_
   [junit4]   2> 41139 T200 oascc.ZkStateReader$3.process Updating live nodes... (3)
   [junit4]   2> 41139 T187 oascc.ZkStateReader$3.process Updating live nodes... (3)
   [junit4]   2> 41139 T182 oascc.ZkStateReader$3.process Updating live nodes... (3)
   [junit4]   2> 41139 T214 oascc.ZkStateReader$3.process Updating live nodes... (3)
   [junit4]   2> 41147 T160 oasc.CorePropertiesLocator.discover Looking for core definitions underneath /mnt/ssd/jenkins/workspace/Lucene-Solr-trunk-Linux/solr/build/solr-core/test/J1/./org.apache.solr.cloud.CollectionsAPIDistributedZkTest-jetty2-1375402240505
   [junit4]   2> 41167 T160 oasc.CorePropertiesLocator.discoverUnder Found core conf in /mnt/ssd/jenkins/workspace/Lucene-Solr-trunk-Linux/solr/build/solr-core/test/J1/./org.apache.solr.cloud.CollectionsAPIDistributedZkTest-jetty2-1375402240505/conf/
   [junit4]   2> 41168 T160 oasc.CorePropertiesLocator.discover Found 1 core definitions
   [junit4]   2> 41169 T160 oass.SolrDispatchFilter.init user.dir=/mnt/ssd/jenkins/workspace/Lucene-Solr-trunk-Linux/solr/build/solr-core/test/J1
   [junit4]   2> 41169 T160 oass.SolrDispatchFilter.init SolrDispatchFilter.init() done
   [junit4]   2> 41170 T160 oascsi.HttpClientUtil.createClient Creating new http client, config:maxConnections=128&maxConnectionsPerHost=32&followRedirects=false
   [junit4]   2> 41252 T160 oejs.Server.doStart jetty-8.1.10.v20130312
   [junit4]   2> 41255 T160 oejs.AbstractConnector.doStart Started SelectChannelConnector@127.0.0.1:40783
   [junit4]   2> 41255 T160 oass.SolrDispatchFilter.init SolrDispatchFilter.init()
   [junit4]   2> 41256 T160 oasc.SolrResourceLoader.locateSolrHome JNDI not configured for solr (NoInitialContextEx)
   [junit4]   2> 41256 T160 oasc.SolrResourceLoader.locateSolrHome using system property solr.solr.home: /mnt/ssd/jenkins/workspace/Lucene-Solr-trunk-Linux/solr/build/solr-core/test/J1/./org.apache.solr.cloud.CollectionsAPIDistributedZkTest-jetty3-1375402241717
   [junit4]   2> 41256 T160 oasc.SolrResourceLoader.<init> new SolrResourceLoader for directory: '/mnt/ssd/jenkins/workspace/Lucene-Solr-trunk-Linux/solr/build/solr-core/test/J1/./org.apache.solr.cloud.CollectionsAPIDistributedZkTest-jetty3-1375402241717/'
   [junit4]   2> 41267 T160 oasc.ConfigSolr.fromFile Loading container configuration from /mnt/ssd/jenkins/workspace/Lucene-Solr-trunk-Linux/solr/build/solr-core/test/J1/./org.apache.solr.cloud.CollectionsAPIDistributedZkTest-jetty3-1375402241717/solr.xml
   [junit4]   2> 41299 T160 oasc.ConfigSolrXml.<init> Config-defined core root directory: 
   [junit4]   2> 41299 T160 oasc.CoreContainer.<init> New CoreContainer 313802473
   [junit4]   2> 41300 T160 oasc.CoreContainer.load Loading cores into CoreContainer [instanceDir=/mnt/ssd/jenkins/workspace/Lucene-Solr-trunk-Linux/solr/build/solr-core/test/J1/./org.apache.solr.cloud.CollectionsAPIDistributedZkTest-jetty3-1375402241717/]
   [junit4]   2> 41301 T160 oashc.HttpShardHandlerFactory.getParameter Setting socketTimeout to: 120000
   [junit4]   2> 41301 T160 oashc.HttpShardHandlerFactory.getParameter Setting urlScheme to: http://
   [junit4]   2> 41302 T160 oashc.HttpShardHandlerFactory.getParameter Setting connTimeout to: 15000
   [junit4]   2> 41302 T160 oashc.HttpShardHandlerFactory.getParameter Setting maxConnectionsPerHost to: 20
   [junit4]   2> 41302 T160 oashc.HttpShardHandlerFactory.getParameter Setting corePoolSize to: 0
   [junit4]   2> 41303 T160 oashc.HttpShardHandlerFactory.getParameter Setting maximumPoolSize to: 2147483647
   [junit4]   2> 41303 T160 oashc.HttpShardHandlerFactory.getParameter Setting maxThreadIdleTime to: 5
   [junit4]   2> 41303 T160 oashc.HttpShardHandlerFactory.getParameter Setting sizeOfQueue to: -1
   [junit4]   2> 41303 T160 oashc.HttpShardHandlerFactory.getParameter Setting fairnessPolicy to: false
   [junit4]   2> 41304 T160 oascsi.HttpClientUtil.createClient Creating new http client, config:maxConnectionsPerHost=20&maxConnections=10000&socketTimeout=120000&connTimeout=15000&retry=false
   [junit4]   2> 41307 T160 oasc.ZkContainer.initZooKeeper Zookeeper client=127.0.0.1:40058/solr
   [junit4]   2> 41308 T160 oasc.ZkController.checkChrootPath zkHost includes chroot
   [junit4]   2> 41309 T160 oascc.ConnectionManager.waitForConnected Waiting for client to connect to ZooKeeper
   [junit4]   2> 41311 T226 oascc.ConnectionManager.process Watcher org.apache.solr.common.cloud.ConnectionManager@5bbee5a3 name:ZooKeeperConnection Watcher:127.0.0.1:40058 got event WatchedEvent state:SyncConnected type:None path:null path:null type:None
   [junit4]   2> 41311 T160 oascc.ConnectionManager.waitForConnected Client is connected to ZooKeeper
   [junit4]   2> 41314 T160 oascsi.HttpClientUtil.createClient Creating new http client, config:maxConnections=500&maxConnectionsPerHost=16&socketTimeout=120000&connTimeout=15000
   [junit4]   2> 41318 T160 oascc.ConnectionManager.waitForConnected Waiting for client to connect to ZooKeeper
   [junit4]   2> 41323 T228 oascc.ConnectionManager.process Watcher org.apache.solr.common.cloud.ConnectionManager@1d24714a name:ZooKeeperConnection Watcher:127.0.0.1:40058/solr got event WatchedEvent state:SyncConnected type:None path:null path:null type:None
   [junit4]   2> 41323 T160 oascc.ConnectionManager.waitForConnected Client is connected to ZooKeeper
   [junit4]   2> 41329 T160 oascc.ZkStateReader.createClusterStateWatchersAndUpdate Updating cluster state from ZooKeeper... 
   [junit4]   2> 42333 T160 oasc.ZkController.createEphemeralLiveNode Register node as live in ZooKeeper:/live_nodes/127.0.0.1:40783_
   [junit4]   2> 42336 T160 oascc.SolrZkClient.makePath makePath: /live_nodes/127.0.0.1:40783_
   [junit4]   2> 42339 T200 oascc.ZkStateReader$3.process Updating live nodes... (4)
   [junit4]   2> 42340 T187 oascc.ZkStateReader$3.process Updating live nodes... (4)
   [junit4]   2> 42340 T214 oascc.ZkStateReader$3.process Updating live nodes... (4)
   [junit4]   2> 42340 T228 oascc.ZkStateReader$3.process Updating live nodes... (4)
   [junit4]   2> 42340 T182 oascc.ZkStateReader$3.process Updating live nodes... (4)
   [junit4]   2> 42346 T160 oasc.CorePropertiesLocator.discover Looking for core definitions underneath /mnt/ssd/jenkins/workspace/Lucene-Solr-trunk-Linux/solr/build/solr-core/test/J1/./org.apache.solr.cloud.CollectionsAPIDistributedZkTest-jetty3-1375402241717
   [junit4]   2> 42370 T160 oasc.CorePropertiesLocator.discoverUnder Found core conf in /mnt/ssd/jenkins/workspace/Lucene-Solr-trunk-Linux/solr/build/solr-core/test/J1/./org.apache.solr.cloud.CollectionsAPIDistributedZkTest-jetty3-1375402241717/conf/
   [junit4]   2> 42371 T160 oasc.CorePropertiesLocator.discover Found 1 core definitions
   [junit4]   2> 42371 T160 oass.SolrDispatchFilter.init user.dir=/mnt/ssd/jenkins/workspace/Lucene-Solr-trunk-Linux/solr/build/solr-core/test/J1
   [junit4]   2> 42371 T160 oass.SolrDispatchFilter.init SolrDispatchFilter.init() done
   [junit4]   2> 42372 T160 oascsi.HttpClientUtil.createClient Creating new http client, config:maxConnections=128&maxConnectionsPerHost=32&followRedirects=false
   [junit4]   2> 42462 T160 oejs.Server.doStart jetty-8.1.10.v20130312
   [junit4]   2> 42467 T160 oejs.AbstractConnector.doStart Started SelectChannelConnector@127.0.0.1:51161
   [junit4]   2> 42467 T160 oass.SolrDispatchFilter.init SolrDispatchFilter.init()
   [junit4]   2> 42468 T160 oasc.SolrResourceLoader.locateSolrHome JNDI not configured for solr (NoInitialContextEx)
   [junit4]   2> 42468 T160 oasc.SolrResourceLoader.locateSolrHome using system property solr.solr.home: /mnt/ssd/jenkins/workspace/Lucene-Solr-trunk-Linux/solr/build/solr-core/test/J1/./org.apache.solr.cloud.CollectionsAPIDistributedZkTest-jetty4-1375402242920
   [junit4]   2> 42469 T160 oasc.SolrResourceLoader.<init> new SolrResourceLoader for directory: '/mnt/ssd/jenkins/workspace/Lucene-Solr-trunk-Linux/solr/build/solr-core/test/J1/./org.apache.solr.cloud.CollectionsAPIDistributedZkTest-jetty4-1375402242920/'
   [junit4]   2> 42481 T160 oasc.ConfigSolr.fromFile Loading container configuration from /mnt/ssd/jenkins/workspace/Lucene-Solr-trunk-Linux/solr/build/solr-core/test/J1/./org.apache.solr.cloud.CollectionsAPIDistributedZkTest-jetty4-1375402242920/solr.xml
   [junit4]   2> 42528 T160 oasc.ConfigSolrXml.<init> Config-defined core root directory: 
   [junit4]   2> 42529 T160 oasc.CoreContainer.<init> New CoreContainer 257896782
   [junit4]   2> 42529 T160 oasc.CoreContainer.load Loading cores into CoreContainer [instanceDir=/mnt/ssd/jenkins/workspace/Lucene-Solr-trunk-Linux/solr/build/solr-core/test/J1/./org.apache.solr.cloud.CollectionsAPIDistributedZkTest-jetty4-1375402242920/]
   [junit4]   2> 42532 T160 oashc.HttpShardHandlerFactory.getParameter Setting socketTimeout to: 120000
   [junit4]   2> 42532 T160 oashc.HttpShardHandlerFactory.getParameter Setting urlScheme to: http://
   [junit4]   2> 42533 T160 oashc.HttpShardHandlerFactory.getParameter Setting connTimeout to: 15000
   [junit4]   2> 42533 T160 oashc.HttpShardHandlerFactory.getParameter Setting maxConnectionsPerHost to: 20
   [junit4]   2> 42533 T160 oashc.HttpShardHandlerFactory.getParameter Setting corePoolSize to: 0
   [junit4]   2> 42534 T160 oashc.HttpShardHandlerFactory.getParameter Setting maximumPoolSize to: 2147483647
   [junit4]   2> 42534 T160 oashc.HttpShardHandlerFactory.getParameter Setting maxThreadIdleTime to: 5
   [junit4]   2> 42534 T160 oashc.HttpShardHandlerFactory.getParameter Setting sizeOfQueue to: -1
   [junit4]   2> 42535 T160 oashc.HttpShardHandlerFactory.getParameter Setting fairnessPolicy to: false
   [junit4]   2> 42535 T160 oascsi.HttpClientUtil.createClient Creating new http client, config:maxConnectionsPerHost=20&maxConnections=10000&socketTimeout=120000&connTimeout=15000&retry=false
   [junit4]   2> 42541 T160 oasc.ZkContainer.initZooKeeper Zookeeper client=127.0.0.1:40058/solr
   [junit4]   2> 42541 T160 oasc.ZkController.checkChrootPath zkHost includes chroot
   [junit4]   2> 42542 T160 oascc.ConnectionManager.waitForConnected Waiting for client to connect to ZooKeeper
   [junit4]   2> 42544 T240 oascc.ConnectionManager.process Watcher org.apache.solr.common.cloud.ConnectionManager@ab45648 name:ZooKeeperConnection Watcher:127.0.0.1:40058 got event WatchedEvent state:SyncConnected type:None path:null path:null type:None
   [junit4]   2> 42544 T160 oascc.ConnectionManager.waitForConnected Client is connected to ZooKeeper
   [junit4]   2> 42546 T160 oascsi.HttpClientUtil.createClient Creating new http client, config:maxConnections=500&maxConnectionsPerHost=16&socketTimeout=120000&connTimeout=15000
   [junit4]   2> 42551 T160 oascc.ConnectionManager.waitForConnected Waiting for client to connect to ZooKeeper
   [junit4]   2> 42553 T242 oascc.ConnectionManager.process Watcher org.apache.solr.common.cloud.ConnectionManager@7a967515 name:ZooKeeperConnection Watcher:127.0.0.1:40058/solr got event WatchedEvent state:SyncConnected type:None path:null path:null type:None
   [junit4]   2> 42554 T160 oascc.ConnectionManager.waitForConnected Client is connected to ZooKeeper
   [junit4]   2> 42559 T160 oascc.ZkStateReader.createClusterStateWatchersAndUpdate Updating cluster state from ZooKeeper... 
   [junit4]   2> 43567 T160 oasc.ZkController.createEphemeralLiveNode Register node as live in ZooKeeper:/live_nodes/127.0.0.1:51161_
   [junit4]   2> 43569 T160 oascc.SolrZkClient.makePath makePath: /live_nodes/127.0.0.1:51161_
   [junit4]   2> 43574 T214 oascc.ZkStateReader$3.process Updating live nodes... (5)
   [junit4]   2> 43574 T187 oascc.ZkStateReader$3.process Updating live nodes... (5)
   [junit4]   2> 43574 T182 oascc.ZkStateReader$3.process Updating live nodes... (5)
   [junit4]   2> 43574 T200 oascc.ZkStateReader$3.process Updating live nodes... (5)
   [junit4]   2> 43574 T228 oascc.ZkStateReader$3.process Updating live nodes... (5)
   [junit4]   2> 43575 T242 oascc.ZkStateReader$3.process Updating live nodes... (5)
   [junit4]   2> 43582 T160 oasc.CorePropertiesLocator.discover Looking for core definitions underneath /mnt/ssd/jenkins/workspace/Lucene-Solr-trunk-Linux/solr/build/solr-core/test/J1/./org.apache.solr.cloud.CollectionsAPIDistributedZkTest-jetty4-1375402242920
   [junit4]   2> 43619 T160 oasc.CorePropertiesLocator.discoverUnder Found core conf in /mnt/ssd/jenkins/workspace/Lucene-Solr-trunk-Linux/solr/build/solr-core/test/J1/./org.apache.solr.cloud.CollectionsAPIDistributedZkTest-jetty4-1375402242920/conf/
   [junit4]   2> 43620 T160 oasc.CorePropertiesLocator.discover Found 1 core definitions
   [junit4]   2> 43621 T160 oass.SolrDispatchFilter.init user.dir=/mnt/ssd/jenkins/workspace/Lucene-Solr-trunk-Linux/solr/build/solr-core/test/J1
   [junit4]   2> 43621 T160 oass.SolrDispatchFilter.init SolrDispatchFilter.init() done
   [junit4]   2> 43622 T160 oascsi.HttpClientUtil.createClient Creating new http client, config:maxConnections=128&maxConnectionsPerHost=32&followRedirects=false
   [junit4]   2> 43629 T160 oascsi.HttpClientUtil.createClient Creating new http client, config:maxConnections=128&maxConnectionsPerHost=32&followRedirects=false
   [junit4]   2> 43873 T193 oasha.CollectionsHandler.handleCreateAction Creating Collection : numShards=2&name=nodes_used_collection&replicationFactor=2&action=CREATE&wt=javabin&version=2
   [junit4]   2> 43876 T182 oasc.DistributedQueue$LatchChildWatcher.process Watcher fired on path: /overseer/collection-queue-work state: SyncConnected type NodeChildrenChanged
   [junit4]   2> 43880 T184 oasc.OverseerCollectionProcessor.run Overseer Collection Processor: Get the message id:/overseer/collection-queue-work/qn-0000000000 message:{
   [junit4]   2> 	  "operation":"createcollection",
   [junit4]   2> 	  "numShards":"2",
   [junit4]   2> 	  "name":"nodes_used_collection",
   [junit4]   2> 	  "replicationFactor":"2"}
   [junit4]   2> 43881 T184 oasc.OverseerCollectionProcessor.processMessage WARN OverseerCollectionProcessor.processMessage : createcollection , {
   [junit4]   2> 	  "operation":"createcollection",
   [junit4]   2> 	  "numShards":"2",
   [junit4]   2> 	  "name":"nodes_used_collection",
   [junit4]   2> 	  "replicationFactor":"2"}
   [junit4]   2> 44710 T183 oascc.ZkStateReader.updateClusterState Updating cloud state from ZooKeeper... 
   [junit4]   2> 44712 T183 oasc.Overseer$ClusterStateUpdater.buildCollection building a new collection: nodes_used_collection
   [junit4]   2> 44712 T183 oasc.Overseer$ClusterStateUpdater.createCollection Create collection nodes_used_collection with shards [shard1, shard2]
   [junit4]   2> 45094 T187 oascc.ZkStateReader$2.process A cluster state change: WatchedEvent state:SyncConnected type:NodeDataChanged path:/clusterstate.json, has occurred - updating... (live nodes size: 5)
   [junit4]   2> 45094 T200 oascc.ZkStateReader$2.process A cluster state change: WatchedEvent state:SyncConnected type:NodeDataChanged path:/clusterstate.json, has occurred - updating... (live nodes size: 5)
   [junit4]   2> 45095 T182 oascc.ZkStateReader$2.process A cluster state change: WatchedEvent state:SyncConnected type:NodeDataChanged path:/clusterstate.json, has occurred - updating... (live nodes size: 5)
   [junit4]   2> 45094 T228 oascc.ZkStateReader$2.process A cluster state change: WatchedEvent state:SyncConnected type:NodeDataChanged path:/clusterstate.json, has occurred - updating... (live nodes size: 5)
   [junit4]   2> 45094 T214 oascc.ZkStateReader$2.process A cluster state change: WatchedEvent state:SyncConnected type:NodeDataChanged path:/clusterstate.json, has occurred - updating... (live nodes size: 5)
   [junit4]   2> 45094 T242 oascc.ZkStateReader$2.process A cluster state change: WatchedEvent state:SyncConnected type:NodeDataChanged path:/clusterstate.json, has occurred - updating... (live nodes size: 5)
   [junit4]   2> 45187 T184 oasc.OverseerCollectionProcessor.createCollection going to create cores replicas shardNames [shard1, shard2] , repFactor : 2
   [junit4]   2> 45188 T184 oasc.OverseerCollectionProcessor.createCollection Creating shard nodes_used_collection_shard1_replica1 as part of slice shard1 of collection nodes_used_collection on 127.0.0.1:40091_
   [junit4]   2> 45193 T184 oasc.OverseerCollectionProcessor.createCollection Creating shard nodes_used_collection_shard1_replica2 as part of slice shard1 of collection nodes_used_collection on 127.0.0.1:40783_
   [junit4]   2> 45194 T184 oasc.OverseerCollectionProcessor.createCollection Creating shard nodes_used_collection_shard2_replica1 as part of slice shard2 of collection nodes_used_collection on 127.0.0.1:43622_
   [junit4]   2> 45195 T184 oasc.OverseerCollectionProcessor.createCollection Creating shard nodes_used_collection_shard2_replica2 as part of slice shard2 of collection nodes_used_collection on 127.0.0.1:51161_
   [junit4]   2> 45218 T177 oasc.ZkController.publish publishing core=nodes_used_collection_shard1_replica1 state=down
   [junit4]   2> 45221 T224 oasc.ZkController.publish publishing core=nodes_used_collection_shard1_replica2 state=down
   [junit4]   2> 45223 T235 oasc.ZkController.publish publishing core=nodes_used_collection_shard2_replica2 state=down
   [junit4]   2> 45226 T224 oasc.ZkController.waitForCoreNodeName look for our core node name
   [junit4]   2> 45225 T196 oasc.ZkController.publish publishing core=nodes_used_collection_shard2_replica1 state=down
   [junit4]   2> 45225 T177 oasc.ZkController.waitForCoreNodeName look for our core node name
   [junit4]   2> 45227 T235 oasc.ZkController.waitForCoreNodeName look for our core node name
   [junit4]   2> 45228 T196 oasc.ZkController.waitForCoreNodeName look for our core node name
   [junit4]   2> 46610 T183 oascc.ZkStateReader.updateClusterState Updating cloud state from ZooKeeper... 
   [junit4]   2> 46612 T183 oasc.Overseer$ClusterStateUpdater.updateState WARN Could not find collection node for nodes_used_collection, skipping publish state
   [junit4]   2> 46613 T183 oasc.Overseer$ClusterStateUpdater.updateState Update state numShards=2 message={
   [junit4]   2> 	  "operation":"state",
   [junit4]   2> 	  "core_node_name":"core_node1",
   [junit4]   2> 	  "numShards":"2",
   [junit4]   2> 	  "shard":"shard1",
   [junit4]   2> 	  "roles":null,
   [junit4]   2> 	  "state":"down",
   [junit4]   2> 	  "shard_state":"active",
   [junit4]   2> 	  "core":"nodes_used_collection_shard1_replica1",
   [junit4]   2> 	  "collection":"nodes_used_collection",
   [junit4]   2> 	  "shard_range":null,
   [junit4]   2> 	  "node_name":"127.0.0.1:40091_",
   [junit4]   2> 	  "base_url":"http://127.0.0.1:40091"}
   [junit4]   2> 46619 T183 oasc.Overseer$ClusterStateUpdater.updateState WARN Could not find collection node for nodes_used_collection, skipping publish state
   [junit4]   2> 46620 T183 oasc.Overseer$ClusterStateUpdater.updateState Update state numShards=2 message={
   [junit4]   2> 	  "operation":"state",
   [junit4]   2> 	  "core_node_name":"core_node2",
   [junit4]   2> 	  "numShards":"2",
   [junit4]   2> 	  "shard":"shard1",
   [junit4]   2> 	  "roles":null,
   [junit4]   2> 	  "state":"down",
   [junit4]   2> 	  "shard_state":"active",
   [junit4]   2> 	  "core":"nodes_used_collection_shard1_replica2",
   [junit4]   2> 	  "collection":"nodes_used_collection",
   [junit4]   2> 	  "shard_range":null,
   [junit4]   2> 	  "node_name":"127.0.0.1:40783_",
   [junit4]   2> 	  "base_url":"http://127.0.0.1:40783"}
   [junit4]   2> 46626 T183 oasc.Overseer$ClusterStateUpdater.updateState WARN Could not find collection node for nodes_used_collection, skipping publish state
   [junit4]   2> 46626 T183 oasc.Overseer$ClusterStateUpdater.updateState Update state numShards=2 message={
   [junit4]   2> 	  "operation":"state",
   [junit4]   2> 	  "core_node_name":"core_node3",
   [junit4]   2> 	  "numShards":"2",
   [junit4]   2> 	  "shard":"shard2",
   [junit4]   2> 	  "roles":null,
   [junit4]   2> 	  "state":"down",
   [junit4]   2> 	  "shard_state":"active",
   [junit4]   2> 	  "core":"nodes_used_collection_shard2_replica2",
   [junit4]   2> 	  "collection":"nodes_used_collection",
   [junit4]   2> 	  "shard_range":null,
   [junit4]   2> 	  "node_name":"127.0.0.1:51161_",
   [junit4]   2> 	  "base_url":"http://127.0.0.1:51161"}
   [junit4]   2> 46633 T183 oasc.Overseer$ClusterStateUpdater.updateState WARN Could not find collection node for nodes_used_collection, skipping publish state
   [junit4]   2> 46634 T183 oasc.Overseer$ClusterStateUpdater.updateState Update state numShards=2 message={
   [junit4]   2> 	  "operation":"state",
   [junit4]   2> 	  "core_node_name":"core_node4",
   [junit4]   2> 	  "numShards":"2",
   [junit4]   2> 	  "shard":"shard2",
   [junit4]   2> 	  "roles":null,
   [junit4]   2> 	  "state":"down",
   [junit4]   2> 	  "shard_state":"active",
   [junit4]   2> 	  "core":"nodes_used_collection_shard2_replica1",
   [junit4]   2> 	  "collection":"nodes_used_collection",
   [junit4]   2> 	  "shard_range":null,
   [junit4]   2> 	  "node_name":"127.0.0.1:43622_",
   [junit4]   2> 	  "base_url":"http://127.0.0.1:43622"}
   [junit4]   2> 46640 T214 oascc.ZkStateReader$2.process A cluster state change: WatchedEvent state:SyncConnected type:NodeDataChanged path:/clusterstate.json, has occurred - updating... (live nodes size: 5)
   [junit4]   2> 46640 T228 oascc.ZkStateReader$2.process A cluster state change: WatchedEvent state:SyncConnected type:NodeDataChanged path:/clusterstate.json, has occurred - updating... (live nodes size: 5)
   [junit4]   2> 46640 T200 oascc.ZkStateReader$2.process A cluster state change: WatchedEvent state:SyncConnected type:NodeDataChanged path:/clusterstate.json, has occurred - updating... (live nodes size: 5)
   [junit4]   2> 46640 T187 oascc.ZkStateReader$2.process A cluster state change: WatchedEvent state:SyncConnected type:NodeDataChanged path:/clusterstate.json, has occurred - updating... (live nodes size: 5)
   [junit4]   2> 46640 T182 oascc.ZkStateReader$2.process A cluster state change: WatchedEvent state:SyncConnected type:NodeDataChanged path:/clusterstate.json, has occurred - updating... (live nodes size: 5)
   [junit4]   2> 46640 T242 oascc.ZkStateReader$2.process A cluster state change: WatchedEvent state:SyncConnected type:NodeDataChanged path:/clusterstate.json, has occurred - updating... (live nodes size: 5)
   [junit4]   2> 47226 T224 oasc.ZkController.waitForShardId waiting to find shard id in clusterstate for nodes_used_collection_shard1_replica2
   [junit4]   2> 47227 T224 oasc.CorePropertiesLocator.writePropertiesFile ERROR Couldn't persist core properties to /mnt/ssd/jenkins/workspace/Lucene-Solr-trunk-Linux/solr/build/solr-core/test/J1/./org.apache.solr.cloud.CollectionsAPIDistributedZkTest-jetty3-1375402241717/nodes_used_collection_shard1_replica2/core.properties: java.io.FileNotFoundException: /mnt/ssd/jenkins/workspace/Lucene-Solr-trunk-Linux/solr/build/solr-core/test/J1/./org.apache.solr.cloud.CollectionsAPIDistributedZkTest-jetty3-1375402241717/nodes_used_collection_shard1_replica2/core.properties (No such file or directory)
   [junit4]   2> 47228 T177 oasc.ZkController.waitForShardId waiting to find shard id in clusterstate for nodes_used_collection_shard1_replica1
   [junit4]   2> 47228 T224 oasc.CoreContainer.create Creating SolrCore 'nodes_used_collection_shard1_replica2' using instanceDir: /mnt/ssd/jenkins/workspace/Lucene-Solr-trunk-Linux/solr/build/solr-core/test/J1/./org.apache.solr.cloud.CollectionsAPIDistributedZkTest-jetty3-1375402241717/nodes_used_collection_shard1_replica2
   [junit4]   2> 47228 T235 oasc.ZkController.waitForShardId waiting to find shard id in clusterstate for nodes_used_collection_shard2_replica2
   [junit4]   2> 47229 T196 oasc.ZkController.waitForShardId waiting to find shard id in clusterstate for nodes_used_collection_shard2_replica1
   [junit4]   2> 47229 T224 oasc.ZkController.createCollectionZkNode Check for collection zkNode:nodes_used_collection
   [junit4]   2> 47229 T177 oasc.CorePropertiesLocator.writePropertiesFile ERROR Couldn't persist core properties to /mnt/ssd/jenkins/workspace/Lucene-Solr-trunk-Linux/solr/build/solr-core/test/J1/./org.apache.solr.cloud.CollectionsAPIDistributedZkTest-controljetty-1375402238933/nodes_used_collection_shard1_replica1/core.properties: java.io.FileNotFoundException: /mnt/ssd/jenkins/workspace/Lucene-Solr-trunk-Linux/solr/build/solr-core/test/J1/./org.apache.solr.cloud.CollectionsAPIDistributedZkTest-controljetty-1375402238933/nodes_used_collection_shard1_replica1/core.properties (No such file or directory)
   [junit4]   2> 47229 T196 oasc.CorePropertiesLocator.writePropertiesFile ERROR Couldn't persist core properties to /mnt/ssd/jenkins/workspace/Lucene-Solr-trunk-Linux/solr/build/solr-core/test/J1/./org.apache.solr.cloud.CollectionsAPIDistributedZkTest-jetty1-1375402239303/nodes_used_collection_shard2_replica1/core.properties: java.io.FileNotFoundException: /mnt/ssd/jenkins/workspace/Lucene-Solr-trunk-Linux/solr/build/solr-core/test/J1/./org.apache.solr.cloud.CollectionsAPIDistributedZkTest-jetty1-1375402239303/nodes_used_collection_shard2_replica1/core.properties (No such file or directory)
   [junit4]   2> 47229 T235 oasc.CorePropertiesLocator.writePropertiesFile ERROR Couldn't persist core properties to /mnt/ssd/jenkins/workspace/Lucene-Solr-trunk-Linux/solr/build/solr-core/test/J1/./org.apache.solr.cloud.CollectionsAPIDistributedZkTest-jetty4-1375402242920/nodes_used_collection_shard2_replica2/core.properties: java.io.FileNotFoundException: /mnt/ssd/jenkins/workspace/Lucene-Solr-trunk-Linux/solr/build/solr-core/test/J1/./org.apache.solr.cloud.CollectionsAPIDistributedZkTest-jetty4-1375402242920/nodes_used_collection_shard2_replica2/core.properties (No such file or directory)
   [junit4]   2> 47230 T196 oasc.CoreContainer.create Creating SolrCore 'nodes_used_collection_shard2_replica1' using instanceDir: /mnt/ssd/jenkins/workspace/Lucene-Solr-trunk-Linux/solr/build/solr-core/test/J1/./org.apache.solr.cloud.CollectionsAPIDistributedZkTest-jetty1-1375402239303/nodes_used_collection_shard2_replica1
   [junit4]   2> 47231 T196 oasc.ZkController.createCollectionZkNode Check for collection zkNode:nodes_used_collection
   [junit4]   2> 47230 T224 oasc.ZkController.createCollectionZkNode Creating collection in ZooKeeper:nodes_used_collection
   [junit4]   2> 47230 T177 oasc.CoreContainer.create Creating SolrCore 'nodes_used_collection_shard1_replica1' using instanceDir: /mnt/ssd/jenkins/workspace/Lucene-Solr-trunk-Linux/solr/build/solr-core/test/J1/./org.apache.solr.cloud.CollectionsAPIDistributedZkTest-controljetty-1375402238933/nodes_used_collection_shard1_replica1
   [junit4]   2> 47232 T177 oasc.ZkController.createCollectionZkNode Check for collection zkNode:nodes_used_collection
   [junit4]   2> 47231 T224 oasc.ZkController.getConfName Looking for collection configName
   [junit4]   2> 47231 T235 oasc.CoreContainer.create Creating SolrCore 'nodes_used_collection_shard2_replica2' using instanceDir: /mnt/ssd/jenkins/workspace/Lucene-Solr-trunk-Linux/solr/build/solr-core/test/J1/./org.apache.solr.cloud.CollectionsAPIDistributedZkTest-jetty4-1375402242920/nodes_used_collection_shard2_replica2
   [junit4]   2> 47232 T196 oasc.ZkController.createCollectionZkNode Creating collection in ZooKeeper:nodes_used_collection
   [junit4]   2> 47233 T177 oasc.ZkController.createCollectionZkNode Creating collection in ZooKeeper:nodes_used_collection
   [junit4]   2> 47233 T235 oasc.ZkController.createCollectionZkNode Check for collection zkNode:nodes_used_collection
   [junit4]   2> 47233 T177 oasc.ZkController.getConfName Looking for collection configName
   [junit4]   2> 47233 T196 oasc.ZkController.getConfName Looking for collection configName
   [junit4]   2> 47234 T224 oasc.ZkController.getConfName Only one config set found in zk - using it:conf1
   [junit4]   2> 47235 T224 oascc.SolrZkClient.makePath makePath: /collections/nodes_used_collection
   [junit4]   2> 47234 T235 oasc.ZkController.createCollectionZkNode Creating collection in ZooKeeper:nodes_used_collection
   [junit4]   2> 47235 T235 oasc.ZkController.getConfName Looking for collection configName
   [junit4]   2> 47236 T177 oasc.ZkController.getConfName Only one config set found in zk - using it:conf1
   [junit4]   2> 47236 T177 oascc.SolrZkClient.makePath makePath: /collections/nodes_used_collection
   [junit4]   2> 47236 T196 oasc.ZkController.getConfName Only one config set found in zk - using it:conf1
   [junit4]   2> 47237 T196 oascc.SolrZkClient.makePath makePath: /collections/nodes_used_collection
   [junit4]   2> 47237 T235 oasc.ZkController.getConfName Only one config set found in zk - using it:conf1
   [junit4]   2> 47238 T235 oascc.SolrZkClient.makePath makePath: /collections/nodes_used_collection
   [junit4]   2> 47240 T177 oasc.ZkController.readConfigName Load collection config from:/collections/nodes_used_collection
   [junit4]   2> 47240 T224 oasc.ZkController.readConfigName Load collection config from:/collections/nodes_used_collection
   [junit4]   2> 47242 T196 oasc.ZkController.readConfigName Load collection config from:/collections/nodes_used_collection
   [junit4]   2> 47242 T235 oasc.ZkController.readConfigName Load collection config from:/collections/nodes_used_collection
   [junit4]   2> 47243 T224 oasc.SolrResourceLoader.<init> new SolrResourceLoader for directory: '/mnt/ssd/jenkins/workspace/Lucene-Solr-trunk-Linux/solr/build/solr-core/test/J1/./org.apache.solr.cloud.CollectionsAPIDistributedZkTest-jetty3-1375402241717/nodes_used_collection_shard1_replica2/'
   [junit4]   2> 47243 T196 oasc.SolrResourceLoader.<init> new SolrResourceLoader for directory: '/mnt/ssd/jenkins/workspace/Lucene-Solr-trunk-Linux/solr/build/solr-core/test/J1/./org.apache.solr.cloud.CollectionsAPIDistributedZkTest-jetty1-1375402239303/nodes_used_collection_shard2_replica1/'
   [junit4]   2> 47243 T177 oasc.SolrResourceLoader.<init> new SolrResourceLoader for directory: '/mnt/ssd/jenkins/workspace/Lucene-Solr-trunk-Linux/solr/build/solr-core/test/J1/./org.apache.solr.cloud.CollectionsAPIDistributedZkTest-controljetty-1375402238933/nodes_used_collection_shard1_replica1/'
   [junit4]   2> 47245 T235 oasc.SolrResourceLoader.<init> new SolrResourceLoader for directory: '/mnt/ssd/jenkins/workspace/Lucene-Solr-trunk-Linux/solr/build/solr-core/test/J1/./org.apache.solr.cloud.CollectionsAPIDistributedZkTest-jetty4-1375402242920/nodes_used_collection_shard2_replica2/'
   [junit4]   2> 47307 T224 oasc.SolrConfig.<init> Using Lucene MatchVersion: LUCENE_50
   [junit4]   2> 47309 T235 oasc.SolrConfig.<init> Using Lucene MatchVersion: LUCENE_50
   [junit4]   2> 47313 T177 oasc.SolrConfig.<init> Using Lucene MatchVersion: LUCENE_50
   [junit4]   2> 47314 T196 oasc.SolrConfig.<init> Using Lucene MatchVersion: LUCENE_50
   [junit4]   2> 47368 T235 oasc.SolrConfig.<init> Loaded SolrConfig: solrconfig.xml
   [junit4]   2> 47373 T235 oass.IndexSchema.readSchema Reading Solr Schema from schema.xml
   [junit4]   2> 47386 T177 oasc.SolrConfig.<init> Loaded SolrConfig: solrconfig.xml
   [junit4]   2> 47388 T177 oass.IndexSchema.readSchema Reading Solr Schema from schema.xml
   [junit4]   2> 47389 T224 oasc.SolrConfig.<init> Loaded SolrConfig: solrconfig.xml
   [junit4]   2> 47403 T177 oass.IndexSchema.readSchema [nodes_used_collection_shard1_replica1] Schema name=test
   [junit4]   2> 47403 T196 oasc.SolrConfig.<init> Loaded SolrConfig: solrconfig.xml
   [junit4]   2> 47404 T224 oass.IndexSchema.readSchema Reading Solr Schema from schema.xml
   [junit4]   2> 47411 T196 oass.IndexSchema.readSchema Reading Solr Schema from schema.xml
   [junit4]   2> 47421 T224 oass.IndexSchema.readSchema [nodes_used_collection_shard1_replica2] Schema name=test
   [junit4]   2> 47428 T196 oass.IndexSchema.readSchema [nodes_used_collection_shard2_replica1] Schema name=test
   [junit4]   2> 47434 T235 oass.IndexSchema.readSchema [nodes_used_collection_shard2_replica2] Schema name=test
   [junit4]   2> 48214 T235 oass.OpenExchangeRatesOrgProvider.init Initialized with rates=open-exchange-rates.json, refreshInterval=1440.
   [junit4]   2> 48229 T235 oass.IndexSchema.readSchema default search field in schema is text
   [junit4]   2> 48233 T235 oass.IndexSchema.readSchema unique key field: id
   [junit4]   2> 48252 T196 oass.OpenExchangeRatesOrgProvider.init Initialized with rates=open-exchange-rates.json, refreshInterval=1440.
   [junit4]   2> 48261 T196 oass.IndexSchema.readSchema default search field in schema is text
   [junit4]   2> 48265 T196 oass.IndexSchema.readSchema unique key field: id
   [junit4]   2> 48268 T235 oass.FileExchangeRateProvider.reload Reloading exchange rates from file currency.xml
   [junit4]   2> 48275 T235 oass.FileExchangeRateProvider.reload Reloading exchange rates from file currency.xml
   [junit4]   2> 48280 T235 oass.OpenExchangeRatesOrgProvider.reload Reloading exchange rates from open-exchange-rates.json
   [junit4]   2> 48283 T235 oass.OpenExchangeRatesOrgProvider$OpenExchangeRates.<init> WARN Unknown key IMPORTANT NOTE
   [junit4]   2> 48284 T235 oass.OpenExchangeRatesOrgProvider$OpenExchangeRates.<init> WARN Expected key, got STRING
   [junit4]   2> 48284 T235 oass.OpenExchangeRatesOrgProvider.reload Reloading exchange rates from open-exchange-rates.json
   [junit4]   2> 48287 T235 oass.OpenExchangeRatesOrgProvider$OpenExchangeRates.<init> WARN Unknown key IMPORTANT NOTE
   [junit4]   2> 48287 T235 oass.OpenExchangeRatesOrgProvider$OpenExchangeRates.<init> WARN Expected key, got STRING
   [junit4]   2> 48288 T235 oasc.SolrCore.initDirectoryFactory org.apache.solr.core.MockDirectoryFactory
   [junit4]   2> 48288 T235 oasc.SolrCore.<init> [nodes_used_collection_shard2_replica2] Opening new SolrCore at /mnt/ssd/jenkins/workspace/Lucene-Solr-trunk-Linux/solr/build/solr-core/test/J1/./org.apache.solr.cloud.CollectionsAPIDistributedZkTest-jetty4-1375402242920/nodes_used_collection_shard2_replica2/, dataDir=/mnt/ssd/jenkins/workspace/Lucene-Solr-trunk-Linux/solr/build/solr-core/test/J1/./org.apache.solr.cloud.CollectionsAPIDistributedZkTest-jetty4-1375402242920//nodes_used_collection_shard2_replica2/data/
   [junit4]   2> 48295 T235 oasc.JmxMonitoredMap.<init> JMX monitoring is enabled. Adding Solr mbeans to JMX Server: com.sun.jmx.mbeanserver.JmxMBeanServer@3534cd84
   [junit4]   2> 48301 T177 oass.OpenExchangeRatesOrgProvider.init Initialized with rates=open-exchange-rates.json, refreshInterval=1440.
   [junit4]   2> 48302 T224 oass.OpenExchangeRatesOrgProvider.init Initialized with rates=open-exchange-rates.json, refreshInterval=1440.
   [junit4]   2> 48311 T196 oass.FileExchangeRateProvider.reload Reloading exchange rates from file currency.xml
   [junit4]   2> 48312 T235 oasc.CachingDirectoryFactory.get return new directory for /mnt/ssd/jenkins/workspace/Lucene-Solr-trunk-Linux/solr/build/solr-core/test/J1/./org.apache.solr.cloud.CollectionsAPIDistributedZkTest-jetty4-1375402242920//nodes_used_collection_shard2_replica2/data
   [junit4]   2> 48312 T235 oasc.SolrCore.getNewIndexDir New index directory detected: old=null new=/mnt/ssd/jenkins/workspace/Lucene-Solr-trunk-Linux/solr/build/solr-core/test/J1/./org.apache.solr.cloud.CollectionsAPIDistributedZkTest-jetty4-1375402242920//nodes_used_collection_shard2_replica2/data/index/
   [junit4]   2> 48313 T235 oasc.SolrCore.initIndex WARN [nodes_used_collection_shard2_replica2] Solr index directory '/mnt/ssd/jenkins/workspace/Lucene-Solr-trunk-Linux/solr/build/solr-core/test/J1/./org.apache.solr.cloud.CollectionsAPIDistributedZkTest-jetty4-1375402242920/nodes_used_collection_shard2_replica2/data/index' doesn't exist. Creating new index...
   [junit4]   2> 48313 T235 oasc.CachingDirectoryFactory.get return new directory for /mnt/ssd/jenkins/workspace/Lucene-Solr-trunk-Linux/solr/build/solr-core/test/J1/./org.apache.solr.cloud.CollectionsAPIDistributedZkTest-jetty4-1375402242920//nodes_used_collection_shard2_replica2/data/index
   [junit4]   2> 48311 T224 oass.IndexSchema.readSchema default search field in schema is text
   [junit4]   2> 48327 T196 oass.FileExchangeRateProvider.reload Reloading exchange rates from file currency.xml
   [junit4]   2> 48330 T224 oass.IndexSchema.readSchema unique key field: id
   [junit4]   2> 48326 T177 oass.IndexSchema.readSchema default search field in schema is text
   [junit4]   2> 48316 T235 oasc.SolrDeletionPolicy.onCommit SolrDeletionPolicy.onCommit: commits: num=1
   [junit4]   2> 		commit{dir=BaseDirectoryWrapper(org.apache.lucene.store.RAMDirectory@ce7809c lockFactory=org.apache.lucene.store.NativeFSLockFactory@73e8f917),segFN=segments_1,generation=1}
   [junit4]   2> 48331 T235 oasc.SolrDeletionPolicy.updateCommits newest commit generation = 1
   [junit4]   2> 48332 T196 oass.OpenExchangeRatesOrgProvider.reload Reloading exchange rates from open-exchange-rates.json
   [junit4]   2> 48334 T196 oass.OpenExchangeRatesOrgProvider$OpenExchangeRates.<init> WARN Unknown key IMPORTANT NOTE
   [junit4]   2> 48335 T196 oass.OpenExchangeRatesOrgProvider$OpenExchangeRates.<init> WARN Expected key, got STRING
   [junit4]   2> 48335 T177 oass.IndexSchema.readSchema unique key field: id
   [junit4]   2> 48335 T196 oass.OpenExchangeRatesOrgProvider.reload Reloading exchange rates from open-exchange-rates.json
   [junit4]   2> 48337 T196 oass.OpenExchangeRatesOrgProvider$OpenExchangeRates.<init> WARN Unknown key IMPORTANT NOTE
   [junit4]   2> 48338 T196 oass.OpenExchangeRatesOrgProvider$OpenExchangeRates.<init> WARN Expected key, got STRING
   [junit4]   2> 48338 T196 oasc.SolrCore.initDirectoryFactory org.apache.solr.core.MockDirectoryFactory
   [junit4]   2> 48339 T196 oasc.SolrCore.<init> [nodes_used_collection_shard2_replica1] Opening new SolrCore at /mnt/ssd/jenkins/workspace/Lucene-Solr-trunk-Linux/solr/build/solr-core/test/J1/./org.apache.solr.cloud.CollectionsAPIDistributedZkTest-jetty1-1375402239303/nodes_used_collection_shard2_replica1/, dataDir=/mnt/ssd/jenkins/workspace/Lucene-Solr-trunk-Linux/solr/build/solr-core/test/J1/./org.apache.solr.cloud.CollectionsAPIDistributedZkTest-jetty1-1375402239303//nodes_used_collection_shard2_replica1/data/
   [junit4]   2> 48340 T196 oasc.JmxMonitoredMap.<init> JMX monitoring is enabled. Adding Solr mbeans to JMX Server: com.sun.jmx.mbeanserver.JmxMBeanServer@3534cd84
   [junit4]   2> 48342 T196 oasc.CachingDirectoryFactory.get return new directory for /mnt/ssd/jenkins/workspace/Lucene-Solr-trunk-Linux/solr/build/solr-core/test/J1/./org.apache.solr.cloud.CollectionsAPIDistributedZkTest-jetty1-1375402239303//nodes_used_collection_shard2_replica1/data
   [junit4]   2> 48342 T196 oasc.SolrCore.getNewIndexDir New index directory detected: old=null new=/mnt/ssd/jenkins/workspace/Lucene-Solr-trunk-Linux/solr/build/solr-core/test/J1/./org.apache.solr.cloud.CollectionsAPIDistributedZkTest-jetty1-1375402239303//nodes_used_collection_shard2_replica1/data/index/
   [junit4]   2> 48342 T196 oasc.SolrCore.initIndex WARN [nodes_used_collection_shard2_replica1] Solr index directory '/mnt/ssd/jenkins/workspace/Lucene-Solr-trunk-Linux/solr/build/solr-core/test/J1/./org.apache.solr.cloud.CollectionsAPIDistributedZkTest-jetty1-1375402239303/nodes_used_collection_shard2_replica1/data/index' doesn't exist. Creating new index...
   [junit4]   2> 48343 T196 oasc.CachingDirectoryFactory.get return new directory for /mnt/ssd/jenkins/workspace/Lucene-Solr-trunk-Linux/solr/build/solr-core/test/J1/./org.apache.solr.cloud.CollectionsAPIDistributedZkTest-jetty1-1375402239303//nodes_used_collection_shard2_replica1/data/index
   [junit4]   2> 48346 T196 oasc.SolrDeletionPolicy.onCommit SolrDeletionPolicy.onCommit: commits: num=1
   [junit4]   2> 		commit{dir=BaseDirectoryWrapper(org.apache.lucene.store.RAMDirectory@58367fb6 lockFactory=org.apache.lucene.store.NativeFSLockFactory@31c1fe18),segFN=segments_1,generation=1}
   [junit4]   2> 48347 T196 oasc.SolrDeletionPolicy.updateCommits newest commit generation = 1
   [junit4]   2> 48359 T235 oasup.UpdateRequestProcessorChain.init inserting DistributedUpdateProcessorFactory into updateRequestProcessorChain "dedupe"
   [junit4]   2> 48362 T196 oasup.UpdateRequestProcessorChain.init inserting DistributedUpdateProcessorFactory into updateRequestProcessorChain "dedupe"
   [junit4]   2> 48363 T196 oasup.UpdateRequestProcessorChain.init inserting DistributedUpdateProcessorFactory into updateRequestProcessorChain "stored_sig"
   [junit4]   2> 48364 T196 oasup.UpdateRequestProcessorChain.init inserting DistributedUpdateProcessorFactory into updateRequestProcessorChain "distrib-dup-test-chain-implicit"
   [junit4]   2> 48365 T196 oasc.RequestHandlers.initHandlersFromConfig created standard: solr.StandardRequestHandler
   [junit4]   2> 48366 T196 oasc.RequestHandlers.initHandlersFromConfig created /get: solr.RealTimeGetHandler
   [junit4]   2> 48366 T196 oasc.RequestHandlers.initHandlersFromConfig adding lazy requestHandler: solr.ReplicationHandler
   [junit4]   2> 48363 T235 oasup.UpdateRequestProcessorChain.init inserting DistributedUpdateProcessorFactory into updateRequestProcessorChain "stored_sig"
   [junit4]   2> 48367 T196 oasc.RequestHandlers.initHandlersFromConfig created /replication: solr.ReplicationHandler
   [junit4]   2> 48368 T196 oasc.RequestHandlers.initHandlersFromConfig created /update: solr.UpdateRequestHandler
   [junit4]   2> 48369 T196 oasc.RequestHandlers.initHandlersFromConfig created /admin/: org.apache.solr.handler.admin.AdminHandlers
   [junit4]   2> 48369 T235 oasup.UpdateRequestProcessorChain.init inserting DistributedUpdateProcessorFactory into updateRequestProcessorChain "distrib-dup-test-chain-implicit"
   [junit4]   2> 48373 T196 oashl.XMLLoader.init xsltCacheLifetimeSeconds=60
   [junit4]   2> 48374 T235 oasc.RequestHandlers.initHandlersFromConfig created standard: solr.StandardRequestHandler
   [junit4]   2> 48377 T235 oasc.RequestHandlers.initHandlersFromConfig created /get: solr.RealTimeGetHandler
   [junit4]   2> 48378 T235 oasc.RequestHandlers.initHandlersFromConfig adding lazy requestHandler: solr.ReplicationHandler
   [junit4]   2> 48378 T196 oass.SolrIndexSearcher.<init> Opening Searcher@65a1033d main
   [junit4]   2> 48379 T177 oass.FileExchangeRateProvider.reload Reloading exchange rates from file currency.xml
   [junit4]   2> 48379 T235 oasc.RequestHandlers.initHandlersFromConfig created /replication: solr.ReplicationHandler
   [junit4]   2> 48380 T196 oasu.CommitTracker.<init> Hard AutoCommit: disabled
   [junit4]   2> 48380 T196 oasu.CommitTracker.<init> Soft AutoCommit: disabled
   [junit4]   2> 48380 T235 oasc.RequestHandlers.initHandlersFromConfig created /update: solr.UpdateRequestHandler
   [junit4]   2> 48381 T235 oasc.RequestHandlers.initHandlersFromConfig created /admin/: org.apache.solr.handler.admin.AdminHandlers
   [junit4]   2> 48383 T235 oashl.XMLLoader.init xsltCacheLifetimeSeconds=60
   [junit4]   2> 48393 T235 oass.SolrIndexSearcher.<init> Opening Searcher@e8fb7a8 main
   [junit4]   2> 48394 T177 oass.FileExchangeRateProvider.reload Reloading exchange rates from file currency.xml
   [junit4]   2> 48396 T224 oass.FileExchangeRateProvider.reload Reloading exchange rates from file currency.xml
   [junit4]   2> 48398 T235 oasu.CommitTracker.<init> Hard AutoCommit: disabled
   [junit4]   2> 48398 T248 oasc.SolrCore.registerSearcher [nodes_used_collection_shard2_replica1] Registered new searcher Searcher@65a1033d main{StandardDirectoryReader(segments_1:1)}
   [junit4]   2> 48400 T177 oass.OpenExchangeRatesOrgProvider.reload Reloading exchange rates from open-exchange-rates.json
   [junit4]   2> 48398 T235 oasu.CommitTracker.<init> Soft AutoCommit: disabled
   [junit4]   2> 48403 T177 oass.OpenExchangeRatesOrgProvider$OpenExchangeRates.<init> WARN Unknown key IMPORTANT NOTE
   [junit4]   2> 48403 T177 oass.OpenExchangeRatesOrgProvider$OpenExchangeRates.<init> WARN Expected key, got STRING
   [junit4]   2> 48403 T177 oass.OpenExchangeRatesOrgProvider.reload Reloading exchange rates from open-exchange-rates.json
   [junit4]   2> 48403 T196 oasc.CoreContainer.registerCore registering core: nodes_used_collection_shard2_replica1
   [junit4]   2> 48407 T196 oasc.ZkController.register Register replica - core:nodes_used_collection_shard2_replica1 address:http://127.0.0.1:43622 collection:nodes_used_collection shard:shard2
   [junit4]   2> 48403 T224 oass.FileExchangeRateProvider.reload Reloading exchange rates from file currency.xml
   [junit4]   2> 48409 T177 oass.OpenExchangeRatesOrgProvider$OpenExchangeRates.<init> WARN Unknown key IMPORTANT NOTE
   [junit4]   2> 48410 T177 oass.OpenExchangeRatesOrgProvider$OpenExchangeRates.<init> WARN Expected key, got STRING
   [junit4]   2> 48410 T177 oasc.SolrCore.initDirectoryFactory org.apache.solr.core.MockDirectoryFactory
   [junit4]   2> 48416 T177 oasc.SolrCore.<init> [nodes_used_collection_shard1_replica1] Opening new SolrCore at /mnt/ssd/jenkins/workspace/Lucene-Solr-trunk-Linux/solr/build/solr-core/test/J1/./org.apache.solr.cloud.CollectionsAPIDistributedZkTest-controljetty-1375402238933/nodes_used_collection_shard1_replica1/, dataDir=/mnt/ssd/jenkins/workspace/Lucene-Solr-trunk-Linux/solr/build/solr-core/test/J1/./org.apache.solr.cloud.CollectionsAPIDistributedZkTest-controljetty-1375402238933//nodes_used_collection_shard1_replica1/data/
   [junit4]   2> 48417 T177 oasc.JmxMonitoredMap.<init> JMX monitoring is enabled. Adding Solr mbeans to JMX Server: com.sun.jmx.mbeanserver.JmxMBeanServer@3534cd84
   [junit4]   2> 48416 T224 oass.OpenExchangeRatesOrgProvider.reload Reloading exchange rates from open-exchange-rates.json
   [junit4]   2> 48414 T235 oasc.CoreContainer.registerCore registering core: nodes_used_collection_shard2_replica2
   [junit4]   2> 48412 T249 oasc.SolrCore.registerSearcher [nodes_used_collection_shard2_replica2] Registered new searcher Searcher@e8fb7a8 main{StandardDirectoryReader(segments_1:1)}
   [junit4]   2> 48412 T196 oascsi.HttpClientUtil.createClient Creating new http client, config:maxConnections=10000&maxConnectionsPerHost=20&connTimeout=15000&socketTimeout=30000&retry=false
   [junit4]   2> 48421 T224 oass.OpenExchangeRatesOrgProvider$OpenExchangeRates.<init> WARN Unknown key IMPORTANT NOTE
   [junit4]   2> 48421 T224 oass.OpenExchangeRatesOrgProvider$OpenExchangeRates.<init> WARN Expected key, got STRING
   [junit4]   2> 48422 T224 oass.OpenExchangeRatesOrgProvider.reload Reloading exchange rates from open-exchange-rates.json
   [junit4]   2> 48424 T224 oass.OpenExchangeRatesOrgProvider$OpenExchangeRates.<init> WARN Unknown key IMPORTANT NOTE
   [junit4]   2> 48425 T224 oass.OpenExchangeRatesOrgProvider$OpenExchangeRates.<init> WARN Expected key, got STRING
   [junit4]   2> 48425 T235 oasc.ZkController.register Register replica - core:nodes_used_collection_shard2_replica2 address:http://127.0.0.1:51161 collection:nodes_used_collection shard:shard2
   [junit4]   2> 48425 T235 oascsi.HttpClientUtil.createClient Creating new http client, config:maxConnections=10000&maxConnectionsPerHost=20&connTimeout=15000&socketTimeout=30000&retry=false
   [junit4]   2> 48426 T177 oasc.CachingDirectoryFactory.get return new directory for /mnt/ssd/jenkins/workspace/Lucene-Solr-trunk-Linux/solr/build/solr-core/test/J1/./org.apache.solr.cloud.CollectionsAPIDistributedZkTest-controljetty-1375402238933//nodes_used_collection_shard1_replica1/data
   [junit4]   2> 48426 T177 oasc.SolrCore.getNewIndexDir New index directory detected: old=null new=/mnt/ssd/jenkins/workspace/Lucene-Solr-trunk-Linux/solr/build/solr-core/test/J1/./org.apache.solr.cloud.CollectionsAPIDistributedZkTest-controljetty-1375402238933//nodes_used_collection_shard1_replica1/data/index/
   [junit4]   2> 48427 T177 oasc.SolrCore.initIndex WARN [nodes_used_collection_shard1_replica1] Solr index directory '/mnt/ssd/jenkins/workspace/Lucene-Solr-trunk-Linux/solr/build/solr-core/test/J1/./org.apache.solr.cloud.CollectionsAPIDistributedZkTest-controljetty-1375402238933/nodes_used_collection_shard1_replica1/data/index' doesn't exist. Creating new index...
   [junit4]   2> 48427 T177 oasc.CachingDirectoryFactory.get return new directory for /mnt/ssd/jenkins/workspace/Lucene-Solr-trunk-Linux/solr/build/solr-core/test/J1/./org.apache.solr.cloud.CollectionsAPIDistributedZkTest-controljetty-1375402238933//nodes_used_collection_shard1_replica1/data/index
   [junit4]   2> 48430 T177 oasc.SolrDeletionPolicy.onCommit SolrDeletionPolicy.onCommit: commits: num=1
   [junit4]   2> 		commit{dir=BaseDirectoryWrapper(org.apache.lucene.store.RAMDirectory@5e3c479e lockFactory=org.apache.lucene.store.NativeFSLockFactory@1a5d4c14),segFN=segments_1,generation=1}
   [junit4]   2> 48431 T177 oasc.SolrDeletionPolicy.updateCommits newest commit generation = 1
   [junit4]   2> 48437 T177 oasup.UpdateRequestProcessorChain.init inserting DistributedUpdateProcessorFactory into updateRequestProcessorChain "dedupe"
   [junit4]   2> 48438 T177 oasup.UpdateRequestProcessorChain.init inserting DistributedUpdateProcessorFactory into updateRequestProcessorChain "stored_sig"
   [junit4]   2> 48425 T224 oasc.SolrCore.initDirectoryFactory org.apache.solr.core.MockDirectoryFactory
   [junit4]   2> 48431 T235 oascc.SolrZkClient.makePath makePath: /collections/nodes_used_collection/leader_elect/shard2/election
   [junit4]   2> 48439 T177 oasup.UpdateRequestProcessorChain.init inserting DistributedUpdateProcessorFactory into updateRequestProcessorChain "distrib-dup-test-chain-implicit"
   [junit4]   2> 48430 T196 oascc.SolrZkClient.makePath makePath: /collections/nodes_used_collection/leader_elect/shard2/election
   [junit4]   2> 48440 T177 oasc.RequestHandlers.initHandlersFromConfig created standard: solr.StandardRequestHandler
   [junit4]   2> 48439 T224 oasc.SolrCore.<init> [nodes_used_collection_shard1_replica2] Opening new SolrCore at /mnt/ssd/jenkins/workspace/Lucene-Solr-trunk-Linux/solr/build/solr-core/test/J1/./org.apache.solr.cloud.CollectionsAPIDistributedZkTest-jetty3-1375402241717/nodes_used_collection_shard1_replica2/, dataDir=/mnt/ssd/jenkins/workspace/Lucene-Solr-trunk-Linux/solr/build/solr-core/test/J1/./org.apache.solr.cloud.CollectionsAPIDistributedZkTest-jetty3-1375402241717//nodes_used_collection_shard1_replica2/data/
   [junit4]   2> 48442 T177 oasc.RequestHandlers.initHandlersFromConfig created /get: solr.RealTimeGetHandler
   [junit4]   2> 48443 T177 oasc.RequestHandlers.initHandlersFromConfig adding lazy requestHandler: solr.ReplicationHandler
   [junit4]   2> 48442 T224 oasc.JmxMonitoredMap.<init> JMX monitoring is enabled. Adding Solr mbeans to JMX Server: com.sun.jmx.mbeanserver.JmxMBeanServer@3534cd84
   [junit4]   2> 48444 T177 oasc.RequestHandlers.initHandlersFromConfig created /replication: solr.ReplicationHandler
   [junit4]   2> 48444 T224 oasc.CachingDirectoryFactory.get return new directory for /mnt/ssd/jenkins/workspace/Lucene-Solr-trunk-Linux/solr/build/solr-core/test/J1/./org.apache.solr.cloud.CollectionsAPIDistributedZkTest-jetty3-1375402241717//nodes_used_collection_shard1_replica2/data
   [junit4]   2> 48445 T224 oasc.SolrCore.getNewIndexDir New index directory detected: old=null new=/mnt/ssd/jenkins/workspace/Lucene-Solr-trunk-Linux/solr/build/solr-core/test/J1/./org.apache.solr.cloud.CollectionsAPIDistributedZkTest-jetty3-1375402241717//nodes_used_collection_shard1_replica2/data/index/
   [junit4]   2> 48445 T177 oasc.RequestHandlers.initHandlersFromConfig created /update: solr.UpdateRequestHandler
   [junit4]   2> 48445 T224 oasc.SolrCore.initIndex WARN [nodes_used_collection_shard1_replica2] Solr index directory '/mnt/ssd/jenkins/workspace/Lucene-Solr-trunk-Linux/solr/build/solr-core/test/J1/./org.apache.solr.cloud.CollectionsAPIDistributedZkTest-jetty3-1375402241717/nodes_used_collection_shard1_replica2/data/index' doesn't exist. Creating new index...
   [junit4]   2> 48446 T224 oasc.CachingDirectoryFactory.get return new directory for /mnt/ssd/jenkins/workspace/Lucene-Solr-trunk-Linux/solr/build/solr-core/test/J1/./org.apache.solr.cloud.CollectionsAPIDistributedZkTest-jetty3-1375402241717//nodes_used_collection_shard1_replica2/data/index
   [junit4]   2> 48449 T224 oasc.SolrDeletionPolicy.onCommit SolrDeletionPolicy.onCommit: commits: num=1
   [junit4]   2> 		commit{dir=BaseDirectoryWrapper(org.apache.lucene.store.RAMDirectory@1629cdec lockFactory=org.apache.lucene.store.NativeFSLockFactory@243d452f),segFN=segments_1,generation=1}
   [junit4]   2> 48449 T224 oasc.SolrDeletionPolicy.updateCommits newest commit generation = 1
   [junit4]   2> 48454 T177 oasc.RequestHandlers.initHandlersFromConfig created /admin/: org.apache.solr.handler.admin.AdminHandlers
   [junit4]   2> 48460 T224 oasup.UpdateRequestProcessorChain.init inserting DistributedUpdateProcessorFactory into updateRequestProcessorChain "dedupe"
   [junit4]   2> 48461 T224 oasup.UpdateRequestProcessorChain.init inserting DistributedUpdateProcessorFactory into updateRequestProcessorChain "stored_sig"
   [junit4]   2> 48462 T224 oasup.UpdateRequestProcessorChain.init inserting DistributedUpdateProcessorFactory into updateRequestProcessorChain "distrib-dup-test-chain-implicit"
   [junit4]   2> 48462 T224 oasc.RequestHandlers.initHandlersFromConfig created standard: solr.StandardRequestHandler
   [junit4]   2> 48463 T224 oasc.RequestHandlers.initHandlersFromConfig created /get: solr.RealTimeGetHandler
   [junit4]   2> 48463 T224 oasc.RequestHandlers.initHandlersFromConfig adding lazy requestHandler: solr.ReplicationHandler
   [junit4]   2> 48464 T224 oasc.RequestHandlers.initHandlersFromConfig created /replication: solr.ReplicationHandler
   [junit4]   2> 48465 T224 oasc.RequestHandlers.initHandlersFromConfig created /update: solr.UpdateRequestHandler
   [junit4]   2> 48465 T224 oasc.RequestHandlers.initHandlersFromConfig created /admin/: org.apache.solr.handler.admin.AdminHandlers
   [junit4]   2> 48466 T196 oasc.ShardLeaderElectionContext.runLeaderProcess Running the leader process for shard shard2
   [junit4]   2> 48467 T224 oashl.XMLLoader.init xsltCacheLifetimeSeconds=60
   [junit4]   2> 48471 T177 oashl.XMLLoader.init xsltCacheLifetimeSeconds=60
   [junit4]   2> 48471 T196 oasc.ShardLeaderElectionContext.waitForReplicasToComeUp Enough replicas found to continue.
   [junit4]   2> 48471 T196 oasc.ShardLeaderElectionContext.runLeaderProcess I may be the new leader - try and sync
   [junit4]   2> 48472 T224 oass.SolrIndexSearcher.<init> Opening Searcher@70e2c815 main
   [junit4]   2> 48473 T224 oasu.CommitTracker.<init> Hard AutoCommit: disabled
   [junit4]   2> 48473 T196 oasc.SyncStrategy.sync Sync replicas to http://127.0.0.1:43622/nodes_used_collection_shard2_replica1/
   [junit4]   2> 48474 T177 oass.SolrIndexSearcher.<init> Opening Searcher@760cffee main
   [junit4]   2> 48474 T224 oasu.CommitTracker.<init> Soft AutoCommit: disabled
   [junit4]   2> 48476 T177 oasu.CommitTracker.<init> Hard AutoCommit: disabled
   [junit4]   2> 48477 T177 oasu.CommitTracker.<init> Soft AutoCommit: disabled
   [junit4]   2> 48480 T250 oasc.SolrCore.registerSearcher [nodes_used_collection_shard1_replica2] Registered new searcher Searcher@70e2c815 main{StandardDirectoryReader(segments_1:1)}
   [junit4]   2> 48482 T251 oasc.SolrCore.registerSearcher [nodes_used_collection_shard1_replica1] Registered new searcher Searcher@760cffee main{StandardDirectoryReader(segments_1:1)}
   [junit4]   2> 48483 T224 oasc.CoreContainer.registerCore registering core: nodes_used_collection_shard1_replica2
   [junit4]   2> 48484 T224 oasc.ZkController.register Register replica - core:nodes_used_collection_shard1_replica2 address:http://127.0.0.1:40783 collection:nodes_used_collection shard:shard1
   [junit4]   2> 48484 T224 oascsi.HttpClientUtil.createClient Creating new http client, config:maxConnections=10000&maxConnectionsPerHost=20&connTimeout=15000&socketTimeout=30000&retry=false
   [junit4]   2> 48480 T196 oascsi.HttpClientUtil.createClient Creating new http client, config:maxConnectionsPerHost=20&maxConnections=10000&connTimeout=30000&socketTimeout=30000&retry=false
   [junit4]   2> 48485 T177 oasc.CoreContainer.registerCore registering core: nodes_used_collection_shard1_replica1
   [junit4]   2> 48486 T177 oasc.ZkController.register Register replica - core:nodes_used_collection_shard1_replica1 address:http://127.0.0.1:40091 collection:nodes_used_collection shard:shard1
   [junit4]   2> 48486 T177 oascsi.HttpClientUtil.createClient Creating new http client, config:maxConnections=10000&maxConnectionsPerHost=20&connTimeout=15000&socketTimeout=30000&retry=false
   [junit4]   2> 48491 T224 oascc.SolrZkClient.makePath makePath: /collections/nodes_used_collection/leader_elect/shard1/election
   [junit4]   2> 48492 T177 oascc.SolrZkClient.makePath makePath: /collections/nodes_used_collection/leader_elect/shard1/election
   [junit4]   2> 48493 T196 oasu.PeerSync.sync PeerSync: core=nodes_used_collection_shard2_replica1 url=http://127.0.0.1:43622 START replicas=[http://127.0.0.1:51161/nodes_used_collection_shard2_replica2/] nUpdates=100
   [junit4]   2> 48494 T196 oasu.PeerSync.sync PeerSync: core=nodes_used_collection_shard2_replica1 url=http://127.0.0.1:43622 DONE.  We have no versions.  sync failed.
   [junit4]   2> 48494 T196 oasc.SyncStrategy.syncReplicas Leader's attempt to sync with shard failed, moving to the next candidate
   [junit4]   2> 48495 T196 oasc.ShardLeaderElectionContext.runLeaderProcess We failed sync, but we have no versions - we can't sync in that case - we were active before, so become leader anyway
   [junit4]   2> 48495 T196 oasc.ShardLeaderElectionContext.runLeaderProcess I am the new leader: http://127.0.0.1:43622/nodes_used_collection_shard2_replica1/ shard2
   [junit4]   2> 48496 T196 oascc.SolrZkClient.makePath makePath: /collections/nodes_used_collection/leaders/shard2
   [junit4]   2> ASYNC  NEW_CORE C14 name=nodes_used_collection_shard2_replica2 org.apache.solr.core.SolrCore@4be95d36 url=http://127.0.0.1:51161/nodes_used_collection_shard2_replica2 node=127.0.0.1:51161_ C14_STATE=coll:nodes_used_collection core:nodes_used_collection_shard2_replica2 props:{state=down, core=nodes_used_collection_shard2_replica2, node_name=127.0.0.1:51161_, base_url=http://127.0.0.1:51161}
   [junit4]   2> 48504 T238 C14 P51161 oasc.SolrCore.execute [nodes_used_collection_shard2_replica2] webapp= path=/get params={getVersions=100&distrib=false&wt=javabin&qt=/get&version=2} status=0 QTime=3 
   [junit4]   2> 48514 T224 oasc.ShardLeaderElectionContext.runLeaderProcess Running the leader process for shard shard1
   [junit4]   2> 48519 T224 oasc.ShardLeaderElectionContext.waitForReplicasToComeUp Enough replicas found to continue.
   [junit4]   2> 48520 T224 oasc.ShardLeaderElectionContext.runLeaderProcess I may be the new leader - try and sync
   [junit4]   2> 48520 T224 oasc.SyncStrategy.sync Sync replicas to http://127.0.0.1:40783/nodes_used_collection_shard1_replica2/
   [junit4]   2> 48521 T224 oasu.PeerSync.sync PeerSync: core=nodes_used_collection_shard1_replica2 url=http://127.0.0.1:40783 START replicas=[http://127.0.0.1:40091/nodes_used_collection_shard1_replica1/] nUpdates=100
   [junit4]   2> 48522 T224 oasu.PeerSync.sync PeerSync: core=nodes_used_collection_shard1_replica2 url=http://127.0.0.1:40783 DONE.  We have no versions.  sync failed.
   [junit4]   2> 48522 T224 oasc.SyncStrategy.syncReplicas Leader's attempt to sync with shard failed, moving to the next candidate
   [junit4]   2> 48523 T224 oasc.ShardLeaderElectionContext.runLeaderProcess We failed sync, but we have no versions - we can't sync in that case - we were active before, so become leader anyway
   [junit4]   2> 48523 T224 oasc.ShardLeaderElectionContext.runLeaderProcess I am the new leader: http://127.0.0.1:40783/nodes_used_collection_shard1_replica2/ shard1
   [junit4]   2> 48523 T224 oascc.SolrZkClient.makePath makePath: /collections/nodes_used_collection/leaders/shard1
   [junit4]   2> ASYNC  NEW_CORE C15 name=nodes_used_collection_shard1_replica1 org.apache.solr.core.SolrCore@3dbd8663 url=http://127.0.0.1:40091/nodes_used_collection_shard1_replica1 node=127.0.0.1:40091_ C15_STATE=coll:nodes_used_collection core:nodes_used_collection_shard1_replica1 props:{state=down, core=nodes_used_collection_shard1_replica1, node_name=127.0.0.1:40091_, base_url=http://127.0.0.1:40091}
   [junit4]   2> 48532 T175 C15 P40091 oasc.SolrCore.execute [nodes_used_collection_shard1_replica1] webapp= path=/get params={getVersions=100&distrib=false&wt=javabin&qt=/get&version=2} status=0 QTime=1 
   [junit4]   2> 49669 T183 oascc.ZkStateReader.updateClusterState Updating cloud state from ZooKeeper... 
   [junit4]   2> 49794 T214 oascc.ZkStateReader$2.process A cluster state change: WatchedEvent state:SyncConnected type:NodeDataChanged path:/clusterstate.json, has occurred - updating... (live nodes size: 5)
   [junit4]   2> 49794 T228 oascc.ZkStateReader$2.process A cluster state change: WatchedEvent state:SyncConnected type:NodeDataChanged path:/clusterstate.json, has occurred - updating... (live nodes size: 5)
   [junit4]   2> 497

[...truncated too long message...]

istribSearch -Dtests.seed=F9F80CC4E86C5A6B -Dtests.multiplier=3 -Dtests.slow=true -Dtests.locale=sr_BA -Dtests.timezone=America/Rankin_Inlet -Dtests.file.encoding=UTF-8
   [junit4] ERROR    119s J1 | CollectionsAPIDistributedZkTest.testDistribSearch <<<
   [junit4]    > Throwable #1: org.apache.solr.client.solrj.SolrServerException: Server refused connection at: http://127.0.0.1:43622
   [junit4]    > 	at __randomizedtesting.SeedInfo.seed([F9F80CC4E86C5A6B:781E82DC9F333A57]:0)
   [junit4]    > 	at org.apache.solr.client.solrj.impl.HttpSolrServer.request(HttpSolrServer.java:428)
   [junit4]    > 	at org.apache.solr.client.solrj.impl.HttpSolrServer.request(HttpSolrServer.java:180)
   [junit4]    > 	at org.apache.solr.cloud.AbstractFullDistribZkTestBase.createCollection(AbstractFullDistribZkTestBase.java:1535)
   [junit4]    > 	at org.apache.solr.cloud.CollectionsAPIDistributedZkTest.testCustomCollectionsAPI(CollectionsAPIDistributedZkTest.java:677)
   [junit4]    > 	at org.apache.solr.cloud.CollectionsAPIDistributedZkTest.doTest(CollectionsAPIDistributedZkTest.java:159)
   [junit4]    > 	at org.apache.solr.BaseDistributedSearchTestCase.testDistribSearch(BaseDistributedSearchTestCase.java:835)
   [junit4]    > 	at java.lang.Thread.run(Thread.java:724)
   [junit4]    > Caused by: org.apache.http.conn.HttpHostConnectException: Connection to http://127.0.0.1:43622 refused
   [junit4]    > 	at org.apache.http.impl.conn.DefaultClientConnectionOperator.openConnection(DefaultClientConnectionOperator.java:190)
   [junit4]    > 	at org.apache.http.impl.conn.ManagedClientConnectionImpl.open(ManagedClientConnectionImpl.java:294)
   [junit4]    > 	at org.apache.http.impl.client.DefaultRequestDirector.tryConnect(DefaultRequestDirector.java:645)
   [junit4]    > 	at org.apache.http.impl.client.DefaultRequestDirector.execute(DefaultRequestDirector.java:480)
   [junit4]    > 	at org.apache.http.impl.client.AbstractHttpClient.execute(AbstractHttpClient.java:906)
   [junit4]    > 	at org.apache.http.impl.client.AbstractHttpClient.execute(AbstractHttpClient.java:805)
   [junit4]    > 	at org.apache.http.impl.client.AbstractHttpClient.execute(AbstractHttpClient.java:784)
   [junit4]    > 	at org.apache.solr.client.solrj.impl.HttpSolrServer.request(HttpSolrServer.java:365)
   [junit4]    > 	... 45 more
   [junit4]    > Caused by: java.net.ConnectException: Connection refused
   [junit4]    > 	at java.net.PlainSocketImpl.socketConnect(Native Method)
   [junit4]    > 	at java.net.AbstractPlainSocketImpl.doConnect(AbstractPlainSocketImpl.java:339)
   [junit4]    > 	at java.net.AbstractPlainSocketImpl.connectToAddress(AbstractPlainSocketImpl.java:200)
   [junit4]    > 	at java.net.AbstractPlainSocketImpl.connect(AbstractPlainSocketImpl.java:182)
   [junit4]    > 	at java.net.SocksSocketImpl.connect(SocksSocketImpl.java:392)
   [junit4]    > 	at java.net.Socket.connect(Socket.java:579)
   [junit4]    > 	at org.apache.http.conn.scheme.PlainSocketFactory.connectSocket(PlainSocketFactory.java:127)
   [junit4]    > 	at org.apache.http.impl.conn.DefaultClientConnectionOperator.openConnection(DefaultClientConnectionOperator.java:180)
   [junit4]    > 	... 52 more
   [junit4]   2> 157497 T160 oas.SolrTestCaseJ4.deleteCore ###deleteCore
   [junit4]   2> 119327 T159 ccr.ThreadLeakControl.checkThreadLeaks WARNING Will linger awaiting termination of 3 leaked thread(s).
   [junit4]   2> 158705 T242 oascc.ZkStateReader$2.process WARN ZooKeeper watch triggered, but Solr cannot talk to ZK
   [junit4]   2> 158706 T242 oascc.ZkStateReader$3.process WARN ZooKeeper watch triggered, but Solr cannot talk to ZK
   [junit4]   2> 158706 T242 oasc.LeaderElector$1.process WARN  org.apache.zookeeper.KeeperException$SessionExpiredException: KeeperErrorCode = Session expired for /collections/new_implicit_coll_0/leader_elect/d/election
   [junit4]   2> 	at org.apache.zookeeper.KeeperException.create(KeeperException.java:127)
   [junit4]   2> 	at org.apache.zookeeper.KeeperException.create(KeeperException.java:51)
   [junit4]   2> 	at org.apache.zookeeper.ZooKeeper.getChildren(ZooKeeper.java:1468)
   [junit4]   2> 	at org.apache.solr.common.cloud.SolrZkClient$6.execute(SolrZkClient.java:235)
   [junit4]   2> 	at org.apache.solr.common.cloud.SolrZkClient$6.execute(SolrZkClient.java:232)
   [junit4]   2> 	at org.apache.solr.common.cloud.ZkCmdExecutor.retryOperation(ZkCmdExecutor.java:65)
   [junit4]   2> 	at org.apache.solr.common.cloud.SolrZkClient.getChildren(SolrZkClient.java:232)
   [junit4]   2> 	at org.apache.solr.cloud.LeaderElector.checkIfIamLeader(LeaderElector.java:84)
   [junit4]   2> 	at org.apache.solr.cloud.LeaderElector.access$000(LeaderElector.java:55)
   [junit4]   2> 	at org.apache.solr.cloud.LeaderElector$1.process(LeaderElector.java:129)
   [junit4]   2> 	at org.apache.zookeeper.ClientCnxn$EventThread.processEvent(ClientCnxn.java:519)
   [junit4]   2> 	at org.apache.zookeeper.ClientCnxn$EventThread.run(ClientCnxn.java:495)
   [junit4]   2> 
   [junit4]   2> 158706 T242 oasc.LeaderElector$1.process WARN  org.apache.zookeeper.KeeperException$SessionExpiredException: KeeperErrorCode = Session expired for /collections/new_implicit_coll_0/leader_elect/a/election
   [junit4]   2> 	at org.apache.zookeeper.KeeperException.create(KeeperException.java:127)
   [junit4]   2> 	at org.apache.zookeeper.KeeperException.create(KeeperException.java:51)
   [junit4]   2> 	at org.apache.zookeeper.ZooKeeper.getChildren(ZooKeeper.java:1468)
   [junit4]   2> 	at org.apache.solr.common.cloud.SolrZkClient$6.execute(SolrZkClient.java:235)
   [junit4]   2> 	at org.apache.solr.common.cloud.SolrZkClient$6.execute(SolrZkClient.java:232)
   [junit4]   2> 	at org.apache.solr.common.cloud.ZkCmdExecutor.retryOperation(ZkCmdExecutor.java:65)
   [junit4]   2> 	at org.apache.solr.common.cloud.SolrZkClient.getChildren(SolrZkClient.java:232)
   [junit4]   2> 	at org.apache.solr.cloud.LeaderElector.checkIfIamLeader(LeaderElector.java:84)
   [junit4]   2> 	at org.apache.solr.cloud.LeaderElector.access$000(LeaderElector.java:55)
   [junit4]   2> 	at org.apache.solr.cloud.LeaderElector$1.process(LeaderElector.java:129)
   [junit4]   2> 	at org.apache.zookeeper.ClientCnxn$EventThread.processEvent(ClientCnxn.java:519)
   [junit4]   2> 	at org.apache.zookeeper.ClientCnxn$EventThread.run(ClientCnxn.java:495)
   [junit4]   2> 
   [junit4]   2> 158707 T242 oasc.LeaderElector$1.process WARN  org.apache.zookeeper.KeeperException$SessionExpiredException: KeeperErrorCode = Session expired for /collections/new_implicit_coll_0/leader_elect/b/election
   [junit4]   2> 	at org.apache.zookeeper.KeeperException.create(KeeperException.java:127)
   [junit4]   2> 	at org.apache.zookeeper.KeeperException.create(KeeperException.java:51)
   [junit4]   2> 	at org.apache.zookeeper.ZooKeeper.getChildren(ZooKeeper.java:1468)
   [junit4]   2> 	at org.apache.solr.common.cloud.SolrZkClient$6.execute(SolrZkClient.java:235)
   [junit4]   2> 	at org.apache.solr.common.cloud.SolrZkClient$6.execute(SolrZkClient.java:232)
   [junit4]   2> 	at org.apache.solr.common.cloud.ZkCmdExecutor.retryOperation(ZkCmdExecutor.java:65)
   [junit4]   2> 	at org.apache.solr.common.cloud.SolrZkClient.getChildren(SolrZkClient.java:232)
   [junit4]   2> 	at org.apache.solr.cloud.LeaderElector.checkIfIamLeader(LeaderElector.java:84)
   [junit4]   2> 	at org.apache.solr.cloud.LeaderElector.access$000(LeaderElector.java:55)
   [junit4]   2> 	at org.apache.solr.cloud.LeaderElector$1.process(LeaderElector.java:129)
   [junit4]   2> 	at org.apache.zookeeper.ClientCnxn$EventThread.processEvent(ClientCnxn.java:519)
   [junit4]   2> 	at org.apache.zookeeper.ClientCnxn$EventThread.run(ClientCnxn.java:495)
   [junit4]   2> 
   [junit4]   2> NOTE: test params are: codec=FastDecompressionCompressingStoredFields(storedFieldsFormat=CompressingStoredFieldsFormat(compressionMode=FAST_DECOMPRESSION, chunkSize=400), termVectorsFormat=CompressingTermVectorsFormat(compressionMode=FAST_DECOMPRESSION, chunkSize=400)), sim=RandomSimilarityProvider(queryNorm=false,coord=no): {}, locale=sr_BA, timezone=America/Rankin_Inlet
   [junit4]   2> NOTE: Linux 3.2.0-51-generic amd64/Oracle Corporation 1.7.0_25 (64-bit)/cpus=8,threads=5,free=137403744,total=274530304
   [junit4]   2> NOTE: All tests run in this JVM: [ZkSolrClientTest, TestRTGBase, DebugComponentTest, TestJmxMonitoredMap, ZkNodePropsTest, TestCoreDiscovery, TestFoldingMultitermQuery, TestUniqueKeyFieldResource, ConvertedLegacyTest, URLClassifyProcessorTest, RequiredFieldsTest, HdfsDirectoryTest, SolrPluginUtilsTest, SpellPossibilityIteratorTest, TestSystemIdResolver, TestRandomMergePolicy, CollectionsAPIDistributedZkTest]
   [junit4] Completed on J1 in 120.61s, 1 test, 1 error <<< FAILURES!

[...truncated 843 lines...]
BUILD FAILED
/mnt/ssd/jenkins/workspace/Lucene-Solr-trunk-Linux/build.xml:389: The following error occurred while executing this line:
/mnt/ssd/jenkins/workspace/Lucene-Solr-trunk-Linux/build.xml:369: The following error occurred while executing this line:
/mnt/ssd/jenkins/workspace/Lucene-Solr-trunk-Linux/build.xml:39: The following error occurred while executing this line:
/mnt/ssd/jenkins/workspace/Lucene-Solr-trunk-Linux/solr/build.xml:181: The following error occurred while executing this line:
/mnt/ssd/jenkins/workspace/Lucene-Solr-trunk-Linux/solr/common-build.xml:449: The following error occurred while executing this line:
/mnt/ssd/jenkins/workspace/Lucene-Solr-trunk-Linux/lucene/common-build.xml:1230: The following error occurred while executing this line:
/mnt/ssd/jenkins/workspace/Lucene-Solr-trunk-Linux/lucene/common-build.xml:873: There were test failures: 320 suites, 1347 tests, 1 error, 34 ignored (6 assumptions)

Total time: 38 minutes 40 seconds
Build step 'Invoke Ant' marked build as failure
Description set: Java: 64bit/jdk1.7.0_25 -XX:+UseCompressedOops -XX:+UseParallelGC
Archiving artifacts
Recording test results
Email was triggered for: Failure
Sending email for trigger: Failure



Mime
View raw message