lucene-dev mailing list archives

Site index · List index
Message view « Date » · « Thread »
Top « Date » · « Thread »
From Policeman Jenkins Server <jenk...@thetaphi.de>
Subject [JENKINS] Lucene-Solr-trunk-Windows (64bit/jdk1.7.0_25) - Build # 3096 - Failure!
Date Thu, 01 Aug 2013 11:39:41 GMT
Build: http://jenkins.thetaphi.de/job/Lucene-Solr-trunk-Windows/3096/
Java: 64bit/jdk1.7.0_25 -XX:+UseCompressedOops -XX:+UseSerialGC

1 tests failed.
FAILED:  org.apache.solr.cloud.CollectionsAPIDistributedZkTest.testDistribSearch

Error Message:
Server refused connection at: http://127.0.0.1:63491/_npe

Stack Trace:
org.apache.solr.client.solrj.SolrServerException: Server refused connection at: http://127.0.0.1:63491/_npe
	at __randomizedtesting.SeedInfo.seed([F6C567AAFFED0645:7723E9B288B26679]:0)
	at org.apache.solr.client.solrj.impl.HttpSolrServer.request(HttpSolrServer.java:428)
	at org.apache.solr.client.solrj.impl.HttpSolrServer.request(HttpSolrServer.java:180)
	at org.apache.solr.cloud.CollectionsAPIDistributedZkTest.testCustomCollectionsAPI(CollectionsAPIDistributedZkTest.java:764)
	at org.apache.solr.cloud.CollectionsAPIDistributedZkTest.doTest(CollectionsAPIDistributedZkTest.java:159)
	at org.apache.solr.BaseDistributedSearchTestCase.testDistribSearch(BaseDistributedSearchTestCase.java:835)
	at sun.reflect.NativeMethodAccessorImpl.invoke0(Native Method)
	at sun.reflect.NativeMethodAccessorImpl.invoke(NativeMethodAccessorImpl.java:57)
	at sun.reflect.DelegatingMethodAccessorImpl.invoke(DelegatingMethodAccessorImpl.java:43)
	at java.lang.reflect.Method.invoke(Method.java:606)
	at com.carrotsearch.randomizedtesting.RandomizedRunner.invoke(RandomizedRunner.java:1559)
	at com.carrotsearch.randomizedtesting.RandomizedRunner.access$600(RandomizedRunner.java:79)
	at com.carrotsearch.randomizedtesting.RandomizedRunner$6.evaluate(RandomizedRunner.java:737)
	at com.carrotsearch.randomizedtesting.RandomizedRunner$7.evaluate(RandomizedRunner.java:773)
	at com.carrotsearch.randomizedtesting.RandomizedRunner$8.evaluate(RandomizedRunner.java:787)
	at com.carrotsearch.randomizedtesting.rules.SystemPropertiesRestoreRule$1.evaluate(SystemPropertiesRestoreRule.java:53)
	at org.apache.lucene.util.TestRuleSetupTeardownChained$1.evaluate(TestRuleSetupTeardownChained.java:50)
	at org.apache.lucene.util.TestRuleFieldCacheSanity$1.evaluate(TestRuleFieldCacheSanity.java:51)
	at org.apache.lucene.util.AbstractBeforeAfterRule$1.evaluate(AbstractBeforeAfterRule.java:46)
	at com.carrotsearch.randomizedtesting.rules.SystemPropertiesInvariantRule$1.evaluate(SystemPropertiesInvariantRule.java:55)
	at org.apache.lucene.util.TestRuleThreadAndTestName$1.evaluate(TestRuleThreadAndTestName.java:49)
	at org.apache.lucene.util.TestRuleIgnoreAfterMaxFailures$1.evaluate(TestRuleIgnoreAfterMaxFailures.java:70)
	at org.apache.lucene.util.TestRuleMarkFailure$1.evaluate(TestRuleMarkFailure.java:48)
	at com.carrotsearch.randomizedtesting.rules.StatementAdapter.evaluate(StatementAdapter.java:36)
	at com.carrotsearch.randomizedtesting.ThreadLeakControl$StatementRunner.run(ThreadLeakControl.java:358)
	at com.carrotsearch.randomizedtesting.ThreadLeakControl.forkTimeoutingTask(ThreadLeakControl.java:782)
	at com.carrotsearch.randomizedtesting.ThreadLeakControl$3.evaluate(ThreadLeakControl.java:442)
	at com.carrotsearch.randomizedtesting.RandomizedRunner.runSingleTest(RandomizedRunner.java:746)
	at com.carrotsearch.randomizedtesting.RandomizedRunner$3.evaluate(RandomizedRunner.java:648)
	at com.carrotsearch.randomizedtesting.RandomizedRunner$4.evaluate(RandomizedRunner.java:682)
	at com.carrotsearch.randomizedtesting.RandomizedRunner$5.evaluate(RandomizedRunner.java:693)
	at com.carrotsearch.randomizedtesting.rules.StatementAdapter.evaluate(StatementAdapter.java:36)
	at com.carrotsearch.randomizedtesting.rules.SystemPropertiesRestoreRule$1.evaluate(SystemPropertiesRestoreRule.java:53)
	at org.apache.lucene.util.AbstractBeforeAfterRule$1.evaluate(AbstractBeforeAfterRule.java:46)
	at org.apache.lucene.util.TestRuleStoreClassName$1.evaluate(TestRuleStoreClassName.java:42)
	at com.carrotsearch.randomizedtesting.rules.SystemPropertiesInvariantRule$1.evaluate(SystemPropertiesInvariantRule.java:55)
	at com.carrotsearch.randomizedtesting.rules.NoShadowingOrOverridesOnMethodsRule$1.evaluate(NoShadowingOrOverridesOnMethodsRule.java:39)
	at com.carrotsearch.randomizedtesting.rules.NoShadowingOrOverridesOnMethodsRule$1.evaluate(NoShadowingOrOverridesOnMethodsRule.java:39)
	at com.carrotsearch.randomizedtesting.rules.StatementAdapter.evaluate(StatementAdapter.java:36)
	at org.apache.lucene.util.TestRuleAssertionsRequired$1.evaluate(TestRuleAssertionsRequired.java:43)
	at org.apache.lucene.util.TestRuleMarkFailure$1.evaluate(TestRuleMarkFailure.java:48)
	at org.apache.lucene.util.TestRuleIgnoreAfterMaxFailures$1.evaluate(TestRuleIgnoreAfterMaxFailures.java:70)
	at org.apache.lucene.util.TestRuleIgnoreTestSuites$1.evaluate(TestRuleIgnoreTestSuites.java:55)
	at com.carrotsearch.randomizedtesting.rules.StatementAdapter.evaluate(StatementAdapter.java:36)
	at com.carrotsearch.randomizedtesting.ThreadLeakControl$StatementRunner.run(ThreadLeakControl.java:358)
	at java.lang.Thread.run(Thread.java:724)
Caused by: org.apache.http.conn.HttpHostConnectException: Connection to http://127.0.0.1:63491 refused
	at org.apache.http.impl.conn.DefaultClientConnectionOperator.openConnection(DefaultClientConnectionOperator.java:190)
	at org.apache.http.impl.conn.ManagedClientConnectionImpl.open(ManagedClientConnectionImpl.java:294)
	at org.apache.http.impl.client.DefaultRequestDirector.tryConnect(DefaultRequestDirector.java:645)
	at org.apache.http.impl.client.DefaultRequestDirector.execute(DefaultRequestDirector.java:480)
	at org.apache.http.impl.client.AbstractHttpClient.execute(AbstractHttpClient.java:906)
	at org.apache.http.impl.client.AbstractHttpClient.execute(AbstractHttpClient.java:805)
	at org.apache.http.impl.client.AbstractHttpClient.execute(AbstractHttpClient.java:784)
	at org.apache.solr.client.solrj.impl.HttpSolrServer.request(HttpSolrServer.java:365)
	... 44 more
Caused by: java.net.ConnectException: Connection refused: connect
	at java.net.DualStackPlainSocketImpl.waitForConnect(Native Method)
	at java.net.DualStackPlainSocketImpl.socketConnect(DualStackPlainSocketImpl.java:85)
	at java.net.AbstractPlainSocketImpl.doConnect(AbstractPlainSocketImpl.java:339)
	at java.net.AbstractPlainSocketImpl.connectToAddress(AbstractPlainSocketImpl.java:200)
	at java.net.AbstractPlainSocketImpl.connect(AbstractPlainSocketImpl.java:182)
	at java.net.PlainSocketImpl.connect(PlainSocketImpl.java:172)
	at java.net.SocksSocketImpl.connect(SocksSocketImpl.java:392)
	at java.net.Socket.connect(Socket.java:579)
	at org.apache.http.conn.scheme.PlainSocketFactory.connectSocket(PlainSocketFactory.java:127)
	at org.apache.http.impl.conn.DefaultClientConnectionOperator.openConnection(DefaultClientConnectionOperator.java:180)
	... 51 more




Build Log:
[...truncated 9591 lines...]
   [junit4] Suite: org.apache.solr.cloud.CollectionsAPIDistributedZkTest
   [junit4]   2> 1175669 T2371 oas.BaseDistributedSearchTestCase.initHostContext Setting hostContext system property: /_npe/
   [junit4]   2> 1175673 T2371 oas.SolrTestCaseJ4.setUp ###Starting testDistribSearch
   [junit4]   2> Creating dataDir: C:\Users\JenkinsSlave\workspace\Lucene-Solr-trunk-Windows\solr\build\solr-core\test\J0\.\solrtest-CollectionsAPIDistributedZkTest-1375354877066
   [junit4]   2> 1175675 T2371 oasc.ZkTestServer.run STARTING ZK TEST SERVER
   [junit4]   2> 1175676 T2372 oasc.ZkTestServer$ZKServerMain.runFromConfig Starting server
   [junit4]   2> 1175785 T2371 oasc.ZkTestServer.run start zk server on port:63472
   [junit4]   2> 1175788 T2371 oascc.ConnectionManager.waitForConnected Waiting for client to connect to ZooKeeper
   [junit4]   2> 1175808 T2378 oascc.ConnectionManager.process Watcher org.apache.solr.common.cloud.ConnectionManager@5ee4fafe name:ZooKeeperConnection Watcher:127.0.0.1:63472 got event WatchedEvent state:SyncConnected type:None path:null path:null type:None
   [junit4]   2> 1175809 T2371 oascc.ConnectionManager.waitForConnected Client is connected to ZooKeeper
   [junit4]   2> 1175809 T2371 oascc.SolrZkClient.makePath makePath: /solr
   [junit4]   2> 1175823 T2373 oazs.NIOServerCnxn.doIO WARN caught end of stream exception EndOfStreamException: Unable to read additional data from client sessionid 0x1403989f49a0000, likely client has closed socket
   [junit4]   2> 	at org.apache.zookeeper.server.NIOServerCnxn.doIO(NIOServerCnxn.java:220)
   [junit4]   2> 	at org.apache.zookeeper.server.NIOServerCnxnFactory.run(NIOServerCnxnFactory.java:208)
   [junit4]   2> 	at java.lang.Thread.run(Thread.java:724)
   [junit4]   2> 
   [junit4]   2> 1175826 T2371 oascc.ConnectionManager.waitForConnected Waiting for client to connect to ZooKeeper
   [junit4]   2> 1175834 T2380 oascc.ConnectionManager.process Watcher org.apache.solr.common.cloud.ConnectionManager@6d2d0a4e name:ZooKeeperConnection Watcher:127.0.0.1:63472/solr got event WatchedEvent state:SyncConnected type:None path:null path:null type:None
   [junit4]   2> 1175835 T2371 oascc.ConnectionManager.waitForConnected Client is connected to ZooKeeper
   [junit4]   2> 1175835 T2371 oascc.SolrZkClient.makePath makePath: /collections/collection1
   [junit4]   2> 1175851 T2371 oascc.SolrZkClient.makePath makePath: /collections/collection1/shards
   [junit4]   2> 1175863 T2371 oascc.SolrZkClient.makePath makePath: /collections/control_collection
   [junit4]   2> 1175870 T2371 oascc.SolrZkClient.makePath makePath: /collections/control_collection/shards
   [junit4]   2> 1175877 T2371 oasc.AbstractZkTestCase.putConfig put C:\Users\JenkinsSlave\workspace\Lucene-Solr-trunk-Windows\solr\build\solr-core\test-files\solr\collection1\conf\solrconfig-tlog.xml to /configs/conf1/solrconfig.xml
   [junit4]   2> 1175878 T2371 oascc.SolrZkClient.makePath makePath: /configs/conf1/solrconfig.xml
   [junit4]   2> 1175891 T2371 oasc.AbstractZkTestCase.putConfig put C:\Users\JenkinsSlave\workspace\Lucene-Solr-trunk-Windows\solr\build\solr-core\test-files\solr\collection1\conf\schema.xml to /configs/conf1/schema.xml
   [junit4]   2> 1175891 T2371 oascc.SolrZkClient.makePath makePath: /configs/conf1/schema.xml
   [junit4]   2> 1175899 T2371 oasc.AbstractZkTestCase.putConfig put C:\Users\JenkinsSlave\workspace\Lucene-Solr-trunk-Windows\solr\build\solr-core\test-files\solr\collection1\conf\stopwords.txt to /configs/conf1/stopwords.txt
   [junit4]   2> 1175901 T2371 oascc.SolrZkClient.makePath makePath: /configs/conf1/stopwords.txt
   [junit4]   2> 1175907 T2371 oasc.AbstractZkTestCase.putConfig put C:\Users\JenkinsSlave\workspace\Lucene-Solr-trunk-Windows\solr\build\solr-core\test-files\solr\collection1\conf\protwords.txt to /configs/conf1/protwords.txt
   [junit4]   2> 1175907 T2371 oascc.SolrZkClient.makePath makePath: /configs/conf1/protwords.txt
   [junit4]   2> 1175914 T2371 oasc.AbstractZkTestCase.putConfig put C:\Users\JenkinsSlave\workspace\Lucene-Solr-trunk-Windows\solr\build\solr-core\test-files\solr\collection1\conf\currency.xml to /configs/conf1/currency.xml
   [junit4]   2> 1175914 T2371 oascc.SolrZkClient.makePath makePath: /configs/conf1/currency.xml
   [junit4]   2> 1175921 T2371 oasc.AbstractZkTestCase.putConfig put C:\Users\JenkinsSlave\workspace\Lucene-Solr-trunk-Windows\solr\build\solr-core\test-files\solr\collection1\conf\open-exchange-rates.json to /configs/conf1/open-exchange-rates.json
   [junit4]   2> 1175922 T2371 oascc.SolrZkClient.makePath makePath: /configs/conf1/open-exchange-rates.json
   [junit4]   2> 1175928 T2371 oasc.AbstractZkTestCase.putConfig put C:\Users\JenkinsSlave\workspace\Lucene-Solr-trunk-Windows\solr\build\solr-core\test-files\solr\collection1\conf\mapping-ISOLatin1Accent.txt to /configs/conf1/mapping-ISOLatin1Accent.txt
   [junit4]   2> 1175928 T2371 oascc.SolrZkClient.makePath makePath: /configs/conf1/mapping-ISOLatin1Accent.txt
   [junit4]   2> 1175934 T2371 oasc.AbstractZkTestCase.putConfig put C:\Users\JenkinsSlave\workspace\Lucene-Solr-trunk-Windows\solr\build\solr-core\test-files\solr\collection1\conf\old_synonyms.txt to /configs/conf1/old_synonyms.txt
   [junit4]   2> 1175934 T2371 oascc.SolrZkClient.makePath makePath: /configs/conf1/old_synonyms.txt
   [junit4]   2> 1175941 T2371 oasc.AbstractZkTestCase.putConfig put C:\Users\JenkinsSlave\workspace\Lucene-Solr-trunk-Windows\solr\build\solr-core\test-files\solr\collection1\conf\synonyms.txt to /configs/conf1/synonyms.txt
   [junit4]   2> 1175941 T2371 oascc.SolrZkClient.makePath makePath: /configs/conf1/synonyms.txt
   [junit4]   2> 1175948 T2373 oazs.NIOServerCnxn.doIO WARN caught end of stream exception EndOfStreamException: Unable to read additional data from client sessionid 0x1403989f49a0001, likely client has closed socket
   [junit4]   2> 	at org.apache.zookeeper.server.NIOServerCnxn.doIO(NIOServerCnxn.java:220)
   [junit4]   2> 	at org.apache.zookeeper.server.NIOServerCnxnFactory.run(NIOServerCnxnFactory.java:208)
   [junit4]   2> 	at java.lang.Thread.run(Thread.java:724)
   [junit4]   2> 
   [junit4]   2> 1176431 T2371 oejs.Server.doStart jetty-8.1.10.v20130312
   [junit4]   2> 1176434 T2371 oejs.AbstractConnector.doStart Started SelectChannelConnector@127.0.0.1:63479
   [junit4]   2> 1176435 T2371 oass.SolrDispatchFilter.init SolrDispatchFilter.init()
   [junit4]   2> 1176436 T2371 oasc.SolrResourceLoader.locateSolrHome JNDI not configured for solr (NoInitialContextEx)
   [junit4]   2> 1176436 T2371 oasc.SolrResourceLoader.locateSolrHome using system property solr.solr.home: C:\Users\JenkinsSlave\workspace\Lucene-Solr-trunk-Windows\solr\build\solr-core\test\J0\.\org.apache.solr.cloud.CollectionsAPIDistributedZkTest-controljetty-1375354877340
   [junit4]   2> 1176436 T2371 oasc.SolrResourceLoader.<init> new SolrResourceLoader for directory: 'C:\Users\JenkinsSlave\workspace\Lucene-Solr-trunk-Windows\solr\build\solr-core\test\J0\.\org.apache.solr.cloud.CollectionsAPIDistributedZkTest-controljetty-1375354877340\'
   [junit4]   2> 1176488 T2371 oasc.ConfigSolr.fromFile Loading container configuration from C:\Users\JenkinsSlave\workspace\Lucene-Solr-trunk-Windows\solr\build\solr-core\test\J0\.\org.apache.solr.cloud.CollectionsAPIDistributedZkTest-controljetty-1375354877340\solr.xml
   [junit4]   2> 1176569 T2371 oasc.ConfigSolrXml.<init> Config-defined core root directory: 
   [junit4]   2> 1176570 T2371 oasc.CoreContainer.<init> New CoreContainer 1755756096
   [junit4]   2> 1176570 T2371 oasc.CoreContainer.load Loading cores into CoreContainer [instanceDir=C:\Users\JenkinsSlave\workspace\Lucene-Solr-trunk-Windows\solr\build\solr-core\test\J0\.\org.apache.solr.cloud.CollectionsAPIDistributedZkTest-controljetty-1375354877340\]
   [junit4]   2> 1176572 T2371 oashc.HttpShardHandlerFactory.getParameter Setting socketTimeout to: 120000
   [junit4]   2> 1176572 T2371 oashc.HttpShardHandlerFactory.getParameter Setting urlScheme to: http://
   [junit4]   2> 1176572 T2371 oashc.HttpShardHandlerFactory.getParameter Setting connTimeout to: 15000
   [junit4]   2> 1176572 T2371 oashc.HttpShardHandlerFactory.getParameter Setting maxConnectionsPerHost to: 20
   [junit4]   2> 1176573 T2371 oashc.HttpShardHandlerFactory.getParameter Setting corePoolSize to: 0
   [junit4]   2> 1176573 T2371 oashc.HttpShardHandlerFactory.getParameter Setting maximumPoolSize to: 2147483647
   [junit4]   2> 1176573 T2371 oashc.HttpShardHandlerFactory.getParameter Setting maxThreadIdleTime to: 5
   [junit4]   2> 1176574 T2371 oashc.HttpShardHandlerFactory.getParameter Setting sizeOfQueue to: -1
   [junit4]   2> 1176574 T2371 oashc.HttpShardHandlerFactory.getParameter Setting fairnessPolicy to: false
   [junit4]   2> 1176574 T2371 oascsi.HttpClientUtil.createClient Creating new http client, config:maxConnectionsPerHost=20&maxConnections=10000&socketTimeout=120000&connTimeout=15000&retry=false
   [junit4]   2> 1176583 T2371 oasc.ZkContainer.initZooKeeper Zookeeper client=127.0.0.1:63472/solr
   [junit4]   2> 1176584 T2371 oasc.ZkController.checkChrootPath zkHost includes chroot
   [junit4]   2> 1176585 T2371 oascc.ConnectionManager.waitForConnected Waiting for client to connect to ZooKeeper
   [junit4]   2> 1176601 T2391 oascc.ConnectionManager.process Watcher org.apache.solr.common.cloud.ConnectionManager@4e96b09a name:ZooKeeperConnection Watcher:127.0.0.1:63472 got event WatchedEvent state:SyncConnected type:None path:null path:null type:None
   [junit4]   2> 1176601 T2371 oascc.ConnectionManager.waitForConnected Client is connected to ZooKeeper
   [junit4]   2> 1176605 T2371 oascsi.HttpClientUtil.createClient Creating new http client, config:maxConnections=500&maxConnectionsPerHost=16&socketTimeout=120000&connTimeout=15000
   [junit4]   2> 1176605 T2373 oazs.NIOServerCnxn.doIO WARN caught end of stream exception EndOfStreamException: Unable to read additional data from client sessionid 0x1403989f49a0002, likely client has closed socket
   [junit4]   2> 	at org.apache.zookeeper.server.NIOServerCnxn.doIO(NIOServerCnxn.java:220)
   [junit4]   2> 	at org.apache.zookeeper.server.NIOServerCnxnFactory.run(NIOServerCnxnFactory.java:208)
   [junit4]   2> 	at java.lang.Thread.run(Thread.java:724)
   [junit4]   2> 
   [junit4]   2> 1176611 T2371 oascc.ConnectionManager.waitForConnected Waiting for client to connect to ZooKeeper
   [junit4]   2> 1176615 T2393 oascc.ConnectionManager.process Watcher org.apache.solr.common.cloud.ConnectionManager@50d6b537 name:ZooKeeperConnection Watcher:127.0.0.1:63472/solr got event WatchedEvent state:SyncConnected type:None path:null path:null type:None
   [junit4]   2> 1176615 T2371 oascc.ConnectionManager.waitForConnected Client is connected to ZooKeeper
   [junit4]   2> 1176622 T2371 oascc.SolrZkClient.makePath makePath: /overseer/queue
   [junit4]   2> 1176637 T2371 oascc.SolrZkClient.makePath makePath: /overseer/collection-queue-work
   [junit4]   2> 1176651 T2371 oascc.SolrZkClient.makePath makePath: /live_nodes
   [junit4]   2> 1176661 T2371 oasc.ZkController.createEphemeralLiveNode Register node as live in ZooKeeper:/live_nodes/127.0.0.1:63479__npe
   [junit4]   2> 1176665 T2371 oascc.SolrZkClient.makePath makePath: /live_nodes/127.0.0.1:63479__npe
   [junit4]   2> 1176680 T2371 oascc.SolrZkClient.makePath makePath: /overseer_elect/election
   [junit4]   2> 1176706 T2371 oascc.SolrZkClient.makePath makePath: /overseer_elect/leader
   [junit4]   2> 1176718 T2371 oasc.Overseer.start Overseer (id=90135257224445955-127.0.0.1:63479__npe-n_0000000000) starting
   [junit4]   2> 1176734 T2371 oascc.SolrZkClient.makePath makePath: /overseer/queue-work
   [junit4]   2> 1176752 T2395 oasc.OverseerCollectionProcessor.run Process current queue of collection creations
   [junit4]   2> 1176755 T2371 oascc.SolrZkClient.makePath makePath: /clusterstate.json
   [junit4]   2> 1176767 T2371 oascc.SolrZkClient.makePath makePath: /aliases.json
   [junit4]   2> 1176776 T2371 oascc.ZkStateReader.createClusterStateWatchersAndUpdate Updating cluster state from ZooKeeper... 
   [junit4]   2> 1176792 T2394 oasc.Overseer$ClusterStateUpdater.run Starting to work on the main queue
   [junit4]   2> 1176803 T2371 oasc.CorePropertiesLocator.discover Looking for core definitions underneath C:\Users\JenkinsSlave\workspace\Lucene-Solr-trunk-Windows\solr\build\solr-core\test\J0\.\org.apache.solr.cloud.CollectionsAPIDistributedZkTest-controljetty-1375354877340
   [junit4]   2> 1177066 T2371 oasc.CorePropertiesLocator.discoverUnder Found core conf in C:\Users\JenkinsSlave\workspace\Lucene-Solr-trunk-Windows\solr\build\solr-core\test\J0\.\org.apache.solr.cloud.CollectionsAPIDistributedZkTest-controljetty-1375354877340\conf\
   [junit4]   2> 1177079 T2371 oasc.CorePropertiesLocator.discover Found 1 core definitions
   [junit4]   2> 1177080 T2371 oass.SolrDispatchFilter.init user.dir=C:\Users\JenkinsSlave\workspace\Lucene-Solr-trunk-Windows\solr\build\solr-core\test\J0
   [junit4]   2> 1177080 T2371 oass.SolrDispatchFilter.init SolrDispatchFilter.init() done
   [junit4]   2> 1177080 T2371 oascsi.HttpClientUtil.createClient Creating new http client, config:maxConnections=128&maxConnectionsPerHost=32&followRedirects=false
   [junit4]   2> 1177087 T2371 oascsi.HttpClientUtil.createClient Creating new http client, config:
   [junit4]   2> 1177090 T2371 oascc.ConnectionManager.waitForConnected Waiting for client to connect to ZooKeeper
   [junit4]   2> 1177093 T2398 oascc.ConnectionManager.process Watcher org.apache.solr.common.cloud.ConnectionManager@38cae72b name:ZooKeeperConnection Watcher:127.0.0.1:63472/solr got event WatchedEvent state:SyncConnected type:None path:null path:null type:None
   [junit4]   2> 1177094 T2371 oascc.ConnectionManager.waitForConnected Client is connected to ZooKeeper
   [junit4]   2> 1177095 T2371 oascc.ZkStateReader.createClusterStateWatchersAndUpdate Updating cluster state from ZooKeeper... 
   [junit4]   2> 1177100 T2371 oasc.ChaosMonkey.monkeyLog monkey: init - expire sessions:true cause connection loss:true
   [junit4]   2> 1177590 T2371 oejs.Server.doStart jetty-8.1.10.v20130312
   [junit4]   2> 1177596 T2371 oejs.AbstractConnector.doStart Started SelectChannelConnector@127.0.0.1:63491
   [junit4]   2> 1177598 T2371 oass.SolrDispatchFilter.init SolrDispatchFilter.init()
   [junit4]   2> 1177598 T2371 oasc.SolrResourceLoader.locateSolrHome JNDI not configured for solr (NoInitialContextEx)
   [junit4]   2> 1177598 T2371 oasc.SolrResourceLoader.locateSolrHome using system property solr.solr.home: C:\Users\JenkinsSlave\workspace\Lucene-Solr-trunk-Windows\solr\build\solr-core\test\J0\.\org.apache.solr.cloud.CollectionsAPIDistributedZkTest-jetty1-1375354878492
   [junit4]   2> 1177599 T2371 oasc.SolrResourceLoader.<init> new SolrResourceLoader for directory: 'C:\Users\JenkinsSlave\workspace\Lucene-Solr-trunk-Windows\solr\build\solr-core\test\J0\.\org.apache.solr.cloud.CollectionsAPIDistributedZkTest-jetty1-1375354878492\'
   [junit4]   2> 1177627 T2371 oasc.ConfigSolr.fromFile Loading container configuration from C:\Users\JenkinsSlave\workspace\Lucene-Solr-trunk-Windows\solr\build\solr-core\test\J0\.\org.apache.solr.cloud.CollectionsAPIDistributedZkTest-jetty1-1375354878492\solr.xml
   [junit4]   2> 1177711 T2371 oasc.ConfigSolrXml.<init> Config-defined core root directory: 
   [junit4]   2> 1177712 T2371 oasc.CoreContainer.<init> New CoreContainer 515806373
   [junit4]   2> 1177712 T2371 oasc.CoreContainer.load Loading cores into CoreContainer [instanceDir=C:\Users\JenkinsSlave\workspace\Lucene-Solr-trunk-Windows\solr\build\solr-core\test\J0\.\org.apache.solr.cloud.CollectionsAPIDistributedZkTest-jetty1-1375354878492\]
   [junit4]   2> 1177715 T2371 oashc.HttpShardHandlerFactory.getParameter Setting socketTimeout to: 120000
   [junit4]   2> 1177715 T2371 oashc.HttpShardHandlerFactory.getParameter Setting urlScheme to: http://
   [junit4]   2> 1177715 T2371 oashc.HttpShardHandlerFactory.getParameter Setting connTimeout to: 15000
   [junit4]   2> 1177715 T2371 oashc.HttpShardHandlerFactory.getParameter Setting maxConnectionsPerHost to: 20
   [junit4]   2> 1177715 T2371 oashc.HttpShardHandlerFactory.getParameter Setting corePoolSize to: 0
   [junit4]   2> 1177715 T2371 oashc.HttpShardHandlerFactory.getParameter Setting maximumPoolSize to: 2147483647
   [junit4]   2> 1177716 T2371 oashc.HttpShardHandlerFactory.getParameter Setting maxThreadIdleTime to: 5
   [junit4]   2> 1177716 T2371 oashc.HttpShardHandlerFactory.getParameter Setting sizeOfQueue to: -1
   [junit4]   2> 1177717 T2371 oashc.HttpShardHandlerFactory.getParameter Setting fairnessPolicy to: false
   [junit4]   2> 1177718 T2371 oascsi.HttpClientUtil.createClient Creating new http client, config:maxConnectionsPerHost=20&maxConnections=10000&socketTimeout=120000&connTimeout=15000&retry=false
   [junit4]   2> 1177724 T2371 oasc.ZkContainer.initZooKeeper Zookeeper client=127.0.0.1:63472/solr
   [junit4]   2> 1177725 T2371 oasc.ZkController.checkChrootPath zkHost includes chroot
   [junit4]   2> 1177727 T2371 oascc.ConnectionManager.waitForConnected Waiting for client to connect to ZooKeeper
   [junit4]   2> 1177742 T2409 oascc.ConnectionManager.process Watcher org.apache.solr.common.cloud.ConnectionManager@5498e955 name:ZooKeeperConnection Watcher:127.0.0.1:63472 got event WatchedEvent state:SyncConnected type:None path:null path:null type:None
   [junit4]   2> 1177743 T2371 oascc.ConnectionManager.waitForConnected Client is connected to ZooKeeper
   [junit4]   2> 1177747 T2371 oascsi.HttpClientUtil.createClient Creating new http client, config:maxConnections=500&maxConnectionsPerHost=16&socketTimeout=120000&connTimeout=15000
   [junit4]   2> 1177747 T2373 oazs.NIOServerCnxn.doIO WARN caught end of stream exception EndOfStreamException: Unable to read additional data from client sessionid 0x1403989f49a0005, likely client has closed socket
   [junit4]   2> 	at org.apache.zookeeper.server.NIOServerCnxn.doIO(NIOServerCnxn.java:220)
   [junit4]   2> 	at org.apache.zookeeper.server.NIOServerCnxnFactory.run(NIOServerCnxnFactory.java:208)
   [junit4]   2> 	at java.lang.Thread.run(Thread.java:724)
   [junit4]   2> 
   [junit4]   2> 1177756 T2371 oascc.ConnectionManager.waitForConnected Waiting for client to connect to ZooKeeper
   [junit4]   2> 1177762 T2411 oascc.ConnectionManager.process Watcher org.apache.solr.common.cloud.ConnectionManager@892598b name:ZooKeeperConnection Watcher:127.0.0.1:63472/solr got event WatchedEvent state:SyncConnected type:None path:null path:null type:None
   [junit4]   2> 1177762 T2371 oascc.ConnectionManager.waitForConnected Client is connected to ZooKeeper
   [junit4]   2> 1177776 T2371 oascc.ZkStateReader.createClusterStateWatchersAndUpdate Updating cluster state from ZooKeeper... 
   [junit4]   2> 1178858 T2371 oasc.ZkController.createEphemeralLiveNode Register node as live in ZooKeeper:/live_nodes/127.0.0.1:63491__npe
   [junit4]   2> 1178863 T2371 oascc.SolrZkClient.makePath makePath: /live_nodes/127.0.0.1:63491__npe
   [junit4]   2> 1178877 T2398 oascc.ZkStateReader$3.process Updating live nodes... (2)
   [junit4]   2> 1178877 T2393 oascc.ZkStateReader$3.process Updating live nodes... (2)
   [junit4]   2> 1178878 T2411 oascc.ZkStateReader$3.process Updating live nodes... (2)
   [junit4]   2> 1178887 T2371 oasc.CorePropertiesLocator.discover Looking for core definitions underneath C:\Users\JenkinsSlave\workspace\Lucene-Solr-trunk-Windows\solr\build\solr-core\test\J0\.\org.apache.solr.cloud.CollectionsAPIDistributedZkTest-jetty1-1375354878492
   [junit4]   2> 1179194 T2371 oasc.CorePropertiesLocator.discoverUnder Found core conf in C:\Users\JenkinsSlave\workspace\Lucene-Solr-trunk-Windows\solr\build\solr-core\test\J0\.\org.apache.solr.cloud.CollectionsAPIDistributedZkTest-jetty1-1375354878492\conf\
   [junit4]   2> 1179207 T2371 oasc.CorePropertiesLocator.discover Found 1 core definitions
   [junit4]   2> 1179208 T2371 oass.SolrDispatchFilter.init user.dir=C:\Users\JenkinsSlave\workspace\Lucene-Solr-trunk-Windows\solr\build\solr-core\test\J0
   [junit4]   2> 1179208 T2371 oass.SolrDispatchFilter.init SolrDispatchFilter.init() done
   [junit4]   2> 1179208 T2371 oascsi.HttpClientUtil.createClient Creating new http client, config:maxConnections=128&maxConnectionsPerHost=32&followRedirects=false
   [junit4]   2> 1179670 T2371 oejs.Server.doStart jetty-8.1.10.v20130312
   [junit4]   2> 1179675 T2371 oejs.AbstractConnector.doStart Started SelectChannelConnector@127.0.0.1:63500
   [junit4]   2> 1179676 T2371 oass.SolrDispatchFilter.init SolrDispatchFilter.init()
   [junit4]   2> 1179676 T2371 oasc.SolrResourceLoader.locateSolrHome JNDI not configured for solr (NoInitialContextEx)
   [junit4]   2> 1179677 T2371 oasc.SolrResourceLoader.locateSolrHome using system property solr.solr.home: C:\Users\JenkinsSlave\workspace\Lucene-Solr-trunk-Windows\solr\build\solr-core\test\J0\.\org.apache.solr.cloud.CollectionsAPIDistributedZkTest-jetty2-1375354880608
   [junit4]   2> 1179678 T2371 oasc.SolrResourceLoader.<init> new SolrResourceLoader for directory: 'C:\Users\JenkinsSlave\workspace\Lucene-Solr-trunk-Windows\solr\build\solr-core\test\J0\.\org.apache.solr.cloud.CollectionsAPIDistributedZkTest-jetty2-1375354880608\'
   [junit4]   2> 1179718 T2371 oasc.ConfigSolr.fromFile Loading container configuration from C:\Users\JenkinsSlave\workspace\Lucene-Solr-trunk-Windows\solr\build\solr-core\test\J0\.\org.apache.solr.cloud.CollectionsAPIDistributedZkTest-jetty2-1375354880608\solr.xml
   [junit4]   2> 1179812 T2371 oasc.ConfigSolrXml.<init> Config-defined core root directory: 
   [junit4]   2> 1179813 T2371 oasc.CoreContainer.<init> New CoreContainer 1072411384
   [junit4]   2> 1179813 T2371 oasc.CoreContainer.load Loading cores into CoreContainer [instanceDir=C:\Users\JenkinsSlave\workspace\Lucene-Solr-trunk-Windows\solr\build\solr-core\test\J0\.\org.apache.solr.cloud.CollectionsAPIDistributedZkTest-jetty2-1375354880608\]
   [junit4]   2> 1179815 T2371 oashc.HttpShardHandlerFactory.getParameter Setting socketTimeout to: 120000
   [junit4]   2> 1179815 T2371 oashc.HttpShardHandlerFactory.getParameter Setting urlScheme to: http://
   [junit4]   2> 1179816 T2371 oashc.HttpShardHandlerFactory.getParameter Setting connTimeout to: 15000
   [junit4]   2> 1179816 T2371 oashc.HttpShardHandlerFactory.getParameter Setting maxConnectionsPerHost to: 20
   [junit4]   2> 1179816 T2371 oashc.HttpShardHandlerFactory.getParameter Setting corePoolSize to: 0
   [junit4]   2> 1179817 T2371 oashc.HttpShardHandlerFactory.getParameter Setting maximumPoolSize to: 2147483647
   [junit4]   2> 1179817 T2371 oashc.HttpShardHandlerFactory.getParameter Setting maxThreadIdleTime to: 5
   [junit4]   2> 1179817 T2371 oashc.HttpShardHandlerFactory.getParameter Setting sizeOfQueue to: -1
   [junit4]   2> 1179817 T2371 oashc.HttpShardHandlerFactory.getParameter Setting fairnessPolicy to: false
   [junit4]   2> 1179818 T2371 oascsi.HttpClientUtil.createClient Creating new http client, config:maxConnectionsPerHost=20&maxConnections=10000&socketTimeout=120000&connTimeout=15000&retry=false
   [junit4]   2> 1179826 T2371 oasc.ZkContainer.initZooKeeper Zookeeper client=127.0.0.1:63472/solr
   [junit4]   2> 1179827 T2371 oasc.ZkController.checkChrootPath zkHost includes chroot
   [junit4]   2> 1179830 T2371 oascc.ConnectionManager.waitForConnected Waiting for client to connect to ZooKeeper
   [junit4]   2> 1179846 T2423 oascc.ConnectionManager.process Watcher org.apache.solr.common.cloud.ConnectionManager@2a9dd3bd name:ZooKeeperConnection Watcher:127.0.0.1:63472 got event WatchedEvent state:SyncConnected type:None path:null path:null type:None
   [junit4]   2> 1179846 T2371 oascc.ConnectionManager.waitForConnected Client is connected to ZooKeeper
   [junit4]   2> 1179851 T2371 oascsi.HttpClientUtil.createClient Creating new http client, config:maxConnections=500&maxConnectionsPerHost=16&socketTimeout=120000&connTimeout=15000
   [junit4]   2> 1179858 T2371 oascc.ConnectionManager.waitForConnected Waiting for client to connect to ZooKeeper
   [junit4]   2> 1179862 T2425 oascc.ConnectionManager.process Watcher org.apache.solr.common.cloud.ConnectionManager@7303e134 name:ZooKeeperConnection Watcher:127.0.0.1:63472/solr got event WatchedEvent state:SyncConnected type:None path:null path:null type:None
   [junit4]   2> 1179862 T2371 oascc.ConnectionManager.waitForConnected Client is connected to ZooKeeper
   [junit4]   2> 1179876 T2371 oascc.ZkStateReader.createClusterStateWatchersAndUpdate Updating cluster state from ZooKeeper... 
   [junit4]   2> 1181064 T2371 oasc.ZkController.createEphemeralLiveNode Register node as live in ZooKeeper:/live_nodes/127.0.0.1:63500__npe
   [junit4]   2> 1181079 T2371 oascc.SolrZkClient.makePath makePath: /live_nodes/127.0.0.1:63500__npe
   [junit4]   2> 1181094 T2398 oascc.ZkStateReader$3.process Updating live nodes... (3)
   [junit4]   2> 1181095 T2393 oascc.ZkStateReader$3.process Updating live nodes... (3)
   [junit4]   2> 1181096 T2425 oascc.ZkStateReader$3.process Updating live nodes... (3)
   [junit4]   2> 1181097 T2411 oascc.ZkStateReader$3.process Updating live nodes... (3)
   [junit4]   2> 1181116 T2371 oasc.CorePropertiesLocator.discover Looking for core definitions underneath C:\Users\JenkinsSlave\workspace\Lucene-Solr-trunk-Windows\solr\build\solr-core\test\J0\.\org.apache.solr.cloud.CollectionsAPIDistributedZkTest-jetty2-1375354880608
   [junit4]   2> 1181410 T2371 oasc.CorePropertiesLocator.discoverUnder Found core conf in C:\Users\JenkinsSlave\workspace\Lucene-Solr-trunk-Windows\solr\build\solr-core\test\J0\.\org.apache.solr.cloud.CollectionsAPIDistributedZkTest-jetty2-1375354880608\conf\
   [junit4]   2> 1181430 T2371 oasc.CorePropertiesLocator.discover Found 1 core definitions
   [junit4]   2> 1181431 T2371 oass.SolrDispatchFilter.init user.dir=C:\Users\JenkinsSlave\workspace\Lucene-Solr-trunk-Windows\solr\build\solr-core\test\J0
   [junit4]   2> 1181431 T2371 oass.SolrDispatchFilter.init SolrDispatchFilter.init() done
   [junit4]   2> 1181432 T2371 oascsi.HttpClientUtil.createClient Creating new http client, config:maxConnections=128&maxConnectionsPerHost=32&followRedirects=false
   [junit4]   2> 1181926 T2371 oejs.Server.doStart jetty-8.1.10.v20130312
   [junit4]   2> 1181930 T2371 oejs.AbstractConnector.doStart Started SelectChannelConnector@127.0.0.1:63509
   [junit4]   2> 1181932 T2371 oass.SolrDispatchFilter.init SolrDispatchFilter.init()
   [junit4]   2> 1181932 T2371 oasc.SolrResourceLoader.locateSolrHome JNDI not configured for solr (NoInitialContextEx)
   [junit4]   2> 1181932 T2371 oasc.SolrResourceLoader.locateSolrHome using system property solr.solr.home: C:\Users\JenkinsSlave\workspace\Lucene-Solr-trunk-Windows\solr\build\solr-core\test\J0\.\org.apache.solr.cloud.CollectionsAPIDistributedZkTest-jetty3-1375354882837
   [junit4]   2> 1181934 T2371 oasc.SolrResourceLoader.<init> new SolrResourceLoader for directory: 'C:\Users\JenkinsSlave\workspace\Lucene-Solr-trunk-Windows\solr\build\solr-core\test\J0\.\org.apache.solr.cloud.CollectionsAPIDistributedZkTest-jetty3-1375354882837\'
   [junit4]   2> 1181965 T2371 oasc.ConfigSolr.fromFile Loading container configuration from C:\Users\JenkinsSlave\workspace\Lucene-Solr-trunk-Windows\solr\build\solr-core\test\J0\.\org.apache.solr.cloud.CollectionsAPIDistributedZkTest-jetty3-1375354882837\solr.xml
   [junit4]   2> 1182069 T2371 oasc.ConfigSolrXml.<init> Config-defined core root directory: 
   [junit4]   2> 1182069 T2371 oasc.CoreContainer.<init> New CoreContainer 11092915
   [junit4]   2> 1182069 T2371 oasc.CoreContainer.load Loading cores into CoreContainer [instanceDir=C:\Users\JenkinsSlave\workspace\Lucene-Solr-trunk-Windows\solr\build\solr-core\test\J0\.\org.apache.solr.cloud.CollectionsAPIDistributedZkTest-jetty3-1375354882837\]
   [junit4]   2> 1182071 T2371 oashc.HttpShardHandlerFactory.getParameter Setting socketTimeout to: 120000
   [junit4]   2> 1182071 T2371 oashc.HttpShardHandlerFactory.getParameter Setting urlScheme to: http://
   [junit4]   2> 1182073 T2371 oashc.HttpShardHandlerFactory.getParameter Setting connTimeout to: 15000
   [junit4]   2> 1182073 T2371 oashc.HttpShardHandlerFactory.getParameter Setting maxConnectionsPerHost to: 20
   [junit4]   2> 1182073 T2371 oashc.HttpShardHandlerFactory.getParameter Setting corePoolSize to: 0
   [junit4]   2> 1182074 T2371 oashc.HttpShardHandlerFactory.getParameter Setting maximumPoolSize to: 2147483647
   [junit4]   2> 1182074 T2371 oashc.HttpShardHandlerFactory.getParameter Setting maxThreadIdleTime to: 5
   [junit4]   2> 1182074 T2371 oashc.HttpShardHandlerFactory.getParameter Setting sizeOfQueue to: -1
   [junit4]   2> 1182074 T2371 oashc.HttpShardHandlerFactory.getParameter Setting fairnessPolicy to: false
   [junit4]   2> 1182075 T2371 oascsi.HttpClientUtil.createClient Creating new http client, config:maxConnectionsPerHost=20&maxConnections=10000&socketTimeout=120000&connTimeout=15000&retry=false
   [junit4]   2> 1182083 T2371 oasc.ZkContainer.initZooKeeper Zookeeper client=127.0.0.1:63472/solr
   [junit4]   2> 1182084 T2371 oasc.ZkController.checkChrootPath zkHost includes chroot
   [junit4]   2> 1182085 T2371 oascc.ConnectionManager.waitForConnected Waiting for client to connect to ZooKeeper
   [junit4]   2> 1182110 T2437 oascc.ConnectionManager.process Watcher org.apache.solr.common.cloud.ConnectionManager@4e6b8c64 name:ZooKeeperConnection Watcher:127.0.0.1:63472 got event WatchedEvent state:SyncConnected type:None path:null path:null type:None
   [junit4]   2> 1182111 T2371 oascc.ConnectionManager.waitForConnected Client is connected to ZooKeeper
   [junit4]   2> 1182117 T2371 oascsi.HttpClientUtil.createClient Creating new http client, config:maxConnections=500&maxConnectionsPerHost=16&socketTimeout=120000&connTimeout=15000
   [junit4]   2> 1182118 T2373 oazs.NIOServerCnxn.doIO WARN caught end of stream exception EndOfStreamException: Unable to read additional data from client sessionid 0x1403989f49a0009, likely client has closed socket
   [junit4]   2> 	at org.apache.zookeeper.server.NIOServerCnxn.doIO(NIOServerCnxn.java:220)
   [junit4]   2> 	at org.apache.zookeeper.server.NIOServerCnxnFactory.run(NIOServerCnxnFactory.java:208)
   [junit4]   2> 	at java.lang.Thread.run(Thread.java:724)
   [junit4]   2> 
   [junit4]   2> 1182133 T2371 oascc.ConnectionManager.waitForConnected Waiting for client to connect to ZooKeeper
   [junit4]   2> 1182142 T2439 oascc.ConnectionManager.process Watcher org.apache.solr.common.cloud.ConnectionManager@2fc89ebe name:ZooKeeperConnection Watcher:127.0.0.1:63472/solr got event WatchedEvent state:SyncConnected type:None path:null path:null type:None
   [junit4]   2> 1182142 T2371 oascc.ConnectionManager.waitForConnected Client is connected to ZooKeeper
   [junit4]   2> 1182162 T2371 oascc.ZkStateReader.createClusterStateWatchersAndUpdate Updating cluster state from ZooKeeper... 
   [junit4]   2> 1183360 T2371 oasc.ZkController.createEphemeralLiveNode Register node as live in ZooKeeper:/live_nodes/127.0.0.1:63509__npe
   [junit4]   2> 1183373 T2371 oascc.SolrZkClient.makePath makePath: /live_nodes/127.0.0.1:63509__npe
   [junit4]   2> 1183394 T2398 oascc.ZkStateReader$3.process Updating live nodes... (4)
   [junit4]   2> 1183395 T2393 oascc.ZkStateReader$3.process Updating live nodes... (4)
   [junit4]   2> 1183396 T2411 oascc.ZkStateReader$3.process Updating live nodes... (4)
   [junit4]   2> 1183397 T2439 oascc.ZkStateReader$3.process Updating live nodes... (4)
   [junit4]   2> 1183401 T2425 oascc.ZkStateReader$3.process Updating live nodes... (4)
   [junit4]   2> 1183425 T2371 oasc.CorePropertiesLocator.discover Looking for core definitions underneath C:\Users\JenkinsSlave\workspace\Lucene-Solr-trunk-Windows\solr\build\solr-core\test\J0\.\org.apache.solr.cloud.CollectionsAPIDistributedZkTest-jetty3-1375354882837
   [junit4]   2> 1183711 T2371 oasc.CorePropertiesLocator.discoverUnder Found core conf in C:\Users\JenkinsSlave\workspace\Lucene-Solr-trunk-Windows\solr\build\solr-core\test\J0\.\org.apache.solr.cloud.CollectionsAPIDistributedZkTest-jetty3-1375354882837\conf\
   [junit4]   2> 1183728 T2371 oasc.CorePropertiesLocator.discover Found 1 core definitions
   [junit4]   2> 1183729 T2371 oass.SolrDispatchFilter.init user.dir=C:\Users\JenkinsSlave\workspace\Lucene-Solr-trunk-Windows\solr\build\solr-core\test\J0
   [junit4]   2> 1183729 T2371 oass.SolrDispatchFilter.init SolrDispatchFilter.init() done
   [junit4]   2> 1183730 T2371 oascsi.HttpClientUtil.createClient Creating new http client, config:maxConnections=128&maxConnectionsPerHost=32&followRedirects=false
   [junit4]   2> 1184261 T2371 oejs.Server.doStart jetty-8.1.10.v20130312
   [junit4]   2> 1184265 T2371 oejs.AbstractConnector.doStart Started SelectChannelConnector@127.0.0.1:63518
   [junit4]   2> 1184265 T2371 oass.SolrDispatchFilter.init SolrDispatchFilter.init()
   [junit4]   2> 1184267 T2371 oasc.SolrResourceLoader.locateSolrHome JNDI not configured for solr (NoInitialContextEx)
   [junit4]   2> 1184267 T2371 oasc.SolrResourceLoader.locateSolrHome using system property solr.solr.home: C:\Users\JenkinsSlave\workspace\Lucene-Solr-trunk-Windows\solr\build\solr-core\test\J0\.\org.apache.solr.cloud.CollectionsAPIDistributedZkTest-jetty4-1375354885132
   [junit4]   2> 1184267 T2371 oasc.SolrResourceLoader.<init> new SolrResourceLoader for directory: 'C:\Users\JenkinsSlave\workspace\Lucene-Solr-trunk-Windows\solr\build\solr-core\test\J0\.\org.apache.solr.cloud.CollectionsAPIDistributedZkTest-jetty4-1375354885132\'
   [junit4]   2> 1184302 T2371 oasc.ConfigSolr.fromFile Loading container configuration from C:\Users\JenkinsSlave\workspace\Lucene-Solr-trunk-Windows\solr\build\solr-core\test\J0\.\org.apache.solr.cloud.CollectionsAPIDistributedZkTest-jetty4-1375354885132\solr.xml
   [junit4]   2> 1184399 T2371 oasc.ConfigSolrXml.<init> Config-defined core root directory: 
   [junit4]   2> 1184400 T2371 oasc.CoreContainer.<init> New CoreContainer 478158171
   [junit4]   2> 1184402 T2371 oasc.CoreContainer.load Loading cores into CoreContainer [instanceDir=C:\Users\JenkinsSlave\workspace\Lucene-Solr-trunk-Windows\solr\build\solr-core\test\J0\.\org.apache.solr.cloud.CollectionsAPIDistributedZkTest-jetty4-1375354885132\]
   [junit4]   2> 1184405 T2371 oashc.HttpShardHandlerFactory.getParameter Setting socketTimeout to: 120000
   [junit4]   2> 1184406 T2371 oashc.HttpShardHandlerFactory.getParameter Setting urlScheme to: http://
   [junit4]   2> 1184406 T2371 oashc.HttpShardHandlerFactory.getParameter Setting connTimeout to: 15000
   [junit4]   2> 1184407 T2371 oashc.HttpShardHandlerFactory.getParameter Setting maxConnectionsPerHost to: 20
   [junit4]   2> 1184409 T2371 oashc.HttpShardHandlerFactory.getParameter Setting corePoolSize to: 0
   [junit4]   2> 1184409 T2371 oashc.HttpShardHandlerFactory.getParameter Setting maximumPoolSize to: 2147483647
   [junit4]   2> 1184410 T2371 oashc.HttpShardHandlerFactory.getParameter Setting maxThreadIdleTime to: 5
   [junit4]   2> 1184410 T2371 oashc.HttpShardHandlerFactory.getParameter Setting sizeOfQueue to: -1
   [junit4]   2> 1184411 T2371 oashc.HttpShardHandlerFactory.getParameter Setting fairnessPolicy to: false
   [junit4]   2> 1184412 T2371 oascsi.HttpClientUtil.createClient Creating new http client, config:maxConnectionsPerHost=20&maxConnections=10000&socketTimeout=120000&connTimeout=15000&retry=false
   [junit4]   2> 1184426 T2371 oasc.ZkContainer.initZooKeeper Zookeeper client=127.0.0.1:63472/solr
   [junit4]   2> 1184426 T2371 oasc.ZkController.checkChrootPath zkHost includes chroot
   [junit4]   2> 1184429 T2371 oascc.ConnectionManager.waitForConnected Waiting for client to connect to ZooKeeper
   [junit4]   2> 1184448 T2451 oascc.ConnectionManager.process Watcher org.apache.solr.common.cloud.ConnectionManager@6de801cd name:ZooKeeperConnection Watcher:127.0.0.1:63472 got event WatchedEvent state:SyncConnected type:None path:null path:null type:None
   [junit4]   2> 1184448 T2371 oascc.ConnectionManager.waitForConnected Client is connected to ZooKeeper
   [junit4]   2> 1184453 T2371 oascsi.HttpClientUtil.createClient Creating new http client, config:maxConnections=500&maxConnectionsPerHost=16&socketTimeout=120000&connTimeout=15000
   [junit4]   2> 1184465 T2371 oascc.ConnectionManager.waitForConnected Waiting for client to connect to ZooKeeper
   [junit4]   2> 1184472 T2453 oascc.ConnectionManager.process Watcher org.apache.solr.common.cloud.ConnectionManager@7aa4ae96 name:ZooKeeperConnection Watcher:127.0.0.1:63472/solr got event WatchedEvent state:SyncConnected type:None path:null path:null type:None
   [junit4]   2> 1184472 T2371 oascc.ConnectionManager.waitForConnected Client is connected to ZooKeeper
   [junit4]   2> 1184486 T2371 oascc.ZkStateReader.createClusterStateWatchersAndUpdate Updating cluster state from ZooKeeper... 
   [junit4]   2> 1185677 T2371 oasc.ZkController.createEphemeralLiveNode Register node as live in ZooKeeper:/live_nodes/127.0.0.1:63518__npe
   [junit4]   2> 1185688 T2371 oascc.SolrZkClient.makePath makePath: /live_nodes/127.0.0.1:63518__npe
   [junit4]   2> 1185706 T2398 oascc.ZkStateReader$3.process Updating live nodes... (5)
   [junit4]   2> 1185707 T2411 oascc.ZkStateReader$3.process Updating live nodes... (5)
   [junit4]   2> 1185708 T2393 oascc.ZkStateReader$3.process Updating live nodes... (5)
   [junit4]   2> 1185708 T2439 oascc.ZkStateReader$3.process Updating live nodes... (5)
   [junit4]   2> 1185710 T2425 oascc.ZkStateReader$3.process Updating live nodes... (5)
   [junit4]   2> 1185710 T2453 oascc.ZkStateReader$3.process Updating live nodes... (5)
   [junit4]   2> 1185731 T2371 oasc.CorePropertiesLocator.discover Looking for core definitions underneath C:\Users\JenkinsSlave\workspace\Lucene-Solr-trunk-Windows\solr\build\solr-core\test\J0\.\org.apache.solr.cloud.CollectionsAPIDistributedZkTest-jetty4-1375354885132
   [junit4]   2> 1186006 T2371 oasc.CorePropertiesLocator.discoverUnder Found core conf in C:\Users\JenkinsSlave\workspace\Lucene-Solr-trunk-Windows\solr\build\solr-core\test\J0\.\org.apache.solr.cloud.CollectionsAPIDistributedZkTest-jetty4-1375354885132\conf\
   [junit4]   2> 1186018 T2371 oasc.CorePropertiesLocator.discover Found 1 core definitions
   [junit4]   2> 1186018 T2371 oass.SolrDispatchFilter.init user.dir=C:\Users\JenkinsSlave\workspace\Lucene-Solr-trunk-Windows\solr\build\solr-core\test\J0
   [junit4]   2> 1186019 T2371 oass.SolrDispatchFilter.init SolrDispatchFilter.init() done
   [junit4]   2> 1186019 T2371 oascsi.HttpClientUtil.createClient Creating new http client, config:maxConnections=128&maxConnectionsPerHost=32&followRedirects=false
   [junit4]   2> 1186028 T2371 oascsi.HttpClientUtil.createClient Creating new http client, config:maxConnections=128&maxConnectionsPerHost=32&followRedirects=false
   [junit4]   2> 1186033 T2402 oasha.CollectionsHandler.handleCreateAction Creating Collection : numShards=2&name=nodes_used_collection&replicationFactor=2&action=CREATE&wt=javabin&version=2
   [junit4]   2> 1186038 T2393 oasc.DistributedQueue$LatchChildWatcher.process Watcher fired on path: /overseer/collection-queue-work state: SyncConnected type NodeChildrenChanged
   [junit4]   2> 1186041 T2393 oasc.DistributedQueue$LatchChildWatcher.process Watcher fired on path: /overseer/collection-queue-work state: SyncConnected type NodeChildrenChanged
   [junit4]   2> 1186041 T2395 oasc.OverseerCollectionProcessor.run Overseer Collection Processor: Get the message id:/overseer/collection-queue-work/qn-0000000000 message:{
   [junit4]   2> 	  "operation":"createcollection",
   [junit4]   2> 	  "numShards":"2",
   [junit4]   2> 	  "name":"nodes_used_collection",
   [junit4]   2> 	  "replicationFactor":"2"}
   [junit4]   2> 1186043 T2395 oasc.OverseerCollectionProcessor.processMessage WARN OverseerCollectionProcessor.processMessage : createcollection , {
   [junit4]   2> 	  "operation":"createcollection",
   [junit4]   2> 	  "numShards":"2",
   [junit4]   2> 	  "name":"nodes_used_collection",
   [junit4]   2> 	  "replicationFactor":"2"}
   [junit4]   2> 1187193 T2394 oascc.ZkStateReader.updateClusterState Updating cloud state from ZooKeeper... 
   [junit4]   2> 1187196 T2394 oasc.Overseer$ClusterStateUpdater.buildCollection building a new collection: nodes_used_collection
   [junit4]   2> 1187196 T2394 oasc.Overseer$ClusterStateUpdater.createCollection Create collection nodes_used_collection with shards [shard1, shard2]
   [junit4]   2> 1187218 T2411 oascc.ZkStateReader$2.process A cluster state change: WatchedEvent state:SyncConnected type:NodeDataChanged path:/clusterstate.json, has occurred - updating... (live nodes size: 5)
   [junit4]   2> 1187218 T2425 oascc.ZkStateReader$2.process A cluster state change: WatchedEvent state:SyncConnected type:NodeDataChanged path:/clusterstate.json, has occurred - updating... (live nodes size: 5)
   [junit4]   2> 1187220 T2453 oascc.ZkStateReader$2.process A cluster state change: WatchedEvent state:SyncConnected type:NodeDataChanged path:/clusterstate.json, has occurred - updating... (live nodes size: 5)
   [junit4]   2> 1187222 T2439 oascc.ZkStateReader$2.process A cluster state change: WatchedEvent state:SyncConnected type:NodeDataChanged path:/clusterstate.json, has occurred - updating... (live nodes size: 5)
   [junit4]   2> 1187218 T2398 oascc.ZkStateReader$2.process A cluster state change: WatchedEvent state:SyncConnected type:NodeDataChanged path:/clusterstate.json, has occurred - updating... (live nodes size: 5)
   [junit4]   2> 1187222 T2393 oascc.ZkStateReader$2.process A cluster state change: WatchedEvent state:SyncConnected type:NodeDataChanged path:/clusterstate.json, has occurred - updating... (live nodes size: 5)
   [junit4]   2> 1187242 T2395 oasc.OverseerCollectionProcessor.createCollection going to create cores replicas shardNames [shard1, shard2] , repFactor : 2
   [junit4]   2> 1187242 T2395 oasc.OverseerCollectionProcessor.createCollection Creating shard nodes_used_collection_shard1_replica1 as part of slice shard1 of collection nodes_used_collection on 127.0.0.1:63518__npe
   [junit4]   2> 1187245 T2395 oasc.OverseerCollectionProcessor.createCollection Creating shard nodes_used_collection_shard1_replica2 as part of slice shard1 of collection nodes_used_collection on 127.0.0.1:63479__npe
   [junit4]   2> 1187246 T2395 oasc.OverseerCollectionProcessor.createCollection Creating shard nodes_used_collection_shard2_replica1 as part of slice shard2 of collection nodes_used_collection on 127.0.0.1:63509__npe
   [junit4]   2> 1187249 T2395 oasc.OverseerCollectionProcessor.createCollection Creating shard nodes_used_collection_shard2_replica2 as part of slice shard2 of collection nodes_used_collection on 127.0.0.1:63500__npe
   [junit4]   2> 1187263 T2435 oasc.ZkController.publish publishing core=nodes_used_collection_shard2_replica1 state=down
   [junit4]   2> 1187264 T2444 oasc.ZkController.publish publishing core=nodes_used_collection_shard1_replica1 state=down
   [junit4]   2> 1187267 T2389 oasc.ZkController.publish publishing core=nodes_used_collection_shard1_replica2 state=down
   [junit4]   2> 1187268 T2420 oasc.ZkController.publish publishing core=nodes_used_collection_shard2_replica2 state=down
   [junit4]   2> 1187270 T2435 oasc.ZkController.waitForCoreNodeName look for our core node name
   [junit4]   2> 1187270 T2444 oasc.ZkController.waitForCoreNodeName look for our core node name
   [junit4]   2> 1187271 T2389 oasc.ZkController.waitForCoreNodeName look for our core node name
   [junit4]   2> 1187274 T2420 oasc.ZkController.waitForCoreNodeName look for our core node name
   [junit4]   2> 1189021 T2394 oascc.ZkStateReader.updateClusterState Updating cloud state from ZooKeeper... 
   [junit4]   2> 1189024 T2394 oasc.Overseer$ClusterStateUpdater.updateState WARN Could not find collection node for nodes_used_collection, skipping publish state
   [junit4]   2> 1189025 T2394 oasc.Overseer$ClusterStateUpdater.updateState Update state numShards=2 message={
   [junit4]   2> 	  "operation":"state",
   [junit4]   2> 	  "core_node_name":"core_node1",
   [junit4]   2> 	  "numShards":"2",
   [junit4]   2> 	  "shard":"shard2",
   [junit4]   2> 	  "roles":null,
   [junit4]   2> 	  "state":"down",
   [junit4]   2> 	  "shard_state":"active",
   [junit4]   2> 	  "core":"nodes_used_collection_shard2_replica1",
   [junit4]   2> 	  "collection":"nodes_used_collection",
   [junit4]   2> 	  "shard_range":null,
   [junit4]   2> 	  "node_name":"127.0.0.1:63509__npe",
   [junit4]   2> 	  "base_url":"http://127.0.0.1:63509/_npe"}
   [junit4]   2> 1189094 T2394 oasc.Overseer$ClusterStateUpdater.updateState WARN Could not find collection node for nodes_used_collection, skipping publish state
   [junit4]   2> 1189094 T2394 oasc.Overseer$ClusterStateUpdater.updateState Update state numShards=2 message={
   [junit4]   2> 	  "operation":"state",
   [junit4]   2> 	  "core_node_name":"core_node2",
   [junit4]   2> 	  "numShards":"2",
   [junit4]   2> 	  "shard":"shard1",
   [junit4]   2> 	  "roles":null,
   [junit4]   2> 	  "state":"down",
   [junit4]   2> 	  "shard_state":"active",
   [junit4]   2> 	  "core":"nodes_used_collection_shard1_replica1",
   [junit4]   2> 	  "collection":"nodes_used_collection",
   [junit4]   2> 	  "shard_range":null,
   [junit4]   2> 	  "node_name":"127.0.0.1:63518__npe",
   [junit4]   2> 	  "base_url":"http://127.0.0.1:63518/_npe"}
   [junit4]   2> 1189103 T2394 oasc.Overseer$ClusterStateUpdater.updateState WARN Could not find collection node for nodes_used_collection, skipping publish state
   [junit4]   2> 1189105 T2394 oasc.Overseer$ClusterStateUpdater.updateState Update state numShards=2 message={
   [junit4]   2> 	  "operation":"state",
   [junit4]   2> 	  "core_node_name":"core_node3",
   [junit4]   2> 	  "numShards":"2",
   [junit4]   2> 	  "shard":"shard1",
   [junit4]   2> 	  "roles":null,
   [junit4]   2> 	  "state":"down",
   [junit4]   2> 	  "shard_state":"active",
   [junit4]   2> 	  "core":"nodes_used_collection_shard1_replica2",
   [junit4]   2> 	  "collection":"nodes_used_collection",
   [junit4]   2> 	  "shard_range":null,
   [junit4]   2> 	  "node_name":"127.0.0.1:63479__npe",
   [junit4]   2> 	  "base_url":"http://127.0.0.1:63479/_npe"}
   [junit4]   2> 1189114 T2394 oasc.Overseer$ClusterStateUpdater.updateState WARN Could not find collection node for nodes_used_collection, skipping publish state
   [junit4]   2> 1189114 T2394 oasc.Overseer$ClusterStateUpdater.updateState Update state numShards=2 message={
   [junit4]   2> 	  "operation":"state",
   [junit4]   2> 	  "core_node_name":"core_node4",
   [junit4]   2> 	  "numShards":"2",
   [junit4]   2> 	  "shard":"shard2",
   [junit4]   2> 	  "roles":null,
   [junit4]   2> 	  "state":"down",
   [junit4]   2> 	  "shard_state":"active",
   [junit4]   2> 	  "core":"nodes_used_collection_shard2_replica2",
   [junit4]   2> 	  "collection":"nodes_used_collection",
   [junit4]   2> 	  "shard_range":null,
   [junit4]   2> 	  "node_name":"127.0.0.1:63500__npe",
   [junit4]   2> 	  "base_url":"http://127.0.0.1:63500/_npe"}
   [junit4]   2> 1189124 T2398 oascc.ZkStateReader$2.process A cluster state change: WatchedEvent state:SyncConnected type:NodeDataChanged path:/clusterstate.json, has occurred - updating... (live nodes size: 5)
   [junit4]   2> 1189124 T2411 oascc.ZkStateReader$2.process A cluster state change: WatchedEvent state:SyncConnected type:NodeDataChanged path:/clusterstate.json, has occurred - updating... (live nodes size: 5)
   [junit4]   2> 1189125 T2425 oascc.ZkStateReader$2.process A cluster state change: WatchedEvent state:SyncConnected type:NodeDataChanged path:/clusterstate.json, has occurred - updating... (live nodes size: 5)
   [junit4]   2> 1189125 T2453 oascc.ZkStateReader$2.process A cluster state change: WatchedEvent state:SyncConnected type:NodeDataChanged path:/clusterstate.json, has occurred - updating... (live nodes size: 5)
   [junit4]   2> 1189125 T2439 oascc.ZkStateReader$2.process A cluster state change: WatchedEvent state:SyncConnected type:NodeDataChanged path:/clusterstate.json, has occurred - updating... (live nodes size: 5)
   [junit4]   2> 1189127 T2393 oascc.ZkStateReader$2.process A cluster state change: WatchedEvent state:SyncConnected type:NodeDataChanged path:/clusterstate.json, has occurred - updating... (live nodes size: 5)
   [junit4]   2> 1189642 T2444 oasc.ZkController.waitForShardId waiting to find shard id in clusterstate for nodes_used_collection_shard1_replica1
   [junit4]   2> 1189643 T2389 oasc.ZkController.waitForShardId waiting to find shard id in clusterstate for nodes_used_collection_shard1_replica2
   [junit4]   2> 1189642 T2435 oasc.ZkController.waitForShardId waiting to find shard id in clusterstate for nodes_used_collection_shard2_replica1
   [junit4]   2> 1189645 T2420 oasc.ZkController.waitForShardId waiting to find shard id in clusterstate for nodes_used_collection_shard2_replica2
   [junit4]   2> 1189648 T2444 oasc.CorePropertiesLocator.writePropertiesFile ERROR Couldn't persist core properties to C:\Users\JenkinsSlave\workspace\Lucene-Solr-trunk-Windows\solr\build\solr-core\test\J0\.\org.apache.solr.cloud.CollectionsAPIDistributedZkTest-jetty4-1375354885132\nodes_used_collection_shard1_replica1\core.properties: java.io.FileNotFoundException: C:\Users\JenkinsSlave\workspace\Lucene-Solr-trunk-Windows\solr\build\solr-core\test\J0\.\org.apache.solr.cloud.CollectionsAPIDistributedZkTest-jetty4-1375354885132\nodes_used_collection_shard1_replica1\core.properties (The system cannot find the path specified)
   [junit4]   2> 1189648 T2444 oasc.CoreContainer.create Creating SolrCore 'nodes_used_collection_shard1_replica1' using instanceDir: C:\Users\JenkinsSlave\workspace\Lucene-Solr-trunk-Windows\solr\build\solr-core\test\J0\.\org.apache.solr.cloud.CollectionsAPIDistributedZkTest-jetty4-1375354885132\nodes_used_collection_shard1_replica1
   [junit4]   2> 1189649 T2444 oasc.ZkController.createCollectionZkNode Check for collection zkNode:nodes_used_collection
   [junit4]   2> 1189648 T2435 oasc.CorePropertiesLocator.writePropertiesFile ERROR Couldn't persist core properties to C:\Users\JenkinsSlave\workspace\Lucene-Solr-trunk-Windows\solr\build\solr-core\test\J0\.\org.apache.solr.cloud.CollectionsAPIDistributedZkTest-jetty3-1375354882837\nodes_used_collection_shard2_replica1\core.properties: java.io.FileNotFoundException: C:\Users\JenkinsSlave\workspace\Lucene-Solr-trunk-Windows\solr\build\solr-core\test\J0\.\org.apache.solr.cloud.CollectionsAPIDistributedZkTest-jetty3-1375354882837\nodes_used_collection_shard2_replica1\core.properties (The system cannot find the path specified)
   [junit4]   2> 1189650 T2435 oasc.CoreContainer.create Creating SolrCore 'nodes_used_collection_shard2_replica1' using instanceDir: C:\Users\JenkinsSlave\workspace\Lucene-Solr-trunk-Windows\solr\build\solr-core\test\J0\.\org.apache.solr.cloud.CollectionsAPIDistributedZkTest-jetty3-1375354882837\nodes_used_collection_shard2_replica1
   [junit4]   2> 1189650 T2420 oasc.CorePropertiesLocator.writePropertiesFile ERROR Couldn't persist core properties to C:\Users\JenkinsSlave\workspace\Lucene-Solr-trunk-Windows\solr\build\solr-core\test\J0\.\org.apache.solr.cloud.CollectionsAPIDistributedZkTest-jetty2-1375354880608\nodes_used_collection_shard2_replica2\core.properties: java.io.FileNotFoundException: C:\Users\JenkinsSlave\workspace\Lucene-Solr-trunk-Windows\solr\build\solr-core\test\J0\.\org.apache.solr.cloud.CollectionsAPIDistributedZkTest-jetty2-1375354880608\nodes_used_collection_shard2_replica2\core.properties (The system cannot find the path specified)
   [junit4]   2> 1189651 T2420 oasc.CoreContainer.create Creating SolrCore 'nodes_used_collection_shard2_replica2' using instanceDir: C:\Users\JenkinsSlave\workspace\Lucene-Solr-trunk-Windows\solr\build\solr-core\test\J0\.\org.apache.solr.cloud.CollectionsAPIDistributedZkTest-jetty2-1375354880608\nodes_used_collection_shard2_replica2
   [junit4]   2> 1189652 T2420 oasc.ZkController.createCollectionZkNode Check for collection zkNode:nodes_used_collection
   [junit4]   2> 1189648 T2389 oasc.CorePropertiesLocator.writePropertiesFile ERROR Couldn't persist core properties to C:\Users\JenkinsSlave\workspace\Lucene-Solr-trunk-Windows\solr\build\solr-core\test\J0\.\org.apache.solr.cloud.CollectionsAPIDistributedZkTest-controljetty-1375354877340\nodes_used_collection_shard1_replica2\core.properties: java.io.FileNotFoundException: C:\Users\JenkinsSlave\workspace\Lucene-Solr-trunk-Windows\solr\build\solr-core\test\J0\.\org.apache.solr.cloud.CollectionsAPIDistributedZkTest-controljetty-1375354877340\nodes_used_collection_shard1_replica2\core.properties (The system cannot find the path specified)
   [junit4]   2> 1189652 T2389 oasc.CoreContainer.create Creating SolrCore 'nodes_used_collection_shard1_replica2' using instanceDir: C:\Users\JenkinsSlave\workspace\Lucene-Solr-trunk-Windows\solr\build\solr-core\test\J0\.\org.apache.solr.cloud.CollectionsAPIDistributedZkTest-controljetty-1375354877340\nodes_used_collection_shard1_replica2
   [junit4]   2> 1189654 T2389 oasc.ZkController.createCollectionZkNode Check for collection zkNode:nodes_used_collection
   [junit4]   2> 1189651 T2435 oasc.ZkController.createCollectionZkNode Check for collection zkNode:nodes_used_collection
   [junit4]   2> 1189651 T2444 oasc.ZkController.createCollectionZkNode Creating collection in ZooKeeper:nodes_used_collection
   [junit4]   2> 1189656 T2444 oasc.ZkController.getConfName Looking for collection configName
   [junit4]   2> 1189655 T2420 oasc.ZkController.createCollectionZkNode Creating collection in ZooKeeper:nodes_used_collection
   [junit4]   2> 1189657 T2420 oasc.ZkController.getConfName Looking for collection configName
   [junit4]   2> 1189658 T2435 oasc.ZkController.createCollectionZkNode Creating collection in ZooKeeper:nodes_used_collection
   [junit4]   2> 1189658 T2435 oasc.ZkController.getConfName Looking for collection configName
   [junit4]   2> 1189659 T2389 oasc.ZkController.createCollectionZkNode Creating collection in ZooKeeper:nodes_used_collection
   [junit4]   2> 1189659 T2389 oasc.ZkController.getConfName Looking for collection configName
   [junit4]   2> 1189660 T2444 oasc.ZkController.getConfName Only one config set found in zk - using it:conf1
   [junit4]   2> 1189662 T2444 oascc.SolrZkClient.makePath makePath: /collections/nodes_used_collection
   [junit4]   2> 1189662 T2420 oasc.ZkController.getConfName Only one config set found in zk - using it:conf1
   [junit4]   2> 1189663 T2420 oascc.SolrZkClient.makePath makePath: /collections/nodes_used_collection
   [junit4]   2> 1189663 T2435 oasc.ZkController.getConfName Only one config set found in zk - using it:conf1
   [junit4]   2> 1189664 T2435 oascc.SolrZkClient.makePath makePath: /collections/nodes_used_collection
   [junit4]   2> 1189665 T2389 oasc.ZkController.getConfName Only one config set found in zk - using it:conf1
   [junit4]   2> 1189665 T2389 oascc.SolrZkClient.makePath makePath: /collections/nodes_used_collection
   [junit4]   2> 1189670 T2444 oasc.ZkController.readConfigName Load collection config from:/collections/nodes_used_collection
   [junit4]   2> 1189673 T2435 oasc.ZkController.readConfigName Load collection config from:/collections/nodes_used_collection
   [junit4]   2> 1189673 T2420 oasc.ZkController.readConfigName Load collection config from:/collections/nodes_used_collection
   [junit4]   2> 1189677 T2444 oasc.SolrResourceLoader.<init> new SolrResourceLoader for directory: 'C:\Users\JenkinsSlave\workspace\Lucene-Solr-trunk-Windows\solr\build\solr-core\test\J0\.\org.apache.solr.cloud.CollectionsAPIDistributedZkTest-jetty4-1375354885132\nodes_used_collection_shard1_replica1\'
   [junit4]   2> 1189677 T2389 oasc.ZkController.readConfigName Load collection config from:/collections/nodes_used_collection
   [junit4]   2> 1189680 T2435 oasc.SolrResourceLoader.<init> new SolrResourceLoader for directory: 'C:\Users\JenkinsSlave\workspace\Lucene-Solr-trunk-Windows\solr\build\solr-core\test\J0\.\org.apache.solr.cloud.CollectionsAPIDistributedZkTest-jetty3-1375354882837\nodes_used_collection_shard2_replica1\'
   [junit4]   2> 1189682 T2420 oasc.SolrResourceLoader.<init> new SolrResourceLoader for directory: 'C:\Users\JenkinsSlave\workspace\Lucene-Solr-trunk-Windows\solr\build\solr-core\test\J0\.\org.apache.solr.cloud.CollectionsAPIDistributedZkTest-jetty2-1375354880608\nodes_used_collection_shard2_replica2\'
   [junit4]   2> 1189685 T2389 oasc.SolrResourceLoader.<init> new SolrResourceLoader for directory: 'C:\Users\JenkinsSlave\workspace\Lucene-Solr-trunk-Windows\solr\build\solr-core\test\J0\.\org.apache.solr.cloud.CollectionsAPIDistributedZkTest-controljetty-1375354877340\nodes_used_collection_shard1_replica2\'
   [junit4]   2> 1189797 T2444 oasc.SolrConfig.<init> Using Lucene MatchVersion: LUCENE_50
   [junit4]   2> 1189804 T2435 oasc.SolrConfig.<init> Using Lucene MatchVersion: LUCENE_50
   [junit4]   2> 1189889 T2444 oasc.SolrConfig.<init> Loaded SolrConfig: solrconfig.xml
   [junit4]   2> 1189898 T2435 oasc.SolrConfig.<init> Loaded SolrConfig: solrconfig.xml
   [junit4]   2> 1189931 T2389 oasc.SolrConfig.<init> Using Lucene MatchVersion: LUCENE_50
   [junit4]   2> 1189945 T2420 oasc.SolrConfig.<init> Using Lucene MatchVersion: LUCENE_50
   [junit4]   2> 1190003 T2444 oass.IndexSchema.readSchema Reading Solr Schema from schema.xml
   [junit4]   2> 1190018 T2435 oass.IndexSchema.readSchema Reading Solr Schema from schema.xml
   [junit4]   2> 1190029 T2435 oass.IndexSchema.readSchema [nodes_used_collection_shard2_replica1] Schema name=test
   [junit4]   2> 1190018 T2444 oass.IndexSchema.readSchema [nodes_used_collection_shard1_replica1] Schema name=test
   [junit4]   2> 1190053 T2389 oasc.SolrConfig.<init> Loaded SolrConfig: solrconfig.xml
   [junit4]   2> 1190075 T2389 oass.IndexSchema.readSchema Reading Solr Schema from schema.xml
   [junit4]   2> 1190086 T2389 oass.IndexSchema.readSchema [nodes_used_collection_shard1_replica2] Schema name=test
   [junit4]   2> 1190138 T2420 oasc.SolrConfig.<init> Loaded SolrConfig: solrconfig.xml
   [junit4]   2> 1190149 T2420 oass.IndexSchema.readSchema Reading Solr Schema from schema.xml
   [junit4]   2> 1190160 T2420 oass.IndexSchema.readSchema [nodes_used_collection_shard2_replica2] Schema name=test
   [junit4]   2> 1191589 T2435 oass.OpenExchangeRatesOrgProvider.init Initialized with rates=open-exchange-rates.json, refreshInterval=1440.
   [junit4]   2> 1191600 T2435 oass.IndexSchema.readSchema default search field in schema is text
   [junit4]   2> 1191605 T2435 oass.IndexSchema.readSchema unique key field: id
   [junit4]   2> 1191727 T2444 oass.OpenExchangeRatesOrgProvider.init Initialized with rates=open-exchange-rates.json, refreshInterval=1440.
   [junit4]   2> 1191735 T2444 oass.IndexSchema.readSchema default search field in schema is text
   [junit4]   2> 1191739 T2444 oass.IndexSchema.readSchema unique key field: id
   [junit4]   2> 1191856 T2389 oass.OpenExchangeRatesOrgProvider.init Initialized with rates=open-exchange-rates.json, refreshInterval=1440.
   [junit4]   2> 1191864 T2389 oass.IndexSchema.readSchema default search field in schema is text
   [junit4]   2> 1191869 T2389 oass.IndexSchema.readSchema unique key field: id
   [junit4]   2> 1192068 T2420 oass.OpenExchangeRatesOrgProvider.init Initialized with rates=open-exchange-rates.json, refreshInterval=1440.
   [junit4]   2> 1192077 T2420 oass.IndexSchema.readSchema default search field in schema is text
   [junit4]   2> 1192081 T2420 oass.IndexSchema.readSchema unique key field: id
   [junit4]   2> 1192162 T2435 oass.FileExchangeRateProvider.reload Reloading exchange rates from file currency.xml
   [junit4]   2> 1192163 T2389 oass.FileExchangeRateProvider.reload Reloading exchange rates from file currency.xml
   [junit4]   2> 1192164 T2420 oass.FileExchangeRateProvider.reload Reloading exchange rates from file currency.xml
   [junit4]   2> 1192168 T2444 oass.FileExchangeRateProvider.reload Reloading exchange rates from file currency.xml
   [junit4]   2> 1192174 T2435 oass.FileExchangeRateProvider.reload Reloading exchange rates from file currency.xml
   [junit4]   2> 1192178 T2389 oass.FileExchangeRateProvider.reload Reloading exchange rates from file currency.xml
   [junit4]   2> 1192195 T2420 oass.FileExchangeRateProvider.reload Reloading exchange rates from file currency.xml
   [junit4]   2> 1192203 T2444 oass.FileExchangeRateProvider.reload Reloading exchange rates from file currency.xml
   [junit4]   2> 1192209 T2435 oass.OpenExchangeRatesOrgProvider.reload Reloading exchange rates from open-exchange-rates.json
   [junit4]   2> 1192213 T2389 oass.OpenExchangeRatesOrgProvider.reload Reloading exchange rates from open-exchange-rates.json
   [junit4]   2> 1192219 T2420 oass.OpenExchangeRatesOrgProvider.reload Reloading exchange rates from open-exchange-rates.json
   [junit4]   2> 1192226 T2444 oass.OpenExchangeRatesOrgProvider.reload Reloading exchange rates from open-exchange-rates.json
   [junit4]   2> 1192228 T2435 oass.OpenExchangeRatesOrgProvider$OpenExchangeRates.<init> WARN Unknown key IMPORTANT NOTE
   [junit4]   2> 1192228 T2435 oass.OpenExchangeRatesOrgProvider$OpenExchangeRates.<init> WARN Expected key, got STRING
   [junit4]   2> 1192228 T2435 oass.OpenExchangeRatesOrgProvider.reload Reloading exchange rates from open-exchange-rates.json
   [junit4]   2> 1192229 T2389 oass.OpenExchangeRatesOrgProvider$OpenExchangeRates.<init> WARN Unknown key IMPORTANT NOTE
   [junit4]   2> 1192229 T2389 oass.OpenExchangeRatesOrgProvider$OpenExchangeRates.<init> WARN Expected key, got STRING
   [junit4]   2> 1192229 T2389 oass.OpenExchangeRatesOrgProvider.reload Reloading exchange rates from open-exchange-rates.json
   [junit4]   2> 1192230 T2420 oass.OpenExchangeRatesOrgProvider$OpenExchangeRates.<init> WARN Unknown key IMPORTANT NOTE
   [junit4]   2> 1192231 T2420 oass.OpenExchangeRatesOrgProvider$OpenExchangeRates.<init> WARN Expected key, got STRING
   [junit4]   2> 1192231 T2420 oass.OpenExchangeRatesOrgProvider.reload Reloading exchange rates from open-exchange-rates.json
   [junit4]   2> 1192234 T2444 oass.OpenExchangeRatesOrgProvider$OpenExchangeRates.<init> WARN Unknown key IMPORTANT NOTE
   [junit4]   2> 1192234 T2444 oass.OpenExchangeRatesOrgProvider$OpenExchangeRates.<init> WARN Expected key, got STRING
   [junit4]   2> 1192234 T2444 oass.OpenExchangeRatesOrgProvider.reload Reloading exchange rates from open-exchange-rates.json
   [junit4]   2> 1192236 T2435 oass.OpenExchangeRatesOrgProvider$OpenExchangeRates.<init> WARN Unknown key IMPORTANT NOTE
   [junit4]   2> 1192236 T2435 oass.OpenExchangeRatesOrgProvider$OpenExchangeRates.<init> WARN Expected key, got STRING
   [junit4]   2> 1192236 T2435 oasc.SolrCore.initDirectoryFactory org.apache.solr.core.MockDirectoryFactory
   [junit4]   2> 1192237 T2435 oasc.SolrCore.<init> [nodes_used_collection_shard2_replica1] Opening new SolrCore at C:\Users\JenkinsSlave\workspace\Lucene-Solr-trunk-Windows\solr\build\solr-core\test\J0\.\org.apache.solr.cloud.CollectionsAPIDistributedZkTest-jetty3-1375354882837\nodes_used_collection_shard2_replica1\, dataDir=C:\Users\JenkinsSlave\workspace\Lucene-Solr-trunk-Windows\solr\build\solr-core\test\J0\.\org.apache.solr.cloud.CollectionsAPIDistributedZkTest-jetty3-1375354882837\\nodes_used_collection_shard2_replica1\data\
   [junit4]   2> 1192237 T2435 oasc.JmxMonitoredMap.<init> JMX monitoring is enabled. Adding Solr mbeans to JMX Server: com.sun.jmx.mbeanserver.JmxMBeanServer@7b7b1ad5
   [junit4]   2> 1192238 T2435 oasc.CachingDirectoryFactory.get return new directory for C:\Users\JenkinsSlave\workspace\Lucene-Solr-trunk-Windows\solr\build\solr-core\test\J0\.\org.apache.solr.cloud.CollectionsAPIDistributedZkTest-jetty3-1375354882837\\nodes_used_collection_shard2_replica1\data\
   [junit4]   2> 1192239 T2435 oasc.SolrCore.getNewIndexDir New index directory detected: old=null new=C:\Users\JenkinsSlave\workspace\Lucene-Solr-trunk-Windows\solr\build\solr-core\test\J0\.\org.apache.solr.cloud.CollectionsAPIDistributedZkTest-jetty3-1375354882837\\nodes_used_collection_shard2_replica1\data\index/
   [junit4]   2> 1192239 T2435 oasc.SolrCore.initIndex WARN [nodes_used_collection_shard2_replica1] Solr index directory 'C:\Users\JenkinsSlave\workspace\Lucene-Solr-trunk-Windows\solr\build\solr-core\test\J0\.\org.apache.solr.cloud.CollectionsAPIDistributedZkTest-jetty3-1375354882837\nodes_used_collection_shard2_replica1\data\index' doesn't exist. Creating new index...
   [junit4]   2> 1192239 T2435 oasc.CachingDirectoryFactory.get return new directory for C:\Users\JenkinsSlave\workspace\Lucene-Solr-trunk-Windows\solr\build\solr-core\test\J0\.\org.apache.solr.cloud.CollectionsAPIDistributedZkTest-jetty3-1375354882837\\nodes_used_collection_shard2_replica1\data\index
   [junit4]   2> 1192245 T2435 oasc.SolrDeletionPolicy.onCommit SolrDeletionPolicy.onCommit: commits: num=1
   [junit4]   2> 		commit{dir=MockDirWrapper(NRTCachingDirectory(org.apache.lucene.store.RAMDirectory@3b7ab07 lockFactory=org.apache.lucene.store.NativeFSLockFactory@48d8df0d; maxCacheMB=0.66796875 maxMergeSizeMB=0.703125)),segFN=segments_1,generation=1}
   [junit4]   2> 1192245 T2435 oasc.SolrDeletionPolicy.updateCommits newest commit generation = 1
   [junit4]   2> 1192251 T2435 oasup.UpdateRequestProcessorChain.init inserting DistributedUpdateProcessorFactory into updateRequestProcessorChain "dedupe"
   [junit4]   2> 1192252 T2435 oasup.UpdateRequestProcessorChain.init inserting DistributedUpdateProcessorFactory into updateRequestProcessorChain "stored_sig"
   [junit4]   2> 1192252 T2435 oasup.UpdateRequestProcessorChain.init inserting DistributedUpdateProcessorFactory into updateRequestProcessorChain "distrib-dup-test-chain-implicit"
   [junit4]   2> 1192253 T2435 oasc.RequestHandlers.initHandlersFromConfig created standard: solr.StandardRequestHandler
   [junit4]   2> 1192253 T2435 oasc.RequestHandlers.initHandlersFromConfig created /get: solr.RealTimeGetHandler
   [junit4]   2> 1192253 T2435 oasc.RequestHandlers.initHandlersFromConfig adding lazy requestHandler: solr.ReplicationHandler
   [junit4]   2> 1192254 T2435 oasc.RequestHandlers.initHandlersFromConfig created /replication: solr.ReplicationHandler
   [junit4]   2> 1192254 T2435 oasc.RequestHandlers.initHandlersFromConfig created /update: solr.UpdateRequestHandler
   [junit4]   2> 1192255 T2435 oasc.RequestHandlers.initHandlersFromConfig created /admin/: org.apache.solr.handler.admin.AdminHandlers
   [junit4]   2> 1192266 T2435 oashl.XMLLoader.init xsltCacheLifetimeSeconds=60
   [junit4]   2> 1192274 T2435 oass.SolrIndexSearcher.<init> Opening Searcher@7ad21cdb main
   [junit4]   2> 1192275 T2435 oasu.CommitTracker.<init> Hard AutoCommit: disabled
   [junit4]   2> 1192275 T2435 oasu.CommitTracker.<init> Soft AutoCommit: disabled
   [junit4]   2> 1192278 T2389 oass.OpenExchangeRatesOrgProvider$OpenExchangeRates.<init> WARN Unknown key IMPORTANT NOTE
   [junit4]   2> 1192278 T2389 oass.OpenExchangeRatesOrgProvider$OpenExchangeRates.<init> WARN Expected key, got STRING
   [junit4]   2> 1192279 T2389 oasc.SolrCore.initDirectoryFactory org.apache.solr.core.MockDirectoryFactory
   [junit4]   2> 1192279 T2389 oasc.SolrCore.<init> [nodes_used_collection_shard1_replica2] Opening new SolrCore at C:\Users\JenkinsSlave\workspace\Lucene-Solr-trunk-Windows\solr\build\solr-core\test\J0\.\org.apache.solr.cloud.CollectionsAPIDistributedZkTest-controljetty-1375354877340\nodes_used_collection_shard1_replica2\, dataDir=C:\Users\JenkinsSlave\workspace\Lucene-Solr-trunk-Windows\solr\build\solr-core\test\J0\.\org.apache.solr.cloud.CollectionsAPIDistributedZkTest-controljetty-1375354877340\\nodes_used_collection_shard1_replica2\data\
   [junit4]   2> 1192279 T2389 oasc.JmxMonitoredMap.<init> JMX monitoring is enabled. Adding Solr mbeans to JMX Server: com.sun.jmx.mbeanserver.JmxMBeanServer@7b7b1ad5
   [junit4]   2> 1192280 T2389 oasc.CachingDirectoryFactory.get return new directory for C:\Users\JenkinsSlave\workspace\Lucene-Solr-trunk-Windows\solr\build\solr-core\test\J0\.\org.apache.solr.cloud.CollectionsAPIDistributedZkTest-controljetty-1375354877340\\nodes_used_collection_shard1_replica2\data\
   [junit4]   2> 1192280 T2389 oasc.SolrCore.getNewIndexDir New index directory detected: old=null new=C:\Users\JenkinsSlave\workspace\Lucene-Solr-trunk-Windows\solr\build\solr-core\test\J0\.\org.apache.solr.cloud.CollectionsAPIDistributedZkTest-controljetty-1375354877340\\nodes_used_collection_shard1_replica2\data\index/
   [junit4]   2> 1192281 T2389 oasc.SolrCore.initIndex WARN [nodes_used_collection_shard1_replica2] Solr index directory 'C:\Users\JenkinsSlave\workspace\Lucene-Solr-trunk-Windows\solr\build\solr-core\test\J0\.\org.apache.solr.cloud.CollectionsAPIDistributedZkTest-controljetty-1375354877340\nodes_used_collection_shard1_replica2\data\index' doesn't exist. Creating new index...
   [junit4]   2> 1192281 T2389 oasc.CachingDirectoryFactory.get return new directory for C:\Users\JenkinsSlave\workspace\Lucene-Solr-trunk-Windows\solr\build\solr-core\test\J0\.\org.apache.solr.cloud.CollectionsAPIDistributedZkTest-controljetty-1375354877340\\nodes_used_collection_shard1_replica2\data\index
   [junit4]   2> 1192286 T2389 oasc.SolrDeletionPolicy.onCommit SolrDeletionPolicy.onCommit: commits: num=1
   [junit4]   2> 		commit{dir=MockDirWrapper(NRTCachingDirectory(org.apache.lucene.store.RAMDirectory@48cfd781 lockFactory=org.apache.lucene.store.NativeFSLockFactory@371458f2; maxCacheMB=0.66796875 maxMergeSizeMB=0.703125)),segFN=segments_1,generation=1}
   [junit4]   2> 1192287 T2389 oasc.SolrDeletionPolicy.updateCommits newest commit generation = 1
   [junit4]   2> 1192294 T2389 oasup.UpdateRequestProcessorChain.init inserting DistributedUpdateProcessorFactory into updateRequestProcessorChain "dedupe"
   [junit4]   2> 1192294 T2389 oasup.UpdateRequestProcessorChain.init inserting DistributedUpdateProcessorFactory into updateRequestProcessorChain "stored_sig"
   [junit4]   2> 1192295 T2389 oasup.UpdateRequestProcessorChain.init inserting DistributedUpdateProcessorFactory into updateRequestProcessorChain "distrib-dup-test-chain-implicit"
   [junit4]   2> 1192296 T2389 oasc.RequestHandlers.initHandlersFromConfig created standard: solr.StandardRequestHandler
   [junit4]   2> 1192296 T2389 oasc.RequestHandlers.initHandlersFromConfig created /get: solr.RealTimeGetHandler
   [junit4]   2> 1192296 T2389 oasc.RequestHandlers.initHandlersFromConfig adding lazy requestHandler: solr.ReplicationHandler
   [junit4]   2> 1192296 T2389 oasc.RequestHandlers.initHandlersFromConfig created /replication: solr.ReplicationHandler
   [junit4]   2> 1192298 T2389 oasc.RequestHandlers.initHandlersFromConfig created /update: solr.UpdateRequestHandler
   [junit4]   2> 1192298 T2389 oasc.RequestHandlers.initHandlersFromConfig created /admin/: org.apache.solr.handler.admin.AdminHandlers
   [junit4]   2> 1192308 T2389 oashl.XMLLoader.init xsltCacheLifetimeSeconds=60
   [junit4]   2> 1192317 T2389 oass.SolrIndexSearcher.<init> Opening Searcher@14e95041 main
   [junit4]   2> 1192318 T2389 oasu.CommitTracker.<init> Hard AutoCommit: disabled
   [junit4]   2> 1192318 T2389 oasu.CommitTracker.<init> Soft AutoCommit: disabled
   [junit4]   2> 1192319 T2420 oass.OpenExchangeRatesOrgProvider$OpenExchangeRates.<init> WARN Unknown key IMPORTANT NOTE
   [junit4]   2> 1192321 T2420 oass.OpenExchangeRatesOrgProvider$OpenExchangeRates.<init> WARN Expected key, got STRING
   [junit4]   2> 1192321 T2420 oasc.SolrCore.initDirectoryFactory org.apache.solr.core.MockDirectoryFactory
   [junit4]   2> 1192322 T2420 oasc.SolrCore.<init> [nodes_used_collection_shard2_replica2] Opening new SolrCore at C:\Users\JenkinsSlave\workspace\Lucene-Solr-trunk-Windows\solr\build\solr-core\test\J0\.\org.apache.solr.cloud.CollectionsAPIDistributedZkTest-jetty2-1375354880608\nodes_used_collection_shard2_replica2\, dataDir=C:\Users\JenkinsSlave\workspace\Lucene-Solr-trunk-Windows\solr\build\solr-core\test\J0\.\org.apache.solr.cloud.CollectionsAPIDistributedZkTest-jetty2-1375354880608\\nodes_used_collection_shard2_replica2\data\
   [junit4]   2> 1192322 T2420 oasc.JmxMonitoredMap.<init> JMX monitoring is enabled. Adding Solr mbeans to JMX Server: com.sun.jmx.mbeanserver.JmxMBeanServer@7b7b1ad5
   [junit4]   2> 1192323 T2420 oasc.CachingDirectoryFactory.get return new directory for C:\Users\JenkinsSlave\workspace\Lucene-Solr-trunk-Windows\solr\build\solr-core\test\J0\.\org.apache.solr.cloud.CollectionsAPIDistributedZkTest-jetty2-1375354880608\\nodes_used_collection_shard2_replica2\data\
   [junit4]   2> 1192323 T2420 oasc.SolrCore.getNewIndexDir New index directory detected: old=null new=C:\Users\JenkinsSlave\workspace\Lucene-Solr-trunk-Windows\solr\build\solr-core\test\J0\.\org.apache.solr.cloud.CollectionsAPIDistributedZkTest-jetty2-1375354880608\\nodes_used_collection_shard2_replica2\data\index/
   [junit4]   2> 1192323 T2420 oasc.SolrCore.initIndex WARN [nodes_used_collection_shard2_replica2] Solr index directory 'C:\Users\JenkinsSlave\workspace\Lucene-Solr-trunk-Windows\solr\build\solr-core\test\J0\.\org.apache.solr.cloud.CollectionsAPIDistributedZkTest-jetty2-1375354880608\nodes_used_collection_shard2_replica2\data\index' doesn't exist. Creating new index...
   [junit4]   2> 1192323 T2420 oasc.CachingDirectoryFactory.get return new directory for C:\Users\JenkinsSlave\workspace\Lucene-Solr-trunk-Windows\solr\build\solr-core\test\J0\.\org.apache.solr.cloud.CollectionsAPIDistributedZkTest-jetty2-1375354880608\\nodes_used_collection_shard2_replica2\data\index
   [junit4]   2> 1192329 T2420 oasc.SolrDeletionPolicy.onCommit SolrDeletionPolicy.onCommit: commits: num=1
   [junit4]   2> 		commit{dir=MockDirWrapper(NRTCachingDirectory(org.apache.lucene.store.RAMDirectory@6dc587ab lockFactory=org.apache.lucene.store.NativeFSLockFactory@1080b4e7; maxCacheMB=0.66796875 maxMergeSizeMB=0.703125)),segFN=segments_1,generation=1}
   [junit4]   2> 1192329 T2420 oasc.SolrDeletionPolicy.updateCommits newest commit generation = 1
   [junit4]   2> 1192335 T2420 oasup.UpdateRequestProcessorChain.init inserting DistributedUpdateProcessorFactory into updateRequestProcessorChain "dedupe"
   [junit4]   2> 1192336 T2420 oasup.UpdateRequestProcessorChain.init inserting DistributedUpdateProcessorFactory into updateRequestProcessorChain "stored_sig"
   [junit4]   2> 1192336 T2420 oasup.UpdateRequestProcessorChain.init inserting DistributedUpdateProcessorFactory into updateRequestProcessorChain "distrib-dup-test-chain-implicit"
   [junit4]   2> 1192337 T2420 oasc.RequestHandlers.initHandlersFromConfig created standard: solr.StandardRequestHandler
   [junit4]   2> 1192337 T2420 oasc.RequestHandlers.initHandlersFromConfig created /get: solr.RealTimeGetHandler
   [junit4]   2> 1192337 T2420 oasc.RequestHandlers.initHandlersFromConfig adding lazy requestHandler: solr.ReplicationHandler
   [junit4]   2> 1192338 T2420 oasc.RequestHandlers.initHandlersFromConfig created /replication: solr.ReplicationHandler
   [junit4]   2> 1192338 T2420 oasc.RequestHandlers.initHandlersFromConfig created /update: solr.UpdateRequestHandler
   [junit4]   2> 1192340 T2420 oasc.RequestHandlers.initHandlersFromConfig created /admin/: org.apache.solr.handler.admin.AdminHandlers
   [junit4]   2> 1192350 T2420 oashl.XMLLoader.init xsltCacheLifetimeSeconds=60
   [junit4]   2> 1192358 T2420 oass.SolrIndexSearcher.<init> Opening Searcher@53431886 main
   [junit4]   2> 1192359 T2420 oasu.CommitTracker.<init> Hard AutoCommit: disabled
   [junit4]   2> 1192359 T2420 oasu.CommitTracker.<init> Soft AutoCommit: disabled
   [junit4]   2> 1192360 T2444 oass.OpenExchangeRatesOrgProvider$OpenExchangeRates.<init> WARN Unknown key IMPORTANT NOTE
   [junit4]   2> 1192387 T2444 oass.OpenExchangeRatesOrgProvider$OpenExchangeRates.<init> WARN Expected key, got STRING
   [junit4]   2> 1192387 T2444 oasc.SolrCore.initDirectoryFactory org.apache.solr.core.MockDirectoryFactory
   [junit4]   2> 1192387 T2444 oasc.SolrCore.<init> [nodes_used_collection_shard1_replica1] Opening new SolrCore at C:\Users\JenkinsSlave\workspace\Lucene-Solr-trunk-Windows\solr\build\solr-core\test\J0\.\org.apache.solr.cloud.CollectionsAPIDistributedZkTest-jetty4-1375354885132\nodes_used_collection_shard1_replica1\, dataDir=C:\Users\JenkinsSlave\workspace\Lucene-Solr-trunk-Windows\solr\build\solr-core\test\J0\.\org.apache.solr.cloud.CollectionsAPIDistributedZkTest-jetty4-1375354885132\\nodes_used_collection_shard1_replica1\data\
   [junit4]   2> 1192387 T2444 oasc.JmxMonitoredMap.<init> JMX monitoring is enabled. Adding Solr mbeans to JMX Server: com.sun.jmx.mbeanserver.JmxMBeanServer@7b7b1ad5
   [junit4]   2> 1192386 T2435 oasc.CoreContainer.registerCore registering core: nodes_used_collection_shard2_replica1
   [junit4]   2> 1192402 T2435 oasc.ZkController.register Register replica - core:nodes_used_collection_shard2_replica1 address:http://127.0.0.1:63509/_npe collection:nodes_used_collection shard:shard2
   [junit4]   2> 1192402 T2435 oascsi.HttpClientUtil.createClient Creating new http client, config:maxConnections=10000&maxConnectionsPerHost=20&connTimeout=15000&socketTimeout=30000&retry=false
   [junit4]   2> 1192385 T2459 oasc.SolrCore.registerSearcher [nodes_used_collection_shard2_replica1] Registered new searcher Searcher@7ad21cdb main{StandardDirectoryReader(segments_1:1)}
   [junit4]   2> 1192378 T2389 oasc.CoreContainer.registerCore registering core: nodes_used_collection_shard1_replica2
   [junit4]   2> 1192410 T2389 oasc.ZkController.register Register replica - core:nodes_used_collection_shard1_replica2 address:http://127.0.0.1:63479/_npe collection:nodes_used_collection shard:shard1
   [junit4]   2> 1192410 T2389 oascsi.HttpClientUtil.createClient Creating new http client, config:maxConnections=10000&maxConnectionsPerHost=20&connTimeout=15000&socketTimeout=30000&retry=false
   [junit4]   2> 1192415 T2444 oasc.CachingDirectoryFactory.get return new directory for C:\Users\JenkinsSlave\workspace\Lucene-Solr-trunk-Windows\solr\build\solr-core\test\J0\.\org.apache.solr.cloud.CollectionsAPIDistributedZkTest-jetty4-1375354885132\\nodes_used_collection_shard1_replica1\data\
   [junit4]   2> 1192415 T2444 oasc.SolrCore.getNewIndexDir New index directory detected: old=null new=C:\Users\JenkinsSlave\workspace\Lucene-Solr-trunk-Windows\solr\build\solr-core\test\J0\.\org.apache.solr.cloud.CollectionsAPIDistributedZkTest-jetty4-1375354885132\\nodes_used_collection_shard1_replica1\data\index/
   [junit4]   2> 1192415 T2444 oasc.SolrCore.initIndex WARN [nodes_used_collection_shard1_replica1] Solr index directory 'C:\Users\JenkinsSlave\workspace\Lucene-Solr-trunk-Windows\solr\build\solr-core\test\J0\.\org.apache.solr.cloud.CollectionsAPIDistributedZkTest-jetty4-1375354885132\nodes_used_collection_shard1_replica1\data\index' doesn't exist. Creating new index...
   [junit4]   2> 1192416 T2444 oasc.CachingDirectoryFactory.get return new directory for C:\Users\JenkinsSlave\workspace\Lucene-Solr-trunk-Windows\solr\build\solr-core\test\J0\.\org.apache.solr.cloud.CollectionsAPIDistributedZkTest-jetty4-1375354885132\\nodes_used_collection_shard1_replica1\data\index
   [junit4]   2> 1192421 T2444 oasc.SolrDeletionPolicy.onCommit SolrDeletionPolicy.onCommit: commits: num=1
   [junit4]   2> 		commit{dir=MockDirWrapper(NRTCachingDirectory(org.apache.lucene.store.RAMDirectory@353abd51 lockFactory=org.apache.lucene.store.NativeFSLockFactory@6205eb81; maxCacheMB=0.66796875 maxMergeSizeMB=0.703125)),segFN=segments_1,generation=1}
   [junit4]   2> 1192422 T2444 oasc.SolrDeletionPolicy.updateCommits newest commit generation = 1
   [junit4]   2> 1192427 T2444 oasup.UpdateRequestProcessorChain.init inserting DistributedUpdateProcessorFactory into updateRequestProcessorChain "dedupe"
   [junit4]   2> 1192427 T2444 oasup.UpdateRequestProcessorChain.init inserting DistributedUpdateProcessorFactory into updateRequestProcessorChain "stored_sig"
   [junit4]   2> 1192428 T2444 oasup.UpdateRequestProcessorChain.init inserting DistributedUpdateProcessorFactory into updateRequestProcessorChain "distrib-dup-test-chain-implicit"
   [junit4]   2> 1192428 T2444 oasc.RequestHandlers.initHandlersFromConfig created standard: solr.StandardRequestHandler
   [junit4]   2> 1192429 T2444 oasc.RequestHandlers.initHandlersFromConfig created /get: solr.RealTimeGetHandler
   [junit4]   2> 1192429 T2444 oasc.RequestHandlers.initHandlersFromConfig adding lazy requestHandler: solr.ReplicationHandler
   [junit4]   2> 1192429 T2444 oasc.RequestHandlers.initHandlersFromConfig created /replication: solr.ReplicationHandler
   [junit4]   2> 1192430 T2444 oasc.RequestHandlers.initHandlersFromConfig created /update: solr.UpdateRequestHandler
   [junit4]   2> 1192431 T2444 oasc.RequestHandlers.initHandlersFromConfig created /admin/: org.apache.solr.handler.admin.AdminHandlers
   [junit4]   2> 1192442 T2444 oashl.XMLLoader.init xsltCacheLifetimeSeconds=60
   [junit4]   2> 1192377 T2460 oasc.SolrCore.registerSearcher [nodes_used_collection_shard1_replica2] Registered new searcher Searcher@14e95041 main{StandardDirectoryReader(segments_1:1)}
   [junit4]   2> 1192454 T2435 oascc.SolrZkClient.makePath makePath: /collections/nodes_used_collection/leader_elect/shard2/election
   [junit4]   2> 1192454 T2389 oascc.SolrZkClient.makePath makePath: /collections/nodes_used_collection/leader_elect/shard1/election
   [junit4]   2> 1192454 T2420 oasc.CoreContainer.registerCore registering core: nodes_used_collection_shard2_replica2
   [junit4]   2> 1192455 T2420 oasc.ZkController.register Register replica - core:nodes_used_collection_shard2_replica2 address:http://127.0.0.1:63500/_npe collection:nodes_used_collection shard:shard2
   [junit4]   2> 1192455 T2420 oascsi.HttpClientUtil.createClient Creating new http client, config:maxConnections=10000&maxConnectionsPerHost=20&connTimeout=15000&socketTimeout=30000&retry=false
   [junit4]   2> 1192452 T2461 oasc.SolrCore.registerSearcher [nodes_used_collection_shard2_replica2] Registered new searcher Searcher@53431886 main{StandardDirectoryReader(segments_1:1)}
   [junit4]   2> 1192449 T2444 oass.SolrIndexSearcher.<init> Opening Searcher@23a9a66e main
   [junit4]   2> 1192467 T2444 oasu.CommitTracker.<init> Hard AutoCommit: disabled
   [junit4]   2> 1192469 T2444 oasu.CommitTracker.<init> Soft AutoCommit: disabled
   [junit4]   2> 1192469 T2420 oascc.SolrZkClient.makeP

[...truncated too long message...]


   [junit4]   2> !!!! WARNING: best effort to remove C:\Users\JenkinsSlave\workspace\Lucene-Solr-trunk-Windows\solr\build\solr-core\test\J0\.\org.apache.solr.cloud.CollectionsAPIDistributedZkTest-1375354877065\zookeeper\server1\data\version-2\log.1 FAILED !!!!!
   [junit4]   2> !!!! WARNING: best effort to remove C:\Users\JenkinsSlave\workspace\Lucene-Solr-trunk-Windows\solr\build\solr-core\test\J0\.\org.apache.solr.cloud.CollectionsAPIDistributedZkTest-1375354877065\zookeeper\server1\data\version-2 FAILED !!!!!
   [junit4]   2> !!!! WARNING: best effort to remove C:\Users\JenkinsSlave\workspace\Lucene-Solr-trunk-Windows\solr\build\solr-core\test\J0\.\org.apache.solr.cloud.CollectionsAPIDistributedZkTest-1375354877065\zookeeper\server1\data FAILED !!!!!
   [junit4]   2> !!!! WARNING: best effort to remove C:\Users\JenkinsSlave\workspace\Lucene-Solr-trunk-Windows\solr\build\solr-core\test\J0\.\org.apache.solr.cloud.CollectionsAPIDistributedZkTest-1375354877065\zookeeper\server1 FAILED !!!!!
   [junit4]   2> !!!! WARNING: best effort to remove C:\Users\JenkinsSlave\workspace\Lucene-Solr-trunk-Windows\solr\build\solr-core\test\J0\.\org.apache.solr.cloud.CollectionsAPIDistributedZkTest-1375354877065\zookeeper FAILED !!!!!
   [junit4]   2> !!!! WARNING: best effort to remove C:\Users\JenkinsSlave\workspace\Lucene-Solr-trunk-Windows\solr\build\solr-core\test\J0\.\org.apache.solr.cloud.CollectionsAPIDistributedZkTest-1375354877065 FAILED !!!!!
   [junit4]   2> 1375150 T2371 oas.SolrTestCaseJ4.tearDown ###Ending testDistribSearch
   [junit4]   2> 1375152 T2371 oasc.ZkTestServer.send4LetterWord connecting to 127.0.0.1:63472 63472
   [junit4]   2> 1376334 T2453 oascc.ZkStateReader$3.process WARN ZooKeeper watch triggered, but Solr cannot talk to ZK
   [junit4]   2> 1377346 T2453 oascc.ZkStateReader$2.process A cluster state change: WatchedEvent state:SyncConnected type:NodeChildrenChanged path:/live_nodes, has occurred - updating... (live nodes size: 1)
   [junit4]   2> 1377347 T2453 oascc.ZkStateReader$2.process WARN ZooKeeper watch triggered, but Solr cannot talk to ZK
   [junit4]   1> client port:0.0.0.0/0.0.0.0:0
   [junit4]   2> NOTE: reproduce with: ant test  -Dtestcase=CollectionsAPIDistributedZkTest -Dtests.method=testDistribSearch -Dtests.seed=F6C567AAFFED0645 -Dtests.slow=true -Dtests.locale=es_GT -Dtests.timezone=Africa/Dar_es_Salaam -Dtests.file.encoding=UTF-8
   [junit4] ERROR    202s | CollectionsAPIDistributedZkTest.testDistribSearch <<<
   [junit4]    > Throwable #1: org.apache.solr.client.solrj.SolrServerException: Server refused connection at: http://127.0.0.1:63491/_npe
   [junit4]    > 	at __randomizedtesting.SeedInfo.seed([F6C567AAFFED0645:7723E9B288B26679]:0)
   [junit4]    > 	at org.apache.solr.client.solrj.impl.HttpSolrServer.request(HttpSolrServer.java:428)
   [junit4]    > 	at org.apache.solr.client.solrj.impl.HttpSolrServer.request(HttpSolrServer.java:180)
   [junit4]    > 	at org.apache.solr.cloud.CollectionsAPIDistributedZkTest.testCustomCollectionsAPI(CollectionsAPIDistributedZkTest.java:764)
   [junit4]    > 	at org.apache.solr.cloud.CollectionsAPIDistributedZkTest.doTest(CollectionsAPIDistributedZkTest.java:159)
   [junit4]    > 	at org.apache.solr.BaseDistributedSearchTestCase.testDistribSearch(BaseDistributedSearchTestCase.java:835)
   [junit4]    > 	at java.lang.Thread.run(Thread.java:724)
   [junit4]    > Caused by: org.apache.http.conn.HttpHostConnectException: Connection to http://127.0.0.1:63491 refused
   [junit4]    > 	at org.apache.http.impl.conn.DefaultClientConnectionOperator.openConnection(DefaultClientConnectionOperator.java:190)
   [junit4]    > 	at org.apache.http.impl.conn.ManagedClientConnectionImpl.open(ManagedClientConnectionImpl.java:294)
   [junit4]    > 	at org.apache.http.impl.client.DefaultRequestDirector.tryConnect(DefaultRequestDirector.java:645)
   [junit4]    > 	at org.apache.http.impl.client.DefaultRequestDirector.execute(DefaultRequestDirector.java:480)
   [junit4]    > 	at org.apache.http.impl.client.AbstractHttpClient.execute(AbstractHttpClient.java:906)
   [junit4]    > 	at org.apache.http.impl.client.AbstractHttpClient.execute(AbstractHttpClient.java:805)
   [junit4]    > 	at org.apache.http.impl.client.AbstractHttpClient.execute(AbstractHttpClient.java:784)
   [junit4]    > 	at org.apache.solr.client.solrj.impl.HttpSolrServer.request(HttpSolrServer.java:365)
   [junit4]    > 	... 44 more
   [junit4]    > Caused by: java.net.ConnectException: Connection refused: connect
   [junit4]    > 	at java.net.DualStackPlainSocketImpl.waitForConnect(Native Method)
   [junit4]    > 	at java.net.DualStackPlainSocketImpl.socketConnect(DualStackPlainSocketImpl.java:85)
   [junit4]    > 	at java.net.AbstractPlainSocketImpl.doConnect(AbstractPlainSocketImpl.java:339)
   [junit4]    > 	at java.net.AbstractPlainSocketImpl.connectToAddress(AbstractPlainSocketImpl.java:200)
   [junit4]    > 	at java.net.AbstractPlainSocketImpl.connect(AbstractPlainSocketImpl.java:182)
   [junit4]    > 	at java.net.PlainSocketImpl.connect(PlainSocketImpl.java:172)
   [junit4]    > 	at java.net.SocksSocketImpl.connect(SocksSocketImpl.java:392)
   [junit4]    > 	at java.net.Socket.connect(Socket.java:579)
   [junit4]    > 	at org.apache.http.conn.scheme.PlainSocketFactory.connectSocket(PlainSocketFactory.java:127)
   [junit4]    > 	at org.apache.http.impl.conn.DefaultClientConnectionOperator.openConnection(DefaultClientConnectionOperator.java:180)
   [junit4]    > 	... 51 more
   [junit4]   2> 1377370 T2371 oas.SolrTestCaseJ4.deleteCore ###deleteCore
   [junit4]   2> NOTE: test params are: codec=Lucene42: {_route_=PostingsFormat(name=Lucene41VarGapFixedInterval), range_facet_l=Pulsing41(freqCutoff=7 minBlockSize=92 maxBlockSize=217), text=PostingsFormat(name=Lucene41VarGapFixedInterval), _version_=Pulsing41(freqCutoff=7 minBlockSize=92 maxBlockSize=217), intDefault=Pulsing41(freqCutoff=7 minBlockSize=92 maxBlockSize=217), id=PostingsFormat(name=Asserting), timestamp=Pulsing41(freqCutoff=7 minBlockSize=92 maxBlockSize=217), a_t=Pulsing41(freqCutoff=7 minBlockSize=92 maxBlockSize=217), range_facet_sl=PostingsFormat(name=Lucene41VarGapFixedInterval), range_facet_si=MockFixedIntBlock(blockSize=803), other_tl1=Pulsing41(freqCutoff=7 minBlockSize=92 maxBlockSize=217), multiDefault=MockFixedIntBlock(blockSize=803), a_si=MockFixedIntBlock(blockSize=803)}, docValues:{timestamp=DocValuesFormat(name=CheapBastard)}, sim=DefaultSimilarity, locale=es_GT, timezone=Africa/Dar_es_Salaam
   [junit4]   2> NOTE: Windows 7 6.1 amd64/Oracle Corporation 1.7.0_25 (64-bit)/cpus=2,threads=4,free=77329336,total=277757952
   [junit4]   2> NOTE: All tests run in this JVM: [TestPHPSerializedResponseWriter, SimplePostToolTest, TestValueSourceCache, DefaultValueUpdateProcessorTest, TestQuerySenderListener, TestSweetSpotSimilarityFactory, ZkNodePropsTest, ShardRoutingCustomTest, SearchHandlerTest, TestRTGBase, ParsingFieldUpdateProcessorsTest, PrimitiveFieldTypeTest, SolrCoreTest, TestRecovery, TestDocumentBuilder, ExternalFileFieldSortTest, DOMUtilTest, TestFiltering, TestIndexingPerformance, MoreLikeThisHandlerTest, TestReload, FieldMutatingUpdateProcessorTest, TestLMJelinekMercerSimilarityFactory, IndexBasedSpellCheckerTest, XmlUpdateRequestHandlerTest, TestWriterPerf, SpatialFilterTest, TestFastLRUCache, OutputWriterTest, NumericFieldsTest, TermsComponentTest, ReturnFieldsTest, QueryEqualityTest, FastVectorHighlighterTest, DocValuesMultiTest, TestCSVLoader, UnloadDistributedZkTest, LeaderElectionTest, FullSolrCloudDistribCmdsTest, TestDefaultSearchFieldResource, NotRequiredUniqueKeyTest, SyncSliceTest, TestHashPartitioner, TestDynamicFieldCollectionResource, TestPluginEnable, UpdateParamsTest, CoreContainerCoreInitFailuresTest, TestPropInjectDefaults, TestBinaryResponseWriter, TestSchemaResource, SolrCoreCheckLockOnStartupTest, SpellCheckComponentTest, PreAnalyzedUpdateProcessorTest, SolrTestCaseJ4Test, PathHierarchyTokenizerFactoryTest, TestSchemaNameResource, BasicZkTest, ChaosMonkeyNothingIsSafeTest, TestSurroundQueryParser, TestDistributedSearch, TestSolrCoreProperties, TestMaxScoreQueryParser, TestDynamicFieldResource, PolyFieldTest, TestAddFieldRealTimeGet, TestComponentsName, HdfsBasicDistributedZk2Test, TestSerializedLuceneMatchVersion, TestRandomDVFaceting, TestBadConfig, HdfsDirectoryTest, TestSolrJ, PluginInfoTest, ScriptEngineTest, HdfsSyncSliceTest, QueryElevationComponentTest, SuggesterWFSTTest, TestReplicationHandler, CopyFieldTest, CurrencyFieldOpenExchangeTest, BadCopyFieldTest, CollectionsAPIDistributedZkTest]
   [junit4] Completed in 201.75s, 1 test, 1 error <<< FAILURES!

[...truncated 737 lines...]
BUILD FAILED
C:\Users\JenkinsSlave\workspace\Lucene-Solr-trunk-Windows\build.xml:389: The following error occurred while executing this line:
C:\Users\JenkinsSlave\workspace\Lucene-Solr-trunk-Windows\build.xml:369: The following error occurred while executing this line:
C:\Users\JenkinsSlave\workspace\Lucene-Solr-trunk-Windows\build.xml:39: The following error occurred while executing this line:
C:\Users\JenkinsSlave\workspace\Lucene-Solr-trunk-Windows\solr\build.xml:181: The following error occurred while executing this line:
C:\Users\JenkinsSlave\workspace\Lucene-Solr-trunk-Windows\solr\common-build.xml:449: The following error occurred while executing this line:
C:\Users\JenkinsSlave\workspace\Lucene-Solr-trunk-Windows\lucene\common-build.xml:1230: The following error occurred while executing this line:
C:\Users\JenkinsSlave\workspace\Lucene-Solr-trunk-Windows\lucene\common-build.xml:873: There were test failures: 320 suites, 1345 tests, 1 error, 39 ignored (11 assumptions)

Total time: 80 minutes 32 seconds
Build step 'Invoke Ant' marked build as failure
Description set: Java: 64bit/jdk1.7.0_25 -XX:+UseCompressedOops -XX:+UseSerialGC
Archiving artifacts
Recording test results
Email was triggered for: Failure
Sending email for trigger: Failure



Mime
View raw message