lucene-dev mailing list archives

Site index · List index
Message view « Date » · « Thread »
Top « Date » · « Thread »
From Policeman Jenkins Server <jenk...@thetaphi.de>
Subject [JENKINS] Lucene-Solr-4.x-Linux (32bit/jdk1.6.0_45) - Build # 6743 - Still Failing!
Date Thu, 01 Aug 2013 02:03:32 GMT
Build: http://jenkins.thetaphi.de/job/Lucene-Solr-4.x-Linux/6743/
Java: 32bit/jdk1.6.0_45 -server -XX:+UseConcMarkSweepGC

1 tests failed.
FAILED:  org.apache.solr.cloud.CollectionsAPIDistributedZkTest.testDistribSearch

Error Message:
Server refused connection at: http://127.0.0.1:35678

Stack Trace:
org.apache.solr.client.solrj.SolrServerException: Server refused connection at: http://127.0.0.1:35678
	at __randomizedtesting.SeedInfo.seed([43D10738B767DAA7:C2378920C038BA9B]:0)
	at org.apache.solr.client.solrj.impl.HttpSolrServer.request(HttpSolrServer.java:428)
	at org.apache.solr.client.solrj.impl.HttpSolrServer.request(HttpSolrServer.java:180)
	at org.apache.solr.cloud.AbstractFullDistribZkTestBase.createCollection(AbstractFullDistribZkTestBase.java:1535)
	at org.apache.solr.cloud.CollectionsAPIDistributedZkTest.testCustomCollectionsAPI(CollectionsAPIDistributedZkTest.java:677)
	at org.apache.solr.cloud.CollectionsAPIDistributedZkTest.doTest(CollectionsAPIDistributedZkTest.java:159)
	at org.apache.solr.BaseDistributedSearchTestCase.testDistribSearch(BaseDistributedSearchTestCase.java:835)
	at sun.reflect.NativeMethodAccessorImpl.invoke0(Native Method)
	at sun.reflect.NativeMethodAccessorImpl.invoke(NativeMethodAccessorImpl.java:39)
	at sun.reflect.DelegatingMethodAccessorImpl.invoke(DelegatingMethodAccessorImpl.java:25)
	at java.lang.reflect.Method.invoke(Method.java:597)
	at com.carrotsearch.randomizedtesting.RandomizedRunner.invoke(RandomizedRunner.java:1559)
	at com.carrotsearch.randomizedtesting.RandomizedRunner.access$600(RandomizedRunner.java:79)
	at com.carrotsearch.randomizedtesting.RandomizedRunner$6.evaluate(RandomizedRunner.java:737)
	at com.carrotsearch.randomizedtesting.RandomizedRunner$7.evaluate(RandomizedRunner.java:773)
	at com.carrotsearch.randomizedtesting.RandomizedRunner$8.evaluate(RandomizedRunner.java:787)
	at com.carrotsearch.randomizedtesting.rules.SystemPropertiesRestoreRule$1.evaluate(SystemPropertiesRestoreRule.java:53)
	at org.apache.lucene.util.TestRuleSetupTeardownChained$1.evaluate(TestRuleSetupTeardownChained.java:50)
	at org.apache.lucene.util.TestRuleFieldCacheSanity$1.evaluate(TestRuleFieldCacheSanity.java:51)
	at org.apache.lucene.util.AbstractBeforeAfterRule$1.evaluate(AbstractBeforeAfterRule.java:46)
	at com.carrotsearch.randomizedtesting.rules.SystemPropertiesInvariantRule$1.evaluate(SystemPropertiesInvariantRule.java:55)
	at org.apache.lucene.util.TestRuleThreadAndTestName$1.evaluate(TestRuleThreadAndTestName.java:49)
	at org.apache.lucene.util.TestRuleIgnoreAfterMaxFailures$1.evaluate(TestRuleIgnoreAfterMaxFailures.java:70)
	at org.apache.lucene.util.TestRuleMarkFailure$1.evaluate(TestRuleMarkFailure.java:48)
	at com.carrotsearch.randomizedtesting.rules.StatementAdapter.evaluate(StatementAdapter.java:36)
	at com.carrotsearch.randomizedtesting.ThreadLeakControl$StatementRunner.run(ThreadLeakControl.java:358)
	at com.carrotsearch.randomizedtesting.ThreadLeakControl.forkTimeoutingTask(ThreadLeakControl.java:782)
	at com.carrotsearch.randomizedtesting.ThreadLeakControl$3.evaluate(ThreadLeakControl.java:442)
	at com.carrotsearch.randomizedtesting.RandomizedRunner.runSingleTest(RandomizedRunner.java:746)
	at com.carrotsearch.randomizedtesting.RandomizedRunner$3.evaluate(RandomizedRunner.java:648)
	at com.carrotsearch.randomizedtesting.RandomizedRunner$4.evaluate(RandomizedRunner.java:682)
	at com.carrotsearch.randomizedtesting.RandomizedRunner$5.evaluate(RandomizedRunner.java:693)
	at com.carrotsearch.randomizedtesting.rules.StatementAdapter.evaluate(StatementAdapter.java:36)
	at com.carrotsearch.randomizedtesting.rules.SystemPropertiesRestoreRule$1.evaluate(SystemPropertiesRestoreRule.java:53)
	at org.apache.lucene.util.AbstractBeforeAfterRule$1.evaluate(AbstractBeforeAfterRule.java:46)
	at org.apache.lucene.util.TestRuleStoreClassName$1.evaluate(TestRuleStoreClassName.java:42)
	at com.carrotsearch.randomizedtesting.rules.SystemPropertiesInvariantRule$1.evaluate(SystemPropertiesInvariantRule.java:55)
	at com.carrotsearch.randomizedtesting.rules.NoShadowingOrOverridesOnMethodsRule$1.evaluate(NoShadowingOrOverridesOnMethodsRule.java:39)
	at com.carrotsearch.randomizedtesting.rules.NoShadowingOrOverridesOnMethodsRule$1.evaluate(NoShadowingOrOverridesOnMethodsRule.java:39)
	at com.carrotsearch.randomizedtesting.rules.StatementAdapter.evaluate(StatementAdapter.java:36)
	at org.apache.lucene.util.TestRuleAssertionsRequired$1.evaluate(TestRuleAssertionsRequired.java:43)
	at org.apache.lucene.util.TestRuleMarkFailure$1.evaluate(TestRuleMarkFailure.java:48)
	at org.apache.lucene.util.TestRuleIgnoreAfterMaxFailures$1.evaluate(TestRuleIgnoreAfterMaxFailures.java:70)
	at org.apache.lucene.util.TestRuleIgnoreTestSuites$1.evaluate(TestRuleIgnoreTestSuites.java:55)
	at com.carrotsearch.randomizedtesting.rules.StatementAdapter.evaluate(StatementAdapter.java:36)
	at com.carrotsearch.randomizedtesting.ThreadLeakControl$StatementRunner.run(ThreadLeakControl.java:358)
	at java.lang.Thread.run(Thread.java:662)
Caused by: org.apache.http.conn.HttpHostConnectException: Connection to http://127.0.0.1:35678 refused
	at org.apache.http.impl.conn.DefaultClientConnectionOperator.openConnection(DefaultClientConnectionOperator.java:190)
	at org.apache.http.impl.conn.ManagedClientConnectionImpl.open(ManagedClientConnectionImpl.java:294)
	at org.apache.http.impl.client.DefaultRequestDirector.tryConnect(DefaultRequestDirector.java:645)
	at org.apache.http.impl.client.DefaultRequestDirector.execute(DefaultRequestDirector.java:480)
	at org.apache.http.impl.client.AbstractHttpClient.execute(AbstractHttpClient.java:906)
	at org.apache.http.impl.client.AbstractHttpClient.execute(AbstractHttpClient.java:805)
	at org.apache.http.impl.client.AbstractHttpClient.execute(AbstractHttpClient.java:784)
	at org.apache.solr.client.solrj.impl.HttpSolrServer.request(HttpSolrServer.java:365)
	... 45 more
Caused by: java.net.ConnectException: Connection refused
	at java.net.PlainSocketImpl.socketConnect(Native Method)
	at java.net.PlainSocketImpl.doConnect(PlainSocketImpl.java:351)
	at java.net.PlainSocketImpl.connectToAddress(PlainSocketImpl.java:213)
	at java.net.PlainSocketImpl.connect(PlainSocketImpl.java:200)
	at java.net.SocksSocketImpl.connect(SocksSocketImpl.java:366)
	at java.net.Socket.connect(Socket.java:529)
	at org.apache.http.conn.scheme.PlainSocketFactory.connectSocket(PlainSocketFactory.java:127)
	at org.apache.http.impl.conn.DefaultClientConnectionOperator.openConnection(DefaultClientConnectionOperator.java:180)
	... 52 more




Build Log:
[...truncated 9281 lines...]
   [junit4] Suite: org.apache.solr.cloud.CollectionsAPIDistributedZkTest
   [junit4]   2> 845826 T2268 oas.BaseDistributedSearchTestCase.initHostContext Setting hostContext system property: /
   [junit4]   2> 845830 T2268 oas.SolrTestCaseJ4.setUp ###Starting testDistribSearch
   [junit4]   2> Creating dataDir: /mnt/ssd/jenkins/workspace/Lucene-Solr-4.x-Linux/solr/build/solr-core/test/J1/./solrtest-CollectionsAPIDistributedZkTest-1375321839902
   [junit4]   2> 845830 T2268 oasc.ZkTestServer.run STARTING ZK TEST SERVER
   [junit4]   2> 845831 T2269 oasc.ZkTestServer$ZKServerMain.runFromConfig Starting server
   [junit4]   2> 845931 T2268 oasc.ZkTestServer.run start zk server on port:40732
   [junit4]   2> 845932 T2268 oascc.ConnectionManager.waitForConnected Waiting for client to connect to ZooKeeper
   [junit4]   2> 846543 T2275 oascc.ConnectionManager.process Watcher org.apache.solr.common.cloud.ConnectionManager@1b3f06e name:ZooKeeperConnection Watcher:127.0.0.1:40732 got event WatchedEvent state:SyncConnected type:None path:null path:null type:None
   [junit4]   2> 846543 T2268 oascc.ConnectionManager.waitForConnected Client is connected to ZooKeeper
   [junit4]   2> 846543 T2268 oascc.SolrZkClient.makePath makePath: /solr
   [junit4]   2> 846549 T2268 oascc.ConnectionManager.waitForConnected Waiting for client to connect to ZooKeeper
   [junit4]   2> 846550 T2277 oascc.ConnectionManager.process Watcher org.apache.solr.common.cloud.ConnectionManager@13dd0e7 name:ZooKeeperConnection Watcher:127.0.0.1:40732/solr got event WatchedEvent state:SyncConnected type:None path:null path:null type:None
   [junit4]   2> 846550 T2268 oascc.ConnectionManager.waitForConnected Client is connected to ZooKeeper
   [junit4]   2> 846550 T2268 oascc.SolrZkClient.makePath makePath: /collections/collection1
   [junit4]   2> 846554 T2268 oascc.SolrZkClient.makePath makePath: /collections/collection1/shards
   [junit4]   2> 846558 T2268 oascc.SolrZkClient.makePath makePath: /collections/control_collection
   [junit4]   2> 846561 T2268 oascc.SolrZkClient.makePath makePath: /collections/control_collection/shards
   [junit4]   2> 846564 T2268 oasc.AbstractZkTestCase.putConfig put /mnt/ssd/jenkins/workspace/Lucene-Solr-4.x-Linux/solr/build/solr-core/test-files/solr/collection1/conf/solrconfig-tlog.xml to /configs/conf1/solrconfig.xml
   [junit4]   2> 846565 T2268 oascc.SolrZkClient.makePath makePath: /configs/conf1/solrconfig.xml
   [junit4]   2> 846570 T2268 oasc.AbstractZkTestCase.putConfig put /mnt/ssd/jenkins/workspace/Lucene-Solr-4.x-Linux/solr/build/solr-core/test-files/solr/collection1/conf/schema.xml to /configs/conf1/schema.xml
   [junit4]   2> 846571 T2268 oascc.SolrZkClient.makePath makePath: /configs/conf1/schema.xml
   [junit4]   2> 846575 T2268 oasc.AbstractZkTestCase.putConfig put /mnt/ssd/jenkins/workspace/Lucene-Solr-4.x-Linux/solr/build/solr-core/test-files/solr/collection1/conf/stopwords.txt to /configs/conf1/stopwords.txt
   [junit4]   2> 846575 T2268 oascc.SolrZkClient.makePath makePath: /configs/conf1/stopwords.txt
   [junit4]   2> 846579 T2268 oasc.AbstractZkTestCase.putConfig put /mnt/ssd/jenkins/workspace/Lucene-Solr-4.x-Linux/solr/build/solr-core/test-files/solr/collection1/conf/protwords.txt to /configs/conf1/protwords.txt
   [junit4]   2> 846579 T2268 oascc.SolrZkClient.makePath makePath: /configs/conf1/protwords.txt
   [junit4]   2> 846583 T2268 oasc.AbstractZkTestCase.putConfig put /mnt/ssd/jenkins/workspace/Lucene-Solr-4.x-Linux/solr/build/solr-core/test-files/solr/collection1/conf/currency.xml to /configs/conf1/currency.xml
   [junit4]   2> 846584 T2268 oascc.SolrZkClient.makePath makePath: /configs/conf1/currency.xml
   [junit4]   2> 846587 T2268 oasc.AbstractZkTestCase.putConfig put /mnt/ssd/jenkins/workspace/Lucene-Solr-4.x-Linux/solr/build/solr-core/test-files/solr/collection1/conf/open-exchange-rates.json to /configs/conf1/open-exchange-rates.json
   [junit4]   2> 846588 T2268 oascc.SolrZkClient.makePath makePath: /configs/conf1/open-exchange-rates.json
   [junit4]   2> 846591 T2268 oasc.AbstractZkTestCase.putConfig put /mnt/ssd/jenkins/workspace/Lucene-Solr-4.x-Linux/solr/build/solr-core/test-files/solr/collection1/conf/mapping-ISOLatin1Accent.txt to /configs/conf1/mapping-ISOLatin1Accent.txt
   [junit4]   2> 846592 T2268 oascc.SolrZkClient.makePath makePath: /configs/conf1/mapping-ISOLatin1Accent.txt
   [junit4]   2> 846596 T2268 oasc.AbstractZkTestCase.putConfig put /mnt/ssd/jenkins/workspace/Lucene-Solr-4.x-Linux/solr/build/solr-core/test-files/solr/collection1/conf/old_synonyms.txt to /configs/conf1/old_synonyms.txt
   [junit4]   2> 846608 T2268 oascc.SolrZkClient.makePath makePath: /configs/conf1/old_synonyms.txt
   [junit4]   2> 846612 T2268 oasc.AbstractZkTestCase.putConfig put /mnt/ssd/jenkins/workspace/Lucene-Solr-4.x-Linux/solr/build/solr-core/test-files/solr/collection1/conf/synonyms.txt to /configs/conf1/synonyms.txt
   [junit4]   2> 846612 T2268 oascc.SolrZkClient.makePath makePath: /configs/conf1/synonyms.txt
   [junit4]   2> 846688 T2268 oejs.Server.doStart jetty-8.1.10.v20130312
   [junit4]   2> 846692 T2268 oejs.AbstractConnector.doStart Started SelectChannelConnector@127.0.0.1:40152
   [junit4]   2> 846693 T2268 oass.SolrDispatchFilter.init SolrDispatchFilter.init()
   [junit4]   2> 846693 T2268 oasc.SolrResourceLoader.locateSolrHome JNDI not configured for solr (NoInitialContextEx)
   [junit4]   2> 846694 T2268 oasc.SolrResourceLoader.locateSolrHome using system property solr.solr.home: /mnt/ssd/jenkins/workspace/Lucene-Solr-4.x-Linux/solr/build/solr-core/test/J1/./org.apache.solr.cloud.CollectionsAPIDistributedZkTest-controljetty-1375321840689
   [junit4]   2> 846694 T2268 oasc.SolrResourceLoader.<init> new SolrResourceLoader for directory: '/mnt/ssd/jenkins/workspace/Lucene-Solr-4.x-Linux/solr/build/solr-core/test/J1/./org.apache.solr.cloud.CollectionsAPIDistributedZkTest-controljetty-1375321840689/'
   [junit4]   2> 846707 T2268 oasc.ConfigSolr.fromFile Loading container configuration from /mnt/ssd/jenkins/workspace/Lucene-Solr-4.x-Linux/solr/build/solr-core/test/J1/./org.apache.solr.cloud.CollectionsAPIDistributedZkTest-controljetty-1375321840689/solr.xml
   [junit4]   2> 846760 T2268 oasc.ConfigSolrXml.<init> Config-defined core root directory: 
   [junit4]   2> 846761 T2268 oasc.CoreContainer.<init> New CoreContainer 27571052
   [junit4]   2> 846761 T2268 oasc.CoreContainer.load Loading cores into CoreContainer [instanceDir=/mnt/ssd/jenkins/workspace/Lucene-Solr-4.x-Linux/solr/build/solr-core/test/J1/./org.apache.solr.cloud.CollectionsAPIDistributedZkTest-controljetty-1375321840689/]
   [junit4]   2> 846762 T2268 oashc.HttpShardHandlerFactory.getParameter Setting socketTimeout to: 120000
   [junit4]   2> 846762 T2268 oashc.HttpShardHandlerFactory.getParameter Setting urlScheme to: http://
   [junit4]   2> 846763 T2268 oashc.HttpShardHandlerFactory.getParameter Setting connTimeout to: 15000
   [junit4]   2> 846763 T2268 oashc.HttpShardHandlerFactory.getParameter Setting maxConnectionsPerHost to: 20
   [junit4]   2> 846763 T2268 oashc.HttpShardHandlerFactory.getParameter Setting corePoolSize to: 0
   [junit4]   2> 846764 T2268 oashc.HttpShardHandlerFactory.getParameter Setting maximumPoolSize to: 2147483647
   [junit4]   2> 846764 T2268 oashc.HttpShardHandlerFactory.getParameter Setting maxThreadIdleTime to: 5
   [junit4]   2> 846764 T2268 oashc.HttpShardHandlerFactory.getParameter Setting sizeOfQueue to: -1
   [junit4]   2> 846765 T2268 oashc.HttpShardHandlerFactory.getParameter Setting fairnessPolicy to: false
   [junit4]   2> 846765 T2268 oascsi.HttpClientUtil.createClient Creating new http client, config:maxConnectionsPerHost=20&maxConnections=10000&socketTimeout=120000&connTimeout=15000&retry=false
   [junit4]   2> 846768 T2268 oasc.ZkContainer.initZooKeeper Zookeeper client=127.0.0.1:40732/solr
   [junit4]   2> 846768 T2268 oasc.ZkController.checkChrootPath zkHost includes chroot
   [junit4]   2> 846769 T2268 oascc.ConnectionManager.waitForConnected Waiting for client to connect to ZooKeeper
   [junit4]   2> 846770 T2288 oascc.ConnectionManager.process Watcher org.apache.solr.common.cloud.ConnectionManager@1ff89bc name:ZooKeeperConnection Watcher:127.0.0.1:40732 got event WatchedEvent state:SyncConnected type:None path:null path:null type:None
   [junit4]   2> 846771 T2268 oascc.ConnectionManager.waitForConnected Client is connected to ZooKeeper
   [junit4]   2> 846773 T2268 oascsi.HttpClientUtil.createClient Creating new http client, config:maxConnections=500&maxConnectionsPerHost=16&socketTimeout=120000&connTimeout=15000
   [junit4]   2> 846776 T2268 oascc.ConnectionManager.waitForConnected Waiting for client to connect to ZooKeeper
   [junit4]   2> 846777 T2290 oascc.ConnectionManager.process Watcher org.apache.solr.common.cloud.ConnectionManager@8a067a name:ZooKeeperConnection Watcher:127.0.0.1:40732/solr got event WatchedEvent state:SyncConnected type:None path:null path:null type:None
   [junit4]   2> 846777 T2268 oascc.ConnectionManager.waitForConnected Client is connected to ZooKeeper
   [junit4]   2> 846779 T2268 oascc.SolrZkClient.makePath makePath: /overseer/queue
   [junit4]   2> 846784 T2268 oascc.SolrZkClient.makePath makePath: /overseer/collection-queue-work
   [junit4]   2> 846789 T2268 oascc.SolrZkClient.makePath makePath: /live_nodes
   [junit4]   2> 846792 T2268 oasc.ZkController.createEphemeralLiveNode Register node as live in ZooKeeper:/live_nodes/127.0.0.1:40152_
   [junit4]   2> 846793 T2268 oascc.SolrZkClient.makePath makePath: /live_nodes/127.0.0.1:40152_
   [junit4]   2> 846798 T2268 oascc.SolrZkClient.makePath makePath: /overseer_elect/election
   [junit4]   2> 846805 T2268 oascc.SolrZkClient.makePath makePath: /overseer_elect/leader
   [junit4]   2> 846808 T2268 oasc.Overseer.start Overseer (id=90133092099948547-127.0.0.1:40152_-n_0000000000) starting
   [junit4]   2> 846812 T2268 oascc.SolrZkClient.makePath makePath: /overseer/queue-work
   [junit4]   2> 846817 T2292 oasc.OverseerCollectionProcessor.run Process current queue of collection creations
   [junit4]   2> 846819 T2268 oascc.SolrZkClient.makePath makePath: /clusterstate.json
   [junit4]   2> 846822 T2268 oascc.SolrZkClient.makePath makePath: /aliases.json
   [junit4]   2> 846825 T2268 oascc.ZkStateReader.createClusterStateWatchersAndUpdate Updating cluster state from ZooKeeper... 
   [junit4]   2> 846829 T2291 oasc.Overseer$ClusterStateUpdater.run Starting to work on the main queue
   [junit4]   2> 846832 T2268 oasc.CorePropertiesLocator.discover Looking for core definitions underneath /mnt/ssd/jenkins/workspace/Lucene-Solr-4.x-Linux/solr/build/solr-core/test/J1/./org.apache.solr.cloud.CollectionsAPIDistributedZkTest-controljetty-1375321840689
   [junit4]   2> 846855 T2268 oasc.CorePropertiesLocator.discoverUnder Found core conf in /mnt/ssd/jenkins/workspace/Lucene-Solr-4.x-Linux/solr/build/solr-core/test/J1/./org.apache.solr.cloud.CollectionsAPIDistributedZkTest-controljetty-1375321840689/conf/
   [junit4]   2> 846856 T2268 oasc.CorePropertiesLocator.discover Found 1 core definitions
   [junit4]   2> 846856 T2268 oass.SolrDispatchFilter.init user.dir=/mnt/ssd/jenkins/workspace/Lucene-Solr-4.x-Linux/solr/build/solr-core/test/J1
   [junit4]   2> 846856 T2268 oass.SolrDispatchFilter.init SolrDispatchFilter.init() done
   [junit4]   2> 846857 T2268 oascsi.HttpClientUtil.createClient Creating new http client, config:maxConnections=128&maxConnectionsPerHost=32&followRedirects=false
   [junit4]   2> 846859 T2268 oascsi.HttpClientUtil.createClient Creating new http client, config:
   [junit4]   2> 846860 T2268 oascc.ConnectionManager.waitForConnected Waiting for client to connect to ZooKeeper
   [junit4]   2> 846862 T2295 oascc.ConnectionManager.process Watcher org.apache.solr.common.cloud.ConnectionManager@9517d8 name:ZooKeeperConnection Watcher:127.0.0.1:40732/solr got event WatchedEvent state:SyncConnected type:None path:null path:null type:None
   [junit4]   2> 846862 T2268 oascc.ConnectionManager.waitForConnected Client is connected to ZooKeeper
   [junit4]   2> 846864 T2268 oascc.ZkStateReader.createClusterStateWatchersAndUpdate Updating cluster state from ZooKeeper... 
   [junit4]   2> 846867 T2268 oasc.ChaosMonkey.monkeyLog monkey: init - expire sessions:true cause connection loss:true
   [junit4]   2> 846943 T2268 oejs.Server.doStart jetty-8.1.10.v20130312
   [junit4]   2> 846945 T2268 oejs.AbstractConnector.doStart Started SelectChannelConnector@127.0.0.1:43146
   [junit4]   2> 846946 T2268 oass.SolrDispatchFilter.init SolrDispatchFilter.init()
   [junit4]   2> 846946 T2268 oasc.SolrResourceLoader.locateSolrHome JNDI not configured for solr (NoInitialContextEx)
   [junit4]   2> 846946 T2268 oasc.SolrResourceLoader.locateSolrHome using system property solr.solr.home: /mnt/ssd/jenkins/workspace/Lucene-Solr-4.x-Linux/solr/build/solr-core/test/J1/./org.apache.solr.cloud.CollectionsAPIDistributedZkTest-jetty1-1375321840939
   [junit4]   2> 846947 T2268 oasc.SolrResourceLoader.<init> new SolrResourceLoader for directory: '/mnt/ssd/jenkins/workspace/Lucene-Solr-4.x-Linux/solr/build/solr-core/test/J1/./org.apache.solr.cloud.CollectionsAPIDistributedZkTest-jetty1-1375321840939/'
   [junit4]   2> 846958 T2268 oasc.ConfigSolr.fromFile Loading container configuration from /mnt/ssd/jenkins/workspace/Lucene-Solr-4.x-Linux/solr/build/solr-core/test/J1/./org.apache.solr.cloud.CollectionsAPIDistributedZkTest-jetty1-1375321840939/solr.xml
   [junit4]   2> 847001 T2268 oasc.ConfigSolrXml.<init> Config-defined core root directory: 
   [junit4]   2> 847001 T2268 oasc.CoreContainer.<init> New CoreContainer 2162788
   [junit4]   2> 847002 T2268 oasc.CoreContainer.load Loading cores into CoreContainer [instanceDir=/mnt/ssd/jenkins/workspace/Lucene-Solr-4.x-Linux/solr/build/solr-core/test/J1/./org.apache.solr.cloud.CollectionsAPIDistributedZkTest-jetty1-1375321840939/]
   [junit4]   2> 847003 T2268 oashc.HttpShardHandlerFactory.getParameter Setting socketTimeout to: 120000
   [junit4]   2> 847003 T2268 oashc.HttpShardHandlerFactory.getParameter Setting urlScheme to: http://
   [junit4]   2> 847004 T2268 oashc.HttpShardHandlerFactory.getParameter Setting connTimeout to: 15000
   [junit4]   2> 847004 T2268 oashc.HttpShardHandlerFactory.getParameter Setting maxConnectionsPerHost to: 20
   [junit4]   2> 847004 T2268 oashc.HttpShardHandlerFactory.getParameter Setting corePoolSize to: 0
   [junit4]   2> 847005 T2268 oashc.HttpShardHandlerFactory.getParameter Setting maximumPoolSize to: 2147483647
   [junit4]   2> 847005 T2268 oashc.HttpShardHandlerFactory.getParameter Setting maxThreadIdleTime to: 5
   [junit4]   2> 847005 T2268 oashc.HttpShardHandlerFactory.getParameter Setting sizeOfQueue to: -1
   [junit4]   2> 847006 T2268 oashc.HttpShardHandlerFactory.getParameter Setting fairnessPolicy to: false
   [junit4]   2> 847006 T2268 oascsi.HttpClientUtil.createClient Creating new http client, config:maxConnectionsPerHost=20&maxConnections=10000&socketTimeout=120000&connTimeout=15000&retry=false
   [junit4]   2> 847016 T2268 oasc.ZkContainer.initZooKeeper Zookeeper client=127.0.0.1:40732/solr
   [junit4]   2> 847017 T2268 oasc.ZkController.checkChrootPath zkHost includes chroot
   [junit4]   2> 847018 T2268 oascc.ConnectionManager.waitForConnected Waiting for client to connect to ZooKeeper
   [junit4]   2> 847019 T2306 oascc.ConnectionManager.process Watcher org.apache.solr.common.cloud.ConnectionManager@2a23f3 name:ZooKeeperConnection Watcher:127.0.0.1:40732 got event WatchedEvent state:SyncConnected type:None path:null path:null type:None
   [junit4]   2> 847019 T2268 oascc.ConnectionManager.waitForConnected Client is connected to ZooKeeper
   [junit4]   2> 847023 T2268 oascsi.HttpClientUtil.createClient Creating new http client, config:maxConnections=500&maxConnectionsPerHost=16&socketTimeout=120000&connTimeout=15000
   [junit4]   2> 847025 T2268 oascc.ConnectionManager.waitForConnected Waiting for client to connect to ZooKeeper
   [junit4]   2> 847027 T2308 oascc.ConnectionManager.process Watcher org.apache.solr.common.cloud.ConnectionManager@1f1d9e9 name:ZooKeeperConnection Watcher:127.0.0.1:40732/solr got event WatchedEvent state:SyncConnected type:None path:null path:null type:None
   [junit4]   2> 847028 T2268 oascc.ConnectionManager.waitForConnected Client is connected to ZooKeeper
   [junit4]   2> 847035 T2268 oascc.ZkStateReader.createClusterStateWatchersAndUpdate Updating cluster state from ZooKeeper... 
   [junit4]   2> 848040 T2268 oasc.ZkController.createEphemeralLiveNode Register node as live in ZooKeeper:/live_nodes/127.0.0.1:43146_
   [junit4]   2> 848042 T2268 oascc.SolrZkClient.makePath makePath: /live_nodes/127.0.0.1:43146_
   [junit4]   2> 848048 T2290 oascc.ZkStateReader$3.process Updating live nodes... (2)
   [junit4]   2> 848057 T2295 oascc.ZkStateReader$3.process Updating live nodes... (2)
   [junit4]   2> 848057 T2308 oascc.ZkStateReader$3.process Updating live nodes... (2)
   [junit4]   2> 848066 T2268 oasc.CorePropertiesLocator.discover Looking for core definitions underneath /mnt/ssd/jenkins/workspace/Lucene-Solr-4.x-Linux/solr/build/solr-core/test/J1/./org.apache.solr.cloud.CollectionsAPIDistributedZkTest-jetty1-1375321840939
   [junit4]   2> 848122 T2268 oasc.CorePropertiesLocator.discoverUnder Found core conf in /mnt/ssd/jenkins/workspace/Lucene-Solr-4.x-Linux/solr/build/solr-core/test/J1/./org.apache.solr.cloud.CollectionsAPIDistributedZkTest-jetty1-1375321840939/conf/
   [junit4]   2> 848123 T2268 oasc.CorePropertiesLocator.discover Found 1 core definitions
   [junit4]   2> 848128 T2268 oass.SolrDispatchFilter.init user.dir=/mnt/ssd/jenkins/workspace/Lucene-Solr-4.x-Linux/solr/build/solr-core/test/J1
   [junit4]   2> 848129 T2268 oass.SolrDispatchFilter.init SolrDispatchFilter.init() done
   [junit4]   2> 848129 T2268 oascsi.HttpClientUtil.createClient Creating new http client, config:maxConnections=128&maxConnectionsPerHost=32&followRedirects=false
   [junit4]   2> 848219 T2268 oejs.Server.doStart jetty-8.1.10.v20130312
   [junit4]   2> 848228 T2268 oejs.AbstractConnector.doStart Started SelectChannelConnector@127.0.0.1:35678
   [junit4]   2> 848229 T2268 oass.SolrDispatchFilter.init SolrDispatchFilter.init()
   [junit4]   2> 848230 T2268 oasc.SolrResourceLoader.locateSolrHome JNDI not configured for solr (NoInitialContextEx)
   [junit4]   2> 848230 T2268 oasc.SolrResourceLoader.locateSolrHome using system property solr.solr.home: /mnt/ssd/jenkins/workspace/Lucene-Solr-4.x-Linux/solr/build/solr-core/test/J1/./org.apache.solr.cloud.CollectionsAPIDistributedZkTest-jetty2-1375321842204
   [junit4]   2> 848231 T2268 oasc.SolrResourceLoader.<init> new SolrResourceLoader for directory: '/mnt/ssd/jenkins/workspace/Lucene-Solr-4.x-Linux/solr/build/solr-core/test/J1/./org.apache.solr.cloud.CollectionsAPIDistributedZkTest-jetty2-1375321842204/'
   [junit4]   2> 848258 T2268 oasc.ConfigSolr.fromFile Loading container configuration from /mnt/ssd/jenkins/workspace/Lucene-Solr-4.x-Linux/solr/build/solr-core/test/J1/./org.apache.solr.cloud.CollectionsAPIDistributedZkTest-jetty2-1375321842204/solr.xml
   [junit4]   2> 848336 T2268 oasc.ConfigSolrXml.<init> Config-defined core root directory: 
   [junit4]   2> 848337 T2268 oasc.CoreContainer.<init> New CoreContainer 9720620
   [junit4]   2> 848338 T2268 oasc.CoreContainer.load Loading cores into CoreContainer [instanceDir=/mnt/ssd/jenkins/workspace/Lucene-Solr-4.x-Linux/solr/build/solr-core/test/J1/./org.apache.solr.cloud.CollectionsAPIDistributedZkTest-jetty2-1375321842204/]
   [junit4]   2> 848340 T2268 oashc.HttpShardHandlerFactory.getParameter Setting socketTimeout to: 120000
   [junit4]   2> 848340 T2268 oashc.HttpShardHandlerFactory.getParameter Setting urlScheme to: http://
   [junit4]   2> 848341 T2268 oashc.HttpShardHandlerFactory.getParameter Setting connTimeout to: 15000
   [junit4]   2> 848341 T2268 oashc.HttpShardHandlerFactory.getParameter Setting maxConnectionsPerHost to: 20
   [junit4]   2> 848350 T2268 oashc.HttpShardHandlerFactory.getParameter Setting corePoolSize to: 0
   [junit4]   2> 848351 T2268 oashc.HttpShardHandlerFactory.getParameter Setting maximumPoolSize to: 2147483647
   [junit4]   2> 848352 T2268 oashc.HttpShardHandlerFactory.getParameter Setting maxThreadIdleTime to: 5
   [junit4]   2> 848352 T2268 oashc.HttpShardHandlerFactory.getParameter Setting sizeOfQueue to: -1
   [junit4]   2> 848353 T2268 oashc.HttpShardHandlerFactory.getParameter Setting fairnessPolicy to: false
   [junit4]   2> 848353 T2268 oascsi.HttpClientUtil.createClient Creating new http client, config:maxConnectionsPerHost=20&maxConnections=10000&socketTimeout=120000&connTimeout=15000&retry=false
   [junit4]   2> 848358 T2268 oasc.ZkContainer.initZooKeeper Zookeeper client=127.0.0.1:40732/solr
   [junit4]   2> 848358 T2268 oasc.ZkController.checkChrootPath zkHost includes chroot
   [junit4]   2> 848369 T2268 oascc.ConnectionManager.waitForConnected Waiting for client to connect to ZooKeeper
   [junit4]   2> 848370 T2320 oascc.ConnectionManager.process Watcher org.apache.solr.common.cloud.ConnectionManager@1e07f70 name:ZooKeeperConnection Watcher:127.0.0.1:40732 got event WatchedEvent state:SyncConnected type:None path:null path:null type:None
   [junit4]   2> 848370 T2268 oascc.ConnectionManager.waitForConnected Client is connected to ZooKeeper
   [junit4]   2> 848374 T2268 oascsi.HttpClientUtil.createClient Creating new http client, config:maxConnections=500&maxConnectionsPerHost=16&socketTimeout=120000&connTimeout=15000
   [junit4]   2> 848387 T2268 oascc.ConnectionManager.waitForConnected Waiting for client to connect to ZooKeeper
   [junit4]   2> 848388 T2322 oascc.ConnectionManager.process Watcher org.apache.solr.common.cloud.ConnectionManager@ae8db7 name:ZooKeeperConnection Watcher:127.0.0.1:40732/solr got event WatchedEvent state:SyncConnected type:None path:null path:null type:None
   [junit4]   2> 848388 T2268 oascc.ConnectionManager.waitForConnected Client is connected to ZooKeeper
   [junit4]   2> 848411 T2268 oascc.ZkStateReader.createClusterStateWatchersAndUpdate Updating cluster state from ZooKeeper... 
   [junit4]   2> 849424 T2268 oasc.ZkController.createEphemeralLiveNode Register node as live in ZooKeeper:/live_nodes/127.0.0.1:35678_
   [junit4]   2> 849426 T2268 oascc.SolrZkClient.makePath makePath: /live_nodes/127.0.0.1:35678_
   [junit4]   2> 849433 T2308 oascc.ZkStateReader$3.process Updating live nodes... (3)
   [junit4]   2> 849433 T2295 oascc.ZkStateReader$3.process Updating live nodes... (3)
   [junit4]   2> 849435 T2290 oascc.ZkStateReader$3.process Updating live nodes... (3)
   [junit4]   2> 849436 T2322 oascc.ZkStateReader$3.process Updating live nodes... (3)
   [junit4]   2> 849445 T2268 oasc.CorePropertiesLocator.discover Looking for core definitions underneath /mnt/ssd/jenkins/workspace/Lucene-Solr-4.x-Linux/solr/build/solr-core/test/J1/./org.apache.solr.cloud.CollectionsAPIDistributedZkTest-jetty2-1375321842204
   [junit4]   2> 849496 T2268 oasc.CorePropertiesLocator.discoverUnder Found core conf in /mnt/ssd/jenkins/workspace/Lucene-Solr-4.x-Linux/solr/build/solr-core/test/J1/./org.apache.solr.cloud.CollectionsAPIDistributedZkTest-jetty2-1375321842204/conf/
   [junit4]   2> 849497 T2268 oasc.CorePropertiesLocator.discover Found 1 core definitions
   [junit4]   2> 849498 T2268 oass.SolrDispatchFilter.init user.dir=/mnt/ssd/jenkins/workspace/Lucene-Solr-4.x-Linux/solr/build/solr-core/test/J1
   [junit4]   2> 849498 T2268 oass.SolrDispatchFilter.init SolrDispatchFilter.init() done
   [junit4]   2> 849499 T2268 oascsi.HttpClientUtil.createClient Creating new http client, config:maxConnections=128&maxConnectionsPerHost=32&followRedirects=false
   [junit4]   2> 849596 T2268 oejs.Server.doStart jetty-8.1.10.v20130312
   [junit4]   2> 849602 T2268 oejs.AbstractConnector.doStart Started SelectChannelConnector@127.0.0.1:38185
   [junit4]   2> 849602 T2268 oass.SolrDispatchFilter.init SolrDispatchFilter.init()
   [junit4]   2> 849603 T2268 oasc.SolrResourceLoader.locateSolrHome JNDI not configured for solr (NoInitialContextEx)
   [junit4]   2> 849605 T2268 oasc.SolrResourceLoader.locateSolrHome using system property solr.solr.home: /mnt/ssd/jenkins/workspace/Lucene-Solr-4.x-Linux/solr/build/solr-core/test/J1/./org.apache.solr.cloud.CollectionsAPIDistributedZkTest-jetty3-1375321843574
   [junit4]   2> 849605 T2268 oasc.SolrResourceLoader.<init> new SolrResourceLoader for directory: '/mnt/ssd/jenkins/workspace/Lucene-Solr-4.x-Linux/solr/build/solr-core/test/J1/./org.apache.solr.cloud.CollectionsAPIDistributedZkTest-jetty3-1375321843574/'
   [junit4]   2> 849622 T2268 oasc.ConfigSolr.fromFile Loading container configuration from /mnt/ssd/jenkins/workspace/Lucene-Solr-4.x-Linux/solr/build/solr-core/test/J1/./org.apache.solr.cloud.CollectionsAPIDistributedZkTest-jetty3-1375321843574/solr.xml
   [junit4]   2> 849694 T2268 oasc.ConfigSolrXml.<init> Config-defined core root directory: 
   [junit4]   2> 849695 T2268 oasc.CoreContainer.<init> New CoreContainer 30360104
   [junit4]   2> 849696 T2268 oasc.CoreContainer.load Loading cores into CoreContainer [instanceDir=/mnt/ssd/jenkins/workspace/Lucene-Solr-4.x-Linux/solr/build/solr-core/test/J1/./org.apache.solr.cloud.CollectionsAPIDistributedZkTest-jetty3-1375321843574/]
   [junit4]   2> 849697 T2268 oashc.HttpShardHandlerFactory.getParameter Setting socketTimeout to: 120000
   [junit4]   2> 849698 T2268 oashc.HttpShardHandlerFactory.getParameter Setting urlScheme to: http://
   [junit4]   2> 849698 T2268 oashc.HttpShardHandlerFactory.getParameter Setting connTimeout to: 15000
   [junit4]   2> 849699 T2268 oashc.HttpShardHandlerFactory.getParameter Setting maxConnectionsPerHost to: 20
   [junit4]   2> 849699 T2268 oashc.HttpShardHandlerFactory.getParameter Setting corePoolSize to: 0
   [junit4]   2> 849700 T2268 oashc.HttpShardHandlerFactory.getParameter Setting maximumPoolSize to: 2147483647
   [junit4]   2> 849701 T2268 oashc.HttpShardHandlerFactory.getParameter Setting maxThreadIdleTime to: 5
   [junit4]   2> 849701 T2268 oashc.HttpShardHandlerFactory.getParameter Setting sizeOfQueue to: -1
   [junit4]   2> 849702 T2268 oashc.HttpShardHandlerFactory.getParameter Setting fairnessPolicy to: false
   [junit4]   2> 849702 T2268 oascsi.HttpClientUtil.createClient Creating new http client, config:maxConnectionsPerHost=20&maxConnections=10000&socketTimeout=120000&connTimeout=15000&retry=false
   [junit4]   2> 849707 T2268 oasc.ZkContainer.initZooKeeper Zookeeper client=127.0.0.1:40732/solr
   [junit4]   2> 849707 T2268 oasc.ZkController.checkChrootPath zkHost includes chroot
   [junit4]   2> 849709 T2268 oascc.ConnectionManager.waitForConnected Waiting for client to connect to ZooKeeper
   [junit4]   2> 849710 T2334 oascc.ConnectionManager.process Watcher org.apache.solr.common.cloud.ConnectionManager@5b47 name:ZooKeeperConnection Watcher:127.0.0.1:40732 got event WatchedEvent state:SyncConnected type:None path:null path:null type:None
   [junit4]   2> 849711 T2268 oascc.ConnectionManager.waitForConnected Client is connected to ZooKeeper
   [junit4]   2> 849715 T2268 oascsi.HttpClientUtil.createClient Creating new http client, config:maxConnections=500&maxConnectionsPerHost=16&socketTimeout=120000&connTimeout=15000
   [junit4]   2> 849720 T2268 oascc.ConnectionManager.waitForConnected Waiting for client to connect to ZooKeeper
   [junit4]   2> 849722 T2336 oascc.ConnectionManager.process Watcher org.apache.solr.common.cloud.ConnectionManager@a67c68 name:ZooKeeperConnection Watcher:127.0.0.1:40732/solr got event WatchedEvent state:SyncConnected type:None path:null path:null type:None
   [junit4]   2> 849723 T2268 oascc.ConnectionManager.waitForConnected Client is connected to ZooKeeper
   [junit4]   2> 849734 T2268 oascc.ZkStateReader.createClusterStateWatchersAndUpdate Updating cluster state from ZooKeeper... 
   [junit4]   2> 850744 T2268 oasc.ZkController.createEphemeralLiveNode Register node as live in ZooKeeper:/live_nodes/127.0.0.1:38185_
   [junit4]   2> 850746 T2268 oascc.SolrZkClient.makePath makePath: /live_nodes/127.0.0.1:38185_
   [junit4]   2> 850753 T2290 oascc.ZkStateReader$3.process Updating live nodes... (4)
   [junit4]   2> 850754 T2322 oascc.ZkStateReader$3.process Updating live nodes... (4)
   [junit4]   2> 850755 T2308 oascc.ZkStateReader$3.process Updating live nodes... (4)
   [junit4]   2> 850755 T2295 oascc.ZkStateReader$3.process Updating live nodes... (4)
   [junit4]   2> 850756 T2336 oascc.ZkStateReader$3.process Updating live nodes... (4)
   [junit4]   2> 850764 T2268 oasc.CorePropertiesLocator.discover Looking for core definitions underneath /mnt/ssd/jenkins/workspace/Lucene-Solr-4.x-Linux/solr/build/solr-core/test/J1/./org.apache.solr.cloud.CollectionsAPIDistributedZkTest-jetty3-1375321843574
   [junit4]   2> 850809 T2268 oasc.CorePropertiesLocator.discoverUnder Found core conf in /mnt/ssd/jenkins/workspace/Lucene-Solr-4.x-Linux/solr/build/solr-core/test/J1/./org.apache.solr.cloud.CollectionsAPIDistributedZkTest-jetty3-1375321843574/conf/
   [junit4]   2> 850810 T2268 oasc.CorePropertiesLocator.discover Found 1 core definitions
   [junit4]   2> 850810 T2268 oass.SolrDispatchFilter.init user.dir=/mnt/ssd/jenkins/workspace/Lucene-Solr-4.x-Linux/solr/build/solr-core/test/J1
   [junit4]   2> 850811 T2268 oass.SolrDispatchFilter.init SolrDispatchFilter.init() done
   [junit4]   2> 850811 T2268 oascsi.HttpClientUtil.createClient Creating new http client, config:maxConnections=128&maxConnectionsPerHost=32&followRedirects=false
   [junit4]   2> 850939 T2268 oejs.Server.doStart jetty-8.1.10.v20130312
   [junit4]   2> 850941 T2268 oejs.AbstractConnector.doStart Started SelectChannelConnector@127.0.0.1:37889
   [junit4]   2> 850942 T2268 oass.SolrDispatchFilter.init SolrDispatchFilter.init()
   [junit4]   2> 850943 T2268 oasc.SolrResourceLoader.locateSolrHome JNDI not configured for solr (NoInitialContextEx)
   [junit4]   2> 850943 T2268 oasc.SolrResourceLoader.locateSolrHome using system property solr.solr.home: /mnt/ssd/jenkins/workspace/Lucene-Solr-4.x-Linux/solr/build/solr-core/test/J1/./org.apache.solr.cloud.CollectionsAPIDistributedZkTest-jetty4-1375321844886
   [junit4]   2> 850944 T2268 oasc.SolrResourceLoader.<init> new SolrResourceLoader for directory: '/mnt/ssd/jenkins/workspace/Lucene-Solr-4.x-Linux/solr/build/solr-core/test/J1/./org.apache.solr.cloud.CollectionsAPIDistributedZkTest-jetty4-1375321844886/'
   [junit4]   2> 850961 T2268 oasc.ConfigSolr.fromFile Loading container configuration from /mnt/ssd/jenkins/workspace/Lucene-Solr-4.x-Linux/solr/build/solr-core/test/J1/./org.apache.solr.cloud.CollectionsAPIDistributedZkTest-jetty4-1375321844886/solr.xml
   [junit4]   2> 851021 T2268 oasc.ConfigSolrXml.<init> Config-defined core root directory: 
   [junit4]   2> 851022 T2268 oasc.CoreContainer.<init> New CoreContainer 22456716
   [junit4]   2> 851022 T2268 oasc.CoreContainer.load Loading cores into CoreContainer [instanceDir=/mnt/ssd/jenkins/workspace/Lucene-Solr-4.x-Linux/solr/build/solr-core/test/J1/./org.apache.solr.cloud.CollectionsAPIDistributedZkTest-jetty4-1375321844886/]
   [junit4]   2> 851024 T2268 oashc.HttpShardHandlerFactory.getParameter Setting socketTimeout to: 120000
   [junit4]   2> 851024 T2268 oashc.HttpShardHandlerFactory.getParameter Setting urlScheme to: http://
   [junit4]   2> 851025 T2268 oashc.HttpShardHandlerFactory.getParameter Setting connTimeout to: 15000
   [junit4]   2> 851025 T2268 oashc.HttpShardHandlerFactory.getParameter Setting maxConnectionsPerHost to: 20
   [junit4]   2> 851026 T2268 oashc.HttpShardHandlerFactory.getParameter Setting corePoolSize to: 0
   [junit4]   2> 851026 T2268 oashc.HttpShardHandlerFactory.getParameter Setting maximumPoolSize to: 2147483647
   [junit4]   2> 851027 T2268 oashc.HttpShardHandlerFactory.getParameter Setting maxThreadIdleTime to: 5
   [junit4]   2> 851027 T2268 oashc.HttpShardHandlerFactory.getParameter Setting sizeOfQueue to: -1
   [junit4]   2> 851028 T2268 oashc.HttpShardHandlerFactory.getParameter Setting fairnessPolicy to: false
   [junit4]   2> 851028 T2268 oascsi.HttpClientUtil.createClient Creating new http client, config:maxConnectionsPerHost=20&maxConnections=10000&socketTimeout=120000&connTimeout=15000&retry=false
   [junit4]   2> 851032 T2268 oasc.ZkContainer.initZooKeeper Zookeeper client=127.0.0.1:40732/solr
   [junit4]   2> 851032 T2268 oasc.ZkController.checkChrootPath zkHost includes chroot
   [junit4]   2> 851033 T2268 oascc.ConnectionManager.waitForConnected Waiting for client to connect to ZooKeeper
   [junit4]   2> 851036 T2348 oascc.ConnectionManager.process Watcher org.apache.solr.common.cloud.ConnectionManager@954bf1 name:ZooKeeperConnection Watcher:127.0.0.1:40732 got event WatchedEvent state:SyncConnected type:None path:null path:null type:None
   [junit4]   2> 851036 T2268 oascc.ConnectionManager.waitForConnected Client is connected to ZooKeeper
   [junit4]   2> 851042 T2268 oascsi.HttpClientUtil.createClient Creating new http client, config:maxConnections=500&maxConnectionsPerHost=16&socketTimeout=120000&connTimeout=15000
   [junit4]   2> 851046 T2268 oascc.ConnectionManager.waitForConnected Waiting for client to connect to ZooKeeper
   [junit4]   2> 851047 T2350 oascc.ConnectionManager.process Watcher org.apache.solr.common.cloud.ConnectionManager@803645 name:ZooKeeperConnection Watcher:127.0.0.1:40732/solr got event WatchedEvent state:SyncConnected type:None path:null path:null type:None
   [junit4]   2> 851048 T2268 oascc.ConnectionManager.waitForConnected Client is connected to ZooKeeper
   [junit4]   2> 851058 T2268 oascc.ZkStateReader.createClusterStateWatchersAndUpdate Updating cluster state from ZooKeeper... 
   [junit4]   2> 852074 T2268 oasc.ZkController.createEphemeralLiveNode Register node as live in ZooKeeper:/live_nodes/127.0.0.1:37889_
   [junit4]   2> 852076 T2268 oascc.SolrZkClient.makePath makePath: /live_nodes/127.0.0.1:37889_
   [junit4]   2> 852083 T2308 oascc.ZkStateReader$3.process Updating live nodes... (5)
   [junit4]   2> 852085 T2336 oascc.ZkStateReader$3.process Updating live nodes... (5)
   [junit4]   2> 852086 T2290 oascc.ZkStateReader$3.process Updating live nodes... (5)
   [junit4]   2> 852088 T2322 oascc.ZkStateReader$3.process Updating live nodes... (5)
   [junit4]   2> 852088 T2350 oascc.ZkStateReader$3.process Updating live nodes... (5)
   [junit4]   2> 852089 T2295 oascc.ZkStateReader$3.process Updating live nodes... (5)
   [junit4]   2> 852099 T2268 oasc.CorePropertiesLocator.discover Looking for core definitions underneath /mnt/ssd/jenkins/workspace/Lucene-Solr-4.x-Linux/solr/build/solr-core/test/J1/./org.apache.solr.cloud.CollectionsAPIDistributedZkTest-jetty4-1375321844886
   [junit4]   2> 852141 T2268 oasc.CorePropertiesLocator.discoverUnder Found core conf in /mnt/ssd/jenkins/workspace/Lucene-Solr-4.x-Linux/solr/build/solr-core/test/J1/./org.apache.solr.cloud.CollectionsAPIDistributedZkTest-jetty4-1375321844886/conf/
   [junit4]   2> 852142 T2268 oasc.CorePropertiesLocator.discover Found 1 core definitions
   [junit4]   2> 852143 T2268 oass.SolrDispatchFilter.init user.dir=/mnt/ssd/jenkins/workspace/Lucene-Solr-4.x-Linux/solr/build/solr-core/test/J1
   [junit4]   2> 852143 T2268 oass.SolrDispatchFilter.init SolrDispatchFilter.init() done
   [junit4]   2> 852144 T2268 oascsi.HttpClientUtil.createClient Creating new http client, config:maxConnections=128&maxConnectionsPerHost=32&followRedirects=false
   [junit4]   2> 852150 T2268 oascsi.HttpClientUtil.createClient Creating new http client, config:maxConnections=128&maxConnectionsPerHost=32&followRedirects=false
   [junit4]   2> 852156 T2301 oasha.CollectionsHandler.handleCreateAction Creating Collection : numShards=2&name=nodes_used_collection&replicationFactor=2&action=CREATE&wt=javabin&version=2
   [junit4]   2> 852160 T2290 oasc.DistributedQueue$LatchChildWatcher.process Watcher fired on path: /overseer/collection-queue-work state: SyncConnected type NodeChildrenChanged
   [junit4]   2> 852163 T2292 oasc.OverseerCollectionProcessor.run Overseer Collection Processor: Get the message id:/overseer/collection-queue-work/qn-0000000000 message:{
   [junit4]   2> 	  "operation":"createcollection",
   [junit4]   2> 	  "numShards":"2",
   [junit4]   2> 	  "name":"nodes_used_collection",
   [junit4]   2> 	  "replicationFactor":"2"}
   [junit4]   2> 852163 T2292 oasc.OverseerCollectionProcessor.processMessage WARN OverseerCollectionProcessor.processMessage : createcollection , {
   [junit4]   2> 	  "operation":"createcollection",
   [junit4]   2> 	  "numShards":"2",
   [junit4]   2> 	  "name":"nodes_used_collection",
   [junit4]   2> 	  "replicationFactor":"2"}
   [junit4]   2> 852164 T2290 oasc.DistributedQueue$LatchChildWatcher.process Watcher fired on path: /overseer/collection-queue-work state: SyncConnected type NodeChildrenChanged
   [junit4]   2> 852844 T2291 oascc.ZkStateReader.updateClusterState Updating cloud state from ZooKeeper... 
   [junit4]   2> 852845 T2291 oasc.Overseer$ClusterStateUpdater.buildCollection building a new collection: nodes_used_collection
   [junit4]   2> 852845 T2291 oasc.Overseer$ClusterStateUpdater.createCollection Create collection nodes_used_collection with shards [shard1, shard2]
   [junit4]   2> 852854 T2350 oascc.ZkStateReader$2.process A cluster state change: WatchedEvent state:SyncConnected type:NodeDataChanged path:/clusterstate.json, has occurred - updating... (live nodes size: 5)
   [junit4]   2> 852854 T2336 oascc.ZkStateReader$2.process A cluster state change: WatchedEvent state:SyncConnected type:NodeDataChanged path:/clusterstate.json, has occurred - updating... (live nodes size: 5)
   [junit4]   2> 852854 T2322 oascc.ZkStateReader$2.process A cluster state change: WatchedEvent state:SyncConnected type:NodeDataChanged path:/clusterstate.json, has occurred - updating... (live nodes size: 5)
   [junit4]   2> 852854 T2295 oascc.ZkStateReader$2.process A cluster state change: WatchedEvent state:SyncConnected type:NodeDataChanged path:/clusterstate.json, has occurred - updating... (live nodes size: 5)
   [junit4]   2> 852855 T2290 oascc.ZkStateReader$2.process A cluster state change: WatchedEvent state:SyncConnected type:NodeDataChanged path:/clusterstate.json, has occurred - updating... (live nodes size: 5)
   [junit4]   2> 852854 T2308 oascc.ZkStateReader$2.process A cluster state change: WatchedEvent state:SyncConnected type:NodeDataChanged path:/clusterstate.json, has occurred - updating... (live nodes size: 5)
   [junit4]   2> 852970 T2292 oasc.OverseerCollectionProcessor.createCollection going to create cores replicas shardNames [shard1, shard2] , repFactor : 2
   [junit4]   2> 852970 T2292 oasc.OverseerCollectionProcessor.createCollection Creating shard nodes_used_collection_shard1_replica1 as part of slice shard1 of collection nodes_used_collection on 127.0.0.1:40152_
   [junit4]   2> 852971 T2292 oasc.OverseerCollectionProcessor.createCollection Creating shard nodes_used_collection_shard1_replica2 as part of slice shard1 of collection nodes_used_collection on 127.0.0.1:37889_
   [junit4]   2> 852972 T2292 oasc.OverseerCollectionProcessor.createCollection Creating shard nodes_used_collection_shard2_replica1 as part of slice shard2 of collection nodes_used_collection on 127.0.0.1:38185_
   [junit4]   2> 852973 T2292 oasc.OverseerCollectionProcessor.createCollection Creating shard nodes_used_collection_shard2_replica2 as part of slice shard2 of collection nodes_used_collection on 127.0.0.1:35678_
   [junit4]   2> 852974 T2345 oasc.ZkController.publish publishing core=nodes_used_collection_shard1_replica2 state=down
   [junit4]   2> 852974 T2283 oasc.ZkController.publish publishing core=nodes_used_collection_shard1_replica1 state=down
   [junit4]   2> 852975 T2330 oasc.ZkController.publish publishing core=nodes_used_collection_shard2_replica1 state=down
   [junit4]   2> 852975 T2318 oasc.ZkController.publish publishing core=nodes_used_collection_shard2_replica2 state=down
   [junit4]   2> 852978 T2345 oasc.ZkController.waitForCoreNodeName look for our core node name
   [junit4]   2> 852979 T2318 oasc.ZkController.waitForCoreNodeName look for our core node name
   [junit4]   2> 852980 T2330 oasc.ZkController.waitForCoreNodeName look for our core node name
   [junit4]   2> 852981 T2283 oasc.ZkController.waitForCoreNodeName look for our core node name
   [junit4]   2> 854374 T2291 oascc.ZkStateReader.updateClusterState Updating cloud state from ZooKeeper... 
   [junit4]   2> 854376 T2291 oasc.Overseer$ClusterStateUpdater.updateState WARN Could not find collection node for nodes_used_collection, skipping publish state
   [junit4]   2> 854377 T2291 oasc.Overseer$ClusterStateUpdater.updateState Update state numShards=2 message={
   [junit4]   2> 	  "operation":"state",
   [junit4]   2> 	  "core_node_name":"core_node1",
   [junit4]   2> 	  "numShards":"2",
   [junit4]   2> 	  "shard":"shard2",
   [junit4]   2> 	  "roles":null,
   [junit4]   2> 	  "state":"down",
   [junit4]   2> 	  "shard_state":"active",
   [junit4]   2> 	  "core":"nodes_used_collection_shard2_replica1",
   [junit4]   2> 	  "collection":"nodes_used_collection",
   [junit4]   2> 	  "shard_range":null,
   [junit4]   2> 	  "node_name":"127.0.0.1:38185_",
   [junit4]   2> 	  "base_url":"http://127.0.0.1:38185"}
   [junit4]   2> 854389 T2291 oasc.Overseer$ClusterStateUpdater.updateState WARN Could not find collection node for nodes_used_collection, skipping publish state
   [junit4]   2> 854389 T2291 oasc.Overseer$ClusterStateUpdater.updateState Update state numShards=2 message={
   [junit4]   2> 	  "operation":"state",
   [junit4]   2> 	  "core_node_name":"core_node2",
   [junit4]   2> 	  "numShards":"2",
   [junit4]   2> 	  "shard":"shard1",
   [junit4]   2> 	  "roles":null,
   [junit4]   2> 	  "state":"down",
   [junit4]   2> 	  "shard_state":"active",
   [junit4]   2> 	  "core":"nodes_used_collection_shard1_replica1",
   [junit4]   2> 	  "collection":"nodes_used_collection",
   [junit4]   2> 	  "shard_range":null,
   [junit4]   2> 	  "node_name":"127.0.0.1:40152_",
   [junit4]   2> 	  "base_url":"http://127.0.0.1:40152"}
   [junit4]   2> 854403 T2291 oasc.Overseer$ClusterStateUpdater.updateState WARN Could not find collection node for nodes_used_collection, skipping publish state
   [junit4]   2> 854403 T2291 oasc.Overseer$ClusterStateUpdater.updateState Update state numShards=2 message={
   [junit4]   2> 	  "operation":"state",
   [junit4]   2> 	  "core_node_name":"core_node3",
   [junit4]   2> 	  "numShards":"2",
   [junit4]   2> 	  "shard":"shard2",
   [junit4]   2> 	  "roles":null,
   [junit4]   2> 	  "state":"down",
   [junit4]   2> 	  "shard_state":"active",
   [junit4]   2> 	  "core":"nodes_used_collection_shard2_replica2",
   [junit4]   2> 	  "collection":"nodes_used_collection",
   [junit4]   2> 	  "shard_range":null,
   [junit4]   2> 	  "node_name":"127.0.0.1:35678_",
   [junit4]   2> 	  "base_url":"http://127.0.0.1:35678"}
   [junit4]   2> 854420 T2291 oasc.Overseer$ClusterStateUpdater.updateState WARN Could not find collection node for nodes_used_collection, skipping publish state
   [junit4]   2> 854421 T2291 oasc.Overseer$ClusterStateUpdater.updateState Update state numShards=2 message={
   [junit4]   2> 	  "operation":"state",
   [junit4]   2> 	  "core_node_name":"core_node4",
   [junit4]   2> 	  "numShards":"2",
   [junit4]   2> 	  "shard":"shard1",
   [junit4]   2> 	  "roles":null,
   [junit4]   2> 	  "state":"down",
   [junit4]   2> 	  "shard_state":"active",
   [junit4]   2> 	  "core":"nodes_used_collection_shard1_replica2",
   [junit4]   2> 	  "collection":"nodes_used_collection",
   [junit4]   2> 	  "shard_range":null,
   [junit4]   2> 	  "node_name":"127.0.0.1:37889_",
   [junit4]   2> 	  "base_url":"http://127.0.0.1:37889"}
   [junit4]   2> 854432 T2336 oascc.ZkStateReader$2.process A cluster state change: WatchedEvent state:SyncConnected type:NodeDataChanged path:/clusterstate.json, has occurred - updating... (live nodes size: 5)
   [junit4]   2> 854432 T2350 oascc.ZkStateReader$2.process A cluster state change: WatchedEvent state:SyncConnected type:NodeDataChanged path:/clusterstate.json, has occurred - updating... (live nodes size: 5)
   [junit4]   2> 854432 T2322 oascc.ZkStateReader$2.process A cluster state change: WatchedEvent state:SyncConnected type:NodeDataChanged path:/clusterstate.json, has occurred - updating... (live nodes size: 5)
   [junit4]   2> 854433 T2308 oascc.ZkStateReader$2.process A cluster state change: WatchedEvent state:SyncConnected type:NodeDataChanged path:/clusterstate.json, has occurred - updating... (live nodes size: 5)
   [junit4]   2> 854433 T2295 oascc.ZkStateReader$2.process A cluster state change: WatchedEvent state:SyncConnected type:NodeDataChanged path:/clusterstate.json, has occurred - updating... (live nodes size: 5)
   [junit4]   2> 854434 T2290 oascc.ZkStateReader$2.process A cluster state change: WatchedEvent state:SyncConnected type:NodeDataChanged path:/clusterstate.json, has occurred - updating... (live nodes size: 5)
   [junit4]   2> 854980 T2318 oasc.ZkController.waitForShardId waiting to find shard id in clusterstate for nodes_used_collection_shard2_replica2
   [junit4]   2> 854980 T2318 oasc.CorePropertiesLocator.writePropertiesFile ERROR Couldn't persist core properties to /mnt/ssd/jenkins/workspace/Lucene-Solr-4.x-Linux/solr/build/solr-core/test/J1/./org.apache.solr.cloud.CollectionsAPIDistributedZkTest-jetty2-1375321842204/nodes_used_collection_shard2_replica2/core.properties: java.io.FileNotFoundException: /mnt/ssd/jenkins/workspace/Lucene-Solr-4.x-Linux/solr/build/solr-core/test/J1/./org.apache.solr.cloud.CollectionsAPIDistributedZkTest-jetty2-1375321842204/nodes_used_collection_shard2_replica2/core.properties (No such file or directory)
   [junit4]   2> 854981 T2330 oasc.ZkController.waitForShardId waiting to find shard id in clusterstate for nodes_used_collection_shard2_replica1
   [junit4]   2> 854982 T2283 oasc.ZkController.waitForShardId waiting to find shard id in clusterstate for nodes_used_collection_shard1_replica1
   [junit4]   2> 854983 T2345 oasc.ZkController.waitForShardId waiting to find shard id in clusterstate for nodes_used_collection_shard1_replica2
   [junit4]   2> 854982 T2318 oasc.CoreContainer.create Creating SolrCore 'nodes_used_collection_shard2_replica2' using instanceDir: /mnt/ssd/jenkins/workspace/Lucene-Solr-4.x-Linux/solr/build/solr-core/test/J1/./org.apache.solr.cloud.CollectionsAPIDistributedZkTest-jetty2-1375321842204/nodes_used_collection_shard2_replica2
   [junit4]   2> 854983 T2318 oasc.ZkController.createCollectionZkNode Check for collection zkNode:nodes_used_collection
   [junit4]   2> 854983 T2345 oasc.CorePropertiesLocator.writePropertiesFile ERROR Couldn't persist core properties to /mnt/ssd/jenkins/workspace/Lucene-Solr-4.x-Linux/solr/build/solr-core/test/J1/./org.apache.solr.cloud.CollectionsAPIDistributedZkTest-jetty4-1375321844886/nodes_used_collection_shard1_replica2/core.properties: java.io.FileNotFoundException: /mnt/ssd/jenkins/workspace/Lucene-Solr-4.x-Linux/solr/build/solr-core/test/J1/./org.apache.solr.cloud.CollectionsAPIDistributedZkTest-jetty4-1375321844886/nodes_used_collection_shard1_replica2/core.properties (No such file or directory)
   [junit4]   2> 854984 T2345 oasc.CoreContainer.create Creating SolrCore 'nodes_used_collection_shard1_replica2' using instanceDir: /mnt/ssd/jenkins/workspace/Lucene-Solr-4.x-Linux/solr/build/solr-core/test/J1/./org.apache.solr.cloud.CollectionsAPIDistributedZkTest-jetty4-1375321844886/nodes_used_collection_shard1_replica2
   [junit4]   2> 854985 T2345 oasc.ZkController.createCollectionZkNode Check for collection zkNode:nodes_used_collection
   [junit4]   2> 854983 T2283 oasc.CorePropertiesLocator.writePropertiesFile ERROR Couldn't persist core properties to /mnt/ssd/jenkins/workspace/Lucene-Solr-4.x-Linux/solr/build/solr-core/test/J1/./org.apache.solr.cloud.CollectionsAPIDistributedZkTest-controljetty-1375321840689/nodes_used_collection_shard1_replica1/core.properties: java.io.FileNotFoundException: /mnt/ssd/jenkins/workspace/Lucene-Solr-4.x-Linux/solr/build/solr-core/test/J1/./org.apache.solr.cloud.CollectionsAPIDistributedZkTest-controljetty-1375321840689/nodes_used_collection_shard1_replica1/core.properties (No such file or directory)
   [junit4]   2> 854983 T2330 oasc.CorePropertiesLocator.writePropertiesFile ERROR Couldn't persist core properties to /mnt/ssd/jenkins/workspace/Lucene-Solr-4.x-Linux/solr/build/solr-core/test/J1/./org.apache.solr.cloud.CollectionsAPIDistributedZkTest-jetty3-1375321843574/nodes_used_collection_shard2_replica1/core.properties: java.io.FileNotFoundException: /mnt/ssd/jenkins/workspace/Lucene-Solr-4.x-Linux/solr/build/solr-core/test/J1/./org.apache.solr.cloud.CollectionsAPIDistributedZkTest-jetty3-1375321843574/nodes_used_collection_shard2_replica1/core.properties (No such file or directory)
   [junit4]   2> 854986 T2330 oasc.CoreContainer.create Creating SolrCore 'nodes_used_collection_shard2_replica1' using instanceDir: /mnt/ssd/jenkins/workspace/Lucene-Solr-4.x-Linux/solr/build/solr-core/test/J1/./org.apache.solr.cloud.CollectionsAPIDistributedZkTest-jetty3-1375321843574/nodes_used_collection_shard2_replica1
   [junit4]   2> 854987 T2330 oasc.ZkController.createCollectionZkNode Check for collection zkNode:nodes_used_collection
   [junit4]   2> 854988 T2330 oasc.ZkController.createCollectionZkNode Creating collection in ZooKeeper:nodes_used_collection
   [junit4]   2> 854986 T2318 oasc.ZkController.createCollectionZkNode Creating collection in ZooKeeper:nodes_used_collection
   [junit4]   2> 854989 T2318 oasc.ZkController.getConfName Looking for collection configName
   [junit4]   2> 854986 T2283 oasc.CoreContainer.create Creating SolrCore 'nodes_used_collection_shard1_replica1' using instanceDir: /mnt/ssd/jenkins/workspace/Lucene-Solr-4.x-Linux/solr/build/solr-core/test/J1/./org.apache.solr.cloud.CollectionsAPIDistributedZkTest-controljetty-1375321840689/nodes_used_collection_shard1_replica1
   [junit4]   2> 854988 T2330 oasc.ZkController.getConfName Looking for collection configName
   [junit4]   2> 854986 T2345 oasc.ZkController.createCollectionZkNode Creating collection in ZooKeeper:nodes_used_collection
   [junit4]   2> 854990 T2345 oasc.ZkController.getConfName Looking for collection configName
   [junit4]   2> 854989 T2283 oasc.ZkController.createCollectionZkNode Check for collection zkNode:nodes_used_collection
   [junit4]   2> 854992 T2318 oasc.ZkController.getConfName Only one config set found in zk - using it:conf1
   [junit4]   2> 854993 T2318 oascc.SolrZkClient.makePath makePath: /collections/nodes_used_collection
   [junit4]   2> 854993 T2330 oasc.ZkController.getConfName Only one config set found in zk - using it:conf1
   [junit4]   2> 854994 T2330 oascc.SolrZkClient.makePath makePath: /collections/nodes_used_collection
   [junit4]   2> 854996 T2345 oasc.ZkController.getConfName Only one config set found in zk - using it:conf1
   [junit4]   2> 854996 T2345 oascc.SolrZkClient.makePath makePath: /collections/nodes_used_collection
   [junit4]   2> 854997 T2283 oasc.ZkController.createCollectionZkNode Creating collection in ZooKeeper:nodes_used_collection
   [junit4]   2> 854998 T2283 oasc.ZkController.getConfName Looking for collection configName
   [junit4]   2> 855000 T2318 oasc.ZkController.readConfigName Load collection config from:/collections/nodes_used_collection
   [junit4]   2> 855003 T2345 oasc.ZkController.readConfigName Load collection config from:/collections/nodes_used_collection
   [junit4]   2> 855005 T2283 oascc.SolrZkClient.makePath makePath: /collections/nodes_used_collection
   [junit4]   2> 855006 T2330 oasc.ZkController.readConfigName Load collection config from:/collections/nodes_used_collection
   [junit4]   2> 855007 T2318 oasc.SolrResourceLoader.<init> new SolrResourceLoader for directory: '/mnt/ssd/jenkins/workspace/Lucene-Solr-4.x-Linux/solr/build/solr-core/test/J1/./org.apache.solr.cloud.CollectionsAPIDistributedZkTest-jetty2-1375321842204/nodes_used_collection_shard2_replica2/'
   [junit4]   2> 855064 T2283 oasc.ZkController.readConfigName Load collection config from:/collections/nodes_used_collection
   [junit4]   2> 855065 T2330 oasc.SolrResourceLoader.<init> new SolrResourceLoader for directory: '/mnt/ssd/jenkins/workspace/Lucene-Solr-4.x-Linux/solr/build/solr-core/test/J1/./org.apache.solr.cloud.CollectionsAPIDistributedZkTest-jetty3-1375321843574/nodes_used_collection_shard2_replica1/'
   [junit4]   2> 855068 T2345 oasc.SolrResourceLoader.<init> new SolrResourceLoader for directory: '/mnt/ssd/jenkins/workspace/Lucene-Solr-4.x-Linux/solr/build/solr-core/test/J1/./org.apache.solr.cloud.CollectionsAPIDistributedZkTest-jetty4-1375321844886/nodes_used_collection_shard1_replica2/'
   [junit4]   2> 855070 T2283 oasc.SolrResourceLoader.<init> new SolrResourceLoader for directory: '/mnt/ssd/jenkins/workspace/Lucene-Solr-4.x-Linux/solr/build/solr-core/test/J1/./org.apache.solr.cloud.CollectionsAPIDistributedZkTest-controljetty-1375321840689/nodes_used_collection_shard1_replica1/'
   [junit4]   2> 855219 T2318 oasc.SolrConfig.<init> Using Lucene MatchVersion: LUCENE_45
   [junit4]   2> 855221 T2345 oasc.SolrConfig.<init> Using Lucene MatchVersion: LUCENE_45
   [junit4]   2> 855255 T2330 oasc.SolrConfig.<init> Using Lucene MatchVersion: LUCENE_45
   [junit4]   2> 855256 T2283 oasc.SolrConfig.<init> Using Lucene MatchVersion: LUCENE_45
   [junit4]   2> 855463 T2318 oasc.SolrConfig.<init> Loaded SolrConfig: solrconfig.xml
   [junit4]   2> 855468 T2283 oasc.SolrConfig.<init> Loaded SolrConfig: solrconfig.xml
   [junit4]   2> 855470 T2318 oass.IndexSchema.readSchema Reading Solr Schema from schema.xml
   [junit4]   2> 855471 T2283 oass.IndexSchema.readSchema Reading Solr Schema from schema.xml
   [junit4]   2> 855502 T2318 oass.IndexSchema.readSchema [nodes_used_collection_shard2_replica2] Schema name=test
   [junit4]   2> 855509 T2345 oasc.SolrConfig.<init> Loaded SolrConfig: solrconfig.xml
   [junit4]   2> 855515 T2345 oass.IndexSchema.readSchema Reading Solr Schema from schema.xml
   [junit4]   2> 855515 T2283 oass.IndexSchema.readSchema [nodes_used_collection_shard1_replica1] Schema name=test
   [junit4]   2> 855551 T2330 oasc.SolrConfig.<init> Loaded SolrConfig: solrconfig.xml
   [junit4]   2> 855554 T2345 oass.IndexSchema.readSchema [nodes_used_collection_shard1_replica2] Schema name=test
   [junit4]   2> 855596 T2330 oass.IndexSchema.readSchema Reading Solr Schema from schema.xml
   [junit4]   2> 855648 T2330 oass.IndexSchema.readSchema [nodes_used_collection_shard2_replica1] Schema name=test
   [junit4]   2> 857991 T2283 oass.ByteField.init WARN ByteField is deprecated and will be removed in 5.0. You should use TrieIntField instead.
   [junit4]   2> 857991 T2283 oass.ShortField.init WARN ShortField is deprecated and will be removed in 5.0. You should use TrieIntField instead.
   [junit4]   2> 857993 T2283 oass.OpenExchangeRatesOrgProvider.init Initialized with rates=open-exchange-rates.json, refreshInterval=1440.
   [junit4]   2> 858003 T2283 oass.IndexSchema.readSchema default search field in schema is text
   [junit4]   2> 858028 T2283 oass.IndexSchema.readSchema unique key field: id
   [junit4]   2> 858081 T2283 oass.FileExchangeRateProvider.reload Reloading exchange rates from file currency.xml
   [junit4]   2> 858087 T2330 oass.ByteField.init WARN ByteField is deprecated and will be removed in 5.0. You should use TrieIntField instead.
   [junit4]   2> 858088 T2330 oass.ShortField.init WARN ShortField is deprecated and will be removed in 5.0. You should use TrieIntField instead.
   [junit4]   2> 858088 T2283 oass.FileExchangeRateProvider.reload Reloading exchange rates from file currency.xml
   [junit4]   2> 858089 T2330 oass.OpenExchangeRatesOrgProvider.init Initialized with rates=open-exchange-rates.json, refreshInterval=1440.
   [junit4]   2> 858132 T2330 oass.IndexSchema.readSchema default search field in schema is text
   [junit4]   2> 858134 T2283 oass.OpenExchangeRatesOrgProvider.reload Reloading exchange rates from open-exchange-rates.json
   [junit4]   2> 858137 T2330 oass.IndexSchema.readSchema unique key field: id
   [junit4]   2> 858163 T2283 oass.OpenExchangeRatesOrgProvider$OpenExchangeRates.<init> WARN Unknown key IMPORTANT NOTE
   [junit4]   2> 858164 T2283 oass.OpenExchangeRatesOrgProvider$OpenExchangeRates.<init> WARN Expected key, got STRING
   [junit4]   2> 858164 T2283 oass.OpenExchangeRatesOrgProvider.reload Reloading exchange rates from open-exchange-rates.json
   [junit4]   2> 858172 T2283 oass.OpenExchangeRatesOrgProvider$OpenExchangeRates.<init> WARN Unknown key IMPORTANT NOTE
   [junit4]   2> 858173 T2283 oass.OpenExchangeRatesOrgProvider$OpenExchangeRates.<init> WARN Expected key, got STRING
   [junit4]   2> 858173 T2283 oasc.SolrCore.initDirectoryFactory org.apache.solr.core.MockDirectoryFactory
   [junit4]   2> 858174 T2283 oasc.SolrCore.<init> [nodes_used_collection_shard1_replica1] Opening new SolrCore at /mnt/ssd/jenkins/workspace/Lucene-Solr-4.x-Linux/solr/build/solr-core/test/J1/./org.apache.solr.cloud.CollectionsAPIDistributedZkTest-controljetty-1375321840689/nodes_used_collection_shard1_replica1/, dataDir=/mnt/ssd/jenkins/workspace/Lucene-Solr-4.x-Linux/solr/build/solr-core/test/J1/./org.apache.solr.cloud.CollectionsAPIDistributedZkTest-controljetty-1375321840689//nodes_used_collection_shard1_replica1/data/
   [junit4]   2> 858174 T2283 oasc.JmxMonitoredMap.<init> JMX monitoring is enabled. Adding Solr mbeans to JMX Server: com.sun.jmx.mbeanserver.JmxMBeanServer@16eb6bc
   [junit4]   2> 858176 T2283 oasc.CachingDirectoryFactory.get return new directory for /mnt/ssd/jenkins/workspace/Lucene-Solr-4.x-Linux/solr/build/solr-core/test/J1/./org.apache.solr.cloud.CollectionsAPIDistributedZkTest-controljetty-1375321840689//nodes_used_collection_shard1_replica1/data
   [junit4]   2> 858176 T2283 oasc.SolrCore.getNewIndexDir New index directory detected: old=null new=/mnt/ssd/jenkins/workspace/Lucene-Solr-4.x-Linux/solr/build/solr-core/test/J1/./org.apache.solr.cloud.CollectionsAPIDistributedZkTest-controljetty-1375321840689//nodes_used_collection_shard1_replica1/data/index/
   [junit4]   2> 858177 T2283 oasc.SolrCore.initIndex WARN [nodes_used_collection_shard1_replica1] Solr index directory '/mnt/ssd/jenkins/workspace/Lucene-Solr-4.x-Linux/solr/build/solr-core/test/J1/./org.apache.solr.cloud.CollectionsAPIDistributedZkTest-controljetty-1375321840689/nodes_used_collection_shard1_replica1/data/index' doesn't exist. Creating new index...
   [junit4]   2> 858178 T2283 oasc.CachingDirectoryFactory.get return new directory for /mnt/ssd/jenkins/workspace/Lucene-Solr-4.x-Linux/solr/build/solr-core/test/J1/./org.apache.solr.cloud.CollectionsAPIDistributedZkTest-controljetty-1375321840689//nodes_used_collection_shard1_replica1/data/index
   [junit4]   2> 858183 T2283 oasc.SolrDeletionPolicy.onCommit SolrDeletionPolicy.onCommit: commits: num=1
   [junit4]   2> 		commit{dir=MockDirWrapper(org.apache.lucene.store.RAMDirectory@15e513f lockFactory=org.apache.lucene.store.NativeFSLockFactory@2a6511),segFN=segments_1,generation=1}
   [junit4]   2> 858183 T2283 oasc.SolrDeletionPolicy.updateCommits newest commit generation = 1
   [junit4]   2> 858188 T2283 oasup.UpdateRequestProcessorChain.init inserting DistributedUpdateProcessorFactory into updateRequestProcessorChain "dedupe"
   [junit4]   2> 858189 T2283 oasup.UpdateRequestProcessorChain.init inserting DistributedUpdateProcessorFactory into updateRequestProcessorChain "stored_sig"
   [junit4]   2> 858190 T2283 oasup.UpdateRequestProcessorChain.init inserting DistributedUpdateProcessorFactory into updateRequestProcessorChain "distrib-dup-test-chain-implicit"
   [junit4]   2> 858193 T2283 oasc.RequestHandlers.initHandlersFromConfig created standard: solr.StandardRequestHandler
   [junit4]   2> 858194 T2283 oasc.RequestHandlers.initHandlersFromConfig created /get: solr.RealTimeGetHandler
   [junit4]   2> 858194 T2283 oasc.RequestHandlers.initHandlersFromConfig adding lazy requestHandler: solr.ReplicationHandler
   [junit4]   2> 858195 T2283 oasc.RequestHandlers.initHandlersFromConfig created /replication: solr.ReplicationHandler
   [junit4]   2> 858196 T2283 oasc.RequestHandlers.initHandlersFromConfig created /update: solr.UpdateRequestHandler
   [junit4]   2> 858192 T2318 oass.ByteField.init WARN ByteField is deprecated and will be removed in 5.0. You should use TrieIntField instead.
   [junit4]   2> 858208 T2318 oass.ShortField.init WARN ShortField is deprecated and will be removed in 5.0. You should use TrieIntField instead.
   [junit4]   2> 858190 T2330 oass.FileExchangeRateProvider.reload Reloading exchange rates from file currency.xml
   [junit4]   2> 858209 T2318 oass.OpenExchangeRatesOrgProvider.init Initialized with rates=open-exchange-rates.json, refreshInterval=1440.
   [junit4]   2> 858214 T2283 oasc.RequestHandlers.initHandlersFromConfig created /admin/: org.apache.solr.handler.admin.AdminHandlers
   [junit4]   2> 858217 T2283 oashl.XMLLoader.init xsltCacheLifetimeSeconds=60
   [junit4]   2> 858220 T2330 oass.FileExchangeRateProvider.reload Reloading exchange rates from file currency.xml
   [junit4]   2> 858227 T2330 oass.OpenExchangeRatesOrgProvider.reload Reloading exchange rates from open-exchange-rates.json
   [junit4]   2> 858230 T2318 oass.IndexSchema.readSchema default search field in schema is text
   [junit4]   2> 858231 T2283 oass.SolrIndexSearcher.<init> Opening Searcher@16dfc68 main
   [junit4]   2> 858231 T2345 oass.ByteField.init WARN ByteField is deprecated and will be removed in 5.0. You should use TrieIntField instead.
   [junit4]   2> 858232 T2330 oass.OpenExchangeRatesOrgProvider$OpenExchangeRates.<init> WARN Unknown key IMPORTANT NOTE
   [junit4]   2> 858232 T2283 oasu.CommitTracker.<init> Hard AutoCommit: disabled
   [junit4]   2> 858234 T2283 oasu.CommitTracker.<init> Soft AutoCommit: disabled
   [junit4]   2> 858234 T2330 oass.OpenExchangeRatesOrgProvider$OpenExchangeRates.<init> WARN Expected key, got STRING
   [junit4]   2> 858233 T2345 oass.ShortField.init WARN ShortField is deprecated and will be removed in 5.0. You should use TrieIntField instead.
   [junit4]   2> 858237 T2318 oass.IndexSchema.readSchema unique key field: id
   [junit4]   2> 858236 T2330 oass.OpenExchangeRatesOrgProvider.reload Reloading exchange rates from open-exchange-rates.json
   [junit4]   2> 858241 T2356 oasc.SolrCore.registerSearcher [nodes_used_collection_shard1_replica1] Registered new searcher Searcher@16dfc68 main{StandardDirectoryReader(segments_1:1)}
   [junit4]   2> 858237 T2345 oass.OpenExchangeRatesOrgProvider.init Initialized with rates=open-exchange-rates.json, refreshInterval=1440.
   [junit4]   2> 858245 T2330 oass.OpenExchangeRatesOrgProvider$OpenExchangeRates.<init> WARN Unknown key IMPORTANT NOTE
   [junit4]   2> 858245 T2330 oass.OpenExchangeRatesOrgProvider$OpenExchangeRates.<init> WARN Expected key, got STRING
   [junit4]   2> 858246 T2330 oasc.SolrCore.initDirectoryFactory org.apache.solr.core.MockDirectoryFactory
   [junit4]   2> 858246 T2330 oasc.SolrCore.<init> [nodes_used_collection_shard2_replica1] Opening new SolrCore at /mnt/ssd/jenkins/workspace/Lucene-Solr-4.x-Linux/solr/build/solr-core/test/J1/./org.apache.solr.cloud.CollectionsAPIDistributedZkTest-jetty3-1375321843574/nodes_used_collection_shard2_replica1/, dataDir=/mnt/ssd/jenkins/workspace/Lucene-Solr-4.x-Linux/solr/build/solr-core/test/J1/./org.apache.solr.cloud.CollectionsAPIDistributedZkTest-jetty3-1375321843574//nodes_used_collection_shard2_replica1/data/
   [junit4]   2> 858247 T2330 oasc.JmxMonitoredMap.<init> JMX monitoring is enabled. Adding Solr mbeans to JMX Server: com.sun.jmx.mbeanserver.JmxMBeanServer@16eb6bc
   [junit4]   2> 858272 T2330 oasc.CachingDirectoryFactory.get return new directory for /mnt/ssd/jenkins/workspace/Lucene-Solr-4.x-Linux/solr/build/solr-core/test/J1/./org.apache.solr.cloud.CollectionsAPIDistributedZkTest-jetty3-1375321843574//nodes_used_collection_shard2_replica1/data
   [junit4]   2> 858272 T2330 oasc.SolrCore.getNewIndexDir New index directory detected: old=null new=/mnt/ssd/jenkins/workspace/Lucene-Solr-4.x-Linux/solr/build/solr-core/test/J1/./org.apache.solr.cloud.CollectionsAPIDistributedZkTest-jetty3-1375321843574//nodes_used_collection_shard2_replica1/data/index/
   [junit4]   2> 858273 T2330 oasc.SolrCore.initIndex WARN [nodes_used_collection_shard2_replica1] Solr index directory '/mnt/ssd/jenkins/workspace/Lucene-Solr-4.x-Linux/solr/build/solr-core/test/J1/./org.apache.solr.cloud.CollectionsAPIDistributedZkTest-jetty3-1375321843574/nodes_used_collection_shard2_replica1/data/index' doesn't exist. Creating new index...
   [junit4]   2> 858273 T2283 oasc.CoreContainer.registerCore registering core: nodes_used_collection_shard1_replica1
   [junit4]   2> 858273 T2330 oasc.CachingDirectoryFactory.get return new directory for /mnt/ssd/jenkins/workspace/Lucene-Solr-4.x-Linux/solr/build/solr-core/test/J1/./org.apache.solr.cloud.CollectionsAPIDistributedZkTest-jetty3-1375321843574//nodes_used_collection_shard2_replica1/data/index
   [junit4]   2> 858274 T2283 oasc.ZkController.register Register replica - core:nodes_used_collection_shard1_replica1 address:http://127.0.0.1:40152 collection:nodes_used_collection shard:shard1
   [junit4]   2> 858275 T2283 oascsi.HttpClientUtil.createClient Creating new http client, config:maxConnections=10000&maxConnectionsPerHost=20&connTimeout=15000&socketTimeout=30000&retry=false
   [junit4]   2> 858276 T2330 oasc.SolrDeletionPolicy.onCommit SolrDeletionPolicy.onCommit: commits: num=1
   [junit4]   2> 		commit{dir=MockDirWrapper(org.apache.lucene.store.RAMDirectory@16487b0 lockFactory=org.apache.lucene.store.NativeFSLockFactory@156c4b3),segFN=segments_1,generation=1}
   [junit4]   2> 858276 T2330 oasc.SolrDeletionPolicy.updateCommits newest commit generation = 1
   [junit4]   2> 858278 T2345 oass.IndexSchema.readSchema default search field in schema is text
   [junit4]   2> 858281 T2283 oascc.SolrZkClient.makePath makePath: /collections/nodes_used_collection/leader_elect/shard1/election
   [junit4]   2> 858282 T2330 oasup.UpdateRequestProcessorChain.init inserting DistributedUpdateProcessorFactory into updateRequestProcessorChain "dedupe"
   [junit4]   2> 858283 T2330 oasup.UpdateRequestProcessorChain.init inserting DistributedUpdateProcessorFactory into updateRequestProcessorChain "stored_sig"
   [junit4]   2> 858284 T2330 oasup.UpdateRequestProcessorChain.init inserting DistributedUpdateProcessorFactory into updateRequestProcessorChain "distrib-dup-test-chain-implicit"
   [junit4]   2> 858284 T2345 oass.IndexSchema.readSchema unique key field: id
   [junit4]   2> 858285 T2330 oasc.RequestHandlers.initHandlersFromConfig created standard: solr.StandardRequestHandler
   [junit4]   2> 858287 T2330 oasc.RequestHandlers.initHandlersFromConfig created /get: solr.RealTimeGetHandler
   [junit4]   2> 858287 T2330 oasc.RequestHandlers.initHandlersFromConfig adding lazy requestHandler: solr.ReplicationHandler
   [junit4]   2> 858288 T2330 oasc.RequestHandlers.initHandlersFromConfig created /replication: solr.ReplicationHandler
   [junit4]   2> 858288 T2330 oasc.RequestHandlers.initHandlersFromConfig created /update: solr.UpdateRequestHandler
   [junit4]   2> 858289 T2330 oasc.RequestHandlers.initHandlersFromConfig created /admin/: org.apache.solr.handler.admin.AdminHandlers
   [junit4]   2> 858291 T2330 oashl.XMLLoader.init xsltCacheLifetimeSeconds=60
   [junit4]   2> 858294 T2330 oass.SolrIndexSearcher.<init> Opening Searcher@345732 main
   [junit4]   2> 858295 T2330 oasu.CommitTracker.<init> Hard AutoCommit: disabled
   [junit4]   2> 858296 T2330 oasu.CommitTracker.<init> Soft AutoCommit: disabled
   [junit4]   2> 858300 T2357 oasc.SolrCore.registerSearcher [nodes_used_collection_shard2_replica1] Registered new searcher Searcher@345732 main{StandardDirectoryReader(segments_1:1)}
   [junit4]   2> 858303 T2318 oass.FileExchangeRateProvider.reload Reloading exchange rates from file currency.xml
   [junit4]   2> 858304 T2330 oasc.CoreContainer.registerCore registering core: nodes_used_collection_shard2_replica1
   [junit4]   2> 858304 T2330 oasc.ZkController.register Register replica - core:nodes_used_collection_shard2_replica1 address:http://127.0.0.1:38185 collection:nodes_used_collection shard:shard2
   [junit4]   2> 858305 T2330 oascsi.HttpClientUtil.createClient Creating new http client, config:maxConnections=10000&maxConnectionsPerHost=20&connTimeout=15000&socketTimeout=30000&retry=false
   [junit4]   2> 858308 T2283 oasc.ShardLeaderElectionContext.runLeaderProcess Running the leader process for shard shard1
   [junit4]   2> 858312 T2330 oascc.SolrZkClient.makePath makePath: /collections/nodes_used_collection/leader_elect/shard2/election
   [junit4]   2> 858313 T2318 oass.FileExchangeRateProvider.reload Reloading exchange rates from file currency.xml
   [junit4]   2> 858322 T2318 oass.OpenExchangeRatesOrgProvider.reload Reloading exchange rates from open-exchange-rates.json
   [junit4]   2> 858322 T2283 oasc.ShardLeaderElectionContext.waitForReplicasToComeUp Waiting until we see more replicas up for shard shard1: total=2 found=1 timeoutin=179997
   [junit4]   2> 858327 T2318 oass.OpenExchangeRatesOrgProvider$OpenExchangeRates.<init> WARN Unknown key IMPORTANT NOTE
   [junit4]   2> 858327 T2318 oass.OpenExchangeRatesOrgProvider$OpenExchangeRates.<init> WARN Expected key, got STRING
   [junit4]   2> 858328 T2318 oass.OpenExchangeRatesOrgProvider.reload Reloading exchange rates from open-exchange-rates.json
   [junit4]   2> 858341 T2318 oass.OpenExchangeRatesOrgProvider$OpenExchangeRates.<init> WARN Unknown key IMPORTANT NOTE
   [junit4]   2> 858342 T2318 oass.OpenExchangeRatesOrgProvider$OpenExchangeRates.<init> WARN Expected key, got STRING
   [junit4]   2> 858342 T2318 oasc.SolrCore.initDirectoryFactory org.apache.solr.core.MockDirectoryFactory
   [junit4]   2> 858343 T2318 oasc.SolrCore.<init> [nodes_used_collection_shard2_replica2] Opening new SolrCore at /mnt/ssd/jenkins/workspace/Lucene-Solr-4.x-Linux/solr/build/solr-core/test/J1/./org.apache.solr.cloud.CollectionsAPIDistributedZkTest-jetty2-1375321842204/nodes_used_collection_shard2_replica2/, dataDir=/mnt/ssd/jenkins/workspace/Lucene-Solr-4.x-Linux/solr/build/solr-core/test/J1/./org.apache.solr.cloud.CollectionsAPIDistributedZkTest-jetty2-1375321842204//nodes_used_collection_shard2_replica2/data/
   [junit4]   2> 858343 T2318 oasc.JmxMonitoredMap.<init> JMX monitoring is enabled. Adding Solr mbeans to JMX Server: com.sun.jmx.mbeanserver.JmxMBeanServer@16eb6bc
   [junit4]   2> 858345 T2318 oasc.CachingDirectoryFactory.get return new directory for /mnt/ssd/jenkins/workspace/Lucene-Solr-4.x-Linux/solr/build/solr-core/test/J1/./org.apache.solr.cloud.CollectionsAPIDistributedZkTest-jetty2-1375321842204//nodes_used_collection_shard2_replica2/data
   [junit4]   2> 858345 T2318 oasc.SolrCore.getNewIndexDir New index directory detected: old=null new=/mnt/ssd/jenkins/workspace/Lucene-Solr-4.x-Linux/solr/build/solr-core/test/J1/./org.apache.solr.cloud.CollectionsAPIDistributedZkTest-jetty2-1375321842204//nodes_used_collection_shard2_replica2/data/index/
   [junit4]   2> 858346 T2318 oasc.SolrCore.initIndex WARN [nodes_used_collection_shard2_replica2] Solr index directory '/mnt/ssd/jenkins/workspace/Lucene-Solr-4.x-Linux/solr/build/solr-core/test/J1/./org.apache.solr.cloud.CollectionsAPIDistributedZkTest-jetty2-1375321842204/nodes_used_collection_shard2_replica2/data/index' doesn't exist. Creating new index...
   [junit4]   2> 858346 T2345 oass.FileExchangeRateProvider.reload Reloading exchange rates from file currency.xml
   [junit4]   2> 858346 T2318 oasc.CachingDirectoryFactory.get return new directory for /mnt/ssd/jenkins/workspace/Lucene-Solr-4.x-Linux/solr/build/solr-core/test/J1/./org.apache.solr.cloud.CollectionsAPIDistributedZkTest-jetty2-1375321842204//nodes_used_collection_shard2_replica2/data/index
   [junit4]   2> 858348 T2330 oasc.ShardLeaderElectionContext.runLeaderProcess Running the leader process for shard shard2
   [junit4]   2> 858349 T2318 oasc.SolrDeletionPolicy.onCommit SolrDeletionPolicy.onCommit: commits: num=1
   [junit4]   2> 		commit{dir=MockDirWrapper(org.apache.lucene.store.RAMDirectory@e893a6 lockFactory=org.apache.lucene.store.NativeFSLockFactory@1c4c9ed),segFN=segments_1,generation=1}
   [junit4]   2> 858349 T2318 oasc.SolrDeletionPolicy.updateCommits newest commit generation = 1
   [junit4]   2> 858354 T2318 oasup.UpdateRequestProcessorChain.init inserting DistributedUpdateProcessorFactory into updateRequestProcessorChain "dedupe"
   [junit4]   2> 858354 T2330 oasc.ShardLeaderElectionContext.waitForReplicasToComeUp Waiting until we see more replicas up for shard shard2: total=2 found=1 timeoutin=179999
   [junit4]   2> 858355 T2345 oass.FileExchangeRateProvider.reload Reloading exchange rates from file currency.xml
   [junit4]   2> 858354 T2318 oasup.UpdateRequestProcessorChain.init inserting DistributedUpdateProcessorFactory into updateRequestProcessorChain "stored_sig"
   [junit4]   2> 858356 T2318 oasup.UpdateRequestProcessorChain.init inserting DistributedUpdateProcessorFactory into updateRequestProcessorChain "distrib-dup-test-chain-implicit"
   [junit4]   2> 858357 T2318 oasc.RequestHandlers.initHandlersFromConfig created standard: solr.StandardRequestHandler
   [junit4]   2> 858358 T2318 oasc.RequestHandlers.initHandlersFromConfig created /get: solr.RealTimeGetHandler
   [junit4]   2> 858358 T2318 oasc.RequestHandlers.initHandlersFromConfig adding lazy requestHandler: solr.ReplicationHandler
   [junit4]   2> 858358 T2318 oasc.RequestHandlers.initHandlersFromConfig created /replication: solr.ReplicationHandler
   [junit4]   2> 858359 T2318 oasc.RequestHandlers.initHandlersFromConfig created /update: solr.UpdateRequestHandler
   [junit4]   2> 858360 T2318 oasc.RequestHandlers.initHandlersFromConfig created /admin/: org.apache.solr.handler.admin.AdminHandlers
   [junit4]   2> 858362 T2318 oashl.XMLLoader.init xsltCacheLifetimeSeconds=60
   [junit4]   2> 858365 T2345 oass.OpenExchangeRatesOrgProvider.reload Reloading exchange rates from open-exchange-rates.json
   [junit4]   2> 858365 T2318 oass.SolrIndexSearcher.<init> Opening Searcher@121c238 main
   [junit4]   2> 858367 T2318 oasu.CommitTracker.<init> Hard AutoCommit: disabled
   [junit4]   2> 858367 T2318 oasu.CommitTracker.<init> Soft AutoCommit: disabled
   [junit4]   2> 858369 T2345 oass.OpenExchangeRatesOrgProvider$OpenExchangeRates.<init> WARN Unknown key IMPORTANT NOTE
   [junit4]   2> 858370 T2345 oass.OpenExchangeRatesOrgProvider$OpenExchangeRates.<init> WARN Expected key, got STRING
   [junit4]   2> 858370 T2345 oass.OpenExchangeRatesOrgProvider.reload Reloading exchange rates from open-exchange-rates.json
   [junit4]   2> 858372 T2358 oasc.SolrCore.registerSearcher [nodes_used_collection_shard2_replica2] Registered new searcher Searcher@121c238 main{StandardDirectoryReader(segments_1:1)}
   [junit4]   2> 858372 T2345 oass.OpenExchangeRatesOrgProvider$OpenExchangeRates.<init> WARN Unknown key IMPORTANT NOTE
   [junit4]   2> 858372 T2345 oass.OpenExchangeRatesOrgProvider$OpenExchangeRates.<init> WARN Expected key, got STRING
   [junit4]   2> 858373 T2345 oasc.SolrCore.initDirectoryFactory org.apache.solr.core.MockDirectoryFactory
   [junit4]   2> 858373 T2318 oasc.CoreContainer.registerCore registering core: nodes_used_collection_shard2_replica2
   [junit4]   2> 858373 T2345 oasc.SolrCore.<init> [nodes_used_collection_shard1_replica2] Opening new SolrCore at /mnt/ssd/jenkins/workspace/Lucene-Solr-4.x-Linux/solr/build/solr-core/test/J1/./org.apache.solr.cloud.CollectionsAPIDistributedZkTest-jetty4-1375321844886/nodes_used_collection_shard1_replica2/, dataDir=/mnt/ssd/jenkins/workspace/Lucene-Solr-4.x-Linux/solr/build/solr-core/test/J1/./org.apache.solr.cloud.CollectionsAPIDistributedZkTest-jetty4-1375321844886//nodes_used_collection_shard1_replica2/data/
   [junit4]   2> 858373 T2318 oasc.ZkController.register Register replica - core:nodes_used_collection_shard2_replica2 address:http://127.0.0.1:35678 collection:nodes_used_collection shard:shard2
   [junit4]   2> 858374 T2345 oasc.JmxMonitoredMap.<init> JMX monitoring is enabled. Adding Solr mbeans to JMX Server: com.sun.jmx.mbeanserver.JmxMBeanServer@16eb6bc
   [junit4]   2> 858374 T2318 oascsi.HttpClientUtil.createClient Creating new http client, config:maxConnections=10000&maxConnectionsPerHost=20&connTimeout=15000&socketTimeout=30000&retry=false
   [junit4]   2> 858377 T2345 oasc.CachingDirectoryFactory.get return new directory for /mnt/ssd/jenkins/workspace/Lucene-Solr-4.x-Linux/solr/build/solr-core/test/J1/./org.apache.solr.cloud.CollectionsAPIDistributedZkTest-jetty4-1375321844886//nodes_used_collection_shard1_replica2/data
   [junit4]   2> 858378 T2345 oasc.SolrCore.getNewIndexDir New index directory detected: old=null new=/mnt/ssd/jenkins/workspace/Lucene-Solr-4.x-Linux/solr/build/solr-core/test/J1/./org.apache.solr.cloud.CollectionsAPIDistributedZkTest-jetty4-1375321844886//nodes_used_collection_shard1_replica2/data/index/
   [junit4]   2> 858379 T2345 oasc.SolrCore.initIndex WARN [nodes_used_collection_shard1_replica2] Solr index directory '/mnt/ssd/jenkins/workspace/Lucene-Solr-4.x-Linux/solr/build/solr-core/test/J1/./org.apache.solr.cloud.CollectionsAPIDistributedZkTest-jetty4-1375321844886/nodes_used_collection_shard1_replica2/data/index' doesn't exist. Creating new index...
   [junit4]   2> 858379 T2345 oasc.CachingDirectoryFactory.get return new directory for /mnt/ssd/jenkins/workspace/Lucene-Solr-4.x-Linux/solr/build/solr-core/test/J1/./org.apache.solr.cloud.CollectionsAPIDistributedZkTest-jetty4-1375321844886//nodes_used_collection_shard1_replica2/data/index
   [junit4]   2> 858382 T2345 oasc.SolrDeletionPolicy.onCommit SolrDeletionPolicy.onCommit: commits: num=1
   [junit4]   2> 		commit{dir=MockDirWrapper(org.apache.lucene.store.RAMDirectory@9eb591 lockFactory=org.apache.lucene.store.NativeFSLockFactory@b69d91),segFN=segments_1,generation=1}
   [junit4]   2> 858382 T2345 oasc.SolrDeletionPolicy.updateCommits newest commit generation = 1
   [junit4]   2> 858386 T2345 oasup.UpdateRequestProcessorChain.init inserting DistributedUpdateProcessorFactory into updateRequestProcessorChain "dedupe"
   [junit4]   2> 858387 T2345 oasup.UpdateRequestProcessorChain.init inserting DistributedUpdateProcessorFactory into updateRequestProcessorChain "stored_sig"
   [junit4]   2> 858387 T2345 oasup.UpdateRequestProcessorChain.init inserting DistributedUpdateProcessorFactory into updateRequestProcessorChain "distrib-dup-test-chain-implicit"
   [junit4]   2> 858388 T2345 oasc.RequestHandlers.initHandlersFromConfig created standard: solr.StandardRequestHandler
   [junit4]   2> 858389 T2345 oasc.RequestHandlers.initHandlersFromConfig created /get: solr.RealTimeGetHandler
   [junit4]   2> 858389 T2345 oasc.RequestHandlers.initHandlersFromConfig adding lazy requestHandler: solr.ReplicationHandler
   [junit4]   2> 858389 T2345 oasc.RequestHandlers.initHandlersFromConfig created /replication: solr.ReplicationHandler
   [junit4]   2> 858390 T2345 oasc.RequestHandlers.initHandlersFromConfig created /update: solr.UpdateRequestHandler
   [junit4]   2> 858391 T2345 oasc.RequestHandlers.initHandlersFromConfig created /admin/: org.apache.solr.handler.admin.AdminHandlers
   [junit4]   2> 858393 T2345 oashl.XMLLoader.init xsltCacheLifetimeSeconds=60
   [junit4]   2> 858397 T2345 oass.SolrIndexSearcher.<init> Opening Searcher@a4daf8 main
   [junit4]   2> 858398 T2345 oasu.CommitTracker.<init> Hard AutoCommit: disabled
   [junit4]   2> 858398 T2345 oasu.CommitTracker.<init> Soft AutoCommit: disabled
   [junit4]   2> 858402 T2359 oasc.SolrCore.registerSearcher [nodes_used_collection_shard1_replica2] Registered new searcher Searcher@a4daf8 main{StandardDirectoryReader(segments_1:1)}
   [junit4]   2> 858404 T2345 oasc.CoreContainer.registerCore registering core: nodes_used_collection_shard1_replica2
   [junit4]   2> 858405 T2345 oasc.ZkController.register Register replica - core:nodes_used_collection_shard1_replica2 address:http://127.0.0.1:37889 collection:nodes_used_collection shard:shard1
   [junit4]   2> 858405 T2345 oascsi.HttpClientUtil.createClient Creating new http client, config:maxConnections=10000&maxConnectionsPerHost=20&connTimeout=15000&socketTimeout=30000&retry=false
   [junit4]   2> 858826 T2283 oasc.ShardLeaderElectionContext.waitForReplicasToComeUp Enough replicas found to continue.
   [junit4]   2> 858827 T2283 oasc.ShardLeaderElectionContext.runLeaderProcess I may be the new leader - try and sync
   [junit4]   2> 858828 T2283 oasc.SyncStrategy.sync Sync replicas to http://127.0.0.1:40152/nodes_used_collection_shard1_replica1/
   [junit4]   2> 858828 T2283 oasu.PeerSync.sync PeerSync: core=nodes_used_collection_shard1_replica1 url=http://127.0.0.1:40152 START replicas=[http://127.0.0.1:37889/nodes_used_collection_shard1_replica2/] nUpdates=100
   [junit4]   2> 858829 T2283 oasu.PeerSync.sync PeerSync: core=nodes_used_collection_shard1_replica1 url=http://127.0.0.1:40152 DONE.  We have no versions.  sync failed.
   [junit4]   2> 858829 T2283 oasc.SyncStrategy.syncReplicas Leader's attempt to sync with shard failed, moving to the next candidate
   [junit4]   2> 858830 T2283 oasc.ShardLeaderElectionContext.runLeaderProcess We failed sync, but we have no versions - we can't sync in that case - we were active before, so become leader anyway
   [junit4]   2> 858830 T2283 oasc.ShardLeaderElectionContext.runLeaderProcess I am the new leader: http://127.0.0.1:40152/nodes_used_collection_shard1_replica1/ shard1
   [junit4]   2> 858831 T2283 oascc.SolrZkClient.makePath makePath: /collections/nodes_used_collection/leaders/shard1
   [junit4]   2> ASYNC  NEW_CORE C3408 name=nodes_used_collection_shard1_replica2 org.apache.solr.core.SolrCore@18f2911 url=http://127.0.0.1:37889/nodes_used_collection_shard1_replica2 node=127.0.0.1:37889_ C3408_STATE=coll:nodes_used_collection core:nodes_used_collection_shard1_replica2 props:{state=down, core=nodes_used_collection_shard1_replica2, node_name=127.0.0.1:37889_, base_url=http://127.0.0.1:37889}
   [junit4]   2> 858868 T2344 C3408 P37889 oasc.SolrCore.execute [nodes_used_collection_shard1_replica2] webapp= path=/get params={getVersions=100&distrib=false&wt=javabin&qt=/get&version=2} status=0 QTime=1 
   [junit4]   2> 858869 T2330 oasc.ShardLeaderElectionContext.waitForReplicasToComeUp Enough replicas found to continue.
   [junit4]   2> 858869 T2330 oasc.ShardLeaderElectionContext.runLeaderProcess I may be the new leader - try and sync
   [junit4]   2> 858869 T2330 oasc.SyncStrategy.sync Sync replicas to http://127.0.0.1:38185/nodes_used_collection_shard2_replica1/
   [junit4]   2> 858870 T2330 oasu.PeerSync.sync PeerSync: core=nodes_used_collection_shard2_replica1 url=http://127.0.0.1:38185 START replicas=[http://127.0.0.1:35678/nodes_used_collection_shard2_replica2/] nUpdates=100
   [junit4]   2> 858870 T2330 oasu.PeerSync.sync PeerSync: core=nodes_

[...truncated too long message...]

	at org.apache.solr.cloud.AbstractFullDistribZkTestBase.createCollection(AbstractFullDistribZkTestBase.java:1535)
   [junit4]    > 	at org.apache.solr.cloud.CollectionsAPIDistributedZkTest.testCustomCollectionsAPI(CollectionsAPIDistributedZkTest.java:677)
   [junit4]    > 	at org.apache.solr.cloud.CollectionsAPIDistributedZkTest.doTest(CollectionsAPIDistributedZkTest.java:159)
   [junit4]    > 	at org.apache.solr.BaseDistributedSearchTestCase.testDistribSearch(BaseDistributedSearchTestCase.java:835)
   [junit4]    > 	at java.lang.Thread.run(Thread.java:662)
   [junit4]    > Caused by: org.apache.http.conn.HttpHostConnectException: Connection to http://127.0.0.1:35678 refused
   [junit4]    > 	at org.apache.http.impl.conn.DefaultClientConnectionOperator.openConnection(DefaultClientConnectionOperator.java:190)
   [junit4]    > 	at org.apache.http.impl.conn.ManagedClientConnectionImpl.open(ManagedClientConnectionImpl.java:294)
   [junit4]    > 	at org.apache.http.impl.client.DefaultRequestDirector.tryConnect(DefaultRequestDirector.java:645)
   [junit4]    > 	at org.apache.http.impl.client.DefaultRequestDirector.execute(DefaultRequestDirector.java:480)
   [junit4]    > 	at org.apache.http.impl.client.AbstractHttpClient.execute(AbstractHttpClient.java:906)
   [junit4]    > 	at org.apache.http.impl.client.AbstractHttpClient.execute(AbstractHttpClient.java:805)
   [junit4]    > 	at org.apache.http.impl.client.AbstractHttpClient.execute(AbstractHttpClient.java:784)
   [junit4]    > 	at org.apache.solr.client.solrj.impl.HttpSolrServer.request(HttpSolrServer.java:365)
   [junit4]    > 	... 45 more
   [junit4]    > Caused by: java.net.ConnectException: Connection refused
   [junit4]    > 	at java.net.PlainSocketImpl.socketConnect(Native Method)
   [junit4]    > 	at java.net.PlainSocketImpl.doConnect(PlainSocketImpl.java:351)
   [junit4]    > 	at java.net.PlainSocketImpl.connectToAddress(PlainSocketImpl.java:213)
   [junit4]    > 	at java.net.PlainSocketImpl.connect(PlainSocketImpl.java:200)
   [junit4]    > 	at java.net.SocksSocketImpl.connect(SocksSocketImpl.java:366)
   [junit4]    > 	at java.net.Socket.connect(Socket.java:529)
   [junit4]    > 	at org.apache.http.conn.scheme.PlainSocketFactory.connectSocket(PlainSocketFactory.java:127)
   [junit4]    > 	at org.apache.http.impl.conn.DefaultClientConnectionOperator.openConnection(DefaultClientConnectionOperator.java:180)
   [junit4]    > 	... 52 more
   [junit4]   2> 997404 T2268 oas.SolrTestCaseJ4.deleteCore ###deleteCore
   [junit4]   2> 151583 T2267 ccr.ThreadLeakControl.checkThreadLeaks WARNING Will linger awaiting termination of 2 leaked thread(s).
   [junit4]   2> 998591 T2350 oasc.LeaderElector$1.process WARN  org.apache.zookeeper.KeeperException$SessionExpiredException: KeeperErrorCode = Session expired for /collections/new_implicit_coll_1/leader_elect/b/election
   [junit4]   2> 	at org.apache.zookeeper.KeeperException.create(KeeperException.java:127)
   [junit4]   2> 	at org.apache.zookeeper.KeeperException.create(KeeperException.java:51)
   [junit4]   2> 	at org.apache.zookeeper.ZooKeeper.getChildren(ZooKeeper.java:1468)
   [junit4]   2> 	at org.apache.solr.common.cloud.SolrZkClient$6.execute(SolrZkClient.java:235)
   [junit4]   2> 	at org.apache.solr.common.cloud.SolrZkClient$6.execute(SolrZkClient.java:232)
   [junit4]   2> 	at org.apache.solr.common.cloud.ZkCmdExecutor.retryOperation(ZkCmdExecutor.java:65)
   [junit4]   2> 	at org.apache.solr.common.cloud.SolrZkClient.getChildren(SolrZkClient.java:232)
   [junit4]   2> 	at org.apache.solr.cloud.LeaderElector.checkIfIamLeader(LeaderElector.java:84)
   [junit4]   2> 	at org.apache.solr.cloud.LeaderElector.access$000(LeaderElector.java:55)
   [junit4]   2> 	at org.apache.solr.cloud.LeaderElector$1.process(LeaderElector.java:129)
   [junit4]   2> 	at org.apache.zookeeper.ClientCnxn$EventThread.processEvent(ClientCnxn.java:519)
   [junit4]   2> 	at org.apache.zookeeper.ClientCnxn$EventThread.run(ClientCnxn.java:495)
   [junit4]   2> 
   [junit4]   2> 998591 T2350 oasc.LeaderElector$1.process WARN  org.apache.zookeeper.KeeperException$SessionExpiredException: KeeperErrorCode = Session expired for /collections/new_implicit_coll_0/leader_elect/b/election
   [junit4]   2> 	at org.apache.zookeeper.KeeperException.create(KeeperException.java:127)
   [junit4]   2> 	at org.apache.zookeeper.KeeperException.create(KeeperException.java:51)
   [junit4]   2> 	at org.apache.zookeeper.ZooKeeper.getChildren(ZooKeeper.java:1468)
   [junit4]   2> 	at org.apache.solr.common.cloud.SolrZkClient$6.execute(SolrZkClient.java:235)
   [junit4]   2> 	at org.apache.solr.common.cloud.SolrZkClient$6.execute(SolrZkClient.java:232)
   [junit4]   2> 	at org.apache.solr.common.cloud.ZkCmdExecutor.retryOperation(ZkCmdExecutor.java:65)
   [junit4]   2> 	at org.apache.solr.common.cloud.SolrZkClient.getChildren(SolrZkClient.java:232)
   [junit4]   2> 	at org.apache.solr.cloud.LeaderElector.checkIfIamLeader(LeaderElector.java:84)
   [junit4]   2> 	at org.apache.solr.cloud.LeaderElector.access$000(LeaderElector.java:55)
   [junit4]   2> 	at org.apache.solr.cloud.LeaderElector$1.process(LeaderElector.java:129)
   [junit4]   2> 	at org.apache.zookeeper.ClientCnxn$EventThread.processEvent(ClientCnxn.java:519)
   [junit4]   2> 	at org.apache.zookeeper.ClientCnxn$EventThread.run(ClientCnxn.java:495)
   [junit4]   2> 
   [junit4]   2> 998592 T2350 oascc.ZkStateReader$3.process WARN ZooKeeper watch triggered, but Solr cannot talk to ZK
   [junit4]   2> 998592 T2350 oascc.ZkStateReader$2.process A cluster state change: WatchedEvent state:SyncConnected type:NodeChildrenChanged path:/live_nodes, has occurred - updating... (live nodes size: 1)
   [junit4]   2> 998592 T2350 oascc.ZkStateReader$2.process WARN ZooKeeper watch triggered, but Solr cannot talk to ZK
   [junit4]   2> NOTE: test params are: codec=Lucene42: {timestamp=PostingsFormat(name=Memory doPackFST= false), range_facet_l=PostingsFormat(name=Memory doPackFST= false), id=PostingsFormat(name=SimpleText), range_facet_sl=PostingsFormat(name=NestedPulsing), a_t=PostingsFormat(name=Memory doPackFST= false), text=PostingsFormat(name=NestedPulsing), range_facet_si=PostingsFormat(name=MockRandom), _version_=PostingsFormat(name=Memory doPackFST= false), other_tl1=PostingsFormat(name=Memory doPackFST= false), multiDefault=PostingsFormat(name=MockRandom), a_si=PostingsFormat(name=MockRandom), intDefault=PostingsFormat(name=Memory doPackFST= false)}, docValues:{}, sim=RandomSimilarityProvider(queryNorm=true,coord=no): {}, locale=ar_IQ, timezone=Australia/Lord_Howe
   [junit4]   2> NOTE: Linux 3.2.0-51-generic i386/Sun Microsystems Inc. 1.6.0_45 (32-bit)/cpus=8,threads=3,free=95125752,total=171261952
   [junit4]   2> NOTE: All tests run in this JVM: [HdfsSyncSliceTest, IndexReaderFactoryTest, TestAddFieldRealTimeGet, TestRangeQuery, TestSchemaSimilarityResource, TestSuggestSpellingConverter, AssignTest, TestInfoStreamLogging, DebugComponentTest, TestSystemIdResolver, UniqFieldsUpdateProcessorFactoryTest, OpenExchangeRatesOrgProviderTest, MultiTermTest, ChaosMonkeySafeLeaderTest, XmlUpdateRequestHandlerTest, HighlighterTest, TestElisionMultitermQuery, HdfsBasicDistributedZk2Test, QueryResultKeyTest, BasicZkTest, SignatureUpdateProcessorFactoryTest, TestAnalyzedSuggestions, TestSchemaVersionResource, TestCSVLoader, ZkSolrClientTest, TestClassNameShortening, TestCopyFieldCollectionResource, PathHierarchyTokenizerFactoryTest, TestNumberUtils, TestCoreDiscovery, CoreAdminCreateDiscoverTest, BlockCacheTest, TestRandomMergePolicy, TestBinaryField, ShardRoutingCustomTest, HdfsCollectionsAPIDistributedZkTest, DefaultValueUpdateProcessorTest, URLClassifyProcessorTest, DirectSolrSpellCheckerTest, DirectUpdateHandlerTest, CurrencyFieldOpenExchangeTest, TestLMJelinekMercerSimilarityFactory, TestLuceneMatchVersion, TestDistributedSearch, SimplePostToolTest, TestUtils, DateMathParserTest, TimeZoneUtilsTest, TestSerializedLuceneMatchVersion, TestLazyCores, TestBinaryResponseWriter, PingRequestHandlerTest, TestAtomicUpdateErrorCases, TestMergePolicyConfig, EchoParamsTest, TestDefaultSimilarityFactory, TestRandomFaceting, ZkNodePropsTest, FileUtilsTest, TestRTGBase, TestDistributedGrouping, SolrRequestParserTest, TermVectorComponentDistributedTest, SolrCmdDistributorTest, SolrCoreCheckLockOnStartupTest, DocumentAnalysisRequestHandlerTest, TestFoldingMultitermQuery, FullSolrCloudDistribCmdsTest, SpellPossibilityIteratorTest, BadIndexSchemaTest, HdfsRecoveryZkTest, TestPropInject, SuggesterWFSTTest, DocValuesMultiTest, TestIndexingPerformance, TestReload, TestBM25SimilarityFactory, TestSolrXMLSerializer, BasicDistributedZkTest, CollectionsAPIDistributedZkTest]
   [junit4] Completed on J1 in 152.87s, 1 test, 1 error <<< FAILURES!

[...truncated 481 lines...]
BUILD FAILED
/mnt/ssd/jenkins/workspace/Lucene-Solr-4.x-Linux/build.xml:395: The following error occurred while executing this line:
/mnt/ssd/jenkins/workspace/Lucene-Solr-4.x-Linux/build.xml:375: The following error occurred while executing this line:
/mnt/ssd/jenkins/workspace/Lucene-Solr-4.x-Linux/build.xml:39: The following error occurred while executing this line:
/mnt/ssd/jenkins/workspace/Lucene-Solr-4.x-Linux/solr/build.xml:181: The following error occurred while executing this line:
/mnt/ssd/jenkins/workspace/Lucene-Solr-4.x-Linux/solr/common-build.xml:449: The following error occurred while executing this line:
/mnt/ssd/jenkins/workspace/Lucene-Solr-4.x-Linux/lucene/common-build.xml:1233: The following error occurred while executing this line:
/mnt/ssd/jenkins/workspace/Lucene-Solr-4.x-Linux/lucene/common-build.xml:876: There were test failures: 321 suites, 1350 tests, 1 error, 35 ignored (7 assumptions)

Total time: 48 minutes 20 seconds
Build step 'Invoke Ant' marked build as failure
Description set: Java: 32bit/jdk1.6.0_45 -server -XX:+UseConcMarkSweepGC
Archiving artifacts
Recording test results
Email was triggered for: Failure
Sending email for trigger: Failure



Mime
View raw message