lucene-dev mailing list archives

Site index · List index
Message view « Date » · « Thread »
Top « Date » · « Thread »
From Policeman Jenkins Server <jenk...@thetaphi.de>
Subject [JENKINS] Lucene-Solr-4.x-MacOSX (64bit/jdk1.7.0) - Build # 677 - Still Failing!
Date Thu, 01 Aug 2013 03:18:22 GMT
Build: http://jenkins.thetaphi.de/job/Lucene-Solr-4.x-MacOSX/677/
Java: 64bit/jdk1.7.0 -XX:+UseCompressedOops -XX:+UseParallelGC

1 tests failed.
FAILED:  org.apache.solr.cloud.CollectionsAPIDistributedZkTest.testDistribSearch

Error Message:
Server refused connection at: http://127.0.0.1:52303

Stack Trace:
org.apache.solr.client.solrj.SolrServerException: Server refused connection at: http://127.0.0.1:52303
	at __randomizedtesting.SeedInfo.seed([BE347C616992BCDF:3FD2F2791ECDDCE3]:0)
	at org.apache.solr.client.solrj.impl.HttpSolrServer.request(HttpSolrServer.java:428)
	at org.apache.solr.client.solrj.impl.HttpSolrServer.request(HttpSolrServer.java:180)
	at org.apache.solr.cloud.AbstractFullDistribZkTestBase.createCollection(AbstractFullDistribZkTestBase.java:1535)
	at org.apache.solr.cloud.CollectionsAPIDistributedZkTest.testCustomCollectionsAPI(CollectionsAPIDistributedZkTest.java:677)
	at org.apache.solr.cloud.CollectionsAPIDistributedZkTest.doTest(CollectionsAPIDistributedZkTest.java:159)
	at org.apache.solr.BaseDistributedSearchTestCase.testDistribSearch(BaseDistributedSearchTestCase.java:835)
	at sun.reflect.NativeMethodAccessorImpl.invoke0(Native Method)
	at sun.reflect.NativeMethodAccessorImpl.invoke(NativeMethodAccessorImpl.java:57)
	at sun.reflect.DelegatingMethodAccessorImpl.invoke(DelegatingMethodAccessorImpl.java:43)
	at java.lang.reflect.Method.invoke(Method.java:606)
	at com.carrotsearch.randomizedtesting.RandomizedRunner.invoke(RandomizedRunner.java:1559)
	at com.carrotsearch.randomizedtesting.RandomizedRunner.access$600(RandomizedRunner.java:79)
	at com.carrotsearch.randomizedtesting.RandomizedRunner$6.evaluate(RandomizedRunner.java:737)
	at com.carrotsearch.randomizedtesting.RandomizedRunner$7.evaluate(RandomizedRunner.java:773)
	at com.carrotsearch.randomizedtesting.RandomizedRunner$8.evaluate(RandomizedRunner.java:787)
	at com.carrotsearch.randomizedtesting.rules.SystemPropertiesRestoreRule$1.evaluate(SystemPropertiesRestoreRule.java:53)
	at org.apache.lucene.util.TestRuleSetupTeardownChained$1.evaluate(TestRuleSetupTeardownChained.java:50)
	at org.apache.lucene.util.TestRuleFieldCacheSanity$1.evaluate(TestRuleFieldCacheSanity.java:51)
	at org.apache.lucene.util.AbstractBeforeAfterRule$1.evaluate(AbstractBeforeAfterRule.java:46)
	at com.carrotsearch.randomizedtesting.rules.SystemPropertiesInvariantRule$1.evaluate(SystemPropertiesInvariantRule.java:55)
	at org.apache.lucene.util.TestRuleThreadAndTestName$1.evaluate(TestRuleThreadAndTestName.java:49)
	at org.apache.lucene.util.TestRuleIgnoreAfterMaxFailures$1.evaluate(TestRuleIgnoreAfterMaxFailures.java:70)
	at org.apache.lucene.util.TestRuleMarkFailure$1.evaluate(TestRuleMarkFailure.java:48)
	at com.carrotsearch.randomizedtesting.rules.StatementAdapter.evaluate(StatementAdapter.java:36)
	at com.carrotsearch.randomizedtesting.ThreadLeakControl$StatementRunner.run(ThreadLeakControl.java:358)
	at com.carrotsearch.randomizedtesting.ThreadLeakControl.forkTimeoutingTask(ThreadLeakControl.java:782)
	at com.carrotsearch.randomizedtesting.ThreadLeakControl$3.evaluate(ThreadLeakControl.java:442)
	at com.carrotsearch.randomizedtesting.RandomizedRunner.runSingleTest(RandomizedRunner.java:746)
	at com.carrotsearch.randomizedtesting.RandomizedRunner$3.evaluate(RandomizedRunner.java:648)
	at com.carrotsearch.randomizedtesting.RandomizedRunner$4.evaluate(RandomizedRunner.java:682)
	at com.carrotsearch.randomizedtesting.RandomizedRunner$5.evaluate(RandomizedRunner.java:693)
	at com.carrotsearch.randomizedtesting.rules.StatementAdapter.evaluate(StatementAdapter.java:36)
	at com.carrotsearch.randomizedtesting.rules.SystemPropertiesRestoreRule$1.evaluate(SystemPropertiesRestoreRule.java:53)
	at org.apache.lucene.util.AbstractBeforeAfterRule$1.evaluate(AbstractBeforeAfterRule.java:46)
	at org.apache.lucene.util.TestRuleStoreClassName$1.evaluate(TestRuleStoreClassName.java:42)
	at com.carrotsearch.randomizedtesting.rules.SystemPropertiesInvariantRule$1.evaluate(SystemPropertiesInvariantRule.java:55)
	at com.carrotsearch.randomizedtesting.rules.NoShadowingOrOverridesOnMethodsRule$1.evaluate(NoShadowingOrOverridesOnMethodsRule.java:39)
	at com.carrotsearch.randomizedtesting.rules.NoShadowingOrOverridesOnMethodsRule$1.evaluate(NoShadowingOrOverridesOnMethodsRule.java:39)
	at com.carrotsearch.randomizedtesting.rules.StatementAdapter.evaluate(StatementAdapter.java:36)
	at org.apache.lucene.util.TestRuleAssertionsRequired$1.evaluate(TestRuleAssertionsRequired.java:43)
	at org.apache.lucene.util.TestRuleMarkFailure$1.evaluate(TestRuleMarkFailure.java:48)
	at org.apache.lucene.util.TestRuleIgnoreAfterMaxFailures$1.evaluate(TestRuleIgnoreAfterMaxFailures.java:70)
	at org.apache.lucene.util.TestRuleIgnoreTestSuites$1.evaluate(TestRuleIgnoreTestSuites.java:55)
	at com.carrotsearch.randomizedtesting.rules.StatementAdapter.evaluate(StatementAdapter.java:36)
	at com.carrotsearch.randomizedtesting.ThreadLeakControl$StatementRunner.run(ThreadLeakControl.java:358)
	at java.lang.Thread.run(Thread.java:724)
Caused by: org.apache.http.conn.HttpHostConnectException: Connection to http://127.0.0.1:52303 refused
	at org.apache.http.impl.conn.DefaultClientConnectionOperator.openConnection(DefaultClientConnectionOperator.java:190)
	at org.apache.http.impl.conn.ManagedClientConnectionImpl.open(ManagedClientConnectionImpl.java:294)
	at org.apache.http.impl.client.DefaultRequestDirector.tryConnect(DefaultRequestDirector.java:645)
	at org.apache.http.impl.client.DefaultRequestDirector.execute(DefaultRequestDirector.java:480)
	at org.apache.http.impl.client.AbstractHttpClient.execute(AbstractHttpClient.java:906)
	at org.apache.http.impl.client.AbstractHttpClient.execute(AbstractHttpClient.java:805)
	at org.apache.http.impl.client.AbstractHttpClient.execute(AbstractHttpClient.java:784)
	at org.apache.solr.client.solrj.impl.HttpSolrServer.request(HttpSolrServer.java:365)
	... 45 more
Caused by: java.net.ConnectException: Connection refused
	at java.net.PlainSocketImpl.socketConnect(Native Method)
	at java.net.AbstractPlainSocketImpl.doConnect(AbstractPlainSocketImpl.java:339)
	at java.net.AbstractPlainSocketImpl.connectToAddress(AbstractPlainSocketImpl.java:200)
	at java.net.AbstractPlainSocketImpl.connect(AbstractPlainSocketImpl.java:182)
	at java.net.SocksSocketImpl.connect(SocksSocketImpl.java:392)
	at java.net.Socket.connect(Socket.java:579)
	at org.apache.http.conn.scheme.PlainSocketFactory.connectSocket(PlainSocketFactory.java:127)
	at org.apache.http.impl.conn.DefaultClientConnectionOperator.openConnection(DefaultClientConnectionOperator.java:180)
	... 52 more




Build Log:
[...truncated 9623 lines...]
   [junit4] Suite: org.apache.solr.cloud.CollectionsAPIDistributedZkTest
   [junit4]   2> 1296047 T2562 oas.BaseDistributedSearchTestCase.initHostContext Setting hostContext system property: /
   [junit4]   2> 1296055 T2562 oas.SolrTestCaseJ4.setUp ###Starting testDistribSearch
   [junit4]   2> Creating dataDir: /Users/jenkins/jenkins-slave/workspace/Lucene-Solr-4.x-MacOSX/solr/build/solr-core/test/J0/./solrtest-CollectionsAPIDistributedZkTest-1375324340863
   [junit4]   2> 1296057 T2562 oasc.ZkTestServer.run STARTING ZK TEST SERVER
   [junit4]   2> 1296057 T2563 oasc.ZkTestServer$ZKServerMain.runFromConfig Starting server
   [junit4]   2> 1296097 T2562 oasc.ZkTestServer.run start zk server on port:52296
   [junit4]   2> 1296101 T2562 oascc.ConnectionManager.waitForConnected Waiting for client to connect to ZooKeeper
   [junit4]   2> 1296107 T2569 oascc.ConnectionManager.process Watcher org.apache.solr.common.cloud.ConnectionManager@6fa59f7e name:ZooKeeperConnection Watcher:127.0.0.1:52296 got event WatchedEvent state:SyncConnected type:None path:null path:null type:None
   [junit4]   2> 1296108 T2562 oascc.ConnectionManager.waitForConnected Client is connected to ZooKeeper
   [junit4]   2> 1296108 T2562 oascc.SolrZkClient.makePath makePath: /solr
   [junit4]   2> 1296124 T2562 oascc.ConnectionManager.waitForConnected Waiting for client to connect to ZooKeeper
   [junit4]   2> 1296128 T2571 oascc.ConnectionManager.process Watcher org.apache.solr.common.cloud.ConnectionManager@1382ec39 name:ZooKeeperConnection Watcher:127.0.0.1:52296/solr got event WatchedEvent state:SyncConnected type:None path:null path:null type:None
   [junit4]   2> 1296128 T2562 oascc.ConnectionManager.waitForConnected Client is connected to ZooKeeper
   [junit4]   2> 1296129 T2562 oascc.SolrZkClient.makePath makePath: /collections/collection1
   [junit4]   2> 1296137 T2562 oascc.SolrZkClient.makePath makePath: /collections/collection1/shards
   [junit4]   2> 1296145 T2562 oascc.SolrZkClient.makePath makePath: /collections/control_collection
   [junit4]   2> 1296151 T2562 oascc.SolrZkClient.makePath makePath: /collections/control_collection/shards
   [junit4]   2> 1296159 T2562 oasc.AbstractZkTestCase.putConfig put /Users/jenkins/jenkins-slave/workspace/Lucene-Solr-4.x-MacOSX/solr/build/solr-core/test-files/solr/collection1/conf/solrconfig-tlog.xml to /configs/conf1/solrconfig.xml
   [junit4]   2> 1296159 T2562 oascc.SolrZkClient.makePath makePath: /configs/conf1/solrconfig.xml
   [junit4]   2> 1296170 T2562 oasc.AbstractZkTestCase.putConfig put /Users/jenkins/jenkins-slave/workspace/Lucene-Solr-4.x-MacOSX/solr/build/solr-core/test-files/solr/collection1/conf/schema.xml to /configs/conf1/schema.xml
   [junit4]   2> 1296170 T2562 oascc.SolrZkClient.makePath makePath: /configs/conf1/schema.xml
   [junit4]   2> 1296183 T2562 oasc.AbstractZkTestCase.putConfig put /Users/jenkins/jenkins-slave/workspace/Lucene-Solr-4.x-MacOSX/solr/build/solr-core/test-files/solr/collection1/conf/stopwords.txt to /configs/conf1/stopwords.txt
   [junit4]   2> 1296184 T2562 oascc.SolrZkClient.makePath makePath: /configs/conf1/stopwords.txt
   [junit4]   2> 1296191 T2562 oasc.AbstractZkTestCase.putConfig put /Users/jenkins/jenkins-slave/workspace/Lucene-Solr-4.x-MacOSX/solr/build/solr-core/test-files/solr/collection1/conf/protwords.txt to /configs/conf1/protwords.txt
   [junit4]   2> 1296191 T2562 oascc.SolrZkClient.makePath makePath: /configs/conf1/protwords.txt
   [junit4]   2> 1296198 T2562 oasc.AbstractZkTestCase.putConfig put /Users/jenkins/jenkins-slave/workspace/Lucene-Solr-4.x-MacOSX/solr/build/solr-core/test-files/solr/collection1/conf/currency.xml to /configs/conf1/currency.xml
   [junit4]   2> 1296199 T2562 oascc.SolrZkClient.makePath makePath: /configs/conf1/currency.xml
   [junit4]   2> 1296208 T2562 oasc.AbstractZkTestCase.putConfig put /Users/jenkins/jenkins-slave/workspace/Lucene-Solr-4.x-MacOSX/solr/build/solr-core/test-files/solr/collection1/conf/open-exchange-rates.json to /configs/conf1/open-exchange-rates.json
   [junit4]   2> 1296209 T2562 oascc.SolrZkClient.makePath makePath: /configs/conf1/open-exchange-rates.json
   [junit4]   2> 1296217 T2562 oasc.AbstractZkTestCase.putConfig put /Users/jenkins/jenkins-slave/workspace/Lucene-Solr-4.x-MacOSX/solr/build/solr-core/test-files/solr/collection1/conf/mapping-ISOLatin1Accent.txt to /configs/conf1/mapping-ISOLatin1Accent.txt
   [junit4]   2> 1296218 T2562 oascc.SolrZkClient.makePath makePath: /configs/conf1/mapping-ISOLatin1Accent.txt
   [junit4]   2> 1296240 T2562 oasc.AbstractZkTestCase.putConfig put /Users/jenkins/jenkins-slave/workspace/Lucene-Solr-4.x-MacOSX/solr/build/solr-core/test-files/solr/collection1/conf/old_synonyms.txt to /configs/conf1/old_synonyms.txt
   [junit4]   2> 1296242 T2562 oascc.SolrZkClient.makePath makePath: /configs/conf1/old_synonyms.txt
   [junit4]   2> 1296249 T2562 oasc.AbstractZkTestCase.putConfig put /Users/jenkins/jenkins-slave/workspace/Lucene-Solr-4.x-MacOSX/solr/build/solr-core/test-files/solr/collection1/conf/synonyms.txt to /configs/conf1/synonyms.txt
   [junit4]   2> 1296249 T2562 oascc.SolrZkClient.makePath makePath: /configs/conf1/synonyms.txt
   [junit4]   2> 1296695 T2562 oejs.Server.doStart jetty-8.1.10.v20130312
   [junit4]   2> 1296707 T2562 oejs.AbstractConnector.doStart Started SelectChannelConnector@127.0.0.1:52299
   [junit4]   2> 1296708 T2562 oass.SolrDispatchFilter.init SolrDispatchFilter.init()
   [junit4]   2> 1296708 T2562 oasc.SolrResourceLoader.locateSolrHome JNDI not configured for solr (NoInitialContextEx)
   [junit4]   2> 1296709 T2562 oasc.SolrResourceLoader.locateSolrHome using system property solr.solr.home: /Users/jenkins/jenkins-slave/workspace/Lucene-Solr-4.x-MacOSX/solr/build/solr-core/test/J0/./org.apache.solr.cloud.CollectionsAPIDistributedZkTest-controljetty-1375324341065
   [junit4]   2> 1296709 T2562 oasc.SolrResourceLoader.<init> new SolrResourceLoader for directory: '/Users/jenkins/jenkins-slave/workspace/Lucene-Solr-4.x-MacOSX/solr/build/solr-core/test/J0/./org.apache.solr.cloud.CollectionsAPIDistributedZkTest-controljetty-1375324341065/'
   [junit4]   2> 1296750 T2562 oasc.ConfigSolr.fromFile Loading container configuration from /Users/jenkins/jenkins-slave/workspace/Lucene-Solr-4.x-MacOSX/solr/build/solr-core/test/J0/./org.apache.solr.cloud.CollectionsAPIDistributedZkTest-controljetty-1375324341065/solr.xml
   [junit4]   2> 1296856 T2562 oasc.ConfigSolrXml.<init> Config-defined core root directory: 
   [junit4]   2> 1296857 T2562 oasc.CoreContainer.<init> New CoreContainer 1477555214
   [junit4]   2> 1296857 T2562 oasc.CoreContainer.load Loading cores into CoreContainer [instanceDir=/Users/jenkins/jenkins-slave/workspace/Lucene-Solr-4.x-MacOSX/solr/build/solr-core/test/J0/./org.apache.solr.cloud.CollectionsAPIDistributedZkTest-controljetty-1375324341065/]
   [junit4]   2> 1296859 T2562 oashc.HttpShardHandlerFactory.getParameter Setting socketTimeout to: 120000
   [junit4]   2> 1296860 T2562 oashc.HttpShardHandlerFactory.getParameter Setting urlScheme to: http://
   [junit4]   2> 1296860 T2562 oashc.HttpShardHandlerFactory.getParameter Setting connTimeout to: 15000
   [junit4]   2> 1296861 T2562 oashc.HttpShardHandlerFactory.getParameter Setting maxConnectionsPerHost to: 20
   [junit4]   2> 1296861 T2562 oashc.HttpShardHandlerFactory.getParameter Setting corePoolSize to: 0
   [junit4]   2> 1296861 T2562 oashc.HttpShardHandlerFactory.getParameter Setting maximumPoolSize to: 2147483647
   [junit4]   2> 1296862 T2562 oashc.HttpShardHandlerFactory.getParameter Setting maxThreadIdleTime to: 5
   [junit4]   2> 1296862 T2562 oashc.HttpShardHandlerFactory.getParameter Setting sizeOfQueue to: -1
   [junit4]   2> 1296863 T2562 oashc.HttpShardHandlerFactory.getParameter Setting fairnessPolicy to: false
   [junit4]   2> 1296863 T2562 oascsi.HttpClientUtil.createClient Creating new http client, config:maxConnectionsPerHost=20&maxConnections=10000&socketTimeout=120000&connTimeout=15000&retry=false
   [junit4]   2> 1296883 T2562 oasc.ZkContainer.initZooKeeper Zookeeper client=127.0.0.1:52296/solr
   [junit4]   2> 1296883 T2562 oasc.ZkController.checkChrootPath zkHost includes chroot
   [junit4]   2> 1296886 T2562 oascc.ConnectionManager.waitForConnected Waiting for client to connect to ZooKeeper
   [junit4]   2> 1296890 T2582 oascc.ConnectionManager.process Watcher org.apache.solr.common.cloud.ConnectionManager@4488af25 name:ZooKeeperConnection Watcher:127.0.0.1:52296 got event WatchedEvent state:SyncConnected type:None path:null path:null type:None
   [junit4]   2> 1296890 T2562 oascc.ConnectionManager.waitForConnected Client is connected to ZooKeeper
   [junit4]   2> 1296900 T2562 oascsi.HttpClientUtil.createClient Creating new http client, config:maxConnections=500&maxConnectionsPerHost=16&socketTimeout=120000&connTimeout=15000
   [junit4]   2> 1296902 T2564 oazs.NIOServerCnxn.doIO WARN caught end of stream exception EndOfStreamException: Unable to read additional data from client sessionid 0x14037b8028b0002, likely client has closed socket
   [junit4]   2> 	at org.apache.zookeeper.server.NIOServerCnxn.doIO(NIOServerCnxn.java:220)
   [junit4]   2> 	at org.apache.zookeeper.server.NIOServerCnxnFactory.run(NIOServerCnxnFactory.java:208)
   [junit4]   2> 	at java.lang.Thread.run(Thread.java:724)
   [junit4]   2> 
   [junit4]   2> 1296917 T2562 oascc.ConnectionManager.waitForConnected Waiting for client to connect to ZooKeeper
   [junit4]   2> 1296921 T2584 oascc.ConnectionManager.process Watcher org.apache.solr.common.cloud.ConnectionManager@165a128d name:ZooKeeperConnection Watcher:127.0.0.1:52296/solr got event WatchedEvent state:SyncConnected type:None path:null path:null type:None
   [junit4]   2> 1296921 T2562 oascc.ConnectionManager.waitForConnected Client is connected to ZooKeeper
   [junit4]   2> 1296926 T2562 oascc.SolrZkClient.makePath makePath: /overseer/queue
   [junit4]   2> 1296934 T2562 oascc.SolrZkClient.makePath makePath: /overseer/collection-queue-work
   [junit4]   2> 1296944 T2562 oascc.SolrZkClient.makePath makePath: /live_nodes
   [junit4]   2> 1296950 T2562 oasc.ZkController.createEphemeralLiveNode Register node as live in ZooKeeper:/live_nodes/127.0.0.1:52299_
   [junit4]   2> 1296953 T2562 oascc.SolrZkClient.makePath makePath: /live_nodes/127.0.0.1:52299_
   [junit4]   2> 1296965 T2562 oascc.SolrZkClient.makePath makePath: /overseer_elect/election
   [junit4]   2> 1296981 T2562 oascc.SolrZkClient.makePath makePath: /overseer_elect/leader
   [junit4]   2> 1296987 T2562 oasc.Overseer.start Overseer (id=90133256003584003-127.0.0.1:52299_-n_0000000000) starting
   [junit4]   2> 1296995 T2562 oascc.SolrZkClient.makePath makePath: /overseer/queue-work
   [junit4]   2> 1297006 T2586 oasc.OverseerCollectionProcessor.run Process current queue of collection creations
   [junit4]   2> 1297012 T2562 oascc.SolrZkClient.makePath makePath: /clusterstate.json
   [junit4]   2> 1297018 T2562 oascc.SolrZkClient.makePath makePath: /aliases.json
   [junit4]   2> 1297023 T2562 oascc.ZkStateReader.createClusterStateWatchersAndUpdate Updating cluster state from ZooKeeper... 
   [junit4]   2> 1297038 T2562 oasc.CorePropertiesLocator.discover Looking for core definitions underneath /Users/jenkins/jenkins-slave/workspace/Lucene-Solr-4.x-MacOSX/solr/build/solr-core/test/J0/./org.apache.solr.cloud.CollectionsAPIDistributedZkTest-controljetty-1375324341065
   [junit4]   2> 1297040 T2585 oasc.Overseer$ClusterStateUpdater.run Starting to work on the main queue
   [junit4]   2> 1297192 T2562 oasc.CorePropertiesLocator.discoverUnder Found core conf in /Users/jenkins/jenkins-slave/workspace/Lucene-Solr-4.x-MacOSX/solr/build/solr-core/test/J0/./org.apache.solr.cloud.CollectionsAPIDistributedZkTest-controljetty-1375324341065/conf/
   [junit4]   2> 1297199 T2562 oasc.CorePropertiesLocator.discover Found 1 core definitions
   [junit4]   2> 1297200 T2562 oass.SolrDispatchFilter.init user.dir=/Users/jenkins/jenkins-slave/workspace/Lucene-Solr-4.x-MacOSX/solr/build/solr-core/test/J0
   [junit4]   2> 1297200 T2562 oass.SolrDispatchFilter.init SolrDispatchFilter.init() done
   [junit4]   2> 1297201 T2562 oascsi.HttpClientUtil.createClient Creating new http client, config:maxConnections=128&maxConnectionsPerHost=32&followRedirects=false
   [junit4]   2> 1297218 T2562 oascsi.HttpClientUtil.createClient Creating new http client, config:
   [junit4]   2> 1297222 T2562 oascc.ConnectionManager.waitForConnected Waiting for client to connect to ZooKeeper
   [junit4]   2> 1297227 T2589 oascc.ConnectionManager.process Watcher org.apache.solr.common.cloud.ConnectionManager@3d650b8b name:ZooKeeperConnection Watcher:127.0.0.1:52296/solr got event WatchedEvent state:SyncConnected type:None path:null path:null type:None
   [junit4]   2> 1297229 T2562 oascc.ConnectionManager.waitForConnected Client is connected to ZooKeeper
   [junit4]   2> 1297236 T2562 oascc.ZkStateReader.createClusterStateWatchersAndUpdate Updating cluster state from ZooKeeper... 
   [junit4]   2> 1297244 T2562 oasc.ChaosMonkey.monkeyLog monkey: init - expire sessions:true cause connection loss:true
   [junit4]   2> 1297693 T2562 oejs.Server.doStart jetty-8.1.10.v20130312
   [junit4]   2> 1297699 T2562 oejs.AbstractConnector.doStart Started SelectChannelConnector@127.0.0.1:52303
   [junit4]   2> 1297706 T2562 oass.SolrDispatchFilter.init SolrDispatchFilter.init()
   [junit4]   2> 1297707 T2562 oasc.SolrResourceLoader.locateSolrHome JNDI not configured for solr (NoInitialContextEx)
   [junit4]   2> 1297707 T2562 oasc.SolrResourceLoader.locateSolrHome using system property solr.solr.home: /Users/jenkins/jenkins-slave/workspace/Lucene-Solr-4.x-MacOSX/solr/build/solr-core/test/J0/./org.apache.solr.cloud.CollectionsAPIDistributedZkTest-jetty1-1375324342052
   [junit4]   2> 1297707 T2562 oasc.SolrResourceLoader.<init> new SolrResourceLoader for directory: '/Users/jenkins/jenkins-slave/workspace/Lucene-Solr-4.x-MacOSX/solr/build/solr-core/test/J0/./org.apache.solr.cloud.CollectionsAPIDistributedZkTest-jetty1-1375324342052/'
   [junit4]   2> 1297746 T2562 oasc.ConfigSolr.fromFile Loading container configuration from /Users/jenkins/jenkins-slave/workspace/Lucene-Solr-4.x-MacOSX/solr/build/solr-core/test/J0/./org.apache.solr.cloud.CollectionsAPIDistributedZkTest-jetty1-1375324342052/solr.xml
   [junit4]   2> 1297903 T2562 oasc.ConfigSolrXml.<init> Config-defined core root directory: 
   [junit4]   2> 1297904 T2562 oasc.CoreContainer.<init> New CoreContainer 643402743
   [junit4]   2> 1297905 T2562 oasc.CoreContainer.load Loading cores into CoreContainer [instanceDir=/Users/jenkins/jenkins-slave/workspace/Lucene-Solr-4.x-MacOSX/solr/build/solr-core/test/J0/./org.apache.solr.cloud.CollectionsAPIDistributedZkTest-jetty1-1375324342052/]
   [junit4]   2> 1297909 T2562 oashc.HttpShardHandlerFactory.getParameter Setting socketTimeout to: 120000
   [junit4]   2> 1297910 T2562 oashc.HttpShardHandlerFactory.getParameter Setting urlScheme to: http://
   [junit4]   2> 1297910 T2562 oashc.HttpShardHandlerFactory.getParameter Setting connTimeout to: 15000
   [junit4]   2> 1297911 T2562 oashc.HttpShardHandlerFactory.getParameter Setting maxConnectionsPerHost to: 20
   [junit4]   2> 1297911 T2562 oashc.HttpShardHandlerFactory.getParameter Setting corePoolSize to: 0
   [junit4]   2> 1297911 T2562 oashc.HttpShardHandlerFactory.getParameter Setting maximumPoolSize to: 2147483647
   [junit4]   2> 1297912 T2562 oashc.HttpShardHandlerFactory.getParameter Setting maxThreadIdleTime to: 5
   [junit4]   2> 1297912 T2562 oashc.HttpShardHandlerFactory.getParameter Setting sizeOfQueue to: -1
   [junit4]   2> 1297913 T2562 oashc.HttpShardHandlerFactory.getParameter Setting fairnessPolicy to: false
   [junit4]   2> 1297913 T2562 oascsi.HttpClientUtil.createClient Creating new http client, config:maxConnectionsPerHost=20&maxConnections=10000&socketTimeout=120000&connTimeout=15000&retry=false
   [junit4]   2> 1297938 T2562 oasc.ZkContainer.initZooKeeper Zookeeper client=127.0.0.1:52296/solr
   [junit4]   2> 1297938 T2562 oasc.ZkController.checkChrootPath zkHost includes chroot
   [junit4]   2> 1297939 T2562 oascc.ConnectionManager.waitForConnected Waiting for client to connect to ZooKeeper
   [junit4]   2> 1297943 T2600 oascc.ConnectionManager.process Watcher org.apache.solr.common.cloud.ConnectionManager@767cc927 name:ZooKeeperConnection Watcher:127.0.0.1:52296 got event WatchedEvent state:SyncConnected type:None path:null path:null type:None
   [junit4]   2> 1297944 T2562 oascc.ConnectionManager.waitForConnected Client is connected to ZooKeeper
   [junit4]   2> 1297948 T2562 oascsi.HttpClientUtil.createClient Creating new http client, config:maxConnections=500&maxConnectionsPerHost=16&socketTimeout=120000&connTimeout=15000
   [junit4]   2> 1297963 T2562 oascc.ConnectionManager.waitForConnected Waiting for client to connect to ZooKeeper
   [junit4]   2> 1297967 T2602 oascc.ConnectionManager.process Watcher org.apache.solr.common.cloud.ConnectionManager@2e033dbe name:ZooKeeperConnection Watcher:127.0.0.1:52296/solr got event WatchedEvent state:SyncConnected type:None path:null path:null type:None
   [junit4]   2> 1297967 T2562 oascc.ConnectionManager.waitForConnected Client is connected to ZooKeeper
   [junit4]   2> 1297977 T2562 oascc.ZkStateReader.createClusterStateWatchersAndUpdate Updating cluster state from ZooKeeper... 
   [junit4]   2> 1298986 T2562 oasc.ZkController.createEphemeralLiveNode Register node as live in ZooKeeper:/live_nodes/127.0.0.1:52303_
   [junit4]   2> 1298988 T2562 oascc.SolrZkClient.makePath makePath: /live_nodes/127.0.0.1:52303_
   [junit4]   2> 1298995 T2602 oascc.ZkStateReader$3.process Updating live nodes... (2)
   [junit4]   2> 1299005 T2562 oasc.CorePropertiesLocator.discover Looking for core definitions underneath /Users/jenkins/jenkins-slave/workspace/Lucene-Solr-4.x-MacOSX/solr/build/solr-core/test/J0/./org.apache.solr.cloud.CollectionsAPIDistributedZkTest-jetty1-1375324342052
   [junit4]   2> 1299016 T2584 oascc.ZkStateReader$3.process Updating live nodes... (2)
   [junit4]   2> 1299017 T2589 oascc.ZkStateReader$3.process Updating live nodes... (2)
   [junit4]   2> 1299168 T2562 oasc.CorePropertiesLocator.discoverUnder Found core conf in /Users/jenkins/jenkins-slave/workspace/Lucene-Solr-4.x-MacOSX/solr/build/solr-core/test/J0/./org.apache.solr.cloud.CollectionsAPIDistributedZkTest-jetty1-1375324342052/conf/
   [junit4]   2> 1299174 T2562 oasc.CorePropertiesLocator.discover Found 1 core definitions
   [junit4]   2> 1299175 T2562 oass.SolrDispatchFilter.init user.dir=/Users/jenkins/jenkins-slave/workspace/Lucene-Solr-4.x-MacOSX/solr/build/solr-core/test/J0
   [junit4]   2> 1299176 T2562 oass.SolrDispatchFilter.init SolrDispatchFilter.init() done
   [junit4]   2> 1299176 T2562 oascsi.HttpClientUtil.createClient Creating new http client, config:maxConnections=128&maxConnectionsPerHost=32&followRedirects=false
   [junit4]   2> 1299688 T2562 oejs.Server.doStart jetty-8.1.10.v20130312
   [junit4]   2> 1299693 T2562 oejs.AbstractConnector.doStart Started SelectChannelConnector@127.0.0.1:52306
   [junit4]   2> 1299694 T2562 oass.SolrDispatchFilter.init SolrDispatchFilter.init()
   [junit4]   2> 1299695 T2562 oasc.SolrResourceLoader.locateSolrHome JNDI not configured for solr (NoInitialContextEx)
   [junit4]   2> 1299695 T2562 oasc.SolrResourceLoader.locateSolrHome using system property solr.solr.home: /Users/jenkins/jenkins-slave/workspace/Lucene-Solr-4.x-MacOSX/solr/build/solr-core/test/J0/./org.apache.solr.cloud.CollectionsAPIDistributedZkTest-jetty2-1375324344002
   [junit4]   2> 1299696 T2562 oasc.SolrResourceLoader.<init> new SolrResourceLoader for directory: '/Users/jenkins/jenkins-slave/workspace/Lucene-Solr-4.x-MacOSX/solr/build/solr-core/test/J0/./org.apache.solr.cloud.CollectionsAPIDistributedZkTest-jetty2-1375324344002/'
   [junit4]   2> 1299733 T2562 oasc.ConfigSolr.fromFile Loading container configuration from /Users/jenkins/jenkins-slave/workspace/Lucene-Solr-4.x-MacOSX/solr/build/solr-core/test/J0/./org.apache.solr.cloud.CollectionsAPIDistributedZkTest-jetty2-1375324344002/solr.xml
   [junit4]   2> 1299849 T2562 oasc.ConfigSolrXml.<init> Config-defined core root directory: 
   [junit4]   2> 1299849 T2562 oasc.CoreContainer.<init> New CoreContainer 489465668
   [junit4]   2> 1299850 T2562 oasc.CoreContainer.load Loading cores into CoreContainer [instanceDir=/Users/jenkins/jenkins-slave/workspace/Lucene-Solr-4.x-MacOSX/solr/build/solr-core/test/J0/./org.apache.solr.cloud.CollectionsAPIDistributedZkTest-jetty2-1375324344002/]
   [junit4]   2> 1299852 T2562 oashc.HttpShardHandlerFactory.getParameter Setting socketTimeout to: 120000
   [junit4]   2> 1299852 T2562 oashc.HttpShardHandlerFactory.getParameter Setting urlScheme to: http://
   [junit4]   2> 1299853 T2562 oashc.HttpShardHandlerFactory.getParameter Setting connTimeout to: 15000
   [junit4]   2> 1299853 T2562 oashc.HttpShardHandlerFactory.getParameter Setting maxConnectionsPerHost to: 20
   [junit4]   2> 1299854 T2562 oashc.HttpShardHandlerFactory.getParameter Setting corePoolSize to: 0
   [junit4]   2> 1299854 T2562 oashc.HttpShardHandlerFactory.getParameter Setting maximumPoolSize to: 2147483647
   [junit4]   2> 1299855 T2562 oashc.HttpShardHandlerFactory.getParameter Setting maxThreadIdleTime to: 5
   [junit4]   2> 1299855 T2562 oashc.HttpShardHandlerFactory.getParameter Setting sizeOfQueue to: -1
   [junit4]   2> 1299855 T2562 oashc.HttpShardHandlerFactory.getParameter Setting fairnessPolicy to: false
   [junit4]   2> 1299856 T2562 oascsi.HttpClientUtil.createClient Creating new http client, config:maxConnectionsPerHost=20&maxConnections=10000&socketTimeout=120000&connTimeout=15000&retry=false
   [junit4]   2> 1299880 T2562 oasc.ZkContainer.initZooKeeper Zookeeper client=127.0.0.1:52296/solr
   [junit4]   2> 1299880 T2562 oasc.ZkController.checkChrootPath zkHost includes chroot
   [junit4]   2> 1299882 T2562 oascc.ConnectionManager.waitForConnected Waiting for client to connect to ZooKeeper
   [junit4]   2> 1299888 T2614 oascc.ConnectionManager.process Watcher org.apache.solr.common.cloud.ConnectionManager@62e2d353 name:ZooKeeperConnection Watcher:127.0.0.1:52296 got event WatchedEvent state:SyncConnected type:None path:null path:null type:None
   [junit4]   2> 1299889 T2562 oascc.ConnectionManager.waitForConnected Client is connected to ZooKeeper
   [junit4]   2> 1299893 T2562 oascsi.HttpClientUtil.createClient Creating new http client, config:maxConnections=500&maxConnectionsPerHost=16&socketTimeout=120000&connTimeout=15000
   [junit4]   2> 1299909 T2562 oascc.ConnectionManager.waitForConnected Waiting for client to connect to ZooKeeper
   [junit4]   2> 1299914 T2616 oascc.ConnectionManager.process Watcher org.apache.solr.common.cloud.ConnectionManager@7c3a2586 name:ZooKeeperConnection Watcher:127.0.0.1:52296/solr got event WatchedEvent state:SyncConnected type:None path:null path:null type:None
   [junit4]   2> 1299914 T2562 oascc.ConnectionManager.waitForConnected Client is connected to ZooKeeper
   [junit4]   2> 1299927 T2562 oascc.ZkStateReader.createClusterStateWatchersAndUpdate Updating cluster state from ZooKeeper... 
   [junit4]   2> 1300939 T2562 oasc.ZkController.createEphemeralLiveNode Register node as live in ZooKeeper:/live_nodes/127.0.0.1:52306_
   [junit4]   2> 1300946 T2562 oascc.SolrZkClient.makePath makePath: /live_nodes/127.0.0.1:52306_
   [junit4]   2> 1300960 T2584 oascc.ZkStateReader$3.process Updating live nodes... (3)
   [junit4]   2> 1300961 T2616 oascc.ZkStateReader$3.process Updating live nodes... (3)
   [junit4]   2> 1300962 T2589 oascc.ZkStateReader$3.process Updating live nodes... (3)
   [junit4]   2> 1300964 T2602 oascc.ZkStateReader$3.process Updating live nodes... (3)
   [junit4]   2> 1300975 T2562 oasc.CorePropertiesLocator.discover Looking for core definitions underneath /Users/jenkins/jenkins-slave/workspace/Lucene-Solr-4.x-MacOSX/solr/build/solr-core/test/J0/./org.apache.solr.cloud.CollectionsAPIDistributedZkTest-jetty2-1375324344002
   [junit4]   2> 1301122 T2562 oasc.CorePropertiesLocator.discoverUnder Found core conf in /Users/jenkins/jenkins-slave/workspace/Lucene-Solr-4.x-MacOSX/solr/build/solr-core/test/J0/./org.apache.solr.cloud.CollectionsAPIDistributedZkTest-jetty2-1375324344002/conf/
   [junit4]   2> 1301131 T2562 oasc.CorePropertiesLocator.discover Found 1 core definitions
   [junit4]   2> 1301132 T2562 oass.SolrDispatchFilter.init user.dir=/Users/jenkins/jenkins-slave/workspace/Lucene-Solr-4.x-MacOSX/solr/build/solr-core/test/J0
   [junit4]   2> 1301132 T2562 oass.SolrDispatchFilter.init SolrDispatchFilter.init() done
   [junit4]   2> 1301133 T2562 oascsi.HttpClientUtil.createClient Creating new http client, config:maxConnections=128&maxConnectionsPerHost=32&followRedirects=false
   [junit4]   2> 1301595 T2562 oejs.Server.doStart jetty-8.1.10.v20130312
   [junit4]   2> 1301600 T2562 oejs.AbstractConnector.doStart Started SelectChannelConnector@127.0.0.1:52309
   [junit4]   2> 1301601 T2562 oass.SolrDispatchFilter.init SolrDispatchFilter.init()
   [junit4]   2> 1301602 T2562 oasc.SolrResourceLoader.locateSolrHome JNDI not configured for solr (NoInitialContextEx)
   [junit4]   2> 1301603 T2562 oasc.SolrResourceLoader.locateSolrHome using system property solr.solr.home: /Users/jenkins/jenkins-slave/workspace/Lucene-Solr-4.x-MacOSX/solr/build/solr-core/test/J0/./org.apache.solr.cloud.CollectionsAPIDistributedZkTest-jetty3-1375324345957
   [junit4]   2> 1301603 T2562 oasc.SolrResourceLoader.<init> new SolrResourceLoader for directory: '/Users/jenkins/jenkins-slave/workspace/Lucene-Solr-4.x-MacOSX/solr/build/solr-core/test/J0/./org.apache.solr.cloud.CollectionsAPIDistributedZkTest-jetty3-1375324345957/'
   [junit4]   2> 1301649 T2562 oasc.ConfigSolr.fromFile Loading container configuration from /Users/jenkins/jenkins-slave/workspace/Lucene-Solr-4.x-MacOSX/solr/build/solr-core/test/J0/./org.apache.solr.cloud.CollectionsAPIDistributedZkTest-jetty3-1375324345957/solr.xml
   [junit4]   2> 1301748 T2562 oasc.ConfigSolrXml.<init> Config-defined core root directory: 
   [junit4]   2> 1301748 T2562 oasc.CoreContainer.<init> New CoreContainer 780007164
   [junit4]   2> 1301749 T2562 oasc.CoreContainer.load Loading cores into CoreContainer [instanceDir=/Users/jenkins/jenkins-slave/workspace/Lucene-Solr-4.x-MacOSX/solr/build/solr-core/test/J0/./org.apache.solr.cloud.CollectionsAPIDistributedZkTest-jetty3-1375324345957/]
   [junit4]   2> 1301751 T2562 oashc.HttpShardHandlerFactory.getParameter Setting socketTimeout to: 120000
   [junit4]   2> 1301751 T2562 oashc.HttpShardHandlerFactory.getParameter Setting urlScheme to: http://
   [junit4]   2> 1301751 T2562 oashc.HttpShardHandlerFactory.getParameter Setting connTimeout to: 15000
   [junit4]   2> 1301752 T2562 oashc.HttpShardHandlerFactory.getParameter Setting maxConnectionsPerHost to: 20
   [junit4]   2> 1301752 T2562 oashc.HttpShardHandlerFactory.getParameter Setting corePoolSize to: 0
   [junit4]   2> 1301753 T2562 oashc.HttpShardHandlerFactory.getParameter Setting maximumPoolSize to: 2147483647
   [junit4]   2> 1301753 T2562 oashc.HttpShardHandlerFactory.getParameter Setting maxThreadIdleTime to: 5
   [junit4]   2> 1301753 T2562 oashc.HttpShardHandlerFactory.getParameter Setting sizeOfQueue to: -1
   [junit4]   2> 1301754 T2562 oashc.HttpShardHandlerFactory.getParameter Setting fairnessPolicy to: false
   [junit4]   2> 1301755 T2562 oascsi.HttpClientUtil.createClient Creating new http client, config:maxConnectionsPerHost=20&maxConnections=10000&socketTimeout=120000&connTimeout=15000&retry=false
   [junit4]   2> 1301777 T2562 oasc.ZkContainer.initZooKeeper Zookeeper client=127.0.0.1:52296/solr
   [junit4]   2> 1301778 T2562 oasc.ZkController.checkChrootPath zkHost includes chroot
   [junit4]   2> 1301781 T2562 oascc.ConnectionManager.waitForConnected Waiting for client to connect to ZooKeeper
   [junit4]   2> 1301785 T2628 oascc.ConnectionManager.process Watcher org.apache.solr.common.cloud.ConnectionManager@3bfcdbb8 name:ZooKeeperConnection Watcher:127.0.0.1:52296 got event WatchedEvent state:SyncConnected type:None path:null path:null type:None
   [junit4]   2> 1301785 T2562 oascc.ConnectionManager.waitForConnected Client is connected to ZooKeeper
   [junit4]   2> 1301789 T2562 oascsi.HttpClientUtil.createClient Creating new http client, config:maxConnections=500&maxConnectionsPerHost=16&socketTimeout=120000&connTimeout=15000
   [junit4]   2> 1301805 T2562 oascc.ConnectionManager.waitForConnected Waiting for client to connect to ZooKeeper
   [junit4]   2> 1301810 T2630 oascc.ConnectionManager.process Watcher org.apache.solr.common.cloud.ConnectionManager@496c1cfd name:ZooKeeperConnection Watcher:127.0.0.1:52296/solr got event WatchedEvent state:SyncConnected type:None path:null path:null type:None
   [junit4]   2> 1301811 T2562 oascc.ConnectionManager.waitForConnected Client is connected to ZooKeeper
   [junit4]   2> 1301823 T2562 oascc.ZkStateReader.createClusterStateWatchersAndUpdate Updating cluster state from ZooKeeper... 
   [junit4]   2> 1302832 T2562 oasc.ZkController.createEphemeralLiveNode Register node as live in ZooKeeper:/live_nodes/127.0.0.1:52309_
   [junit4]   2> 1302834 T2562 oascc.SolrZkClient.makePath makePath: /live_nodes/127.0.0.1:52309_
   [junit4]   2> 1302844 T2630 oascc.ZkStateReader$3.process Updating live nodes... (4)
   [junit4]   2> 1302852 T2584 oascc.ZkStateReader$3.process Updating live nodes... (4)
   [junit4]   2> 1302853 T2602 oascc.ZkStateReader$3.process Updating live nodes... (4)
   [junit4]   2> 1302854 T2616 oascc.ZkStateReader$3.process Updating live nodes... (4)
   [junit4]   2> 1302855 T2589 oascc.ZkStateReader$3.process Updating live nodes... (4)
   [junit4]   2> 1302862 T2562 oasc.CorePropertiesLocator.discover Looking for core definitions underneath /Users/jenkins/jenkins-slave/workspace/Lucene-Solr-4.x-MacOSX/solr/build/solr-core/test/J0/./org.apache.solr.cloud.CollectionsAPIDistributedZkTest-jetty3-1375324345957
   [junit4]   2> 1303020 T2562 oasc.CorePropertiesLocator.discoverUnder Found core conf in /Users/jenkins/jenkins-slave/workspace/Lucene-Solr-4.x-MacOSX/solr/build/solr-core/test/J0/./org.apache.solr.cloud.CollectionsAPIDistributedZkTest-jetty3-1375324345957/conf/
   [junit4]   2> 1303028 T2562 oasc.CorePropertiesLocator.discover Found 1 core definitions
   [junit4]   2> 1303030 T2562 oass.SolrDispatchFilter.init user.dir=/Users/jenkins/jenkins-slave/workspace/Lucene-Solr-4.x-MacOSX/solr/build/solr-core/test/J0
   [junit4]   2> 1303030 T2562 oass.SolrDispatchFilter.init SolrDispatchFilter.init() done
   [junit4]   2> 1303030 T2562 oascsi.HttpClientUtil.createClient Creating new http client, config:maxConnections=128&maxConnectionsPerHost=32&followRedirects=false
   [junit4]   2> 1303507 T2562 oejs.Server.doStart jetty-8.1.10.v20130312
   [junit4]   2> 1303519 T2562 oejs.AbstractConnector.doStart Started SelectChannelConnector@127.0.0.1:52312
   [junit4]   2> 1303520 T2562 oass.SolrDispatchFilter.init SolrDispatchFilter.init()
   [junit4]   2> 1303521 T2562 oasc.SolrResourceLoader.locateSolrHome JNDI not configured for solr (NoInitialContextEx)
   [junit4]   2> 1303521 T2562 oasc.SolrResourceLoader.locateSolrHome using system property solr.solr.home: /Users/jenkins/jenkins-slave/workspace/Lucene-Solr-4.x-MacOSX/solr/build/solr-core/test/J0/./org.apache.solr.cloud.CollectionsAPIDistributedZkTest-jetty4-1375324347861
   [junit4]   2> 1303522 T2562 oasc.SolrResourceLoader.<init> new SolrResourceLoader for directory: '/Users/jenkins/jenkins-slave/workspace/Lucene-Solr-4.x-MacOSX/solr/build/solr-core/test/J0/./org.apache.solr.cloud.CollectionsAPIDistributedZkTest-jetty4-1375324347861/'
   [junit4]   2> 1303562 T2562 oasc.ConfigSolr.fromFile Loading container configuration from /Users/jenkins/jenkins-slave/workspace/Lucene-Solr-4.x-MacOSX/solr/build/solr-core/test/J0/./org.apache.solr.cloud.CollectionsAPIDistributedZkTest-jetty4-1375324347861/solr.xml
   [junit4]   2> 1303666 T2562 oasc.ConfigSolrXml.<init> Config-defined core root directory: 
   [junit4]   2> 1303666 T2562 oasc.CoreContainer.<init> New CoreContainer 8688883
   [junit4]   2> 1303667 T2562 oasc.CoreContainer.load Loading cores into CoreContainer [instanceDir=/Users/jenkins/jenkins-slave/workspace/Lucene-Solr-4.x-MacOSX/solr/build/solr-core/test/J0/./org.apache.solr.cloud.CollectionsAPIDistributedZkTest-jetty4-1375324347861/]
   [junit4]   2> 1303669 T2562 oashc.HttpShardHandlerFactory.getParameter Setting socketTimeout to: 120000
   [junit4]   2> 1303669 T2562 oashc.HttpShardHandlerFactory.getParameter Setting urlScheme to: http://
   [junit4]   2> 1303669 T2562 oashc.HttpShardHandlerFactory.getParameter Setting connTimeout to: 15000
   [junit4]   2> 1303670 T2562 oashc.HttpShardHandlerFactory.getParameter Setting maxConnectionsPerHost to: 20
   [junit4]   2> 1303670 T2562 oashc.HttpShardHandlerFactory.getParameter Setting corePoolSize to: 0
   [junit4]   2> 1303671 T2562 oashc.HttpShardHandlerFactory.getParameter Setting maximumPoolSize to: 2147483647
   [junit4]   2> 1303671 T2562 oashc.HttpShardHandlerFactory.getParameter Setting maxThreadIdleTime to: 5
   [junit4]   2> 1303671 T2562 oashc.HttpShardHandlerFactory.getParameter Setting sizeOfQueue to: -1
   [junit4]   2> 1303672 T2562 oashc.HttpShardHandlerFactory.getParameter Setting fairnessPolicy to: false
   [junit4]   2> 1303672 T2562 oascsi.HttpClientUtil.createClient Creating new http client, config:maxConnectionsPerHost=20&maxConnections=10000&socketTimeout=120000&connTimeout=15000&retry=false
   [junit4]   2> 1303690 T2562 oasc.ZkContainer.initZooKeeper Zookeeper client=127.0.0.1:52296/solr
   [junit4]   2> 1303691 T2562 oasc.ZkController.checkChrootPath zkHost includes chroot
   [junit4]   2> 1303694 T2562 oascc.ConnectionManager.waitForConnected Waiting for client to connect to ZooKeeper
   [junit4]   2> 1303697 T2642 oascc.ConnectionManager.process Watcher org.apache.solr.common.cloud.ConnectionManager@1e8eb3f1 name:ZooKeeperConnection Watcher:127.0.0.1:52296 got event WatchedEvent state:SyncConnected type:None path:null path:null type:None
   [junit4]   2> 1303697 T2562 oascc.ConnectionManager.waitForConnected Client is connected to ZooKeeper
   [junit4]   2> 1303702 T2562 oascsi.HttpClientUtil.createClient Creating new http client, config:maxConnections=500&maxConnectionsPerHost=16&socketTimeout=120000&connTimeout=15000
   [junit4]   2> 1303722 T2562 oascc.ConnectionManager.waitForConnected Waiting for client to connect to ZooKeeper
   [junit4]   2> 1303727 T2644 oascc.ConnectionManager.process Watcher org.apache.solr.common.cloud.ConnectionManager@a2beec name:ZooKeeperConnection Watcher:127.0.0.1:52296/solr got event WatchedEvent state:SyncConnected type:None path:null path:null type:None
   [junit4]   2> 1303727 T2562 oascc.ConnectionManager.waitForConnected Client is connected to ZooKeeper
   [junit4]   2> 1303739 T2562 oascc.ZkStateReader.createClusterStateWatchersAndUpdate Updating cluster state from ZooKeeper... 
   [junit4]   2> 1304750 T2562 oasc.ZkController.createEphemeralLiveNode Register node as live in ZooKeeper:/live_nodes/127.0.0.1:52312_
   [junit4]   2> 1304752 T2562 oascc.SolrZkClient.makePath makePath: /live_nodes/127.0.0.1:52312_
   [junit4]   2> 1304762 T2630 oascc.ZkStateReader$3.process Updating live nodes... (5)
   [junit4]   2> 1304762 T2602 oascc.ZkStateReader$3.process Updating live nodes... (5)
   [junit4]   2> 1304778 T2562 oasc.CorePropertiesLocator.discover Looking for core definitions underneath /Users/jenkins/jenkins-slave/workspace/Lucene-Solr-4.x-MacOSX/solr/build/solr-core/test/J0/./org.apache.solr.cloud.CollectionsAPIDistributedZkTest-jetty4-1375324347861
   [junit4]   2> 1304780 T2589 oascc.ZkStateReader$3.process Updating live nodes... (5)
   [junit4]   2> 1304782 T2616 oascc.ZkStateReader$3.process Updating live nodes... (5)
   [junit4]   2> 1304783 T2584 oascc.ZkStateReader$3.process Updating live nodes... (5)
   [junit4]   2> 1304783 T2644 oascc.ZkStateReader$3.process Updating live nodes... (5)
   [junit4]   2> 1304922 T2562 oasc.CorePropertiesLocator.discoverUnder Found core conf in /Users/jenkins/jenkins-slave/workspace/Lucene-Solr-4.x-MacOSX/solr/build/solr-core/test/J0/./org.apache.solr.cloud.CollectionsAPIDistributedZkTest-jetty4-1375324347861/conf/
   [junit4]   2> 1304930 T2562 oasc.CorePropertiesLocator.discover Found 1 core definitions
   [junit4]   2> 1304931 T2562 oass.SolrDispatchFilter.init user.dir=/Users/jenkins/jenkins-slave/workspace/Lucene-Solr-4.x-MacOSX/solr/build/solr-core/test/J0
   [junit4]   2> 1304932 T2562 oass.SolrDispatchFilter.init SolrDispatchFilter.init() done
   [junit4]   2> 1304932 T2562 oascsi.HttpClientUtil.createClient Creating new http client, config:maxConnections=128&maxConnectionsPerHost=32&followRedirects=false
   [junit4]   2> 1304950 T2562 oascsi.HttpClientUtil.createClient Creating new http client, config:maxConnections=128&maxConnectionsPerHost=32&followRedirects=false
   [junit4]   2> 1304970 T2594 oasha.CollectionsHandler.handleCreateAction Creating Collection : numShards=2&name=nodes_used_collection&replicationFactor=2&action=CREATE&wt=javabin&version=2
   [junit4]   2> 1304975 T2584 oasc.DistributedQueue$LatchChildWatcher.process Watcher fired on path: /overseer/collection-queue-work state: SyncConnected type NodeChildrenChanged
   [junit4]   2> 1304978 T2584 oasc.DistributedQueue$LatchChildWatcher.process Watcher fired on path: /overseer/collection-queue-work state: SyncConnected type NodeChildrenChanged
   [junit4]   2> 1304979 T2586 oasc.OverseerCollectionProcessor.run Overseer Collection Processor: Get the message id:/overseer/collection-queue-work/qn-0000000000 message:{
   [junit4]   2> 	  "operation":"createcollection",
   [junit4]   2> 	  "numShards":"2",
   [junit4]   2> 	  "name":"nodes_used_collection",
   [junit4]   2> 	  "replicationFactor":"2"}
   [junit4]   2> 1304979 T2586 oasc.OverseerCollectionProcessor.processMessage WARN OverseerCollectionProcessor.processMessage : createcollection , {
   [junit4]   2> 	  "operation":"createcollection",
   [junit4]   2> 	  "numShards":"2",
   [junit4]   2> 	  "name":"nodes_used_collection",
   [junit4]   2> 	  "replicationFactor":"2"}
   [junit4]   2> 1306113 T2585 oascc.ZkStateReader.updateClusterState Updating cloud state from ZooKeeper... 
   [junit4]   2> 1306115 T2585 oasc.Overseer$ClusterStateUpdater.buildCollection building a new collection: nodes_used_collection
   [junit4]   2> 1306115 T2585 oasc.Overseer$ClusterStateUpdater.createCollection Create collection nodes_used_collection with shards [shard1, shard2]
   [junit4]   2> 1306124 T2602 oascc.ZkStateReader$2.process A cluster state change: WatchedEvent state:SyncConnected type:NodeDataChanged path:/clusterstate.json, has occurred - updating... (live nodes size: 5)
   [junit4]   2> 1306125 T2589 oascc.ZkStateReader$2.process A cluster state change: WatchedEvent state:SyncConnected type:NodeDataChanged path:/clusterstate.json, has occurred - updating... (live nodes size: 5)
   [junit4]   2> 1306127 T2644 oascc.ZkStateReader$2.process A cluster state change: WatchedEvent state:SyncConnected type:NodeDataChanged path:/clusterstate.json, has occurred - updating... (live nodes size: 5)
   [junit4]   2> 1306127 T2616 oascc.ZkStateReader$2.process A cluster state change: WatchedEvent state:SyncConnected type:NodeDataChanged path:/clusterstate.json, has occurred - updating... (live nodes size: 5)
   [junit4]   2> 1306124 T2630 oascc.ZkStateReader$2.process A cluster state change: WatchedEvent state:SyncConnected type:NodeDataChanged path:/clusterstate.json, has occurred - updating... (live nodes size: 5)
   [junit4]   2> 1306128 T2584 oascc.ZkStateReader$2.process A cluster state change: WatchedEvent state:SyncConnected type:NodeDataChanged path:/clusterstate.json, has occurred - updating... (live nodes size: 5)
   [junit4]   2> 1306212 T2586 oasc.OverseerCollectionProcessor.createCollection going to create cores replicas shardNames [shard1, shard2] , repFactor : 2
   [junit4]   2> 1306213 T2586 oasc.OverseerCollectionProcessor.createCollection Creating shard nodes_used_collection_shard1_replica1 as part of slice shard1 of collection nodes_used_collection on 127.0.0.1:52299_
   [junit4]   2> 1306214 T2586 oasc.OverseerCollectionProcessor.createCollection Creating shard nodes_used_collection_shard1_replica2 as part of slice shard1 of collection nodes_used_collection on 127.0.0.1:52309_
   [junit4]   2> 1306215 T2586 oasc.OverseerCollectionProcessor.createCollection Creating shard nodes_used_collection_shard2_replica1 as part of slice shard2 of collection nodes_used_collection on 127.0.0.1:52306_
   [junit4]   2> 1306215 T2586 oasc.OverseerCollectionProcessor.createCollection Creating shard nodes_used_collection_shard2_replica2 as part of slice shard2 of collection nodes_used_collection on 127.0.0.1:52303_
   [junit4]   2> 1306253 T2580 oasc.ZkController.publish publishing core=nodes_used_collection_shard1_replica1 state=down
   [junit4]   2> 1306253 T2611 oasc.ZkController.publish publishing core=nodes_used_collection_shard2_replica1 state=down
   [junit4]   2> 1306254 T2598 oasc.ZkController.publish publishing core=nodes_used_collection_shard2_replica2 state=down
   [junit4]   2> 1306257 T2626 oasc.ZkController.publish publishing core=nodes_used_collection_shard1_replica2 state=down
   [junit4]   2> 1306259 T2611 oasc.ZkController.waitForCoreNodeName look for our core node name
   [junit4]   2> 1306260 T2580 oasc.ZkController.waitForCoreNodeName look for our core node name
   [junit4]   2> 1306260 T2626 oasc.ZkController.waitForCoreNodeName look for our core node name
   [junit4]   2> 1306261 T2598 oasc.ZkController.waitForCoreNodeName look for our core node name
   [junit4]   2> 1307661 T2585 oascc.ZkStateReader.updateClusterState Updating cloud state from ZooKeeper... 
   [junit4]   2> 1307664 T2585 oasc.Overseer$ClusterStateUpdater.updateState WARN Could not find collection node for nodes_used_collection, skipping publish state
   [junit4]   2> 1307665 T2585 oasc.Overseer$ClusterStateUpdater.updateState Update state numShards=2 message={
   [junit4]   2> 	  "operation":"state",
   [junit4]   2> 	  "core_node_name":"core_node1",
   [junit4]   2> 	  "numShards":"2",
   [junit4]   2> 	  "shard":"shard2",
   [junit4]   2> 	  "roles":null,
   [junit4]   2> 	  "state":"down",
   [junit4]   2> 	  "shard_state":"active",
   [junit4]   2> 	  "core":"nodes_used_collection_shard2_replica1",
   [junit4]   2> 	  "collection":"nodes_used_collection",
   [junit4]   2> 	  "shard_range":null,
   [junit4]   2> 	  "node_name":"127.0.0.1:52306_",
   [junit4]   2> 	  "base_url":"http://127.0.0.1:52306"}
   [junit4]   2> 1307676 T2585 oasc.Overseer$ClusterStateUpdater.updateState WARN Could not find collection node for nodes_used_collection, skipping publish state
   [junit4]   2> 1307676 T2585 oasc.Overseer$ClusterStateUpdater.updateState Update state numShards=2 message={
   [junit4]   2> 	  "operation":"state",
   [junit4]   2> 	  "core_node_name":"core_node2",
   [junit4]   2> 	  "numShards":"2",
   [junit4]   2> 	  "shard":"shard1",
   [junit4]   2> 	  "roles":null,
   [junit4]   2> 	  "state":"down",
   [junit4]   2> 	  "shard_state":"active",
   [junit4]   2> 	  "core":"nodes_used_collection_shard1_replica1",
   [junit4]   2> 	  "collection":"nodes_used_collection",
   [junit4]   2> 	  "shard_range":null,
   [junit4]   2> 	  "node_name":"127.0.0.1:52299_",
   [junit4]   2> 	  "base_url":"http://127.0.0.1:52299"}
   [junit4]   2> 1307683 T2585 oasc.Overseer$ClusterStateUpdater.updateState WARN Could not find collection node for nodes_used_collection, skipping publish state
   [junit4]   2> 1307683 T2585 oasc.Overseer$ClusterStateUpdater.updateState Update state numShards=2 message={
   [junit4]   2> 	  "operation":"state",
   [junit4]   2> 	  "core_node_name":"core_node3",
   [junit4]   2> 	  "numShards":"2",
   [junit4]   2> 	  "shard":"shard1",
   [junit4]   2> 	  "roles":null,
   [junit4]   2> 	  "state":"down",
   [junit4]   2> 	  "shard_state":"active",
   [junit4]   2> 	  "core":"nodes_used_collection_shard1_replica2",
   [junit4]   2> 	  "collection":"nodes_used_collection",
   [junit4]   2> 	  "shard_range":null,
   [junit4]   2> 	  "node_name":"127.0.0.1:52309_",
   [junit4]   2> 	  "base_url":"http://127.0.0.1:52309"}
   [junit4]   2> 1307690 T2585 oasc.Overseer$ClusterStateUpdater.updateState WARN Could not find collection node for nodes_used_collection, skipping publish state
   [junit4]   2> 1307691 T2585 oasc.Overseer$ClusterStateUpdater.updateState Update state numShards=2 message={
   [junit4]   2> 	  "operation":"state",
   [junit4]   2> 	  "core_node_name":"core_node4",
   [junit4]   2> 	  "numShards":"2",
   [junit4]   2> 	  "shard":"shard2",
   [junit4]   2> 	  "roles":null,
   [junit4]   2> 	  "state":"down",
   [junit4]   2> 	  "shard_state":"active",
   [junit4]   2> 	  "core":"nodes_used_collection_shard2_replica2",
   [junit4]   2> 	  "collection":"nodes_used_collection",
   [junit4]   2> 	  "shard_range":null,
   [junit4]   2> 	  "node_name":"127.0.0.1:52303_",
   [junit4]   2> 	  "base_url":"http://127.0.0.1:52303"}
   [junit4]   2> 1307707 T2630 oascc.ZkStateReader$2.process A cluster state change: WatchedEvent state:SyncConnected type:NodeDataChanged path:/clusterstate.json, has occurred - updating... (live nodes size: 5)
   [junit4]   2> 1307708 T2644 oascc.ZkStateReader$2.process A cluster state change: WatchedEvent state:SyncConnected type:NodeDataChanged path:/clusterstate.json, has occurred - updating... (live nodes size: 5)
   [junit4]   2> 1307707 T2602 oascc.ZkStateReader$2.process A cluster state change: WatchedEvent state:SyncConnected type:NodeDataChanged path:/clusterstate.json, has occurred - updating... (live nodes size: 5)
   [junit4]   2> 1307708 T2584 oascc.ZkStateReader$2.process A cluster state change: WatchedEvent state:SyncConnected type:NodeDataChanged path:/clusterstate.json, has occurred - updating... (live nodes size: 5)
   [junit4]   2> 1307708 T2616 oascc.ZkStateReader$2.process A cluster state change: WatchedEvent state:SyncConnected type:NodeDataChanged path:/clusterstate.json, has occurred - updating... (live nodes size: 5)
   [junit4]   2> 1307708 T2589 oascc.ZkStateReader$2.process A cluster state change: WatchedEvent state:SyncConnected type:NodeDataChanged path:/clusterstate.json, has occurred - updating... (live nodes size: 5)
   [junit4]   2> 1308262 T2580 oasc.ZkController.waitForShardId waiting to find shard id in clusterstate for nodes_used_collection_shard1_replica1
   [junit4]   2> 1308263 T2626 oasc.ZkController.waitForShardId waiting to find shard id in clusterstate for nodes_used_collection_shard1_replica2
   [junit4]   2> 1308262 T2598 oasc.ZkController.waitForShardId waiting to find shard id in clusterstate for nodes_used_collection_shard2_replica2
   [junit4]   2> 1308262 T2611 oasc.ZkController.waitForShardId waiting to find shard id in clusterstate for nodes_used_collection_shard2_replica1
   [junit4]   2> 1308269 T2611 oasc.CorePropertiesLocator.writePropertiesFile ERROR Couldn't persist core properties to /Users/jenkins/jenkins-slave/workspace/Lucene-Solr-4.x-MacOSX/solr/build/solr-core/test/J0/./org.apache.solr.cloud.CollectionsAPIDistributedZkTest-jetty2-1375324344002/nodes_used_collection_shard2_replica1/core.properties: java.io.FileNotFoundException: /Users/jenkins/jenkins-slave/workspace/Lucene-Solr-4.x-MacOSX/solr/build/solr-core/test/J0/./org.apache.solr.cloud.CollectionsAPIDistributedZkTest-jetty2-1375324344002/nodes_used_collection_shard2_replica1/core.properties (No such file or directory)
   [junit4]   2> 1308270 T2611 oasc.CoreContainer.create Creating SolrCore 'nodes_used_collection_shard2_replica1' using instanceDir: /Users/jenkins/jenkins-slave/workspace/Lucene-Solr-4.x-MacOSX/solr/build/solr-core/test/J0/./org.apache.solr.cloud.CollectionsAPIDistributedZkTest-jetty2-1375324344002/nodes_used_collection_shard2_replica1
   [junit4]   2> 1308270 T2611 oasc.ZkController.createCollectionZkNode Check for collection zkNode:nodes_used_collection
   [junit4]   2> 1308264 T2626 oasc.CorePropertiesLocator.writePropertiesFile ERROR Couldn't persist core properties to /Users/jenkins/jenkins-slave/workspace/Lucene-Solr-4.x-MacOSX/solr/build/solr-core/test/J0/./org.apache.solr.cloud.CollectionsAPIDistributedZkTest-jetty3-1375324345957/nodes_used_collection_shard1_replica2/core.properties: java.io.FileNotFoundException: /Users/jenkins/jenkins-slave/workspace/Lucene-Solr-4.x-MacOSX/solr/build/solr-core/test/J0/./org.apache.solr.cloud.CollectionsAPIDistributedZkTest-jetty3-1375324345957/nodes_used_collection_shard1_replica2/core.properties (No such file or directory)
   [junit4]   2> 1308272 T2626 oasc.CoreContainer.create Creating SolrCore 'nodes_used_collection_shard1_replica2' using instanceDir: /Users/jenkins/jenkins-slave/workspace/Lucene-Solr-4.x-MacOSX/solr/build/solr-core/test/J0/./org.apache.solr.cloud.CollectionsAPIDistributedZkTest-jetty3-1375324345957/nodes_used_collection_shard1_replica2
   [junit4]   2> 1308274 T2626 oasc.ZkController.createCollectionZkNode Check for collection zkNode:nodes_used_collection
   [junit4]   2> 1308276 T2598 oasc.CorePropertiesLocator.writePropertiesFile ERROR Couldn't persist core properties to /Users/jenkins/jenkins-slave/workspace/Lucene-Solr-4.x-MacOSX/solr/build/solr-core/test/J0/./org.apache.solr.cloud.CollectionsAPIDistributedZkTest-jetty1-1375324342052/nodes_used_collection_shard2_replica2/core.properties: java.io.FileNotFoundException: /Users/jenkins/jenkins-slave/workspace/Lucene-Solr-4.x-MacOSX/solr/build/solr-core/test/J0/./org.apache.solr.cloud.CollectionsAPIDistributedZkTest-jetty1-1375324342052/nodes_used_collection_shard2_replica2/core.properties (No such file or directory)
   [junit4]   2> 1308277 T2598 oasc.CoreContainer.create Creating SolrCore 'nodes_used_collection_shard2_replica2' using instanceDir: /Users/jenkins/jenkins-slave/workspace/Lucene-Solr-4.x-MacOSX/solr/build/solr-core/test/J0/./org.apache.solr.cloud.CollectionsAPIDistributedZkTest-jetty1-1375324342052/nodes_used_collection_shard2_replica2
   [junit4]   2> 1308277 T2598 oasc.ZkController.createCollectionZkNode Check for collection zkNode:nodes_used_collection
   [junit4]   2> 1308264 T2580 oasc.CorePropertiesLocator.writePropertiesFile ERROR Couldn't persist core properties to /Users/jenkins/jenkins-slave/workspace/Lucene-Solr-4.x-MacOSX/solr/build/solr-core/test/J0/./org.apache.solr.cloud.CollectionsAPIDistributedZkTest-controljetty-1375324341065/nodes_used_collection_shard1_replica1/core.properties: java.io.FileNotFoundException: /Users/jenkins/jenkins-slave/workspace/Lucene-Solr-4.x-MacOSX/solr/build/solr-core/test/J0/./org.apache.solr.cloud.CollectionsAPIDistributedZkTest-controljetty-1375324341065/nodes_used_collection_shard1_replica1/core.properties (No such file or directory)
   [junit4]   2> 1308278 T2580 oasc.CoreContainer.create Creating SolrCore 'nodes_used_collection_shard1_replica1' using instanceDir: /Users/jenkins/jenkins-slave/workspace/Lucene-Solr-4.x-MacOSX/solr/build/solr-core/test/J0/./org.apache.solr.cloud.CollectionsAPIDistributedZkTest-controljetty-1375324341065/nodes_used_collection_shard1_replica1
   [junit4]   2> 1308279 T2580 oasc.ZkController.createCollectionZkNode Check for collection zkNode:nodes_used_collection
   [junit4]   2> 1308281 T2611 oasc.ZkController.createCollectionZkNode Creating collection in ZooKeeper:nodes_used_collection
   [junit4]   2> 1308281 T2611 oasc.ZkController.getConfName Looking for collection configName
   [junit4]   2> 1308282 T2598 oasc.ZkController.createCollectionZkNode Creating collection in ZooKeeper:nodes_used_collection
   [junit4]   2> 1308282 T2598 oasc.ZkController.getConfName Looking for collection configName
   [junit4]   2> 1308284 T2580 oasc.ZkController.createCollectionZkNode Creating collection in ZooKeeper:nodes_used_collection
   [junit4]   2> 1308285 T2580 oasc.ZkController.getConfName Looking for collection configName
   [junit4]   2> 1308285 T2626 oasc.ZkController.createCollectionZkNode Creating collection in ZooKeeper:nodes_used_collection
   [junit4]   2> 1308286 T2626 oasc.ZkController.getConfName Looking for collection configName
   [junit4]   2> 1308289 T2626 oasc.ZkController.getConfName Only one config set found in zk - using it:conf1
   [junit4]   2> 1308289 T2626 oascc.SolrZkClient.makePath makePath: /collections/nodes_used_collection
   [junit4]   2> 1308295 T2626 oasc.ZkController.readConfigName Load collection config from:/collections/nodes_used_collection
   [junit4]   2> 1308298 T2626 oasc.SolrResourceLoader.<init> new SolrResourceLoader for directory: '/Users/jenkins/jenkins-slave/workspace/Lucene-Solr-4.x-MacOSX/solr/build/solr-core/test/J0/./org.apache.solr.cloud.CollectionsAPIDistributedZkTest-jetty3-1375324345957/nodes_used_collection_shard1_replica2/'
   [junit4]   2> 1308316 T2598 oasc.ZkController.getConfName Only one config set found in zk - using it:conf1
   [junit4]   2> 1308317 T2598 oascc.SolrZkClient.makePath makePath: /collections/nodes_used_collection
   [junit4]   2> 1308318 T2611 oasc.ZkController.getConfName Only one config set found in zk - using it:conf1
   [junit4]   2> 1308318 T2611 oascc.SolrZkClient.makePath makePath: /collections/nodes_used_collection
   [junit4]   2> 1308323 T2598 oasc.ZkController.readConfigName Load collection config from:/collections/nodes_used_collection
   [junit4]   2> 1308326 T2580 oasc.ZkController.getConfName Only one config set found in zk - using it:conf1
   [junit4]   2> 1308327 T2580 oascc.SolrZkClient.makePath makePath: /collections/nodes_used_collection
   [junit4]   2> 1308328 T2598 oasc.SolrResourceLoader.<init> new SolrResourceLoader for directory: '/Users/jenkins/jenkins-slave/workspace/Lucene-Solr-4.x-MacOSX/solr/build/solr-core/test/J0/./org.apache.solr.cloud.CollectionsAPIDistributedZkTest-jetty1-1375324342052/nodes_used_collection_shard2_replica2/'
   [junit4]   2> 1308330 T2611 oasc.ZkController.readConfigName Load collection config from:/collections/nodes_used_collection
   [junit4]   2> 1308332 T2580 oasc.ZkController.readConfigName Load collection config from:/collections/nodes_used_collection
   [junit4]   2> 1308335 T2611 oasc.SolrResourceLoader.<init> new SolrResourceLoader for directory: '/Users/jenkins/jenkins-slave/workspace/Lucene-Solr-4.x-MacOSX/solr/build/solr-core/test/J0/./org.apache.solr.cloud.CollectionsAPIDistributedZkTest-jetty2-1375324344002/nodes_used_collection_shard2_replica1/'
   [junit4]   2> 1308338 T2580 oasc.SolrResourceLoader.<init> new SolrResourceLoader for directory: '/Users/jenkins/jenkins-slave/workspace/Lucene-Solr-4.x-MacOSX/solr/build/solr-core/test/J0/./org.apache.solr.cloud.CollectionsAPIDistributedZkTest-controljetty-1375324341065/nodes_used_collection_shard1_replica1/'
   [junit4]   2> 1308564 T2598 oasc.SolrConfig.<init> Using Lucene MatchVersion: LUCENE_45
   [junit4]   2> 1308578 T2611 oasc.SolrConfig.<init> Using Lucene MatchVersion: LUCENE_45
   [junit4]   2> 1308583 T2580 oasc.SolrConfig.<init> Using Lucene MatchVersion: LUCENE_45
   [junit4]   2> 1308630 T2626 oasc.SolrConfig.<init> Using Lucene MatchVersion: LUCENE_45
   [junit4]   2> 1308803 T2580 oasc.SolrConfig.<init> Loaded SolrConfig: solrconfig.xml
   [junit4]   2> 1308808 T2580 oass.IndexSchema.readSchema Reading Solr Schema from schema.xml
   [junit4]   2> 1308819 T2626 oasc.SolrConfig.<init> Loaded SolrConfig: solrconfig.xml
   [junit4]   2> 1308834 T2598 oasc.SolrConfig.<init> Loaded SolrConfig: solrconfig.xml
   [junit4]   2> 1308843 T2611 oasc.SolrConfig.<init> Loaded SolrConfig: solrconfig.xml
   [junit4]   2> 1308849 T2626 oass.IndexSchema.readSchema Reading Solr Schema from schema.xml
   [junit4]   2> 1308854 T2611 oass.IndexSchema.readSchema Reading Solr Schema from schema.xml
   [junit4]   2> 1308861 T2580 oass.IndexSchema.readSchema [nodes_used_collection_shard1_replica1] Schema name=test
   [junit4]   2> 1308866 T2626 oass.IndexSchema.readSchema [nodes_used_collection_shard1_replica2] Schema name=test
   [junit4]   2> 1308870 T2598 oass.IndexSchema.readSchema Reading Solr Schema from schema.xml
   [junit4]   2> 1308881 T2598 oass.IndexSchema.readSchema [nodes_used_collection_shard2_replica2] Schema name=test
   [junit4]   2> 1308898 T2611 oass.IndexSchema.readSchema [nodes_used_collection_shard2_replica1] Schema name=test
   [junit4]   2> 1311189 T2580 oass.ByteField.init WARN ByteField is deprecated and will be removed in 5.0. You should use TrieIntField instead.
   [junit4]   2> 1311190 T2580 oass.ShortField.init WARN ShortField is deprecated and will be removed in 5.0. You should use TrieIntField instead.
   [junit4]   2> 1311191 T2580 oass.OpenExchangeRatesOrgProvider.init Initialized with rates=open-exchange-rates.json, refreshInterval=1440.
   [junit4]   2> 1311212 T2580 oass.IndexSchema.readSchema default search field in schema is text
   [junit4]   2> 1311221 T2580 oass.IndexSchema.readSchema unique key field: id
   [junit4]   2> 1311404 T2598 oass.ByteField.init WARN ByteField is deprecated and will be removed in 5.0. You should use TrieIntField instead.
   [junit4]   2> 1311405 T2598 oass.ShortField.init WARN ShortField is deprecated and will be removed in 5.0. You should use TrieIntField instead.
   [junit4]   2> 1311406 T2598 oass.OpenExchangeRatesOrgProvider.init Initialized with rates=open-exchange-rates.json, refreshInterval=1440.
   [junit4]   2> 1311414 T2580 oass.FileExchangeRateProvider.reload Reloading exchange rates from file currency.xml
   [junit4]   2> 1311419 T2626 oass.ByteField.init WARN ByteField is deprecated and will be removed in 5.0. You should use TrieIntField instead.
   [junit4]   2> 1311419 T2626 oass.ShortField.init WARN ShortField is deprecated and will be removed in 5.0. You should use TrieIntField instead.
   [junit4]   2> 1311421 T2580 oass.FileExchangeRateProvider.reload Reloading exchange rates from file currency.xml
   [junit4]   2> 1311421 T2626 oass.OpenExchangeRatesOrgProvider.init Initialized with rates=open-exchange-rates.json, refreshInterval=1440.
   [junit4]   2> 1311428 T2580 oass.OpenExchangeRatesOrgProvider.reload Reloading exchange rates from open-exchange-rates.json
   [junit4]   2> 1311432 T2580 oass.OpenExchangeRatesOrgProvider$OpenExchangeRates.<init> WARN Unknown key IMPORTANT NOTE
   [junit4]   2> 1311433 T2580 oass.OpenExchangeRatesOrgProvider$OpenExchangeRates.<init> WARN Expected key, got STRING
   [junit4]   2> 1311433 T2580 oass.OpenExchangeRatesOrgProvider.reload Reloading exchange rates from open-exchange-rates.json
   [junit4]   2> 1311434 T2626 oass.IndexSchema.readSchema default search field in schema is text
   [junit4]   2> 1311439 T2626 oass.IndexSchema.readSchema unique key field: id
   [junit4]   2> 1311442 T2580 oass.OpenExchangeRatesOrgProvider$OpenExchangeRates.<init> WARN Unknown key IMPORTANT NOTE
   [junit4]   2> 1311443 T2580 oass.OpenExchangeRatesOrgProvider$OpenExchangeRates.<init> WARN Expected key, got STRING
   [junit4]   2> 1311443 T2580 oasc.SolrCore.initDirectoryFactory org.apache.solr.core.MockDirectoryFactory
   [junit4]   2> 1311444 T2580 oasc.SolrCore.<init> [nodes_used_collection_shard1_replica1] Opening new SolrCore at /Users/jenkins/jenkins-slave/workspace/Lucene-Solr-4.x-MacOSX/solr/build/solr-core/test/J0/./org.apache.solr.cloud.CollectionsAPIDistributedZkTest-controljetty-1375324341065/nodes_used_collection_shard1_replica1/, dataDir=/Users/jenkins/jenkins-slave/workspace/Lucene-Solr-4.x-MacOSX/solr/build/solr-core/test/J0/./org.apache.solr.cloud.CollectionsAPIDistributedZkTest-controljetty-1375324341065//nodes_used_collection_shard1_replica1/data/
   [junit4]   2> 1311447 T2580 oasc.JmxMonitoredMap.<init> JMX monitoring is enabled. Adding Solr mbeans to JMX Server: com.sun.jmx.mbeanserver.JmxMBeanServer@5f5091f2
   [junit4]   2> 1311449 T2580 oasc.CachingDirectoryFactory.get return new directory for /Users/jenkins/jenkins-slave/workspace/Lucene-Solr-4.x-MacOSX/solr/build/solr-core/test/J0/./org.apache.solr.cloud.CollectionsAPIDistributedZkTest-controljetty-1375324341065//nodes_used_collection_shard1_replica1/data
   [junit4]   2> 1311453 T2580 oasc.SolrCore.getNewIndexDir New index directory detected: old=null new=/Users/jenkins/jenkins-slave/workspace/Lucene-Solr-4.x-MacOSX/solr/build/solr-core/test/J0/./org.apache.solr.cloud.CollectionsAPIDistributedZkTest-controljetty-1375324341065//nodes_used_collection_shard1_replica1/data/index/
   [junit4]   2> 1311454 T2580 oasc.SolrCore.initIndex WARN [nodes_used_collection_shard1_replica1] Solr index directory '/Users/jenkins/jenkins-slave/workspace/Lucene-Solr-4.x-MacOSX/solr/build/solr-core/test/J0/./org.apache.solr.cloud.CollectionsAPIDistributedZkTest-controljetty-1375324341065/nodes_used_collection_shard1_replica1/data/index' doesn't exist. Creating new index...
   [junit4]   2> 1311454 T2580 oasc.CachingDirectoryFactory.get return new directory for /Users/jenkins/jenkins-slave/workspace/Lucene-Solr-4.x-MacOSX/solr/build/solr-core/test/J0/./org.apache.solr.cloud.CollectionsAPIDistributedZkTest-controljetty-1375324341065//nodes_used_collection_shard1_replica1/data/index
   [junit4]   2> 1311479 T2611 oass.ByteField.init WARN ByteField is deprecated and will be removed in 5.0. You should use TrieIntField instead.
   [junit4]   2> 1311480 T2611 oass.ShortField.init WARN ShortField is deprecated and will be removed in 5.0. You should use TrieIntField instead.
   [junit4]   2> 1311495 T2611 oass.OpenExchangeRatesOrgProvider.init Initialized with rates=open-exchange-rates.json, refreshInterval=1440.
   [junit4]   2> 1311500 T2580 oasc.SolrDeletionPolicy.onCommit SolrDeletionPolicy.onCommit: commits: num=1
   [junit4]   2> 		commit{dir=MockDirWrapper(org.apache.lucene.store.RAMDirectory@34d509f lockFactory=org.apache.lucene.store.NativeFSLockFactory@2dbe43d),segFN=segments_1,generation=1}
   [junit4]   2> 1311501 T2580 oasc.SolrDeletionPolicy.updateCommits newest commit generation = 1
   [junit4]   2> 1311533 T2580 oasup.UpdateRequestProcessorChain.init inserting DistributedUpdateProcessorFactory into updateRequestProcessorChain "dedupe"
   [junit4]   2> 1311534 T2580 oasup.UpdateRequestProcessorChain.init inserting DistributedUpdateProcessorFactory into updateRequestProcessorChain "stored_sig"
   [junit4]   2> 1311535 T2580 oasup.UpdateRequestProcessorChain.init inserting DistributedUpdateProcessorFactory into updateRequestProcessorChain "distrib-dup-test-chain-implicit"
   [junit4]   2> 1311536 T2580 oasc.RequestHandlers.initHandlersFromConfig created standard: solr.StandardRequestHandler
   [junit4]   2> 1311537 T2580 oasc.RequestHandlers.initHandlersFromConfig created /get: solr.RealTimeGetHandler
   [junit4]   2> 1311537 T2580 oasc.RequestHandlers.initHandlersFromConfig adding lazy requestHandler: solr.ReplicationHandler
   [junit4]   2> 1311537 T2580 oasc.RequestHandlers.initHandlersFromConfig created /replication: solr.ReplicationHandler
   [junit4]   2> 1311559 T2598 oass.IndexSchema.readSchema default search field in schema is text
   [junit4]   2> 1311562 T2580 oasc.RequestHandlers.initHandlersFromConfig created /update: solr.UpdateRequestHandler
   [junit4]   2> 1311562 T2580 oasc.RequestHandlers.initHandlersFromConfig created /admin/: org.apache.solr.handler.admin.AdminHandlers
   [junit4]   2> 1311565 T2598 oass.IndexSchema.readSchema unique key field: id
   [junit4]   2> 1311619 T2611 oass.IndexSchema.readSchema default search field in schema is text
   [junit4]   2> 1311620 T2580 oashl.XMLLoader.init xsltCacheLifetimeSeconds=60
   [junit4]   2> 1311624 T2611 oass.IndexSchema.readSchema unique key field: id
   [junit4]   2> 1311635 T2580 oass.SolrIndexSearcher.<init> Opening Searcher@50099999 main
   [junit4]   2> 1311637 T2580 oasu.CommitTracker.<init> Hard AutoCommit: disabled
   [junit4]   2> 1311637 T2580 oasu.CommitTracker.<init> Soft AutoCommit: disabled
   [junit4]   2> 1311642 T2650 oasc.SolrCore.registerSearcher [nodes_used_collection_shard1_replica1] Registered new searcher Searcher@50099999 main{StandardDirectoryReader(segments_1:1)}
   [junit4]   2> 1311648 T2626 oass.FileExchangeRateProvider.reload Reloading exchange rates from file currency.xml
   [junit4]   2> 1311658 T2580 oasc.CoreContainer.registerCore registering core: nodes_used_collection_shard1_replica1
   [junit4]   2> 1311658 T2580 oasc.ZkController.register Register replica - core:nodes_used_collection_shard1_replica1 address:http://127.0.0.1:52299 collection:nodes_used_collection shard:shard1
   [junit4]   2> 1311658 T2580 oascsi.HttpClientUtil.createClient Creating new http client, config:maxConnections=10000&maxConnectionsPerHost=20&connTimeout=15000&socketTimeout=30000&retry=false
   [junit4]   2> 1311722 T2598 oass.FileExchangeRateProvider.reload Reloading exchange rates from file currency.xml
   [junit4]   2> 1311730 T2626 oass.FileExchangeRateProvider.reload Reloading exchange rates from file currency.xml
   [junit4]   2> 1311742 T2626 oass.OpenExchangeRatesOrgProvider.reload Reloading exchange rates from open-exchange-rates.json
   [junit4]   2> 1311743 T2598 oass.FileExchangeRateProvider.reload Reloading exchange rates from file currency.xml
   [junit4]   2> 1311752 T2626 oass.OpenExchangeRatesOrgProvider$OpenExchangeRates.<init> WARN Unknown key IMPORTANT NOTE
   [junit4]   2> 1311753 T2626 oass.OpenExchangeRatesOrgProvider$OpenExchangeRates.<init> WARN Expected key, got STRING
   [junit4]   2> 1311753 T2626 oass.OpenExchangeRatesOrgProvider.reload Reloading exchange rates from open-exchange-rates.json
   [junit4]   2> 1311758 T2598 oass.OpenExchangeRatesOrgProvider.reload Reloading exchange rates from open-exchange-rates.json
   [junit4]   2> 1311766 T2598 oass.OpenExchangeRatesOrgProvider$OpenExchangeRates.<init> WARN Unknown key IMPORTANT NOTE
   [junit4]   2> 1311766 T2598 oass.OpenExchangeRatesOrgProvider$OpenExchangeRates.<init> WARN Expected key, got STRING
   [junit4]   2> 1311767 T2598 oass.OpenExchangeRatesOrgProvider.reload Reloading exchange rates from open-exchange-rates.json
   [junit4]   2> 1311766 T2626 oass.OpenExchangeRatesOrgProvider$OpenExchangeRates.<init> WARN Unknown key IMPORTANT NOTE
   [junit4]   2> 1311768 T2626 oass.OpenExchangeRatesOrgProvider$OpenExchangeRates.<init> WARN Expected key, got STRING
   [junit4]   2> 1311769 T2626 oasc.SolrCore.initDirectoryFactory org.apache.solr.core.MockDirectoryFactory
   [junit4]   2> 1311769 T2626 oasc.SolrCore.<init> [nodes_used_collection_shard1_replica2] Opening new SolrCore at /Users/jenkins/jenkins-slave/workspace/Lucene-Solr-4.x-MacOSX/solr/build/solr-core/test/J0/./org.apache.solr.cloud.CollectionsAPIDistributedZkTest-jetty3-1375324345957/nodes_used_collection_shard1_replica2/, dataDir=/Users/jenkins/jenkins-slave/workspace/Lucene-Solr-4.x-MacOSX/solr/build/solr-core/test/J0/./org.apache.solr.cloud.CollectionsAPIDistributedZkTest-jetty3-1375324345957//nodes_used_collection_shard1_replica2/data/
   [junit4]   2> 1311769 T2626 oasc.JmxMonitoredMap.<init> JMX monitoring is enabled. Adding Solr mbeans to JMX Server: com.sun.jmx.mbeanserver.JmxMBeanServer@5f5091f2
   [junit4]   2> 1311770 T2626 oasc.CachingDirectoryFactory.get return new directory for /Users/jenkins/jenkins-slave/workspace/Lucene-Solr-4.x-MacOSX/solr/build/solr-core/test/J0/./org.apache.solr.cloud.CollectionsAPIDistributedZkTest-jetty3-1375324345957//nodes_used_collection_shard1_replica2/data
   [junit4]   2> 1311780 T2598 oass.OpenExchangeRatesOrgProvider$OpenExchangeRates.<init> WARN Unknown key IMPORTANT NOTE
   [junit4]   2> 1311781 T2598 oass.OpenExchangeRatesOrgProvider$OpenExchangeRates.<init> WARN Expected key, got STRING
   [junit4]   2> 1311781 T2598 oasc.SolrCore.initDirectoryFactory org.apache.solr.core.MockDirectoryFactory
   [junit4]   2> 1311786 T2598 oasc.SolrCore.<init> [nodes_used_collection_shard2_replica2] Opening new SolrCore at /Users/jenkins/jenkins-slave/workspace/Lucene-Solr-4.x-MacOSX/solr/build/solr-core/test/J0/./org.apache.solr.cloud.CollectionsAPIDistributedZkTest-jetty1-1375324342052/nodes_used_collection_shard2_replica2/, dataDir=/Users/jenkins/jenkins-slave/workspace/Lucene-Solr-4.x-MacOSX/solr/build/solr-core/test/J0/./org.apache.solr.cloud.CollectionsAPIDistributedZkTest-jetty1-1375324342052//nodes_used_collection_shard2_replica2/data/
   [junit4]   2> 1311787 T2598 oasc.JmxMonitoredMap.<init> JMX monitoring is enabled. Adding Solr mbeans to JMX Server: com.sun.jmx.mbeanserver.JmxMBeanServer@5f5091f2
   [junit4]   2> 1311788 T2598 oasc.CachingDirectoryFactory.get return new directory for /Users/jenkins/jenkins-slave/workspace/Lucene-Solr-4.x-MacOSX/solr/build/solr-core/test/J0/./org.apache.solr.cloud.CollectionsAPIDistributedZkTest-jetty1-1375324342052//nodes_used_collection_shard2_replica2/data
   [junit4]   2> 1311788 T2626 oasc.SolrCore.getNewIndexDir New index directory detected: old=null new=/Users/jenkins/jenkins-slave/workspace/Lucene-Solr-4.x-MacOSX/solr/build/solr-core/test/J0/./org.apache.solr.cloud.CollectionsAPIDistributedZkTest-jetty3-1375324345957//nodes_used_collection_shard1_replica2/data/index/
   [junit4]   2> 1311788 T2626 oasc.SolrCore.initIndex WARN [nodes_used_collection_shard1_replica2] Solr index directory '/Users/jenkins/jenkins-slave/workspace/Lucene-Solr-4.x-MacOSX/solr/build/solr-core/test/J0/./org.apache.solr.cloud.CollectionsAPIDistributedZkTest-jetty3-1375324345957/nodes_used_collection_shard1_replica2/data/index' doesn't exist. Creating new index...
   [junit4]   2> 1311794 T2580 oascc.SolrZkClient.makePath makePath: /collections/nodes_used_collection/leader_elect/shard1/election
   [junit4]   2> 1311799 T2598 oasc.SolrCore.getNewIndexDir New index directory detected: old=null new=/Users/jenkins/jenkins-slave/workspace/Lucene-Solr-4.x-MacOSX/solr/build/solr-core/test/J0/./org.apache.solr.cloud.CollectionsAPIDistributedZkTest-jetty1-1375324342052//nodes_used_collection_shard2_replica2/data/index/
   [junit4]   2> 1311799 T2598 oasc.SolrCore.initIndex WARN [nodes_used_collection_shard2_replica2] Solr index directory '/Users/jenkins/jenkins-slave/workspace/Lucene-Solr-4.x-MacOSX/solr/build/solr-core/test/J0/./org.apache.solr.cloud.CollectionsAPIDistributedZkTest-jetty1-1375324342052/nodes_used_collection_shard2_replica2/data/index' doesn't exist. Creating new index...
   [junit4]   2> 1311800 T2611 oass.FileExchangeRateProvider.reload Reloading exchange rates from file currency.xml
   [junit4]   2> 1311800 T2626 oasc.CachingDirectoryFactory.get return new directory for /Users/jenkins/jenkins-slave/workspace/Lucene-Solr-4.x-MacOSX/solr/build/solr-core/test/J0/./org.apache.solr.cloud.CollectionsAPIDistributedZkTest-jetty3-1375324345957//nodes_used_collection_shard1_replica2/data/index
   [junit4]   2> 1311801 T2598 oasc.CachingDirectoryFactory.get return new directory for /Users/jenkins/jenkins-slave/workspace/Lucene-Solr-4.x-MacOSX/solr/build/solr-core/test/J0/./org.apache.solr.cloud.CollectionsAPIDistributedZkTest-jetty1-1375324342052//nodes_used_collection_shard2_replica2/data/index
   [junit4]   2> 1311816 T2626 oasc.SolrDeletionPolicy.onCommit SolrDeletionPolicy.onCommit: commits: num=1
   [junit4]   2> 		commit{dir=MockDirWrapper(org.apache.lucene.store.RAMDirectory@6cb6cff7 lockFactory=org.apache.lucene.store.NativeFSLockFactory@16726159),segFN=segments_1,generation=1}
   [junit4]   2> 1311817 T2626 oasc.SolrDeletionPolicy.updateCommits newest commit generation = 1
   [junit4]   2> 1311841 T2598 oasc.SolrDeletionPolicy.onCommit SolrDeletionPolicy.onCommit: commits: num=1
   [junit4]   2> 		commit{dir=MockDirWrapper(org.apache.lucene.store.RAMDirectory@7b184c1 lockFactory=org.apache.lucene.store.NativeFSLockFactory@7f15ac84),segFN=segments_1,generation=1}
   [junit4]   2> 1311842 T2598 oasc.SolrDeletionPolicy.updateCommits newest commit generation = 1
   [junit4]   2> 1311851 T2611 oass.FileExchangeRateProvider.reload Reloading exchange rates from file currency.xml
   [junit4]   2> 1311861 T2598 oasup.UpdateRequestProcessorChain.init inserting DistributedUpdateProcessorFactory into updateRequestProcessorChain "dedupe"
   [junit4]   2> 1311862 T2598 oasup.UpdateRequestProcessorChain.init inserting DistributedUpdateProcessorFactory into updateRequestProcessorChain "stored_sig"
   [junit4]   2> 1311863 T2598 oasup.UpdateRequestProcessorChain.init inserting DistributedUpdateProcessorFactory into updateRequestProcessorChain "distrib-dup-test-chain-implicit"
   [junit4]   2> 1311861 T2626 oasup.UpdateRequestProcessorChain.init inserting DistributedUpdateProcessorFactory into updateRequestProcessorChain "dedupe"
   [junit4]   2> 1311865 T2626 oasup.UpdateRequestProcessorChain.init inserting DistributedUpdateProcessorFactory into updateRequestProcessorChain "stored_sig"
   [junit4]   2> 1311866 T2626 oasup.UpdateRequestProcessorChain.init inserting DistributedUpdateProcessorFactory into updateRequestProcessorChain "distrib-dup-test-chain-implicit"
   [junit4]   2> 1311867 T2626 oasc.RequestHandlers.initHandlersFromConfig created standard: solr.StandardRequestHandler
   [junit4]   2> 1311867 T2626 oasc.RequestHandlers.initHandlersFromConfig created /get: solr.RealTimeGetHandler
   [junit4]   2> 1311868 T2626 oasc.RequestHandlers.initHandlersFromConfig adding lazy requestHandler: solr.ReplicationHandler
   [junit4]   2> 1311868 T2626 oasc.RequestHandlers.initHandlersFromConfig created /replication: solr.ReplicationHandler
   [junit4]   2> 1311869 T2626 oasc.RequestHandlers.initHandlersFromConfig created /update: solr.UpdateRequestHandler
   [junit4]   2> 1311869 T2626 oasc.RequestHandlers.initHandlersFromConfig created /admin/: org.apache.solr.handler.admin.AdminHandlers
   [junit4]   2> 1311864 T2598 oasc.RequestHandlers.initHandlersFromConfig created standard: solr.StandardRequestHandler
   [junit4]   2> 1311884 T2598 oasc.RequestHandlers.initHandlersFromConfig created /get: solr.RealTimeGetHandler
   [junit4]   2> 1311885 T2598 oasc.RequestHandlers.initHandlersFromConfig adding lazy requestHandler: solr.ReplicationHandler
   [junit4]   2> 1311885 T2598 oasc.RequestHandlers.initHandlersFromConfig created /replication: solr.ReplicationHandler
   [junit4]   2> 1311886 T2598 oasc.RequestHandlers.initHandlersFromConfig created /update: solr.UpdateRequestHandler
   [junit4]   2> 1311887 T2598 oasc.RequestHandlers.initHandlersFromConfig created /admin/: org.apache.solr.handler.admin.AdminHandlers
   [junit4]   2> 1311908 T2598 oashl.XMLLoader.init xsltCacheLifetimeSeconds=60
   [junit4]   2> 1311911 T2626 oashl.XMLLoader.init xsltCacheLifetimeSeconds=60
   [junit4]   2> 1311929 T2611 oass.OpenExchangeRatesOrgProvider.reload Reloading exchange rates from open-exchange-rates.json
   [junit4]   2> 1311932 T2580 oasc.ShardLeaderElectionContext.runLeaderProcess Running the leader process for shard shard1
   [junit4]   2> 1311932 T2626 oass.SolrIndexSearcher.<init> Opening Searcher@6480f9fa main
   [junit4]   2> 1311934 T2626 oasu.CommitTracker.<init> Hard AutoCommit: disabled
   [junit4]   2> 1311934 T2626 oasu.CommitTracker.<init> Soft AutoCommit: disabled
   [junit4]   2> 1311938 T2651 oasc.SolrCore.registerSearcher [nodes_used_collection_shard1_replica2] Registered new searcher Searcher@6480f9fa main{StandardDirectoryReader(segments_1:1)}
   [junit4]   2> 1311940 T2626 oasc.CoreContainer.registerCore registering core: nodes_used_collection_shard1_replica2
   [junit4]   2> 1311941 T2626 oasc.ZkController.register Register replica - core:nodes_used_collection_shard1_replica2 address:http://127.0.0.1:52309 collection:nodes_used_collection shard:shard1
   [junit4]   2> 1311941 T2626 oascsi.HttpClientUtil.createClient Creating new http client, config:maxConnections=10000&maxConnectionsPerHost=20&connTimeout=15000&socketTimeout=30000&retry=false
   [junit4]   2> 1311950 T2598 oass.SolrIndexSearcher.<init> Opening Searcher@76cbc939 main
   [junit4]   2> 1311944 T2611 oass.OpenExchangeRatesOrgProvider$OpenExchangeRates.<init> WARN Unknown key IMPORTANT NOTE
   [junit4]   2> 1311952 T2611 oass.OpenExchangeRatesOrgProvider$OpenExchangeRates.<init> WARN Expected key, got STRING
   [junit4]   2> 1311952 T2611 oass.OpenExchangeRatesOrgProvider.reload Reloading exchange rates from open-exchange-rates.json
   [junit4]   2> 1311951 T2598 oasu.CommitTracker.<init> Hard AutoCommit: disabled
   [junit4]   2> 1311961 T2598 oasu.CommitTracker.<init> Soft AutoCommit: disabled
   [junit4]   2> 1311966 T2652 oasc.SolrCore.registerSearcher [nodes_used_collection_shard2_replica2] Registered new searcher Searcher@76cbc939 main{StandardDirectoryReader(segments_1:1)}
   [junit4]   2> 1311967 T2598 oasc.CoreContainer.registerCore registering core: nodes_used_collection_shard2_replica2
   [junit4]   2> 1311968 T2598 oasc.ZkController.register Register replica - core:nodes_used_collection_shard2_replica2 address:http://127.0.0.1:52303 collection:nodes_used_collection shard:shard2
   [junit4]   2> 1311968 T2598 oascsi.HttpClientUtil.createClient Creating new http client, config:maxConnections=10000&maxConnectionsPerHost=20&connTimeout=15000&socketTimeout=30000&retry=false
   [junit4]   2> 1311984 T2611 oass.OpenExchangeRatesOrgProvider$OpenExchangeRates.<init> WARN Unknown key IMPORTANT NOTE
   [junit4]   2> 1311999 T2611 oass.OpenExchangeRatesOrgProvider$OpenExchangeRates.<init> WARN Expected key, got STRING
   [junit4]   2> 1312000 T2611 oasc.SolrCore.initDirectoryFactory org.apache.solr.core.MockDirectoryFactory
   [junit4]   2> 1312000 T2611 oasc.SolrCore.<init> [nodes_used_collection_shard2_replica1] Opening new SolrCore at /Users/jenkins/jenkins-slave/workspace/Lucene-Solr-4.x-MacOSX/solr/build/solr-core/test/J0/./org.apache.solr.cloud.CollectionsAPIDistributedZkTest-jetty2-1375324344002/nodes_used_collection_shard2_replica1/, dataDir=/Users/jenkins/jenkins-slave/workspace/Lucene-Solr-4.x-MacOSX/solr/build/solr-core/test/J0/./org.apache.solr.cloud.CollectionsAPIDistributedZkTest-jetty2-1375324344002//nodes_used_collection_shard2_replica1/data/
   [junit4]   2> 1312000 T2611 oasc.JmxMonitoredMap.<init> JMX monitoring is enabled. Adding Solr mbeans to JMX Server: com.sun.jmx.mbeanserver.JmxMBeanServer@5f5091f2
   [junit4]   2> 1312002 T2611 oasc.CachingDirectoryFactory.get return new directory for /Users/jenkins/jenkins-slave/workspace/Lucene-Solr-4.x-MacOSX/solr/build/solr-core/test/J0/./org.apache.solr.cloud.CollectionsAPIDistributedZkTest-jetty2-1375324344002//nodes_used_collection_shard2_replica1/data
   [junit4]   2> 1311998 T2580 oasc.ShardLeaderElectionContext.waitForReplicasToComeUp Waiting until we see more replicas up for shard shard1: total=2 found=1 timeoutin=179985
   [junit4]   2> 1312010 T2611 oasc.SolrCore.getNewIndexDir New index directory detected: old=null new=/Users/jenkins/jenkins-slave/workspace/Lucene-Solr-4.x-MacOSX/solr/build/solr-core/test/J0/./org.apache.solr.cloud.CollectionsAPIDistributedZkTest-jetty2-1375324344002//nodes_used_collection_shard2_replica1/data/index/
   [junit4]   2> 1312013 T2611 oasc.SolrCore.initIndex WARN [nodes_used_collection_shard2_replica1] Solr index directory '/Users/jenkins/jenkins-slave/workspace/Lucene-Solr-4.x-MacOSX/solr/build/solr-core/test/J0/./org.apache.solr.cloud.CollectionsAPIDistributedZkTest-jetty2-1375324344002/nodes_used_collection_shard2_replica1/data/index' doesn't exist. Creating new index...
   [junit4]   2> 1312025 T2611 oasc.CachingDirectoryFactory.get return new directory for /Users/jenkins/jenkins-slave/workspace/Lucene-Solr-4.x-MacOSX/solr/build/solr-core/test/J0/./org.apache.solr.cloud.CollectionsAPIDistributedZkTest-jetty2-1375324344002//nodes_used_collection_shard2_replica1/data/index
   [junit4]   2> 1312035 T2598 oascc.SolrZkClient.makePath makePath: /collections/nodes_used_collection/leader_elect/shard2/election
   [junit4]   2> 1312053 T2611 oasc.SolrDeletionPolicy.onCommit SolrDeletionPolicy.onCommit: commits: num=1
   [junit4]   2> 		commit{dir=MockDirWrapper(org.apache.lucene.store.RAMDirectory@132cda0 lockFactory=org.apache.lucene.store.NativeFSLockFactory@247f9f18),segFN=segments_1,generation=1}
   [junit4]   2> 1312054 T2611 oasc.SolrDeletionPolicy.updateCommits newest commit generation = 1
   [junit4]   2> 1312061 T2611 oasup.UpdateRequestProcessorChain.init inserting DistributedUpdateProcessorFactory into updateRequestProcessorChain "dedupe"
   [junit4]   2> 1312062 T2611 oasup.UpdateRequestProcessorChain.init inserting DistributedUpdateProcessorFactory into updateRequestProcessorChain "stored_sig"
   [junit4]   2> 1312065 T2611 oasup.UpdateRequestProcessorChain.init inserting DistributedUpdateProcessorFactory into updateRequestProcessorChain "distrib-dup-test-chain-implicit"
   [junit4]   2> 1312066 T2611 oasc.RequestHandlers.initHandlersFromConfig created standard: solr.StandardRequestHandler
   [junit4]   2> 1312067 T2611 oasc.RequestHandlers.initHandlersFromConfig created /get: solr.RealTimeGetHandler
   [junit4]   2> 1312067 T2611 oasc.RequestHandlers.initHandlersFromConfig adding lazy requestHandler: solr.ReplicationHandler
   [junit4]   2> 1312068 T2611 oasc.RequestHandlers.initHandlersFromConfig created /replication: solr.ReplicationHandler
   [junit4]   2> 1312069 T2611 oasc.RequestHandlers.initHandlersFromConfig created /update: solr.UpdateRequestHandler
   [junit4]   2> 1312081 T2611 oasc.RequestHandlers.initHandlersFromConfig created /admin/: org.apache.solr.handler.admin.AdminHandlers
   [junit4]   2> 1312107 T2611 oashl.XMLLoader.init xsltCacheLifetimeSeconds=60
   [junit4]   2> 1312130 T2611 oass.SolrIndexSearcher.<init> Opening Searcher@4b038a52 main
   [junit4]   2> 1312132 T2611 oasu.CommitTracker.<init> Hard AutoCommit: disabled
   [junit4]   2> 1312132 T2611 oasu.CommitTracker.<init> Soft AutoCommit: disabled
   [junit4]   2> 1312137 T2653 oasc.SolrCore.registerSearcher [nodes_used_collection_shard2_replica1] Registered new searcher Searcher@4b038a52 main{StandardDirectoryReader(segments_1:1)}
   [junit4]   2> 1312149 T2611 oasc.CoreContainer.registerCore registering core: nodes_used_collection_shard2_replica1
   [junit4]   2> 1312150 T2611 oasc.ZkController.register Register replica - core:nodes_used_collection_shard2_replica1 address:http://127.0.0.1:52306 collection:nodes_used_collection shard:shard2
   [junit4]   2> 1312150 T2611 oascsi.HttpClientUtil.createClient Creating new http client, config:maxConnections=10000&maxConnectionsPerHost=20&connTimeout=15000&socketTimeout=30000&retry=false
   [junit4]   2> 1312153 T2598 oasc.ShardLeaderElectionContext.runLeaderProcess Running the leader process for shard shard2
   [junit4]   2> 1312212 T2598 oasc.ShardLeaderElectionContext.waitForReplicasToComeUp Enough replicas found to continue.
   [junit4]   2> 1312213 T2598 oasc.ShardLeaderElectionContext.runLeaderProcess I may be the new leader - try and sync
   [junit4]   2> 1312213 T2598 oasc.SyncStrategy.sync Sync replicas to http://127.0.0.1:52303/nodes_used_collection_shard2_replica2/
   [junit4]   2> 1312213 T2598 oasu.PeerSync.sync PeerSync: core=nodes_used_collection_shard2_replica2 url=http://127.0.0.1:52303 START 

[...truncated too long message...]

Pending=0,adds=0,deletesById=0,deletesByQuery=0,errors=0,cumulative_adds=0,cumulative_deletesById=0,cumulative_deletesByQuery=0,cumulative_errors=0}
   [junit4]   2> 1534670 T2562 oasu.SolrCoreState.decrefSolrCoreState Closing SolrCoreState
   [junit4]   2> 1534670 T2562 oasu.DefaultSolrCoreState.closeIndexWriter SolrCoreState ref count has reached 0 - closing IndexWriter
   [junit4]   2> 1534671 T2562 oasu.DefaultSolrCoreState.closeIndexWriter closing IndexWriter with IndexWriterCloser
   [junit4]   2> 1534671 T2562 oasc.SolrCore.closeSearcher [new_implicit_coll_1_c_replica1] Closing main searcher on request.
   [junit4]   2> 1534672 T2562 oasc.CachingDirectoryFactory.close Closing MockDirectoryFactory - 2 directories currently being tracked
   [junit4]   2> 1534672 T2562 oasc.CachingDirectoryFactory.closeCacheValue looking to close /Users/jenkins/jenkins-slave/workspace/Lucene-Solr-4.x-MacOSX/solr/build/solr-core/test/J0/./org.apache.solr.cloud.CollectionsAPIDistributedZkTest-jetty4-1375324347861//new_implicit_coll_1_c_replica1/data/index [CachedDir<<refCount=0;path=/Users/jenkins/jenkins-slave/workspace/Lucene-Solr-4.x-MacOSX/solr/build/solr-core/test/J0/./org.apache.solr.cloud.CollectionsAPIDistributedZkTest-jetty4-1375324347861//new_implicit_coll_1_c_replica1/data/index;done=false>>]
   [junit4]   2> 1534673 T2562 oasc.CachingDirectoryFactory.close Closing directory: /Users/jenkins/jenkins-slave/workspace/Lucene-Solr-4.x-MacOSX/solr/build/solr-core/test/J0/./org.apache.solr.cloud.CollectionsAPIDistributedZkTest-jetty4-1375324347861//new_implicit_coll_1_c_replica1/data/index
   [junit4]   2> 1534673 T2562 oasc.CachingDirectoryFactory.closeCacheValue looking to close /Users/jenkins/jenkins-slave/workspace/Lucene-Solr-4.x-MacOSX/solr/build/solr-core/test/J0/./org.apache.solr.cloud.CollectionsAPIDistributedZkTest-jetty4-1375324347861//new_implicit_coll_1_c_replica1/data [CachedDir<<refCount=0;path=/Users/jenkins/jenkins-slave/workspace/Lucene-Solr-4.x-MacOSX/solr/build/solr-core/test/J0/./org.apache.solr.cloud.CollectionsAPIDistributedZkTest-jetty4-1375324347861//new_implicit_coll_1_c_replica1/data;done=false>>]
   [junit4]   2> 1534674 T2562 oasc.CachingDirectoryFactory.close Closing directory: /Users/jenkins/jenkins-slave/workspace/Lucene-Solr-4.x-MacOSX/solr/build/solr-core/test/J0/./org.apache.solr.cloud.CollectionsAPIDistributedZkTest-jetty4-1375324347861//new_implicit_coll_1_c_replica1/data
   [junit4]   2> 1534683 T2644 oascc.ZkStateReader$2.process A cluster state change: WatchedEvent state:SyncConnected type:NodeChildrenChanged path:/live_nodes, has occurred - updating... (live nodes size: 1)
   [junit4]   2> 1534684 T2644 oascc.ZkStateReader$2.process WARN ZooKeeper watch triggered, but Solr cannot talk to ZK
   [junit4]   2> 1534684 T2644 oascc.ZkStateReader$3.process WARN ZooKeeper watch triggered, but Solr cannot talk to ZK
   [junit4]   2> 1534696 T2562 oejsh.ContextHandler.doStop stopped o.e.j.s.ServletContextHandler{/,null}
   [junit4]   2> 1534761 T2562 oas.SolrTestCaseJ4.tearDown ###Ending testDistribSearch
   [junit4]   2> 1534765 T2562 oasc.ZkTestServer.send4LetterWord connecting to 127.0.0.1:52296 52296
   [junit4]   1> client port:0.0.0.0/0.0.0.0:0
   [junit4]   2> NOTE: reproduce with: ant test  -Dtestcase=CollectionsAPIDistributedZkTest -Dtests.method=testDistribSearch -Dtests.seed=BE347C616992BCDF -Dtests.slow=true -Dtests.locale=ms -Dtests.timezone=Pacific/Tahiti -Dtests.file.encoding=UTF-8
   [junit4] ERROR    243s | CollectionsAPIDistributedZkTest.testDistribSearch <<<
   [junit4]    > Throwable #1: org.apache.solr.client.solrj.SolrServerException: Server refused connection at: http://127.0.0.1:52303
   [junit4]    > 	at __randomizedtesting.SeedInfo.seed([BE347C616992BCDF:3FD2F2791ECDDCE3]:0)
   [junit4]    > 	at org.apache.solr.client.solrj.impl.HttpSolrServer.request(HttpSolrServer.java:428)
   [junit4]    > 	at org.apache.solr.client.solrj.impl.HttpSolrServer.request(HttpSolrServer.java:180)
   [junit4]    > 	at org.apache.solr.cloud.AbstractFullDistribZkTestBase.createCollection(AbstractFullDistribZkTestBase.java:1535)
   [junit4]    > 	at org.apache.solr.cloud.CollectionsAPIDistributedZkTest.testCustomCollectionsAPI(CollectionsAPIDistributedZkTest.java:677)
   [junit4]    > 	at org.apache.solr.cloud.CollectionsAPIDistributedZkTest.doTest(CollectionsAPIDistributedZkTest.java:159)
   [junit4]    > 	at org.apache.solr.BaseDistributedSearchTestCase.testDistribSearch(BaseDistributedSearchTestCase.java:835)
   [junit4]    > 	at java.lang.Thread.run(Thread.java:724)
   [junit4]    > Caused by: org.apache.http.conn.HttpHostConnectException: Connection to http://127.0.0.1:52303 refused
   [junit4]    > 	at org.apache.http.impl.conn.DefaultClientConnectionOperator.openConnection(DefaultClientConnectionOperator.java:190)
   [junit4]    > 	at org.apache.http.impl.conn.ManagedClientConnectionImpl.open(ManagedClientConnectionImpl.java:294)
   [junit4]    > 	at org.apache.http.impl.client.DefaultRequestDirector.tryConnect(DefaultRequestDirector.java:645)
   [junit4]    > 	at org.apache.http.impl.client.DefaultRequestDirector.execute(DefaultRequestDirector.java:480)
   [junit4]    > 	at org.apache.http.impl.client.AbstractHttpClient.execute(AbstractHttpClient.java:906)
   [junit4]    > 	at org.apache.http.impl.client.AbstractHttpClient.execute(AbstractHttpClient.java:805)
   [junit4]    > 	at org.apache.http.impl.client.AbstractHttpClient.execute(AbstractHttpClient.java:784)
   [junit4]    > 	at org.apache.solr.client.solrj.impl.HttpSolrServer.request(HttpSolrServer.java:365)
   [junit4]    > 	... 45 more
   [junit4]    > Caused by: java.net.ConnectException: Connection refused
   [junit4]    > 	at java.net.PlainSocketImpl.socketConnect(Native Method)
   [junit4]    > 	at java.net.AbstractPlainSocketImpl.doConnect(AbstractPlainSocketImpl.java:339)
   [junit4]    > 	at java.net.AbstractPlainSocketImpl.connectToAddress(AbstractPlainSocketImpl.java:200)
   [junit4]    > 	at java.net.AbstractPlainSocketImpl.connect(AbstractPlainSocketImpl.java:182)
   [junit4]    > 	at java.net.SocksSocketImpl.connect(SocksSocketImpl.java:392)
   [junit4]    > 	at java.net.Socket.connect(Socket.java:579)
   [junit4]    > 	at org.apache.http.conn.scheme.PlainSocketFactory.connectSocket(PlainSocketFactory.java:127)
   [junit4]    > 	at org.apache.http.impl.conn.DefaultClientConnectionOperator.openConnection(DefaultClientConnectionOperator.java:180)
   [junit4]    > 	... 52 more
   [junit4]   2> 1538801 T2562 oas.SolrTestCaseJ4.deleteCore ###deleteCore
   [junit4]   2> NOTE: test params are: codec=Lucene3x, sim=DefaultSimilarity, locale=ms, timezone=Pacific/Tahiti
   [junit4]   2> NOTE: Mac OS X 10.8.4 x86_64/Oracle Corporation 1.7.0_25 (64-bit)/cpus=2,threads=1,free=192269280,total=362414080
   [junit4]   2> NOTE: All tests run in this JVM: [TestReplicationHandler, SpellCheckCollatorTest, OpenExchangeRatesOrgProviderTest, TestFastOutputStream, TestSearchPerf, DocValuesTest, TestSolrQueryParser, TestSolrXml, FileBasedSpellCheckerTest, HardAutoCommitTest, SampleTest, TestSolrDeletionPolicy2, TestSolrDeletionPolicy1, BasicFunctionalityTest, TestSchemaNameResource, ChaosMonkeyNothingIsSafeTest, TestPhraseSuggestions, ZkSolrClientTest, BasicDistributedZk2Test, QueryParsingTest, TestLRUCache, TestFieldTypeResource, TestBM25SimilarityFactory, BlockDirectoryTest, TestMaxScoreQueryParser, SpellingQueryConverterTest, TestCSVResponseWriter, LeaderElectionIntegrationTest, TermVectorComponentDistributedTest, PrimitiveFieldTypeTest, TestTrie, AutoCommitTest, TestJoin, TestSolr4Spatial, TermVectorComponentTest, TestSurroundQueryParser, WordBreakSolrSpellCheckerTest, TestExtendedDismaxParser, TestDynamicFieldResource, TestSolrCoreProperties, SpatialFilterTest, FieldAnalysisRequestHandlerTest, TestDistributedGrouping, ShardRoutingCustomTest, HighlighterConfigTest, SortByFunctionTest, TermsComponentTest, SchemaVersionSpecificBehaviorTest, TestSort, ExternalFileFieldSortTest, DistributedTermsComponentTest, TestFastWriter, TestSchemaVersionResource, XmlUpdateRequestHandlerTest, TestPartialUpdateDeduplication, TestPerFieldSimilarity, TestCloudManagedSchema, PathHierarchyTokenizerFactoryTest, TestSchemaResource, SolrCmdDistributorTest, TestLMDirichletSimilarityFactory, DateFieldTest, TestRandomFaceting, HdfsRecoveryZkTest, QueryResultKeyTest, CoreAdminHandlerTest, TestMergePolicyConfig, TestStressReorder, TestUtils, ReturnFieldsTest, TestRemoteStreaming, TestRecoveryHdfs, HdfsBasicDistributedZk2Test, SolrIndexSplitterTest, SolrInfoMBeanTest, CollectionsAPIDistributedZkTest]
   [junit4] Completed in 242.83s, 1 test, 1 error <<< FAILURES!

[...truncated 749 lines...]
BUILD FAILED
/Users/jenkins/jenkins-slave/workspace/Lucene-Solr-4.x-MacOSX/build.xml:395: The following error occurred while executing this line:
/Users/jenkins/jenkins-slave/workspace/Lucene-Solr-4.x-MacOSX/build.xml:375: The following error occurred while executing this line:
/Users/jenkins/jenkins-slave/workspace/Lucene-Solr-4.x-MacOSX/build.xml:39: The following error occurred while executing this line:
/Users/jenkins/jenkins-slave/workspace/Lucene-Solr-4.x-MacOSX/solr/build.xml:181: The following error occurred while executing this line:
/Users/jenkins/jenkins-slave/workspace/Lucene-Solr-4.x-MacOSX/solr/common-build.xml:449: The following error occurred while executing this line:
/Users/jenkins/jenkins-slave/workspace/Lucene-Solr-4.x-MacOSX/lucene/common-build.xml:1233: The following error occurred while executing this line:
/Users/jenkins/jenkins-slave/workspace/Lucene-Solr-4.x-MacOSX/lucene/common-build.xml:876: There were test failures: 321 suites, 1350 tests, 1 error, 40 ignored (6 assumptions)

Total time: 114 minutes 43 seconds
Build step 'Invoke Ant' marked build as failure
Description set: Java: 64bit/jdk1.7.0 -XX:+UseCompressedOops -XX:+UseParallelGC
Archiving artifacts
Recording test results
Email was triggered for: Failure
Sending email for trigger: Failure



Mime
View raw message