lucene-dev mailing list archives

Site index · List index
Message view « Date » · « Thread »
Top « Date » · « Thread »
From Policeman Jenkins Server <jenk...@thetaphi.de>
Subject [JENKINS] Lucene-Solr-trunk-Linux (32bit/jdk1.8.0-ea-b99) - Build # 6853 - Still Failing!
Date Sat, 03 Aug 2013 01:27:32 GMT
Build: http://jenkins.thetaphi.de/job/Lucene-Solr-trunk-Linux/6853/
Java: 32bit/jdk1.8.0-ea-b99 -client -XX:+UseG1GC

1 tests failed.
REGRESSION:  org.apache.solr.cloud.SliceStateUpdateTest.testSliceStateUpdate

Error Message:
expected:<[in]active> but was:<[]active>

Stack Trace:
org.junit.ComparisonFailure: expected:<[in]active> but was:<[]active>
	at __randomizedtesting.SeedInfo.seed([57A23F39F6A09DF7:87C0B275A8754773]:0)
	at org.junit.Assert.assertEquals(Assert.java:125)
	at org.junit.Assert.assertEquals(Assert.java:147)
	at org.apache.solr.cloud.SliceStateUpdateTest.testSliceStateUpdate(SliceStateUpdateTest.java:183)
	at sun.reflect.NativeMethodAccessorImpl.invoke0(Native Method)
	at sun.reflect.NativeMethodAccessorImpl.invoke(NativeMethodAccessorImpl.java:57)
	at sun.reflect.DelegatingMethodAccessorImpl.invoke(DelegatingMethodAccessorImpl.java:43)
	at java.lang.reflect.Method.invoke(Method.java:491)
	at com.carrotsearch.randomizedtesting.RandomizedRunner.invoke(RandomizedRunner.java:1559)
	at com.carrotsearch.randomizedtesting.RandomizedRunner.access$600(RandomizedRunner.java:79)
	at com.carrotsearch.randomizedtesting.RandomizedRunner$6.evaluate(RandomizedRunner.java:737)
	at com.carrotsearch.randomizedtesting.RandomizedRunner$7.evaluate(RandomizedRunner.java:773)
	at com.carrotsearch.randomizedtesting.RandomizedRunner$8.evaluate(RandomizedRunner.java:787)
	at com.carrotsearch.randomizedtesting.rules.SystemPropertiesRestoreRule$1.evaluate(SystemPropertiesRestoreRule.java:53)
	at org.apache.lucene.util.TestRuleSetupTeardownChained$1.evaluate(TestRuleSetupTeardownChained.java:50)
	at org.apache.lucene.util.TestRuleFieldCacheSanity$1.evaluate(TestRuleFieldCacheSanity.java:51)
	at org.apache.lucene.util.AbstractBeforeAfterRule$1.evaluate(AbstractBeforeAfterRule.java:46)
	at com.carrotsearch.randomizedtesting.rules.SystemPropertiesInvariantRule$1.evaluate(SystemPropertiesInvariantRule.java:55)
	at org.apache.lucene.util.TestRuleThreadAndTestName$1.evaluate(TestRuleThreadAndTestName.java:49)
	at org.apache.lucene.util.TestRuleIgnoreAfterMaxFailures$1.evaluate(TestRuleIgnoreAfterMaxFailures.java:70)
	at org.apache.lucene.util.TestRuleMarkFailure$1.evaluate(TestRuleMarkFailure.java:48)
	at com.carrotsearch.randomizedtesting.rules.StatementAdapter.evaluate(StatementAdapter.java:36)
	at com.carrotsearch.randomizedtesting.ThreadLeakControl$StatementRunner.run(ThreadLeakControl.java:358)
	at com.carrotsearch.randomizedtesting.ThreadLeakControl.forkTimeoutingTask(ThreadLeakControl.java:782)
	at com.carrotsearch.randomizedtesting.ThreadLeakControl$3.evaluate(ThreadLeakControl.java:442)
	at com.carrotsearch.randomizedtesting.RandomizedRunner.runSingleTest(RandomizedRunner.java:746)
	at com.carrotsearch.randomizedtesting.RandomizedRunner$3.evaluate(RandomizedRunner.java:648)
	at com.carrotsearch.randomizedtesting.RandomizedRunner$4.evaluate(RandomizedRunner.java:682)
	at com.carrotsearch.randomizedtesting.RandomizedRunner$5.evaluate(RandomizedRunner.java:693)
	at com.carrotsearch.randomizedtesting.rules.StatementAdapter.evaluate(StatementAdapter.java:36)
	at com.carrotsearch.randomizedtesting.rules.SystemPropertiesRestoreRule$1.evaluate(SystemPropertiesRestoreRule.java:53)
	at org.apache.lucene.util.AbstractBeforeAfterRule$1.evaluate(AbstractBeforeAfterRule.java:46)
	at org.apache.lucene.util.TestRuleStoreClassName$1.evaluate(TestRuleStoreClassName.java:42)
	at com.carrotsearch.randomizedtesting.rules.SystemPropertiesInvariantRule$1.evaluate(SystemPropertiesInvariantRule.java:55)
	at com.carrotsearch.randomizedtesting.rules.NoShadowingOrOverridesOnMethodsRule$1.evaluate(NoShadowingOrOverridesOnMethodsRule.java:39)
	at com.carrotsearch.randomizedtesting.rules.NoShadowingOrOverridesOnMethodsRule$1.evaluate(NoShadowingOrOverridesOnMethodsRule.java:39)
	at com.carrotsearch.randomizedtesting.rules.StatementAdapter.evaluate(StatementAdapter.java:36)
	at org.apache.lucene.util.TestRuleAssertionsRequired$1.evaluate(TestRuleAssertionsRequired.java:43)
	at org.apache.lucene.util.TestRuleMarkFailure$1.evaluate(TestRuleMarkFailure.java:48)
	at org.apache.lucene.util.TestRuleIgnoreAfterMaxFailures$1.evaluate(TestRuleIgnoreAfterMaxFailures.java:70)
	at org.apache.lucene.util.TestRuleIgnoreTestSuites$1.evaluate(TestRuleIgnoreTestSuites.java:55)
	at com.carrotsearch.randomizedtesting.rules.StatementAdapter.evaluate(StatementAdapter.java:36)
	at com.carrotsearch.randomizedtesting.ThreadLeakControl$StatementRunner.run(ThreadLeakControl.java:358)
	at java.lang.Thread.run(Thread.java:724)




Build Log:
[...truncated 9501 lines...]
   [junit4] Suite: org.apache.solr.cloud.SliceStateUpdateTest
   [junit4]   2> 353559 T1563 oas.SolrTestCaseJ4.setUp ###Starting testSliceStateUpdate
   [junit4]   2> Creating dataDir: /mnt/ssd/jenkins/workspace/Lucene-Solr-trunk-Linux/solr/build/solr-core/test/J0/./solrtest-SliceStateUpdateTest-1375492541711
   [junit4]   2> 353560 T1563 oasc.ZkTestServer.run STARTING ZK TEST SERVER
   [junit4]   2> 353560 T1564 oasc.ZkTestServer$ZKServerMain.runFromConfig Starting server
   [junit4]   2> 353660 T1563 oasc.ZkTestServer.run start zk server on port:58096
   [junit4]   2> 353662 T1563 oascc.ConnectionManager.waitForConnected Waiting for client to connect to ZooKeeper
   [junit4]   2> 353672 T1570 oascc.ConnectionManager.process Watcher org.apache.solr.common.cloud.ConnectionManager@2fa664 name:ZooKeeperConnection Watcher:127.0.0.1:58096 got event WatchedEvent state:SyncConnected type:None path:null path:null type:None
   [junit4]   2> 353672 T1563 oascc.ConnectionManager.waitForConnected Client is connected to ZooKeeper
   [junit4]   2> 353672 T1563 oascc.SolrZkClient.makePath makePath: /solr
   [junit4]   2> 353677 T1563 oascc.ConnectionManager.waitForConnected Waiting for client to connect to ZooKeeper
   [junit4]   2> 353678 T1572 oascc.ConnectionManager.process Watcher org.apache.solr.common.cloud.ConnectionManager@e842d1 name:ZooKeeperConnection Watcher:127.0.0.1:58096/solr got event WatchedEvent state:SyncConnected type:None path:null path:null type:None
   [junit4]   2> 353678 T1563 oascc.ConnectionManager.waitForConnected Client is connected to ZooKeeper
   [junit4]   2> 353679 T1563 oascc.SolrZkClient.makePath makePath: /collections/collection1
   [junit4]   2> 353681 T1563 oascc.SolrZkClient.makePath makePath: /collections/collection1/shards
   [junit4]   2> 353682 T1563 oascc.SolrZkClient.makePath makePath: /collections/control_collection
   [junit4]   2> 353684 T1563 oascc.SolrZkClient.makePath makePath: /collections/control_collection/shards
   [junit4]   2> 353686 T1563 oasc.AbstractZkTestCase.putConfig put /mnt/ssd/jenkins/workspace/Lucene-Solr-trunk-Linux/solr/build/solr-core/test-files/solr/collection1/conf/solrconfig.xml to /configs/conf1/solrconfig.xml
   [junit4]   2> 353687 T1563 oascc.SolrZkClient.makePath makePath: /configs/conf1/solrconfig.xml
   [junit4]   2> 353691 T1563 oasc.AbstractZkTestCase.putConfig put /mnt/ssd/jenkins/workspace/Lucene-Solr-trunk-Linux/solr/build/solr-core/test-files/solr/collection1/conf/schema.xml to /configs/conf1/schema.xml
   [junit4]   2> 353692 T1563 oascc.SolrZkClient.makePath makePath: /configs/conf1/schema.xml
   [junit4]   2> 353695 T1563 oasc.AbstractZkTestCase.putConfig put /mnt/ssd/jenkins/workspace/Lucene-Solr-trunk-Linux/solr/build/solr-core/test-files/solr/collection1/conf/stopwords.txt to /configs/conf1/stopwords.txt
   [junit4]   2> 353695 T1563 oascc.SolrZkClient.makePath makePath: /configs/conf1/stopwords.txt
   [junit4]   2> 353698 T1563 oasc.AbstractZkTestCase.putConfig put /mnt/ssd/jenkins/workspace/Lucene-Solr-trunk-Linux/solr/build/solr-core/test-files/solr/collection1/conf/protwords.txt to /configs/conf1/protwords.txt
   [junit4]   2> 353698 T1563 oascc.SolrZkClient.makePath makePath: /configs/conf1/protwords.txt
   [junit4]   2> 353701 T1563 oasc.AbstractZkTestCase.putConfig put /mnt/ssd/jenkins/workspace/Lucene-Solr-trunk-Linux/solr/build/solr-core/test-files/solr/collection1/conf/currency.xml to /configs/conf1/currency.xml
   [junit4]   2> 353701 T1563 oascc.SolrZkClient.makePath makePath: /configs/conf1/currency.xml
   [junit4]   2> 353704 T1563 oasc.AbstractZkTestCase.putConfig put /mnt/ssd/jenkins/workspace/Lucene-Solr-trunk-Linux/solr/build/solr-core/test-files/solr/collection1/conf/open-exchange-rates.json to /configs/conf1/open-exchange-rates.json
   [junit4]   2> 353704 T1563 oascc.SolrZkClient.makePath makePath: /configs/conf1/open-exchange-rates.json
   [junit4]   2> 353707 T1563 oasc.AbstractZkTestCase.putConfig put /mnt/ssd/jenkins/workspace/Lucene-Solr-trunk-Linux/solr/build/solr-core/test-files/solr/collection1/conf/mapping-ISOLatin1Accent.txt to /configs/conf1/mapping-ISOLatin1Accent.txt
   [junit4]   2> 353707 T1563 oascc.SolrZkClient.makePath makePath: /configs/conf1/mapping-ISOLatin1Accent.txt
   [junit4]   2> 353710 T1563 oasc.AbstractZkTestCase.putConfig put /mnt/ssd/jenkins/workspace/Lucene-Solr-trunk-Linux/solr/build/solr-core/test-files/solr/collection1/conf/old_synonyms.txt to /configs/conf1/old_synonyms.txt
   [junit4]   2> 353711 T1563 oascc.SolrZkClient.makePath makePath: /configs/conf1/old_synonyms.txt
   [junit4]   2> 353713 T1563 oasc.AbstractZkTestCase.putConfig put /mnt/ssd/jenkins/workspace/Lucene-Solr-trunk-Linux/solr/build/solr-core/test-files/solr/collection1/conf/synonyms.txt to /configs/conf1/synonyms.txt
   [junit4]   2> 353714 T1563 oascc.SolrZkClient.makePath makePath: /configs/conf1/synonyms.txt
   [junit4]   2> 353716 T1563 oasc.SliceStateUpdateTest.setUp ####SETUP_START testSliceStateUpdate
   [junit4]   2> 353717 T1563 oascc.ConnectionManager.waitForConnected Waiting for client to connect to ZooKeeper
   [junit4]   2> 353718 T1574 oascc.ConnectionManager.process Watcher org.apache.solr.common.cloud.ConnectionManager@d7cd14 name:ZooKeeperConnection Watcher:127.0.0.1:58096/solr got event WatchedEvent state:SyncConnected type:None path:null path:null type:None
   [junit4]   2> 353718 T1563 oascc.ConnectionManager.waitForConnected Client is connected to ZooKeeper
   [junit4]   2> 353719 T1563 oascc.SolrZkClient.makePath makePath: /collections/testcore
   [junit4]   2> 353721 T1563 oascc.SolrZkClient.makePath makePath: /collections/testcore/shards
   [junit4]   2> 353725 T1563 oasc.SolrResourceLoader.locateSolrHome JNDI not configured for solr (NoInitialContextEx)
   [junit4]   2> 353725 T1563 oasc.SolrResourceLoader.locateSolrHome using system property solr.solr.home: /mnt/ssd/jenkins/workspace/Lucene-Solr-trunk-Linux/solr/build/solr-core/test-files/solr
   [junit4]   2> 353725 T1563 oasc.SolrResourceLoader.<init> new SolrResourceLoader for directory: '/mnt/ssd/jenkins/workspace/Lucene-Solr-trunk-Linux/solr/build/solr-core/test-files/solr/'
   [junit4]   2> 353738 T1563 oasc.ConfigSolr.fromFile Loading container configuration from /mnt/ssd/jenkins/workspace/Lucene-Solr-trunk-Linux/solr/build/solr-core/test-files/solr/solr.xml
   [junit4]   2> 353762 T1563 oasc.CoreContainer.<init> New CoreContainer 9506903
   [junit4]   2> 353763 T1563 oasc.SolrResourceLoader.locateSolrHome JNDI not configured for solr (NoInitialContextEx)
   [junit4]   2> 353763 T1563 oasc.SolrResourceLoader.locateSolrHome using system property solr.solr.home: /mnt/ssd/jenkins/workspace/Lucene-Solr-trunk-Linux/solr/build/solr-core/test-files/solr
   [junit4]   2> 353763 T1563 oasc.SolrResourceLoader.<init> new SolrResourceLoader for directory: '/mnt/ssd/jenkins/workspace/Lucene-Solr-trunk-Linux/solr/build/solr-core/test-files/solr/'
   [junit4]   2> 353780 T1563 oasc.ConfigSolr.fromFile Loading container configuration from /mnt/ssd/jenkins/workspace/Lucene-Solr-trunk-Linux/solr/build/solr-core/test-files/solr/solr.xml
   [junit4]   2> 353792 T1563 oasc.CoreContainer.<init> New CoreContainer 32565094
   [junit4]   2> 353792 T1563 oasc.CoreContainer.load Loading cores into CoreContainer [instanceDir=/mnt/ssd/jenkins/workspace/Lucene-Solr-trunk-Linux/solr/build/solr-core/test-files/solr/]
   [junit4]   2> 353793 T1563 oashc.HttpShardHandlerFactory.getParameter Setting socketTimeout to: 120000
   [junit4]   2> 353794 T1563 oashc.HttpShardHandlerFactory.getParameter Setting urlScheme to: http://
   [junit4]   2> 353794 T1563 oashc.HttpShardHandlerFactory.getParameter Setting connTimeout to: 15000
   [junit4]   2> 353794 T1563 oashc.HttpShardHandlerFactory.getParameter Setting maxConnectionsPerHost to: 20
   [junit4]   2> 353795 T1563 oashc.HttpShardHandlerFactory.getParameter Setting corePoolSize to: 0
   [junit4]   2> 353795 T1563 oashc.HttpShardHandlerFactory.getParameter Setting maximumPoolSize to: 2147483647
   [junit4]   2> 353795 T1563 oashc.HttpShardHandlerFactory.getParameter Setting maxThreadIdleTime to: 5
   [junit4]   2> 353796 T1563 oashc.HttpShardHandlerFactory.getParameter Setting sizeOfQueue to: -1
   [junit4]   2> 353796 T1563 oashc.HttpShardHandlerFactory.getParameter Setting fairnessPolicy to: false
   [junit4]   2> 353796 T1563 oascsi.HttpClientUtil.createClient Creating new http client, config:maxConnectionsPerHost=20&maxConnections=10000&socketTimeout=120000&connTimeout=15000&retry=false
   [junit4]   2> 353800 T1563 oasc.ZkContainer.initZooKeeper Zookeeper client=127.0.0.1:58096/solr
   [junit4]   2> 353800 T1563 oasc.ZkController.checkChrootPath zkHost includes chroot
   [junit4]   2> 353801 T1563 oascc.ConnectionManager.waitForConnected Waiting for client to connect to ZooKeeper
   [junit4]   2> 353802 T1576 oascc.ConnectionManager.process Watcher org.apache.solr.common.cloud.ConnectionManager@15160a9 name:ZooKeeperConnection Watcher:127.0.0.1:58096 got event WatchedEvent state:SyncConnected type:None path:null path:null type:None
   [junit4]   2> 353802 T1563 oascc.ConnectionManager.waitForConnected Client is connected to ZooKeeper
   [junit4]   2> 353804 T1563 oascsi.HttpClientUtil.createClient Creating new http client, config:maxConnections=500&maxConnectionsPerHost=16&socketTimeout=120000&connTimeout=15000
   [junit4]   2> 353807 T1563 oascc.ConnectionManager.waitForConnected Waiting for client to connect to ZooKeeper
   [junit4]   2> 353808 T1578 oascc.ConnectionManager.process Watcher org.apache.solr.common.cloud.ConnectionManager@aa7b53 name:ZooKeeperConnection Watcher:127.0.0.1:58096/solr got event WatchedEvent state:SyncConnected type:None path:null path:null type:None
   [junit4]   2> 353808 T1563 oascc.ConnectionManager.waitForConnected Client is connected to ZooKeeper
   [junit4]   2> 353809 T1563 oascc.SolrZkClient.makePath makePath: /overseer/queue
   [junit4]   2> 353811 T1563 oascc.SolrZkClient.makePath makePath: /overseer/collection-queue-work
   [junit4]   2> 353814 T1563 oascc.SolrZkClient.makePath makePath: /live_nodes
   [junit4]   2> 353815 T1563 oasc.ZkController.createEphemeralLiveNode Register node as live in ZooKeeper:/live_nodes/127.0.0.1:8983_solr
   [junit4]   2> 353815 T1563 oascc.SolrZkClient.makePath makePath: /live_nodes/127.0.0.1:8983_solr
   [junit4]   2> 353817 T1563 oascc.SolrZkClient.makePath makePath: /overseer_elect/election
   [junit4]   2> 353821 T1563 oascc.SolrZkClient.makePath makePath: /overseer_elect/leader
   [junit4]   2> 353822 T1563 oasc.Overseer.start Overseer (id=90144279213834244-127.0.0.1:8983_solr-n_0000000000) starting
   [junit4]   2> 353825 T1563 oascc.SolrZkClient.makePath makePath: /overseer/queue-work
   [junit4]   2> 353827 T1580 oasc.OverseerCollectionProcessor.run Process current queue of collection creations
   [junit4]   2> 353828 T1563 oascc.SolrZkClient.makePath makePath: /clusterstate.json
   [junit4]   2> 353830 T1563 oascc.SolrZkClient.makePath makePath: /aliases.json
   [junit4]   2> 353832 T1563 oascc.ZkStateReader.createClusterStateWatchersAndUpdate Updating cluster state from ZooKeeper... 
   [junit4]   2> 353835 T1579 oasc.Overseer$ClusterStateUpdater.run Starting to work on the main queue
   [junit4]   2> 353837 T1581 oasc.ZkController.publish publishing core=collection1 state=down
   [junit4]   2> 353837 T1581 oasc.ZkController.publish numShards not found on descriptor - reading it from system property
   [junit4]   2> 353838 T1581 oasc.ZkController.waitForCoreNodeName look for our core node name
   [junit4]   2> 355338 T1579 oascc.ZkStateReader.updateClusterState Updating cloud state from ZooKeeper... 
   [junit4]   2> 355339 T1579 oasc.Overseer$ClusterStateUpdater.updateState Update state numShards=null message={
   [junit4]   2> 	  "operation":"state",
   [junit4]   2> 	  "core_node_name":"core_node1",
   [junit4]   2> 	  "numShards":null,
   [junit4]   2> 	  "shard":null,
   [junit4]   2> 	  "roles":null,
   [junit4]   2> 	  "state":"down",
   [junit4]   2> 	  "shard_state":"active",
   [junit4]   2> 	  "core":"collection1",
   [junit4]   2> 	  "collection":"collection1",
   [junit4]   2> 	  "shard_range":null,
   [junit4]   2> 	  "node_name":"127.0.0.1:8983_solr",
   [junit4]   2> 	  "base_url":"http://127.0.0.1:8983/solr"}
   [junit4]   2> 355339 T1579 oasc.Overseer$ClusterStateUpdater.updateState Assigning new node to shard shard=shard1
   [junit4]   2> 355342 T1578 oascc.ZkStateReader$2.process A cluster state change: WatchedEvent state:SyncConnected type:NodeDataChanged path:/clusterstate.json, has occurred - updating... (live nodes size: 1)
   [junit4]   2> 355838 T1581 oasc.ZkController.waitForShardId waiting to find shard id in clusterstate for collection1
   [junit4]   2> 355839 T1581 oasc.CoreContainer.create Creating SolrCore 'collection1' using instanceDir: /mnt/ssd/jenkins/workspace/Lucene-Solr-trunk-Linux/solr/build/solr-core/test-files/solr/collection1
   [junit4]   2> 355839 T1581 oasc.ZkController.createCollectionZkNode Check for collection zkNode:collection1
   [junit4]   2> 355840 T1581 oasc.ZkController.createCollectionZkNode Collection zkNode exists
   [junit4]   2> 355840 T1581 oasc.ZkController.readConfigName Load collection config from:/collections/collection1
   [junit4]   2> 355841 T1581 oasc.SolrResourceLoader.<init> new SolrResourceLoader for directory: '/mnt/ssd/jenkins/workspace/Lucene-Solr-trunk-Linux/solr/build/solr-core/test-files/solr/collection1/'
   [junit4]   2> 355841 T1581 oasc.SolrResourceLoader.replaceClassLoader Adding 'file:/mnt/ssd/jenkins/workspace/Lucene-Solr-trunk-Linux/solr/build/solr-core/test-files/solr/collection1/lib/README' to classloader
   [junit4]   2> 355842 T1581 oasc.SolrResourceLoader.replaceClassLoader Adding 'file:/mnt/ssd/jenkins/workspace/Lucene-Solr-trunk-Linux/solr/build/solr-core/test-files/solr/collection1/lib/classes/' to classloader
   [junit4]   2> 355884 T1581 oasc.SolrConfig.<init> Using Lucene MatchVersion: LUCENE_50
   [junit4]   2> 355921 T1581 oasc.SolrConfig.<init> Loaded SolrConfig: solrconfig.xml
   [junit4]   2> 355923 T1581 oass.IndexSchema.readSchema Reading Solr Schema from schema.xml
   [junit4]   2> 355933 T1581 oass.IndexSchema.readSchema [collection1] Schema name=test
   [junit4]   2> 356136 T1581 oass.OpenExchangeRatesOrgProvider.init Initialized with rates=open-exchange-rates.json, refreshInterval=1440.
   [junit4]   2> 356143 T1581 oass.IndexSchema.readSchema default search field in schema is text
   [junit4]   2> 356146 T1581 oass.IndexSchema.readSchema unique key field: id
   [junit4]   2> 356157 T1581 oass.FileExchangeRateProvider.reload Reloading exchange rates from file currency.xml
   [junit4]   2> 356160 T1581 oass.FileExchangeRateProvider.reload Reloading exchange rates from file currency.xml
   [junit4]   2> 356163 T1581 oass.OpenExchangeRatesOrgProvider.reload Reloading exchange rates from open-exchange-rates.json
   [junit4]   2> 356164 T1581 oass.OpenExchangeRatesOrgProvider$OpenExchangeRates.<init> WARN Unknown key IMPORTANT NOTE
   [junit4]   2> 356164 T1581 oass.OpenExchangeRatesOrgProvider$OpenExchangeRates.<init> WARN Expected key, got STRING
   [junit4]   2> 356165 T1581 oass.OpenExchangeRatesOrgProvider.reload Reloading exchange rates from open-exchange-rates.json
   [junit4]   2> 356165 T1581 oass.OpenExchangeRatesOrgProvider$OpenExchangeRates.<init> WARN Unknown key IMPORTANT NOTE
   [junit4]   2> 356166 T1581 oass.OpenExchangeRatesOrgProvider$OpenExchangeRates.<init> WARN Expected key, got STRING
   [junit4]   2> 356166 T1581 oasc.SolrCore.initDirectoryFactory org.apache.solr.core.MockDirectoryFactory
   [junit4]   2> 356166 T1581 oasc.SolrCore.<init> [collection1] Opening new SolrCore at /mnt/ssd/jenkins/workspace/Lucene-Solr-trunk-Linux/solr/build/solr-core/test-files/solr/collection1/, dataDir=/mnt/ssd/jenkins/workspace/Lucene-Solr-trunk-Linux/solr/build/solr-core/test/J0/./solrtest-SliceStateUpdateTest-1375492541711/data2/
   [junit4]   2> 356167 T1581 oasc.JmxMonitoredMap.<init> JMX monitoring is enabled. Adding Solr mbeans to JMX Server: com.sun.jmx.mbeanserver.JmxMBeanServer@855c0c
   [junit4]   2> 356168 T1581 oasc.CachingDirectoryFactory.get return new directory for /mnt/ssd/jenkins/workspace/Lucene-Solr-trunk-Linux/solr/build/solr-core/test/J0/./solrtest-SliceStateUpdateTest-1375492541711/data2
   [junit4]   2> 356168 T1581 oasc.SolrCore.getNewIndexDir New index directory detected: old=null new=/mnt/ssd/jenkins/workspace/Lucene-Solr-trunk-Linux/solr/build/solr-core/test/J0/./solrtest-SliceStateUpdateTest-1375492541711/data2/index/
   [junit4]   2> 356168 T1581 oasc.SolrCore.initIndex WARN [collection1] Solr index directory '/mnt/ssd/jenkins/workspace/Lucene-Solr-trunk-Linux/solr/build/solr-core/test/J0/./solrtest-SliceStateUpdateTest-1375492541711/data2/index' doesn't exist. Creating new index...
   [junit4]   2> 356169 T1581 oasc.CachingDirectoryFactory.get return new directory for /mnt/ssd/jenkins/workspace/Lucene-Solr-trunk-Linux/solr/build/solr-core/test/J0/./solrtest-SliceStateUpdateTest-1375492541711/data2/index
   [junit4]   2> 356170 T1581 oasc.SolrDeletionPolicy.onCommit SolrDeletionPolicy.onCommit: commits: num=1
   [junit4]   2> 		commit{dir=RateLimitedDirectoryWrapper(MockDirWrapper(org.apache.lucene.store.RAMDirectory@77b885 lockFactory=org.apache.lucene.store.NativeFSLockFactory@1fb8d5)),segFN=segments_1,generation=1}
   [junit4]   2> 356170 T1581 oasc.SolrDeletionPolicy.updateCommits newest commit generation = 1
   [junit4]   2> 356171 T1581 oasc.SolrCore.initWriters created xml: solr.XMLResponseWriter
   [junit4]   2> 356174 T1581 oasup.UpdateRequestProcessorChain.init inserting DistributedUpdateProcessorFactory into updateRequestProcessorChain "dedupe"
   [junit4]   2> 356175 T1581 oasup.UpdateRequestProcessorChain.init inserting DistributedUpdateProcessorFactory into updateRequestProcessorChain "dedupe-allfields"
   [junit4]   2> 356175 T1581 oasup.UpdateRequestProcessorChain.init inserting DistributedUpdateProcessorFactory into updateRequestProcessorChain "stored_sig"
   [junit4]   2> 356176 T1581 oasup.UpdateRequestProcessorChain.init inserting DistributedUpdateProcessorFactory into updateRequestProcessorChain "uniq-fields"
   [junit4]   2> 356176 T1581 oasup.UpdateRequestProcessorChain.init inserting DistributedUpdateProcessorFactory into updateRequestProcessorChain "distrib-dup-test-chain-implicit"
   [junit4]   2> 356177 T1581 oasc.RequestHandlers.initHandlersFromConfig adding lazy requestHandler: solr.ReplicationHandler
   [junit4]   2> 356177 T1581 oasc.RequestHandlers.initHandlersFromConfig created /replication: solr.ReplicationHandler
   [junit4]   2> 356178 T1581 oasc.RequestHandlers.initHandlersFromConfig created standard: solr.StandardRequestHandler
   [junit4]   2> 356179 T1581 oasc.RequestHandlers.initHandlersFromConfig created /get: solr.RealTimeGetHandler
   [junit4]   2> 356179 T1581 oasc.RequestHandlers.initHandlersFromConfig created dismax: solr.SearchHandler
   [junit4]   2> 356180 T1581 oasc.RequestHandlers.initHandlersFromConfig created mock: org.apache.solr.core.MockQuerySenderListenerReqHandler
   [junit4]   2> 356180 T1581 oasc.RequestHandlers.initHandlersFromConfig created /admin/: org.apache.solr.handler.admin.AdminHandlers
   [junit4]   2> 356181 T1581 oasc.RequestHandlers.initHandlersFromConfig created defaults: solr.StandardRequestHandler
   [junit4]   2> 356181 T1581 oasc.RequestHandlers.initHandlersFromConfig adding lazy requestHandler: solr.StandardRequestHandler
   [junit4]   2> 356182 T1581 oasc.RequestHandlers.initHandlersFromConfig created lazy: solr.StandardRequestHandler
   [junit4]   2> 356182 T1581 oasc.RequestHandlers.initHandlersFromConfig created /update: solr.UpdateRequestHandler
   [junit4]   2> 356183 T1581 oasc.RequestHandlers.initHandlersFromConfig created /terms: org.apache.solr.handler.component.SearchHandler
   [junit4]   2> 356184 T1581 oasc.RequestHandlers.initHandlersFromConfig created spellCheckCompRH: org.apache.solr.handler.component.SearchHandler
   [junit4]   2> 356184 T1581 oasc.RequestHandlers.initHandlersFromConfig created spellCheckCompRH_Direct: org.apache.solr.handler.component.SearchHandler
   [junit4]   2> 356185 T1581 oasc.RequestHandlers.initHandlersFromConfig created spellCheckWithWordbreak: org.apache.solr.handler.component.SearchHandler
   [junit4]   2> 356186 T1581 oasc.RequestHandlers.initHandlersFromConfig created spellCheckWithWordbreak_Direct: org.apache.solr.handler.component.SearchHandler
   [junit4]   2> 356186 T1581 oasc.RequestHandlers.initHandlersFromConfig created spellCheckCompRH1: org.apache.solr.handler.component.SearchHandler
   [junit4]   2> 356187 T1581 oasc.RequestHandlers.initHandlersFromConfig created mltrh: org.apache.solr.handler.component.SearchHandler
   [junit4]   2> 356188 T1581 oasc.RequestHandlers.initHandlersFromConfig created tvrh: org.apache.solr.handler.component.SearchHandler
   [junit4]   2> 356188 T1581 oasc.RequestHandlers.initHandlersFromConfig created /mlt: solr.MoreLikeThisHandler
   [junit4]   2> 356189 T1581 oasc.RequestHandlers.initHandlersFromConfig created /debug/dump: solr.DumpRequestHandler
   [junit4]   2> 356191 T1581 oashl.XMLLoader.init xsltCacheLifetimeSeconds=60
   [junit4]   2> 356193 T1581 oasc.SolrCore.initDeprecatedSupport WARN solrconfig.xml uses deprecated <admin/gettableFiles>, Please update your config to use the ShowFileRequestHandler.
   [junit4]   2> 356194 T1581 oasc.SolrCore.initDeprecatedSupport WARN adding ShowFileRequestHandler with hidden files: [OLD_SYNONYMS.TXT, STOPWORDS.TXT, PROTWORDS.TXT, OPEN-EXCHANGE-RATES.JSON, SYNONYMS.TXT, CURRENCY.XML, MAPPING-ISOLATIN1ACCENT.TXT]
   [junit4]   2> 356195 T1581 oass.SolrIndexSearcher.<init> Opening Searcher@144f1d6 main
   [junit4]   2> 356196 T1581 oasu.CommitTracker.<init> Hard AutoCommit: disabled
   [junit4]   2> 356196 T1581 oasu.CommitTracker.<init> Soft AutoCommit: disabled
   [junit4]   2> 356197 T1581 oashc.SpellCheckComponent.inform Initializing spell checkers
   [junit4]   2> 356201 T1581 oass.DirectSolrSpellChecker.init init: {name=direct,classname=DirectSolrSpellChecker,field=lowerfilt,minQueryLength=3}
   [junit4]   2> 356226 T1582 oasc.SolrCore.registerSearcher [collection1] Registered new searcher Searcher@144f1d6 main{StandardDirectoryReader(segments_1:1)}
   [junit4]   2> 356238 T1581 oasc.CoreContainer.registerCore registering core: collection1
   [junit4]   2> 356238 T1581 oasc.ZkController.register Register replica - core:collection1 address:http://127.0.0.1:8983/solr collection:collection1 shard:shard1
   [junit4]   2> 356239 T1581 oascsi.HttpClientUtil.createClient Creating new http client, config:maxConnections=10000&maxConnectionsPerHost=20&connTimeout=15000&socketTimeout=30000&retry=false
   [junit4]   2> 356244 T1581 oascc.SolrZkClient.makePath makePath: /collections/collection1/leader_elect/shard1/election
   [junit4]   2> 356249 T1581 oasc.ShardLeaderElectionContext.runLeaderProcess Running the leader process for shard shard1
   [junit4]   2> 356251 T1581 oasc.ShardLeaderElectionContext.waitForReplicasToComeUp Enough replicas found to continue.
   [junit4]   2> 356251 T1581 oasc.ShardLeaderElectionContext.runLeaderProcess I may be the new leader - try and sync
   [junit4]   2> 356252 T1581 oasc.ShardLeaderElectionContext.runLeaderProcess I am the new leader: http://127.0.0.1:8983/solr/collection1/ shard1
   [junit4]   2> 356252 T1581 oascc.SolrZkClient.makePath makePath: /collections/collection1/leaders/shard1
   [junit4]   2> 356845 T1579 oascc.ZkStateReader.updateClusterState Updating cloud state from ZooKeeper... 
   [junit4]   2> 356850 T1578 oascc.ZkStateReader$2.process A cluster state change: WatchedEvent state:SyncConnected type:NodeDataChanged path:/clusterstate.json, has occurred - updating... (live nodes size: 1)
   [junit4]   2> 356862 T1581 oasc.ZkController.register We are http://127.0.0.1:8983/solr/collection1/ and leader is http://127.0.0.1:8983/solr/collection1/
   [junit4]   2> 356862 T1581 oasc.ZkController.register No LogReplay needed for core=collection1 baseURL=http://127.0.0.1:8983/solr
   [junit4]   2> 356863 T1581 oasc.ZkController.checkRecovery WARN Skipping recovery according to sys prop solrcloud.skip.autorecovery
   [junit4]   2> 356863 T1581 oasc.ZkController.publish publishing core=collection1 state=active
   [junit4]   2> 356863 T1581 oasc.ZkController.publish numShards not found on descriptor - reading it from system property
   [junit4]   2> 356864 T1581 oascc.ZkStateReader.updateClusterState Updating cloud state from ZooKeeper... 
   [junit4]   2> 356865 T1563 oasc.CoreContainer.load Loading cores into CoreContainer [instanceDir=/mnt/ssd/jenkins/workspace/Lucene-Solr-trunk-Linux/solr/build/solr-core/test-files/solr/]
   [junit4]   2> 356866 T1563 oashc.HttpShardHandlerFactory.getParameter Setting socketTimeout to: 120000
   [junit4]   2> 356866 T1563 oashc.HttpShardHandlerFactory.getParameter Setting urlScheme to: http://
   [junit4]   2> 356867 T1563 oashc.HttpShardHandlerFactory.getParameter Setting connTimeout to: 15000
   [junit4]   2> 356867 T1563 oashc.HttpShardHandlerFactory.getParameter Setting maxConnectionsPerHost to: 20
   [junit4]   2> 356868 T1563 oashc.HttpShardHandlerFactory.getParameter Setting corePoolSize to: 0
   [junit4]   2> 356868 T1563 oashc.HttpShardHandlerFactory.getParameter Setting maximumPoolSize to: 2147483647
   [junit4]   2> 356868 T1563 oashc.HttpShardHandlerFactory.getParameter Setting maxThreadIdleTime to: 5
   [junit4]   2> 356869 T1563 oashc.HttpShardHandlerFactory.getParameter Setting sizeOfQueue to: -1
   [junit4]   2> 356869 T1563 oashc.HttpShardHandlerFactory.getParameter Setting fairnessPolicy to: false
   [junit4]   2> 356870 T1563 oascsi.HttpClientUtil.createClient Creating new http client, config:maxConnectionsPerHost=20&maxConnections=10000&socketTimeout=120000&connTimeout=15000&retry=false
   [junit4]   2> 356874 T1563 oasc.ZkContainer.initZooKeeper Zookeeper client=127.0.0.1:58096/solr
   [junit4]   2> 356874 T1563 oasc.ZkController.checkChrootPath zkHost includes chroot
   [junit4]   2> 356875 T1563 oascc.ConnectionManager.waitForConnected Waiting for client to connect to ZooKeeper
   [junit4]   2> 356876 T1585 oascc.ConnectionManager.process Watcher org.apache.solr.common.cloud.ConnectionManager@1396b61 name:ZooKeeperConnection Watcher:127.0.0.1:58096 got event WatchedEvent state:SyncConnected type:None path:null path:null type:None
   [junit4]   2> 356877 T1563 oascc.ConnectionManager.waitForConnected Client is connected to ZooKeeper
   [junit4]   2> 356878 T1563 oascsi.HttpClientUtil.createClient Creating new http client, config:maxConnections=500&maxConnectionsPerHost=16&socketTimeout=120000&connTimeout=15000
   [junit4]   2> 356881 T1563 oascc.ConnectionManager.waitForConnected Waiting for client to connect to ZooKeeper
   [junit4]   2> 356882 T1587 oascc.ConnectionManager.process Watcher org.apache.solr.common.cloud.ConnectionManager@1f07cae name:ZooKeeperConnection Watcher:127.0.0.1:58096/solr got event WatchedEvent state:SyncConnected type:None path:null path:null type:None
   [junit4]   2> 356882 T1563 oascc.ConnectionManager.waitForConnected Client is connected to ZooKeeper
   [junit4]   2> 356885 T1563 oascc.ZkStateReader.createClusterStateWatchersAndUpdate Updating cluster state from ZooKeeper... 
   [junit4]   2> 357889 T1563 oasc.ZkController.createEphemeralLiveNode Register node as live in ZooKeeper:/live_nodes/127.0.0.1:8983_solr
   [junit4]   2> 357890 T1578 oascc.ZkStateReader$2.process A cluster state change: WatchedEvent state:SyncConnected type:NodeChildrenChanged path:/live_nodes, has occurred - updating... (live nodes size: 1)
   [junit4]   2> 357890 T1563 oasc.ZkController.createEphemeralLiveNode Found a previous node that still exists while trying to register a new live node /live_nodes/127.0.0.1:8983_solr - removing existing node to create another.
   [junit4]   2> 357891 T1563 oascc.SolrZkClient.makePath makePath: /live_nodes/127.0.0.1:8983_solr
   [junit4]   2> 357891 T1587 oascc.ZkStateReader$3.process Updating live nodes... (0)
   [junit4]   2> 357891 T1578 oascc.ZkStateReader$3.process Updating live nodes... (0)
   [junit4]   2> 357892 T1578 oascc.ZkStateReader$2.process A cluster state change: WatchedEvent state:SyncConnected type:NodeChildrenChanged path:/live_nodes, has occurred - updating... (live nodes size: 0)
   [junit4]   2> 357893 T1587 oascc.ZkStateReader$3.process Updating live nodes... (1)
   [junit4]   2> 357894 T1578 oascc.ZkStateReader$3.process Updating live nodes... (1)
   [junit4]   2> 357898 T1588 oasc.ZkController.publish publishing core=collection1 state=down
   [junit4]   2> 357898 T1588 oasc.ZkController.publish numShards not found on descriptor - reading it from system property
   [junit4]   2> 357899 T1588 oasc.ZkController.waitForCoreNodeName look for our core node name
   [junit4]   2> 357900 T1588 oasc.ZkController.waitForShardId waiting to find shard id in clusterstate for collection1
   [junit4]   2> 357900 T1588 oasc.CoreContainer.create Creating SolrCore 'collection1' using instanceDir: /mnt/ssd/jenkins/workspace/Lucene-Solr-trunk-Linux/solr/build/solr-core/test-files/solr/collection1
   [junit4]   2> 357900 T1588 oasc.ZkController.createCollectionZkNode Check for collection zkNode:collection1
   [junit4]   2> 357901 T1588 oasc.ZkController.createCollectionZkNode Collection zkNode exists
   [junit4]   2> 357901 T1588 oasc.ZkController.readConfigName Load collection config from:/collections/collection1
   [junit4]   2> 357902 T1588 oasc.SolrResourceLoader.<init> new SolrResourceLoader for directory: '/mnt/ssd/jenkins/workspace/Lucene-Solr-trunk-Linux/solr/build/solr-core/test-files/solr/collection1/'
   [junit4]   2> 357902 T1588 oasc.SolrResourceLoader.replaceClassLoader Adding 'file:/mnt/ssd/jenkins/workspace/Lucene-Solr-trunk-Linux/solr/build/solr-core/test-files/solr/collection1/lib/README' to classloader
   [junit4]   2> 357903 T1588 oasc.SolrResourceLoader.replaceClassLoader Adding 'file:/mnt/ssd/jenkins/workspace/Lucene-Solr-trunk-Linux/solr/build/solr-core/test-files/solr/collection1/lib/classes/' to classloader
   [junit4]   2> 357950 T1588 oasc.SolrConfig.<init> Using Lucene MatchVersion: LUCENE_50
   [junit4]   2> 357975 T1588 oasc.SolrConfig.<init> Loaded SolrConfig: solrconfig.xml
   [junit4]   2> 357977 T1588 oass.IndexSchema.readSchema Reading Solr Schema from schema.xml
   [junit4]   2> 357983 T1588 oass.IndexSchema.readSchema [collection1] Schema name=test
   [junit4]   2> 358184 T1588 oass.OpenExchangeRatesOrgProvider.init Initialized with rates=open-exchange-rates.json, refreshInterval=1440.
   [junit4]   2> 358192 T1588 oass.IndexSchema.readSchema default search field in schema is text
   [junit4]   2> 358195 T1588 oass.IndexSchema.readSchema unique key field: id
   [junit4]   2> 358275 T1588 oass.FileExchangeRateProvider.reload Reloading exchange rates from file currency.xml
   [junit4]   2> 358279 T1588 oass.FileExchangeRateProvider.reload Reloading exchange rates from file currency.xml
   [junit4]   2> 358282 T1588 oass.OpenExchangeRatesOrgProvider.reload Reloading exchange rates from open-exchange-rates.json
   [junit4]   2> 358283 T1588 oass.OpenExchangeRatesOrgProvider$OpenExchangeRates.<init> WARN Unknown key IMPORTANT NOTE
   [junit4]   2> 358283 T1588 oass.OpenExchangeRatesOrgProvider$OpenExchangeRates.<init> WARN Expected key, got STRING
   [junit4]   2> 358283 T1588 oass.OpenExchangeRatesOrgProvider.reload Reloading exchange rates from open-exchange-rates.json
   [junit4]   2> 358284 T1588 oass.OpenExchangeRatesOrgProvider$OpenExchangeRates.<init> WARN Unknown key IMPORTANT NOTE
   [junit4]   2> 358285 T1588 oass.OpenExchangeRatesOrgProvider$OpenExchangeRates.<init> WARN Expected key, got STRING
   [junit4]   2> 358285 T1588 oasc.SolrCore.initDirectoryFactory org.apache.solr.core.MockDirectoryFactory
   [junit4]   2> 358285 T1588 oasc.SolrCore.<init> [collection1] Opening new SolrCore at /mnt/ssd/jenkins/workspace/Lucene-Solr-trunk-Linux/solr/build/solr-core/test-files/solr/collection1/, dataDir=/mnt/ssd/jenkins/workspace/Lucene-Solr-trunk-Linux/solr/build/solr-core/test/J0/./solrtest-SliceStateUpdateTest-1375492541711/data2/
   [junit4]   2> 358286 T1588 oasc.JmxMonitoredMap.<init> JMX monitoring is enabled. Adding Solr mbeans to JMX Server: com.sun.jmx.mbeanserver.JmxMBeanServer@855c0c
   [junit4]   2> 358287 T1588 oasc.CachingDirectoryFactory.get return new directory for /mnt/ssd/jenkins/workspace/Lucene-Solr-trunk-Linux/solr/build/solr-core/test/J0/./solrtest-SliceStateUpdateTest-1375492541711/data2
   [junit4]   2> 358287 T1588 oasc.SolrCore.getNewIndexDir New index directory detected: old=null new=/mnt/ssd/jenkins/workspace/Lucene-Solr-trunk-Linux/solr/build/solr-core/test/J0/./solrtest-SliceStateUpdateTest-1375492541711/data2/index/
   [junit4]   2> 358287 T1588 oasc.SolrCore.initIndex WARN [collection1] Solr index directory '/mnt/ssd/jenkins/workspace/Lucene-Solr-trunk-Linux/solr/build/solr-core/test/J0/./solrtest-SliceStateUpdateTest-1375492541711/data2/index' doesn't exist. Creating new index...
   [junit4]   2> 358288 T1588 oasc.CachingDirectoryFactory.get return new directory for /mnt/ssd/jenkins/workspace/Lucene-Solr-trunk-Linux/solr/build/solr-core/test/J0/./solrtest-SliceStateUpdateTest-1375492541711/data2/index
   [junit4]   2> 358289 T1588 oasc.SolrDeletionPolicy.onCommit SolrDeletionPolicy.onCommit: commits: num=1
   [junit4]   2> 		commit{dir=RateLimitedDirectoryWrapper(MockDirWrapper(org.apache.lucene.store.RAMDirectory@ef2f45 lockFactory=org.apache.lucene.store.NativeFSLockFactory@9caf08)),segFN=segments_1,generation=1}
   [junit4]   2> 358290 T1588 oasc.SolrDeletionPolicy.updateCommits newest commit generation = 1
   [junit4]   2> 358290 T1588 oasc.SolrCore.initWriters created xml: solr.XMLResponseWriter
   [junit4]   2> 358295 T1588 oasup.UpdateRequestProcessorChain.init inserting DistributedUpdateProcessorFactory into updateRequestProcessorChain "dedupe"
   [junit4]   2> 358296 T1588 oasup.UpdateRequestProcessorChain.init inserting DistributedUpdateProcessorFactory into updateRequestProcessorChain "dedupe-allfields"
   [junit4]   2> 358296 T1588 oasup.UpdateRequestProcessorChain.init inserting DistributedUpdateProcessorFactory into updateRequestProcessorChain "stored_sig"
   [junit4]   2> 358296 T1588 oasup.UpdateRequestProcessorChain.init inserting DistributedUpdateProcessorFactory into updateRequestProcessorChain "uniq-fields"
   [junit4]   2> 358297 T1588 oasup.UpdateRequestProcessorChain.init inserting DistributedUpdateProcessorFactory into updateRequestProcessorChain "distrib-dup-test-chain-implicit"
   [junit4]   2> 358297 T1588 oasc.RequestHandlers.initHandlersFromConfig adding lazy requestHandler: solr.ReplicationHandler
   [junit4]   2> 358298 T1588 oasc.RequestHandlers.initHandlersFromConfig created /replication: solr.ReplicationHandler
   [junit4]   2> 358299 T1588 oasc.RequestHandlers.initHandlersFromConfig created standard: solr.StandardRequestHandler
   [junit4]   2> 358300 T1588 oasc.RequestHandlers.initHandlersFromConfig created /get: solr.RealTimeGetHandler
   [junit4]   2> 358301 T1588 oasc.RequestHandlers.initHandlersFromConfig created dismax: solr.SearchHandler
   [junit4]   2> 358302 T1588 oasc.RequestHandlers.initHandlersFromConfig created mock: org.apache.solr.core.MockQuerySenderListenerReqHandler
   [junit4]   2> 358303 T1588 oasc.RequestHandlers.initHandlersFromConfig created /admin/: org.apache.solr.handler.admin.AdminHandlers
   [junit4]   2> 358304 T1588 oasc.RequestHandlers.initHandlersFromConfig created defaults: solr.StandardRequestHandler
   [junit4]   2> 358304 T1588 oasc.RequestHandlers.initHandlersFromConfig adding lazy requestHandler: solr.StandardRequestHandler
   [junit4]   2> 358304 T1588 oasc.RequestHandlers.initHandlersFromConfig created lazy: solr.StandardRequestHandler
   [junit4]   2> 358305 T1588 oasc.RequestHandlers.initHandlersFromConfig created /update: solr.UpdateRequestHandler
   [junit4]   2> 358306 T1588 oasc.RequestHandlers.initHandlersFromConfig created /terms: org.apache.solr.handler.component.SearchHandler
   [junit4]   2> 358307 T1588 oasc.RequestHandlers.initHandlersFromConfig created spellCheckCompRH: org.apache.solr.handler.component.SearchHandler
   [junit4]   2> 358309 T1588 oasc.RequestHandlers.initHandlersFromConfig created spellCheckCompRH_Direct: org.apache.solr.handler.component.SearchHandler
   [junit4]   2> 358310 T1588 oasc.RequestHandlers.initHandlersFromConfig created spellCheckWithWordbreak: org.apache.solr.handler.component.SearchHandler
   [junit4]   2> 358311 T1588 oasc.RequestHandlers.initHandlersFromConfig created spellCheckWithWordbreak_Direct: org.apache.solr.handler.component.SearchHandler
   [junit4]   2> 358311 T1588 oasc.RequestHandlers.initHandlersFromConfig created spellCheckCompRH1: org.apache.solr.handler.component.SearchHandler
   [junit4]   2> 358312 T1588 oasc.RequestHandlers.initHandlersFromConfig created mltrh: org.apache.solr.handler.component.SearchHandler
   [junit4]   2> 358313 T1588 oasc.RequestHandlers.initHandlersFromConfig created tvrh: org.apache.solr.handler.component.SearchHandler
   [junit4]   2> 358315 T1588 oasc.RequestHandlers.initHandlersFromConfig created /mlt: solr.MoreLikeThisHandler
   [junit4]   2> 358316 T1588 oasc.RequestHandlers.initHandlersFromConfig created /debug/dump: solr.DumpRequestHandler
   [junit4]   2> 358318 T1588 oashl.XMLLoader.init xsltCacheLifetimeSeconds=60
   [junit4]   2> 358320 T1588 oasc.SolrCore.initDeprecatedSupport WARN solrconfig.xml uses deprecated <admin/gettableFiles>, Please update your config to use the ShowFileRequestHandler.
   [junit4]   2> 358321 T1588 oasc.SolrCore.initDeprecatedSupport WARN adding ShowFileRequestHandler with hidden files: [OLD_SYNONYMS.TXT, STOPWORDS.TXT, PROTWORDS.TXT, OPEN-EXCHANGE-RATES.JSON, SYNONYMS.TXT, CURRENCY.XML, MAPPING-ISOLATIN1ACCENT.TXT]
   [junit4]   2> 358323 T1588 oass.SolrIndexSearcher.<init> Opening Searcher@12a1ec1 main
   [junit4]   2> 358324 T1588 oasu.CommitTracker.<init> Hard AutoCommit: disabled
   [junit4]   2> 358324 T1588 oasu.CommitTracker.<init> Soft AutoCommit: disabled
   [junit4]   2> 358325 T1588 oashc.SpellCheckComponent.inform Initializing spell checkers
   [junit4]   2> 358327 T1588 oass.DirectSolrSpellChecker.init init: {name=direct,classname=DirectSolrSpellChecker,field=lowerfilt,minQueryLength=3}
   [junit4]   2> 358348 T1589 oasc.SolrCore.registerSearcher [collection1] Registered new searcher Searcher@12a1ec1 main{StandardDirectoryReader(segments_1:1)}
   [junit4]   2> 358354 T1579 oascc.ZkStateReader.updateClusterState Updating cloud state from ZooKeeper... 
   [junit4]   2> 358355 T1579 oasc.Overseer$ClusterStateUpdater.updateState Update state numShards=null message={
   [junit4]   2> 	  "operation":"state",
   [junit4]   2> 	  "core_node_name":"core_node1",
   [junit4]   2> 	  "numShards":null,
   [junit4]   2> 	  "shard":"shard1",
   [junit4]   2> 	  "roles":null,
   [junit4]   2> 	  "state":"active",
   [junit4]   2> 	  "shard_state":"active",
   [junit4]   2> 	  "core":"collection1",
   [junit4]   2> 	  "collection":"collection1",
   [junit4]   2> 	  "shard_range":null,
   [junit4]   2> 	  "node_name":"127.0.0.1:8983_solr",
   [junit4]   2> 	  "base_url":"http://127.0.0.1:8983/solr"}
   [junit4]   2> 358362 T1588 oasc.CoreContainer.registerCore registering core: collection1
   [junit4]   2> 358363 T1588 oasc.ZkController.register Register replica - core:collection1 address:http://127.0.0.1:8983/solr collection:collection1 shard:shard1
   [junit4]   2> 358363 T1588 oascsi.HttpClientUtil.createClient Creating new http client, config:maxConnections=10000&maxConnectionsPerHost=20&connTimeout=15000&socketTimeout=30000&retry=false
   [junit4]   2> 358413 T1588 oasc.ZkController.register We are http://127.0.0.1:8983/solr/collection1/ and leader is http://127.0.0.1:8983/solr/collection1/
   [junit4]   2> 358413 T1579 oasc.Overseer$ClusterStateUpdater.updateState node=core_node1 is already registered
   [junit4]   2> 358413 T1588 oasc.ZkController.register No LogReplay needed for core=collection1 baseURL=http://127.0.0.1:8983/solr
   [junit4]   2> 358414 T1588 oasc.ZkController.checkRecovery WARN Skipping recovery according to sys prop solrcloud.skip.autorecovery
   [junit4]   2> 358414 T1579 oasc.Overseer$ClusterStateUpdater.updateState Update state numShards=null message={
   [junit4]   2> 	  "operation":"state",
   [junit4]   2> 	  "core_node_name":"core_node1",
   [junit4]   2> 	  "numShards":null,
   [junit4]   2> 	  "shard":null,
   [junit4]   2> 	  "roles":null,
   [junit4]   2> 	  "state":"down",
   [junit4]   2> 	  "shard_state":"active",
   [junit4]   2> 	  "core":"collection1",
   [junit4]   2> 	  "collection":"collection1",
   [junit4]   2> 	  "shard_range":null,
   [junit4]   2> 	  "node_name":"127.0.0.1:8983_solr",
   [junit4]   2> 	  "base_url":"http://127.0.0.1:8983/solr"}
   [junit4]   2> 358414 T1588 oasc.ZkController.publish publishing core=collection1 state=active
   [junit4]   2> 358415 T1588 oasc.ZkController.publish numShards not found on descriptor - reading it from system property
   [junit4]   2> 358414 T1579 oasc.Overseer$ClusterStateUpdater.updateState shard=shard1 is already registered
   [junit4]   2> 358625 T1588 oascc.ZkStateReader.updateClusterState Updating cloud state from ZooKeeper... 
   [junit4]   2> 358627 T1563 oasc.SliceStateUpdateTest.setUp ####SETUP_END testSliceStateUpdate
   [junit4]   2> 358628 T1579 oasc.Overseer$ClusterStateUpdater.updateState Update state numShards=null message={
   [junit4]   2> 	  "operation":"state",
   [junit4]   2> 	  "core_node_name":"core_node1",
   [junit4]   2> 	  "numShards":null,
   [junit4]   2> 	  "shard":"shard1",
   [junit4]   2> 	  "roles":null,
   [junit4]   2> 	  "state":"active",
   [junit4]   2> 	  "shard_state":"active",
   [junit4]   2> 	  "core":"collection1",
   [junit4]   2> 	  "collection":"collection1",
   [junit4]   2> 	  "shard_range":null,
   [junit4]   2> 	  "node_name":"127.0.0.1:8983_solr",
   [junit4]   2> 	  "base_url":"http://127.0.0.1:8983/solr"}
   [junit4]   2> 358628 T1563 oascc.ConnectionManager.waitForConnected Waiting for client to connect to ZooKeeper
   [junit4]   2> 358629 T1592 oascc.ConnectionManager.process Watcher org.apache.solr.common.cloud.ConnectionManager@133c687 name:ZooKeeperConnection Watcher:127.0.0.1:58096/solr got event WatchedEvent state:SyncConnected type:None path:null path:null type:None
   [junit4]   2> 358630 T1563 oascc.ConnectionManager.waitForConnected Client is connected to ZooKeeper
   [junit4]   2> 358631 T1587 oascc.ZkStateReader$2.process A cluster state change: WatchedEvent state:SyncConnected type:NodeDataChanged path:/clusterstate.json, has occurred - updating... (live nodes size: 1)
   [junit4]   2> 358631 T1578 oascc.ZkStateReader$2.process A cluster state change: WatchedEvent state:SyncConnected type:NodeDataChanged path:/clusterstate.json, has occurred - updating... (live nodes size: 1)
   [junit4]   2> 396141 T1563 oasc.CoreContainer.shutdown Shutting down CoreContainer instance=9506903
   [junit4]   2> 396176 T1579 oascc.ZkStateReader.updateClusterState Updating cloud state from ZooKeeper... 
   [junit4]   2> 396177 T1579 oasc.Overseer$ClusterStateUpdater.updateState Update state numShards=null message={
   [junit4]   2> 	  "operation":"state",
   [junit4]   2> 	  "core_node_name":"core_node1",
   [junit4]   2> 	  "shard":null,
   [junit4]   2> 	  "roles":null,
   [junit4]   2> 	  "state":"down",
   [junit4]   2> 	  "core":"collection1",
   [junit4]   2> 	  "collection":"collection1",
   [junit4]   2> 	  "node_name":"127.0.0.1:8983_solr",
   [junit4]   2> 	  "base_url":"http://127.0.0.1:8983/solr"}
   [junit4]   2> 396177 T1579 oasc.Overseer$ClusterStateUpdater.updateState shard=shard1 is already registered
   [junit4]   2> 396180 T1578 oascc.ZkStateReader$2.process A cluster state change: WatchedEvent state:SyncConnected type:NodeDataChanged path:/clusterstate.json, has occurred - updating... (live nodes size: 1)
   [junit4]   2> 396180 T1587 oascc.ZkStateReader$2.process A cluster state change: WatchedEvent state:SyncConnected type:NodeDataChanged path:/clusterstate.json, has occurred - updating... (live nodes size: 1)
   [junit4]   2> 398144 T1563 oasc.ZkController.publish publishing core=collection1 state=down
   [junit4]   2> 398144 T1563 oasc.ZkController.publish numShards not found on descriptor - reading it from system property
   [junit4]   2> 398146 T1563 oasc.SolrCore.close [collection1]  CLOSING SolrCore org.apache.solr.core.SolrCore@10a79c7
   [junit4]   2> 398156 T1563 oasu.DirectUpdateHandler2.close closing DirectUpdateHandler2{commits=0,autocommits=0,soft autocommits=0,optimizes=0,rollbacks=0,expungeDeletes=0,docsPending=0,adds=0,deletesById=0,deletesByQuery=0,errors=0,cumulative_adds=0,cumulative_deletesById=0,cumulative_deletesByQuery=0,cumulative_errors=0}
   [junit4]   2> 398156 T1563 oasu.SolrCoreState.decrefSolrCoreState Closing SolrCoreState
   [junit4]   2> 398156 T1563 oasu.DefaultSolrCoreState.closeIndexWriter SolrCoreState ref count has reached 0 - closing IndexWriter
   [junit4]   2> 398157 T1563 oasu.DefaultSolrCoreState.closeIndexWriter closing IndexWriter with IndexWriterCloser
   [junit4]   2> 398157 T1563 oasc.SolrCore.closeSearcher [collection1] Closing main searcher on request.
   [junit4]   2> 398158 T1563 oasc.CachingDirectoryFactory.close Closing MockDirectoryFactory - 2 directories currently being tracked
   [junit4]   2> 398158 T1563 oasc.CachingDirectoryFactory.closeCacheValue looking to close /mnt/ssd/jenkins/workspace/Lucene-Solr-trunk-Linux/solr/build/solr-core/test/J0/./solrtest-SliceStateUpdateTest-1375492541711/data2 [CachedDir<<refCount=0;path=/mnt/ssd/jenkins/workspace/Lucene-Solr-trunk-Linux/solr/build/solr-core/test/J0/./solrtest-SliceStateUpdateTest-1375492541711/data2;done=false>>]
   [junit4]   2> 398158 T1563 oasc.CachingDirectoryFactory.close Closing directory: /mnt/ssd/jenkins/workspace/Lucene-Solr-trunk-Linux/solr/build/solr-core/test/J0/./solrtest-SliceStateUpdateTest-1375492541711/data2
   [junit4]   2> 398159 T1563 oasc.CachingDirectoryFactory.closeCacheValue looking to close /mnt/ssd/jenkins/workspace/Lucene-Solr-trunk-Linux/solr/build/solr-core/test/J0/./solrtest-SliceStateUpdateTest-1375492541711/data2/index [CachedDir<<refCount=0;path=/mnt/ssd/jenkins/workspace/Lucene-Solr-trunk-Linux/solr/build/solr-core/test/J0/./solrtest-SliceStateUpdateTest-1375492541711/data2/index;done=false>>]
   [junit4]   2> 398159 T1563 oasc.CachingDirectoryFactory.close Closing directory: /mnt/ssd/jenkins/workspace/Lucene-Solr-trunk-Linux/solr/build/solr-core/test/J0/./solrtest-SliceStateUpdateTest-1375492541711/data2/index
   [junit4]   2> 398160 T1579 oasc.Overseer$ClusterStateUpdater.amILeader According to ZK I (id=90144279213834244-127.0.0.1:8983_solr-n_0000000000) am no longer a leader.
   [junit4]   2> 398161 T1563 oasc.CoreContainer.shutdown Shutting down CoreContainer instance=32565094
   [junit4]   2> 398162 T1587 oascc.SolrZkClient.makePath makePath: /overseer_elect/leader
   [junit4]   2> 398164 T1587 oasc.Overseer.start Overseer (id=90144279213834246-127.0.0.1:8983_solr-n_0000000001) starting
   [junit4]   2> 398167 T1594 oasc.OverseerCollectionProcessor.run Process current queue of collection creations
   [junit4]   2> 398168 T1593 oasc.Overseer$ClusterStateUpdater.run Starting to work on the main queue
   [junit4]   2> 398168 T1587 oasc.ShardLeaderElectionContext.runLeaderProcess Running the leader process for shard shard1
   [junit4]   2> 398170 T1587 oasc.ShardLeaderElectionContext.shouldIBeLeader Checking if I should try and be the leader.
   [junit4]   2> 398170 T1587 oasc.ShardLeaderElectionContext.shouldIBeLeader My last published State was Active, it's okay to be the leader.
   [junit4]   2> 398170 T1587 oasc.ShardLeaderElectionContext.runLeaderProcess I may be the new leader - try and sync
   [junit4]   2> 398170 T1593 oascc.ZkStateReader.updateClusterState Updating cloud state from ZooKeeper... 
   [junit4]   2> 398170 T1587 oasc.ShardLeaderElectionContext.runLeaderProcess I am the new leader: http://127.0.0.1:8983/solr/collection1/ shard1
   [junit4]   2> 398171 T1587 oascc.SolrZkClient.makePath makePath: /collections/collection1/leaders/shard1
   [junit4]   2> 398171 T1593 oasc.Overseer$ClusterStateUpdater.updateState Update state numShards=null message={
   [junit4]   2> 	  "operation":"state",
   [junit4]   2> 	  "core_node_name":"core_node1",
   [junit4]   2> 	  "numShards":null,
   [junit4]   2> 	  "shard":"shard1",
   [junit4]   2> 	  "roles":null,
   [junit4]   2> 	  "state":"down",
   [junit4]   2> 	  "shard_state":"active",
   [junit4]   2> 	  "core":"collection1",
   [junit4]   2> 	  "collection":"collection1",
   [junit4]   2> 	  "shard_range":null,
   [junit4]   2> 	  "node_name":"127.0.0.1:8983_solr",
   [junit4]   2> 	  "base_url":"http://127.0.0.1:8983/solr"}
   [junit4]   2> 398180 T1587 oascc.ZkStateReader$2.process A cluster state change: WatchedEvent state:SyncConnected type:NodeDataChanged path:/clusterstate.json, has occurred - updating... (live nodes size: 1)
   [junit4]   2> 399162 T1563 oasc.ZkController.publish publishing core=collection1 state=down
   [junit4]   2> 399162 T1563 oasc.ZkController.publish numShards not found on descriptor - reading it from system property
   [junit4]   2> 399164 T1563 oasc.SolrCore.close [collection1]  CLOSING SolrCore org.apache.solr.core.SolrCore@1e14684
   [junit4]   2> 399182 T1563 oasu.DirectUpdateHandler2.close closing DirectUpdateHandler2{commits=0,autocommits=0,soft autocommits=0,optimizes=0,rollbacks=0,expungeDeletes=0,docsPending=0,adds=0,deletesById=0,deletesByQuery=0,errors=0,cumulative_adds=0,cumulative_deletesById=0,cumulative_deletesByQuery=0,cumulative_errors=0}
   [junit4]   2> 399182 T1563 oasu.SolrCoreState.decrefSolrCoreState Closing SolrCoreState
   [junit4]   2> 399183 T1563 oasu.DefaultSolrCoreState.closeIndexWriter SolrCoreState ref count has reached 0 - closing IndexWriter
   [junit4]   2> 399183 T1563 oasu.DefaultSolrCoreState.closeIndexWriter closing IndexWriter with IndexWriterCloser
   [junit4]   2> 399183 T1563 oasc.SolrCore.closeSearcher [collection1] Closing main searcher on request.
   [junit4]   2> 399184 T1563 oasc.CachingDirectoryFactory.close Closing MockDirectoryFactory - 2 directories currently being tracked
   [junit4]   2> 399184 T1563 oasc.CachingDirectoryFactory.closeCacheValue looking to close /mnt/ssd/jenkins/workspace/Lucene-Solr-trunk-Linux/solr/build/solr-core/test/J0/./solrtest-SliceStateUpdateTest-1375492541711/data2 [CachedDir<<refCount=0;path=/mnt/ssd/jenkins/workspace/Lucene-Solr-trunk-Linux/solr/build/solr-core/test/J0/./solrtest-SliceStateUpdateTest-1375492541711/data2;done=false>>]
   [junit4]   2> 399184 T1563 oasc.CachingDirectoryFactory.close Closing directory: /mnt/ssd/jenkins/workspace/Lucene-Solr-trunk-Linux/solr/build/solr-core/test/J0/./solrtest-SliceStateUpdateTest-1375492541711/data2
   [junit4]   2> 399185 T1563 oasc.CachingDirectoryFactory.closeCacheValue looking to close /mnt/ssd/jenkins/workspace/Lucene-Solr-trunk-Linux/solr/build/solr-core/test/J0/./solrtest-SliceStateUpdateTest-1375492541711/data2/index [CachedDir<<refCount=0;path=/mnt/ssd/jenkins/workspace/Lucene-Solr-trunk-Linux/solr/build/solr-core/test/J0/./solrtest-SliceStateUpdateTest-1375492541711/data2/index;done=false>>]
   [junit4]   2> 399185 T1563 oasc.CachingDirectoryFactory.close Closing directory: /mnt/ssd/jenkins/workspace/Lucene-Solr-trunk-Linux/solr/build/solr-core/test/J0/./solrtest-SliceStateUpdateTest-1375492541711/data2/index
   [junit4]   2> 399186 T1593 oasc.Overseer$ClusterStateUpdater.amILeader According to ZK I (id=90144279213834246-127.0.0.1:8983_solr-n_0000000001) am no longer a leader.
   [junit4]   2> 399188 T1563 oasc.ZkTestServer.send4LetterWord connecting to 127.0.0.1:58096 58096
   [junit4]   2> 399189 T1563 oas.SolrTestCaseJ4.tearDown ###Ending testSliceStateUpdate
   [junit4]   1> client port:0.0.0.0/0.0.0.0:0
   [junit4]   2> NOTE: reproduce with: ant test  -Dtestcase=SliceStateUpdateTest -Dtests.method=testSliceStateUpdate -Dtests.seed=57A23F39F6A09DF7 -Dtests.multiplier=3 -Dtests.slow=true -Dtests.locale=mk -Dtests.timezone=Africa/Ceuta -Dtests.file.encoding=UTF-8
   [junit4] FAILURE 45.7s J0 | SliceStateUpdateTest.testSliceStateUpdate <<<
   [junit4]    > Throwable #1: org.junit.ComparisonFailure: expected:<[in]active> but was:<[]active>
   [junit4]    > 	at __randomizedtesting.SeedInfo.seed([57A23F39F6A09DF7:87C0B275A8754773]:0)
   [junit4]    > 	at org.apache.solr.cloud.SliceStateUpdateTest.testSliceStateUpdate(SliceStateUpdateTest.java:183)
   [junit4]    > 	at java.lang.Thread.run(Thread.java:724)
   [junit4]   2> 399216 T1563 oas.SolrTestCaseJ4.deleteCore ###deleteCore
   [junit4]   2> 45668 T1562 ccr.ThreadLeakControl.checkThreadLeaks WARNING Will linger awaiting termination of 3 leaked thread(s).
   [junit4]   2> 400487 T1587 oascc.ZkStateReader$3.process WARN ZooKeeper watch triggered, but Solr cannot talk to ZK
   [junit4]   2> 400487 T1587 oascc.ZkStateReader$2.process A cluster state change: WatchedEvent state:SyncConnected type:NodeChildrenChanged path:/live_nodes, has occurred - updating... (live nodes size: 1)
   [junit4]   2> 400488 T1587 oascc.ZkStateReader$2.process WARN ZooKeeper watch triggered, but Solr cannot talk to ZK
   [junit4]   2> NOTE: test params are: codec=FastDecompressionCompressingStoredFields(storedFieldsFormat=CompressingStoredFieldsFormat(compressionMode=FAST_DECOMPRESSION, chunkSize=268), termVectorsFormat=CompressingTermVectorsFormat(compressionMode=FAST_DECOMPRESSION, chunkSize=268)), sim=DefaultSimilarity, locale=mk, timezone=Africa/Ceuta
   [junit4]   2> NOTE: Linux 3.2.0-51-generic i386/Oracle Corporation 1.8.0-ea (32-bit)/cpus=8,threads=1,free=160705080,total=319815680
   [junit4]   2> NOTE: All tests run in this JVM: [TestFieldTypeResource, SoftAutoCommitTest, TestMaxScoreQueryParser, SearchHandlerTest, WordBreakSolrSpellCheckerTest, QueryEqualityTest, SpellingQueryConverterTest, ResponseLogComponentTest, SynonymTokenizerTest, TestPluginEnable, TestSerializedLuceneMatchVersion, TermsComponentTest, TestJoin, CoreAdminHandlerTest, ReturnFieldsTest, TestIBSimilarityFactory, TestValueSourceCache, DocValuesTest, DirectUpdateHandlerOptimizeTest, LegacyHTMLStripCharFilterTest, OverseerCollectionProcessorTest, SpatialFilterTest, ChaosMonkeyNothingIsSafeTest, DateFieldTest, BinaryUpdateRequestHandlerTest, OverseerTest, DistributedTermsComponentTest, TestBadConfig, ShowFileRequestHandlerTest, SuggesterTest, DistributedSpellCheckComponentTest, TestFieldResource, CoreMergeIndexesAdminHandlerTest, TestStressVersions, AddSchemaFieldsUpdateProcessorFactoryTest, SolrCoreTest, TestFastWriter, FastVectorHighlighterTest, PluginInfoTest, TestRandomDVFaceting, CachingDirectoryFactoryTest, SolrTestCaseJ4Test, TestDynamicFieldCollectionResource, TestDynamicFieldResource, TestPseudoReturnFields, SystemInfoHandlerTest, SuggesterFSTTest, UpdateRequestProcessorFactoryTest, SliceStateUpdateTest]
   [junit4] Completed on J0 in 47.20s, 1 test, 1 failure <<< FAILURES!

[...truncated 766 lines...]
BUILD FAILED
/mnt/ssd/jenkins/workspace/Lucene-Solr-trunk-Linux/build.xml:389: The following error occurred while executing this line:
/mnt/ssd/jenkins/workspace/Lucene-Solr-trunk-Linux/build.xml:369: The following error occurred while executing this line:
/mnt/ssd/jenkins/workspace/Lucene-Solr-trunk-Linux/build.xml:39: The following error occurred while executing this line:
/mnt/ssd/jenkins/workspace/Lucene-Solr-trunk-Linux/solr/build.xml:181: The following error occurred while executing this line:
/mnt/ssd/jenkins/workspace/Lucene-Solr-trunk-Linux/solr/common-build.xml:449: The following error occurred while executing this line:
/mnt/ssd/jenkins/workspace/Lucene-Solr-trunk-Linux/lucene/common-build.xml:1230: The following error occurred while executing this line:
/mnt/ssd/jenkins/workspace/Lucene-Solr-trunk-Linux/lucene/common-build.xml:873: There were test failures: 320 suites, 1347 tests, 1 failure, 37 ignored (6 assumptions)

Total time: 38 minutes 12 seconds
Build step 'Invoke Ant' marked build as failure
Description set: Java: 32bit/jdk1.8.0-ea-b99 -client -XX:+UseG1GC
Archiving artifacts
Recording test results
Email was triggered for: Failure
Sending email for trigger: Failure



Mime
View raw message