lucene-dev mailing list archives

Site index · List index
Message view « Date » · « Thread »
Top « Date » · « Thread »
From Apache Jenkins Server <jenk...@builds.apache.org>
Subject [JENKINS] Lucene-Solr-Tests-trunk-Java7 - Build # 4197 - Failure
Date Thu, 01 Aug 2013 00:32:52 GMT
Build: https://builds.apache.org/job/Lucene-Solr-Tests-trunk-Java7/4197/

1 tests failed.
REGRESSION:  org.apache.solr.cloud.CollectionsAPIDistributedZkTest.testDistribSearch

Error Message:
IOException occured when talking to server at: http://127.0.0.1:34590/mpwv/y

Stack Trace:
org.apache.solr.client.solrj.SolrServerException: IOException occured when talking to server at: http://127.0.0.1:34590/mpwv/y
	at __randomizedtesting.SeedInfo.seed([9BDDBF19FC02BEDD:1A3B31018B5DDEE1]:0)
	at org.apache.solr.client.solrj.impl.HttpSolrServer.request(HttpSolrServer.java:435)
	at org.apache.solr.client.solrj.impl.HttpSolrServer.request(HttpSolrServer.java:180)
	at org.apache.solr.cloud.AbstractFullDistribZkTestBase.createCollection(AbstractFullDistribZkTestBase.java:1535)
	at org.apache.solr.cloud.CollectionsAPIDistributedZkTest.testCustomCollectionsAPI(CollectionsAPIDistributedZkTest.java:677)
	at org.apache.solr.cloud.CollectionsAPIDistributedZkTest.doTest(CollectionsAPIDistributedZkTest.java:159)
	at org.apache.solr.BaseDistributedSearchTestCase.testDistribSearch(BaseDistributedSearchTestCase.java:835)
	at sun.reflect.NativeMethodAccessorImpl.invoke0(Native Method)
	at sun.reflect.NativeMethodAccessorImpl.invoke(NativeMethodAccessorImpl.java:57)
	at sun.reflect.DelegatingMethodAccessorImpl.invoke(DelegatingMethodAccessorImpl.java:43)
	at java.lang.reflect.Method.invoke(Method.java:606)
	at com.carrotsearch.randomizedtesting.RandomizedRunner.invoke(RandomizedRunner.java:1559)
	at com.carrotsearch.randomizedtesting.RandomizedRunner.access$600(RandomizedRunner.java:79)
	at com.carrotsearch.randomizedtesting.RandomizedRunner$6.evaluate(RandomizedRunner.java:737)
	at com.carrotsearch.randomizedtesting.RandomizedRunner$7.evaluate(RandomizedRunner.java:773)
	at com.carrotsearch.randomizedtesting.RandomizedRunner$8.evaluate(RandomizedRunner.java:787)
	at com.carrotsearch.randomizedtesting.rules.SystemPropertiesRestoreRule$1.evaluate(SystemPropertiesRestoreRule.java:53)
	at org.apache.lucene.util.TestRuleSetupTeardownChained$1.evaluate(TestRuleSetupTeardownChained.java:50)
	at org.apache.lucene.util.TestRuleFieldCacheSanity$1.evaluate(TestRuleFieldCacheSanity.java:51)
	at org.apache.lucene.util.AbstractBeforeAfterRule$1.evaluate(AbstractBeforeAfterRule.java:46)
	at com.carrotsearch.randomizedtesting.rules.SystemPropertiesInvariantRule$1.evaluate(SystemPropertiesInvariantRule.java:55)
	at org.apache.lucene.util.TestRuleThreadAndTestName$1.evaluate(TestRuleThreadAndTestName.java:49)
	at org.apache.lucene.util.TestRuleIgnoreAfterMaxFailures$1.evaluate(TestRuleIgnoreAfterMaxFailures.java:70)
	at org.apache.lucene.util.TestRuleMarkFailure$1.evaluate(TestRuleMarkFailure.java:48)
	at com.carrotsearch.randomizedtesting.rules.StatementAdapter.evaluate(StatementAdapter.java:36)
	at com.carrotsearch.randomizedtesting.ThreadLeakControl$StatementRunner.run(ThreadLeakControl.java:358)
	at com.carrotsearch.randomizedtesting.ThreadLeakControl.forkTimeoutingTask(ThreadLeakControl.java:782)
	at com.carrotsearch.randomizedtesting.ThreadLeakControl$3.evaluate(ThreadLeakControl.java:442)
	at com.carrotsearch.randomizedtesting.RandomizedRunner.runSingleTest(RandomizedRunner.java:746)
	at com.carrotsearch.randomizedtesting.RandomizedRunner$3.evaluate(RandomizedRunner.java:648)
	at com.carrotsearch.randomizedtesting.RandomizedRunner$4.evaluate(RandomizedRunner.java:682)
	at com.carrotsearch.randomizedtesting.RandomizedRunner$5.evaluate(RandomizedRunner.java:693)
	at com.carrotsearch.randomizedtesting.rules.StatementAdapter.evaluate(StatementAdapter.java:36)
	at com.carrotsearch.randomizedtesting.rules.SystemPropertiesRestoreRule$1.evaluate(SystemPropertiesRestoreRule.java:53)
	at org.apache.lucene.util.AbstractBeforeAfterRule$1.evaluate(AbstractBeforeAfterRule.java:46)
	at org.apache.lucene.util.TestRuleStoreClassName$1.evaluate(TestRuleStoreClassName.java:42)
	at com.carrotsearch.randomizedtesting.rules.SystemPropertiesInvariantRule$1.evaluate(SystemPropertiesInvariantRule.java:55)
	at com.carrotsearch.randomizedtesting.rules.NoShadowingOrOverridesOnMethodsRule$1.evaluate(NoShadowingOrOverridesOnMethodsRule.java:39)
	at com.carrotsearch.randomizedtesting.rules.NoShadowingOrOverridesOnMethodsRule$1.evaluate(NoShadowingOrOverridesOnMethodsRule.java:39)
	at com.carrotsearch.randomizedtesting.rules.StatementAdapter.evaluate(StatementAdapter.java:36)
	at org.apache.lucene.util.TestRuleAssertionsRequired$1.evaluate(TestRuleAssertionsRequired.java:43)
	at org.apache.lucene.util.TestRuleMarkFailure$1.evaluate(TestRuleMarkFailure.java:48)
	at org.apache.lucene.util.TestRuleIgnoreAfterMaxFailures$1.evaluate(TestRuleIgnoreAfterMaxFailures.java:70)
	at org.apache.lucene.util.TestRuleIgnoreTestSuites$1.evaluate(TestRuleIgnoreTestSuites.java:55)
	at com.carrotsearch.randomizedtesting.rules.StatementAdapter.evaluate(StatementAdapter.java:36)
	at com.carrotsearch.randomizedtesting.ThreadLeakControl$StatementRunner.run(ThreadLeakControl.java:358)
	at java.lang.Thread.run(Thread.java:724)
Caused by: org.apache.http.conn.ConnectTimeoutException: Connect to 127.0.0.1:34590 timed out
	at org.apache.http.conn.scheme.PlainSocketFactory.connectSocket(PlainSocketFactory.java:129)
	at org.apache.http.impl.conn.DefaultClientConnectionOperator.openConnection(DefaultClientConnectionOperator.java:180)
	at org.apache.http.impl.conn.ManagedClientConnectionImpl.open(ManagedClientConnectionImpl.java:294)
	at org.apache.http.impl.client.DefaultRequestDirector.tryConnect(DefaultRequestDirector.java:645)
	at org.apache.http.impl.client.DefaultRequestDirector.execute(DefaultRequestDirector.java:480)
	at org.apache.http.impl.client.AbstractHttpClient.execute(AbstractHttpClient.java:906)
	at org.apache.http.impl.client.AbstractHttpClient.execute(AbstractHttpClient.java:805)
	at org.apache.http.impl.client.AbstractHttpClient.execute(AbstractHttpClient.java:784)
	at org.apache.solr.client.solrj.impl.HttpSolrServer.request(HttpSolrServer.java:365)
	... 45 more




Build Log:
[...truncated 9868 lines...]
   [junit4] Suite: org.apache.solr.cloud.CollectionsAPIDistributedZkTest
   [junit4]   2> 1184337 T2273 oas.BaseDistributedSearchTestCase.initHostContext Setting hostContext system property: /mpwv/y
   [junit4]   2> 1184344 T2273 oas.SolrTestCaseJ4.setUp ###Starting testDistribSearch
   [junit4]   2> Creating dataDir: /usr/home/hudson/hudson-slave/workspace/Lucene-Solr-Tests-trunk-Java7/solr/build/solr-core/test/J1/./solrtest-CollectionsAPIDistributedZkTest-1375316012187
   [junit4]   2> 1184345 T2273 oasc.ZkTestServer.run STARTING ZK TEST SERVER
   [junit4]   2> 1184346 T2274 oasc.ZkTestServer$ZKServerMain.runFromConfig Starting server
   [junit4]   2> 1184448 T2273 oasc.ZkTestServer.run start zk server on port:34583
   [junit4]   2> 1184449 T2273 oascc.ConnectionManager.waitForConnected Waiting for client to connect to ZooKeeper
   [junit4]   2> 1184454 T2280 oascc.ConnectionManager.process Watcher org.apache.solr.common.cloud.ConnectionManager@11ff8b62 name:ZooKeeperConnection Watcher:127.0.0.1:34583 got event WatchedEvent state:SyncConnected type:None path:null path:null type:None
   [junit4]   2> 1184454 T2273 oascc.ConnectionManager.waitForConnected Client is connected to ZooKeeper
   [junit4]   2> 1184454 T2273 oascc.SolrZkClient.makePath makePath: /solr
   [junit4]   2> 1184468 T2273 oascc.ConnectionManager.waitForConnected Waiting for client to connect to ZooKeeper
   [junit4]   2> 1184470 T2282 oascc.ConnectionManager.process Watcher org.apache.solr.common.cloud.ConnectionManager@55cd2d67 name:ZooKeeperConnection Watcher:127.0.0.1:34583/solr got event WatchedEvent state:SyncConnected type:None path:null path:null type:None
   [junit4]   2> 1184471 T2273 oascc.ConnectionManager.waitForConnected Client is connected to ZooKeeper
   [junit4]   2> 1184471 T2273 oascc.SolrZkClient.makePath makePath: /collections/collection1
   [junit4]   2> 1184482 T2273 oascc.SolrZkClient.makePath makePath: /collections/collection1/shards
   [junit4]   2> 1184485 T2273 oascc.SolrZkClient.makePath makePath: /collections/control_collection
   [junit4]   2> 1184488 T2273 oascc.SolrZkClient.makePath makePath: /collections/control_collection/shards
   [junit4]   2> 1184495 T2273 oasc.AbstractZkTestCase.putConfig put /usr/home/hudson/hudson-slave/workspace/Lucene-Solr-Tests-trunk-Java7/solr/build/solr-core/test-files/solr/collection1/conf/solrconfig-tlog.xml to /configs/conf1/solrconfig.xml
   [junit4]   2> 1184496 T2273 oascc.SolrZkClient.makePath makePath: /configs/conf1/solrconfig.xml
   [junit4]   2> 1184510 T2273 oasc.AbstractZkTestCase.putConfig put /usr/home/hudson/hudson-slave/workspace/Lucene-Solr-Tests-trunk-Java7/solr/build/solr-core/test-files/solr/collection1/conf/schema.xml to /configs/conf1/schema.xml
   [junit4]   2> 1184510 T2273 oascc.SolrZkClient.makePath makePath: /configs/conf1/schema.xml
   [junit4]   2> 1184615 T2273 oasc.AbstractZkTestCase.putConfig put /usr/home/hudson/hudson-slave/workspace/Lucene-Solr-Tests-trunk-Java7/solr/build/solr-core/test-files/solr/collection1/conf/stopwords.txt to /configs/conf1/stopwords.txt
   [junit4]   2> 1184616 T2273 oascc.SolrZkClient.makePath makePath: /configs/conf1/stopwords.txt
   [junit4]   2> 1184619 T2273 oasc.AbstractZkTestCase.putConfig put /usr/home/hudson/hudson-slave/workspace/Lucene-Solr-Tests-trunk-Java7/solr/build/solr-core/test-files/solr/collection1/conf/protwords.txt to /configs/conf1/protwords.txt
   [junit4]   2> 1184620 T2273 oascc.SolrZkClient.makePath makePath: /configs/conf1/protwords.txt
   [junit4]   2> 1184629 T2273 oasc.AbstractZkTestCase.putConfig put /usr/home/hudson/hudson-slave/workspace/Lucene-Solr-Tests-trunk-Java7/solr/build/solr-core/test-files/solr/collection1/conf/currency.xml to /configs/conf1/currency.xml
   [junit4]   2> 1184630 T2273 oascc.SolrZkClient.makePath makePath: /configs/conf1/currency.xml
   [junit4]   2> 1184633 T2273 oasc.AbstractZkTestCase.putConfig put /usr/home/hudson/hudson-slave/workspace/Lucene-Solr-Tests-trunk-Java7/solr/build/solr-core/test-files/solr/collection1/conf/open-exchange-rates.json to /configs/conf1/open-exchange-rates.json
   [junit4]   2> 1184634 T2273 oascc.SolrZkClient.makePath makePath: /configs/conf1/open-exchange-rates.json
   [junit4]   2> 1184637 T2273 oasc.AbstractZkTestCase.putConfig put /usr/home/hudson/hudson-slave/workspace/Lucene-Solr-Tests-trunk-Java7/solr/build/solr-core/test-files/solr/collection1/conf/mapping-ISOLatin1Accent.txt to /configs/conf1/mapping-ISOLatin1Accent.txt
   [junit4]   2> 1184638 T2273 oascc.SolrZkClient.makePath makePath: /configs/conf1/mapping-ISOLatin1Accent.txt
   [junit4]   2> 1184641 T2273 oasc.AbstractZkTestCase.putConfig put /usr/home/hudson/hudson-slave/workspace/Lucene-Solr-Tests-trunk-Java7/solr/build/solr-core/test-files/solr/collection1/conf/old_synonyms.txt to /configs/conf1/old_synonyms.txt
   [junit4]   2> 1184641 T2273 oascc.SolrZkClient.makePath makePath: /configs/conf1/old_synonyms.txt
   [junit4]   2> 1184644 T2273 oasc.AbstractZkTestCase.putConfig put /usr/home/hudson/hudson-slave/workspace/Lucene-Solr-Tests-trunk-Java7/solr/build/solr-core/test-files/solr/collection1/conf/synonyms.txt to /configs/conf1/synonyms.txt
   [junit4]   2> 1184645 T2273 oascc.SolrZkClient.makePath makePath: /configs/conf1/synonyms.txt
   [junit4]   2> 1184927 T2273 oejs.Server.doStart jetty-8.1.10.v20130312
   [junit4]   2> 1184931 T2273 oejs.AbstractConnector.doStart Started SocketConnector@127.0.0.1:34586
   [junit4]   2> 1184932 T2273 oass.SolrDispatchFilter.init SolrDispatchFilter.init()
   [junit4]   2> 1184933 T2273 oasc.SolrResourceLoader.locateSolrHome JNDI not configured for solr (NoInitialContextEx)
   [junit4]   2> 1184933 T2273 oasc.SolrResourceLoader.locateSolrHome using system property solr.solr.home: /usr/home/hudson/hudson-slave/workspace/Lucene-Solr-Tests-trunk-Java7/solr/build/solr-core/test/J1/./org.apache.solr.cloud.CollectionsAPIDistributedZkTest-controljetty-1375316012492
   [junit4]   2> 1184934 T2273 oasc.SolrResourceLoader.<init> new SolrResourceLoader for directory: '/usr/home/hudson/hudson-slave/workspace/Lucene-Solr-Tests-trunk-Java7/solr/build/solr-core/test/J1/./org.apache.solr.cloud.CollectionsAPIDistributedZkTest-controljetty-1375316012492/'
   [junit4]   2> 1184973 T2273 oasc.ConfigSolr.fromFile Loading container configuration from /usr/home/hudson/hudson-slave/workspace/Lucene-Solr-Tests-trunk-Java7/solr/build/solr-core/test/J1/./org.apache.solr.cloud.CollectionsAPIDistributedZkTest-controljetty-1375316012492/solr.xml
   [junit4]   2> 1185092 T2273 oasc.ConfigSolrXml.<init> Config-defined core root directory: 
   [junit4]   2> 1185092 T2273 oasc.CoreContainer.<init> New CoreContainer 1648884342
   [junit4]   2> 1185093 T2273 oasc.CoreContainer.load Loading cores into CoreContainer [instanceDir=/usr/home/hudson/hudson-slave/workspace/Lucene-Solr-Tests-trunk-Java7/solr/build/solr-core/test/J1/./org.apache.solr.cloud.CollectionsAPIDistributedZkTest-controljetty-1375316012492/]
   [junit4]   2> 1185095 T2273 oashc.HttpShardHandlerFactory.getParameter Setting socketTimeout to: 120000
   [junit4]   2> 1185095 T2273 oashc.HttpShardHandlerFactory.getParameter Setting urlScheme to: http://
   [junit4]   2> 1185096 T2273 oashc.HttpShardHandlerFactory.getParameter Setting connTimeout to: 15000
   [junit4]   2> 1185096 T2273 oashc.HttpShardHandlerFactory.getParameter Setting maxConnectionsPerHost to: 20
   [junit4]   2> 1185097 T2273 oashc.HttpShardHandlerFactory.getParameter Setting corePoolSize to: 0
   [junit4]   2> 1185097 T2273 oashc.HttpShardHandlerFactory.getParameter Setting maximumPoolSize to: 2147483647
   [junit4]   2> 1185098 T2273 oashc.HttpShardHandlerFactory.getParameter Setting maxThreadIdleTime to: 5
   [junit4]   2> 1185098 T2273 oashc.HttpShardHandlerFactory.getParameter Setting sizeOfQueue to: -1
   [junit4]   2> 1185099 T2273 oashc.HttpShardHandlerFactory.getParameter Setting fairnessPolicy to: false
   [junit4]   2> 1185099 T2273 oascsi.HttpClientUtil.createClient Creating new http client, config:maxConnectionsPerHost=20&maxConnections=10000&socketTimeout=120000&connTimeout=15000&retry=false
   [junit4]   2> 1185117 T2273 oasc.ZkContainer.initZooKeeper Zookeeper client=127.0.0.1:34583/solr
   [junit4]   2> 1185117 T2273 oasc.ZkController.checkChrootPath zkHost includes chroot
   [junit4]   2> 1185119 T2273 oascc.ConnectionManager.waitForConnected Waiting for client to connect to ZooKeeper
   [junit4]   2> 1185122 T2293 oascc.ConnectionManager.process Watcher org.apache.solr.common.cloud.ConnectionManager@3fe7997e name:ZooKeeperConnection Watcher:127.0.0.1:34583 got event WatchedEvent state:SyncConnected type:None path:null path:null type:None
   [junit4]   2> 1185122 T2273 oascc.ConnectionManager.waitForConnected Client is connected to ZooKeeper
   [junit4]   2> 1185133 T2273 oascsi.HttpClientUtil.createClient Creating new http client, config:maxConnections=500&maxConnectionsPerHost=16&socketTimeout=120000&connTimeout=15000
   [junit4]   2> 1185146 T2273 oascc.ConnectionManager.waitForConnected Waiting for client to connect to ZooKeeper
   [junit4]   2> 1185148 T2295 oascc.ConnectionManager.process Watcher org.apache.solr.common.cloud.ConnectionManager@5f530f8c name:ZooKeeperConnection Watcher:127.0.0.1:34583/solr got event WatchedEvent state:SyncConnected type:None path:null path:null type:None
   [junit4]   2> 1185148 T2273 oascc.ConnectionManager.waitForConnected Client is connected to ZooKeeper
   [junit4]   2> 1185151 T2273 oascc.SolrZkClient.makePath makePath: /overseer/queue
   [junit4]   2> 1185163 T2273 oascc.SolrZkClient.makePath makePath: /overseer/collection-queue-work
   [junit4]   2> 1185166 T2273 oascc.SolrZkClient.makePath makePath: /live_nodes
   [junit4]   2> 1185168 T2273 oasc.ZkController.createEphemeralLiveNode Register node as live in ZooKeeper:/live_nodes/127.0.0.1:34586_mpwv%2Fy
   [junit4]   2> 1185176 T2273 oascc.SolrZkClient.makePath makePath: /live_nodes/127.0.0.1:34586_mpwv%2Fy
   [junit4]   2> 1185179 T2273 oascc.SolrZkClient.makePath makePath: /overseer_elect/election
   [junit4]   2> 1185191 T2273 oascc.SolrZkClient.makePath makePath: /overseer_elect/leader
   [junit4]   2> 1185198 T2273 oasc.Overseer.start Overseer (id=90132710175145987-127.0.0.1:34586_mpwv%2Fy-n_0000000000) starting
   [junit4]   2> 1185203 T2273 oascc.SolrZkClient.makePath makePath: /overseer/queue-work
   [junit4]   2> 1185217 T2297 oasc.OverseerCollectionProcessor.run Process current queue of collection creations
   [junit4]   2> 1185218 T2273 oascc.SolrZkClient.makePath makePath: /clusterstate.json
   [junit4]   2> 1185220 T2273 oascc.SolrZkClient.makePath makePath: /aliases.json
   [junit4]   2> 1185227 T2273 oascc.ZkStateReader.createClusterStateWatchersAndUpdate Updating cluster state from ZooKeeper... 
   [junit4]   2> 1185230 T2296 oasc.Overseer$ClusterStateUpdater.run Starting to work on the main queue
   [junit4]   2> 1185233 T2273 oasc.CorePropertiesLocator.discover Looking for core definitions underneath /usr/home/hudson/hudson-slave/workspace/Lucene-Solr-Tests-trunk-Java7/solr/build/solr-core/test/J1/./org.apache.solr.cloud.CollectionsAPIDistributedZkTest-controljetty-1375316012492
   [junit4]   2> 1185402 T2273 oasc.CorePropertiesLocator.discoverUnder Found core conf in /usr/home/hudson/hudson-slave/workspace/Lucene-Solr-Tests-trunk-Java7/solr/build/solr-core/test/J1/./org.apache.solr.cloud.CollectionsAPIDistributedZkTest-controljetty-1375316012492/conf/
   [junit4]   2> 1185407 T2273 oasc.CorePropertiesLocator.discover Found 1 core definitions
   [junit4]   2> 1185408 T2273 oass.SolrDispatchFilter.init user.dir=/usr/home/hudson/hudson-slave/workspace/Lucene-Solr-Tests-trunk-Java7/solr/build/solr-core/test/J1
   [junit4]   2> 1185408 T2273 oass.SolrDispatchFilter.init SolrDispatchFilter.init() done
   [junit4]   2> 1185409 T2273 oascsi.HttpClientUtil.createClient Creating new http client, config:maxConnections=128&maxConnectionsPerHost=32&followRedirects=false
   [junit4]   2> 1185426 T2273 oascsi.HttpClientUtil.createClient Creating new http client, config:
   [junit4]   2> 1185428 T2273 oascc.ConnectionManager.waitForConnected Waiting for client to connect to ZooKeeper
   [junit4]   2> 1185430 T2300 oascc.ConnectionManager.process Watcher org.apache.solr.common.cloud.ConnectionManager@360d4511 name:ZooKeeperConnection Watcher:127.0.0.1:34583/solr got event WatchedEvent state:SyncConnected type:None path:null path:null type:None
   [junit4]   2> 1185430 T2273 oascc.ConnectionManager.waitForConnected Client is connected to ZooKeeper
   [junit4]   2> 1185432 T2273 oascc.ZkStateReader.createClusterStateWatchersAndUpdate Updating cluster state from ZooKeeper... 
   [junit4]   2> 1185435 T2273 oasc.ChaosMonkey.monkeyLog monkey: init - expire sessions:true cause connection loss:true
   [junit4]   2> 1185714 T2273 oejs.Server.doStart jetty-8.1.10.v20130312
   [junit4]   2> 1185717 T2273 oejs.AbstractConnector.doStart Started SocketConnector@127.0.0.1:34590
   [junit4]   2> 1185718 T2273 oass.SolrDispatchFilter.init SolrDispatchFilter.init()
   [junit4]   2> 1185719 T2273 oasc.SolrResourceLoader.locateSolrHome JNDI not configured for solr (NoInitialContextEx)
   [junit4]   2> 1185719 T2273 oasc.SolrResourceLoader.locateSolrHome using system property solr.solr.home: /usr/home/hudson/hudson-slave/workspace/Lucene-Solr-Tests-trunk-Java7/solr/build/solr-core/test/J1/./org.apache.solr.cloud.CollectionsAPIDistributedZkTest-jetty1-1375316013277
   [junit4]   2> 1185720 T2273 oasc.SolrResourceLoader.<init> new SolrResourceLoader for directory: '/usr/home/hudson/hudson-slave/workspace/Lucene-Solr-Tests-trunk-Java7/solr/build/solr-core/test/J1/./org.apache.solr.cloud.CollectionsAPIDistributedZkTest-jetty1-1375316013277/'
   [junit4]   2> 1185759 T2273 oasc.ConfigSolr.fromFile Loading container configuration from /usr/home/hudson/hudson-slave/workspace/Lucene-Solr-Tests-trunk-Java7/solr/build/solr-core/test/J1/./org.apache.solr.cloud.CollectionsAPIDistributedZkTest-jetty1-1375316013277/solr.xml
   [junit4]   2> 1185850 T2273 oasc.ConfigSolrXml.<init> Config-defined core root directory: 
   [junit4]   2> 1185851 T2273 oasc.CoreContainer.<init> New CoreContainer 1467846495
   [junit4]   2> 1185851 T2273 oasc.CoreContainer.load Loading cores into CoreContainer [instanceDir=/usr/home/hudson/hudson-slave/workspace/Lucene-Solr-Tests-trunk-Java7/solr/build/solr-core/test/J1/./org.apache.solr.cloud.CollectionsAPIDistributedZkTest-jetty1-1375316013277/]
   [junit4]   2> 1185853 T2273 oashc.HttpShardHandlerFactory.getParameter Setting socketTimeout to: 120000
   [junit4]   2> 1185854 T2273 oashc.HttpShardHandlerFactory.getParameter Setting urlScheme to: http://
   [junit4]   2> 1185854 T2273 oashc.HttpShardHandlerFactory.getParameter Setting connTimeout to: 15000
   [junit4]   2> 1185854 T2273 oashc.HttpShardHandlerFactory.getParameter Setting maxConnectionsPerHost to: 20
   [junit4]   2> 1185855 T2273 oashc.HttpShardHandlerFactory.getParameter Setting corePoolSize to: 0
   [junit4]   2> 1185855 T2273 oashc.HttpShardHandlerFactory.getParameter Setting maximumPoolSize to: 2147483647
   [junit4]   2> 1185856 T2273 oashc.HttpShardHandlerFactory.getParameter Setting maxThreadIdleTime to: 5
   [junit4]   2> 1185856 T2273 oashc.HttpShardHandlerFactory.getParameter Setting sizeOfQueue to: -1
   [junit4]   2> 1185857 T2273 oashc.HttpShardHandlerFactory.getParameter Setting fairnessPolicy to: false
   [junit4]   2> 1185857 T2273 oascsi.HttpClientUtil.createClient Creating new http client, config:maxConnectionsPerHost=20&maxConnections=10000&socketTimeout=120000&connTimeout=15000&retry=false
   [junit4]   2> 1185875 T2273 oasc.ZkContainer.initZooKeeper Zookeeper client=127.0.0.1:34583/solr
   [junit4]   2> 1185875 T2273 oasc.ZkController.checkChrootPath zkHost includes chroot
   [junit4]   2> 1185876 T2273 oascc.ConnectionManager.waitForConnected Waiting for client to connect to ZooKeeper
   [junit4]   2> 1185879 T2311 oascc.ConnectionManager.process Watcher org.apache.solr.common.cloud.ConnectionManager@64c712b6 name:ZooKeeperConnection Watcher:127.0.0.1:34583 got event WatchedEvent state:SyncConnected type:None path:null path:null type:None
   [junit4]   2> 1185879 T2273 oascc.ConnectionManager.waitForConnected Client is connected to ZooKeeper
   [junit4]   2> 1185896 T2273 oascsi.HttpClientUtil.createClient Creating new http client, config:maxConnections=500&maxConnectionsPerHost=16&socketTimeout=120000&connTimeout=15000
   [junit4]   2> 1185908 T2273 oascc.ConnectionManager.waitForConnected Waiting for client to connect to ZooKeeper
   [junit4]   2> 1185910 T2313 oascc.ConnectionManager.process Watcher org.apache.solr.common.cloud.ConnectionManager@180b2a45 name:ZooKeeperConnection Watcher:127.0.0.1:34583/solr got event WatchedEvent state:SyncConnected type:None path:null path:null type:None
   [junit4]   2> 1185910 T2273 oascc.ConnectionManager.waitForConnected Client is connected to ZooKeeper
   [junit4]   2> 1185922 T2273 oascc.ZkStateReader.createClusterStateWatchersAndUpdate Updating cluster state from ZooKeeper... 
   [junit4]   2> 1186925 T2273 oasc.ZkController.createEphemeralLiveNode Register node as live in ZooKeeper:/live_nodes/127.0.0.1:34590_mpwv%2Fy
   [junit4]   2> 1186927 T2273 oascc.SolrZkClient.makePath makePath: /live_nodes/127.0.0.1:34590_mpwv%2Fy
   [junit4]   2> 1186931 T2313 oascc.ZkStateReader$3.process Updating live nodes... (2)
   [junit4]   2> 1186931 T2295 oascc.ZkStateReader$3.process Updating live nodes... (2)
   [junit4]   2> 1186931 T2300 oascc.ZkStateReader$3.process Updating live nodes... (2)
   [junit4]   2> 1186943 T2273 oasc.CorePropertiesLocator.discover Looking for core definitions underneath /usr/home/hudson/hudson-slave/workspace/Lucene-Solr-Tests-trunk-Java7/solr/build/solr-core/test/J1/./org.apache.solr.cloud.CollectionsAPIDistributedZkTest-jetty1-1375316013277
   [junit4]   2> 1186946 T2273 oasc.CorePropertiesLocator.discoverUnder Found core conf in /usr/home/hudson/hudson-slave/workspace/Lucene-Solr-Tests-trunk-Java7/solr/build/solr-core/test/J1/./org.apache.solr.cloud.CollectionsAPIDistributedZkTest-jetty1-1375316013277/conf/
   [junit4]   2> 1187115 T2273 oasc.CorePropertiesLocator.discover Found 1 core definitions
   [junit4]   2> 1187116 T2273 oass.SolrDispatchFilter.init user.dir=/usr/home/hudson/hudson-slave/workspace/Lucene-Solr-Tests-trunk-Java7/solr/build/solr-core/test/J1
   [junit4]   2> 1187116 T2273 oass.SolrDispatchFilter.init SolrDispatchFilter.init() done
   [junit4]   2> 1187117 T2273 oascsi.HttpClientUtil.createClient Creating new http client, config:maxConnections=128&maxConnectionsPerHost=32&followRedirects=false
   [junit4]   2> 1187410 T2273 oejs.Server.doStart jetty-8.1.10.v20130312
   [junit4]   2> 1187413 T2273 oejs.AbstractConnector.doStart Started SocketConnector@127.0.0.1:34593
   [junit4]   2> 1187414 T2273 oass.SolrDispatchFilter.init SolrDispatchFilter.init()
   [junit4]   2> 1187414 T2273 oasc.SolrResourceLoader.locateSolrHome JNDI not configured for solr (NoInitialContextEx)
   [junit4]   2> 1187415 T2273 oasc.SolrResourceLoader.locateSolrHome using system property solr.solr.home: /usr/home/hudson/hudson-slave/workspace/Lucene-Solr-Tests-trunk-Java7/solr/build/solr-core/test/J1/./org.apache.solr.cloud.CollectionsAPIDistributedZkTest-jetty2-1375316014974
   [junit4]   2> 1187415 T2273 oasc.SolrResourceLoader.<init> new SolrResourceLoader for directory: '/usr/home/hudson/hudson-slave/workspace/Lucene-Solr-Tests-trunk-Java7/solr/build/solr-core/test/J1/./org.apache.solr.cloud.CollectionsAPIDistributedZkTest-jetty2-1375316014974/'
   [junit4]   2> 1187455 T2273 oasc.ConfigSolr.fromFile Loading container configuration from /usr/home/hudson/hudson-slave/workspace/Lucene-Solr-Tests-trunk-Java7/solr/build/solr-core/test/J1/./org.apache.solr.cloud.CollectionsAPIDistributedZkTest-jetty2-1375316014974/solr.xml
   [junit4]   2> 1187575 T2273 oasc.ConfigSolrXml.<init> Config-defined core root directory: 
   [junit4]   2> 1187576 T2273 oasc.CoreContainer.<init> New CoreContainer 1583049325
   [junit4]   2> 1187576 T2273 oasc.CoreContainer.load Loading cores into CoreContainer [instanceDir=/usr/home/hudson/hudson-slave/workspace/Lucene-Solr-Tests-trunk-Java7/solr/build/solr-core/test/J1/./org.apache.solr.cloud.CollectionsAPIDistributedZkTest-jetty2-1375316014974/]
   [junit4]   2> 1187578 T2273 oashc.HttpShardHandlerFactory.getParameter Setting socketTimeout to: 120000
   [junit4]   2> 1187579 T2273 oashc.HttpShardHandlerFactory.getParameter Setting urlScheme to: http://
   [junit4]   2> 1187579 T2273 oashc.HttpShardHandlerFactory.getParameter Setting connTimeout to: 15000
   [junit4]   2> 1187580 T2273 oashc.HttpShardHandlerFactory.getParameter Setting maxConnectionsPerHost to: 20
   [junit4]   2> 1187580 T2273 oashc.HttpShardHandlerFactory.getParameter Setting corePoolSize to: 0
   [junit4]   2> 1187580 T2273 oashc.HttpShardHandlerFactory.getParameter Setting maximumPoolSize to: 2147483647
   [junit4]   2> 1187581 T2273 oashc.HttpShardHandlerFactory.getParameter Setting maxThreadIdleTime to: 5
   [junit4]   2> 1187581 T2273 oashc.HttpShardHandlerFactory.getParameter Setting sizeOfQueue to: -1
   [junit4]   2> 1187582 T2273 oashc.HttpShardHandlerFactory.getParameter Setting fairnessPolicy to: false
   [junit4]   2> 1187582 T2273 oascsi.HttpClientUtil.createClient Creating new http client, config:maxConnectionsPerHost=20&maxConnections=10000&socketTimeout=120000&connTimeout=15000&retry=false
   [junit4]   2> 1187597 T2273 oasc.ZkContainer.initZooKeeper Zookeeper client=127.0.0.1:34583/solr
   [junit4]   2> 1187597 T2273 oasc.ZkController.checkChrootPath zkHost includes chroot
   [junit4]   2> 1187598 T2273 oascc.ConnectionManager.waitForConnected Waiting for client to connect to ZooKeeper
   [junit4]   2> 1187637 T2325 oascc.ConnectionManager.process Watcher org.apache.solr.common.cloud.ConnectionManager@22356854 name:ZooKeeperConnection Watcher:127.0.0.1:34583 got event WatchedEvent state:SyncConnected type:None path:null path:null type:None
   [junit4]   2> 1187637 T2273 oascc.ConnectionManager.waitForConnected Client is connected to ZooKeeper
   [junit4]   2> 1187640 T2273 oascsi.HttpClientUtil.createClient Creating new http client, config:maxConnections=500&maxConnectionsPerHost=16&socketTimeout=120000&connTimeout=15000
   [junit4]   2> 1187651 T2273 oascc.ConnectionManager.waitForConnected Waiting for client to connect to ZooKeeper
   [junit4]   2> 1187653 T2327 oascc.ConnectionManager.process Watcher org.apache.solr.common.cloud.ConnectionManager@417c1018 name:ZooKeeperConnection Watcher:127.0.0.1:34583/solr got event WatchedEvent state:SyncConnected type:None path:null path:null type:None
   [junit4]   2> 1187654 T2273 oascc.ConnectionManager.waitForConnected Client is connected to ZooKeeper
   [junit4]   2> 1187665 T2273 oascc.ZkStateReader.createClusterStateWatchersAndUpdate Updating cluster state from ZooKeeper... 
   [junit4]   2> 1188675 T2273 oasc.ZkController.createEphemeralLiveNode Register node as live in ZooKeeper:/live_nodes/127.0.0.1:34593_mpwv%2Fy
   [junit4]   2> 1188684 T2273 oascc.SolrZkClient.makePath makePath: /live_nodes/127.0.0.1:34593_mpwv%2Fy
   [junit4]   2> 1188688 T2313 oascc.ZkStateReader$3.process Updating live nodes... (3)
   [junit4]   2> 1188688 T2295 oascc.ZkStateReader$3.process Updating live nodes... (3)
   [junit4]   2> 1188688 T2327 oascc.ZkStateReader$3.process Updating live nodes... (3)
   [junit4]   2> 1188688 T2300 oascc.ZkStateReader$3.process Updating live nodes... (3)
   [junit4]   2> 1188708 T2273 oasc.CorePropertiesLocator.discover Looking for core definitions underneath /usr/home/hudson/hudson-slave/workspace/Lucene-Solr-Tests-trunk-Java7/solr/build/solr-core/test/J1/./org.apache.solr.cloud.CollectionsAPIDistributedZkTest-jetty2-1375316014974
   [junit4]   2> 1188879 T2273 oasc.CorePropertiesLocator.discoverUnder Found core conf in /usr/home/hudson/hudson-slave/workspace/Lucene-Solr-Tests-trunk-Java7/solr/build/solr-core/test/J1/./org.apache.solr.cloud.CollectionsAPIDistributedZkTest-jetty2-1375316014974/conf/
   [junit4]   2> 1188880 T2273 oasc.CorePropertiesLocator.discover Found 1 core definitions
   [junit4]   2> 1188881 T2273 oass.SolrDispatchFilter.init user.dir=/usr/home/hudson/hudson-slave/workspace/Lucene-Solr-Tests-trunk-Java7/solr/build/solr-core/test/J1
   [junit4]   2> 1188881 T2273 oass.SolrDispatchFilter.init SolrDispatchFilter.init() done
   [junit4]   2> 1188882 T2273 oascsi.HttpClientUtil.createClient Creating new http client, config:maxConnections=128&maxConnectionsPerHost=32&followRedirects=false
   [junit4]   2> 1189176 T2273 oejs.Server.doStart jetty-8.1.10.v20130312
   [junit4]   2> 1189179 T2273 oejs.AbstractConnector.doStart Started SocketConnector@127.0.0.1:34596
   [junit4]   2> 1189180 T2273 oass.SolrDispatchFilter.init SolrDispatchFilter.init()
   [junit4]   2> 1189180 T2273 oasc.SolrResourceLoader.locateSolrHome JNDI not configured for solr (NoInitialContextEx)
   [junit4]   2> 1189181 T2273 oasc.SolrResourceLoader.locateSolrHome using system property solr.solr.home: /usr/home/hudson/hudson-slave/workspace/Lucene-Solr-Tests-trunk-Java7/solr/build/solr-core/test/J1/./org.apache.solr.cloud.CollectionsAPIDistributedZkTest-jetty3-1375316016739
   [junit4]   2> 1189181 T2273 oasc.SolrResourceLoader.<init> new SolrResourceLoader for directory: '/usr/home/hudson/hudson-slave/workspace/Lucene-Solr-Tests-trunk-Java7/solr/build/solr-core/test/J1/./org.apache.solr.cloud.CollectionsAPIDistributedZkTest-jetty3-1375316016739/'
   [junit4]   2> 1189221 T2273 oasc.ConfigSolr.fromFile Loading container configuration from /usr/home/hudson/hudson-slave/workspace/Lucene-Solr-Tests-trunk-Java7/solr/build/solr-core/test/J1/./org.apache.solr.cloud.CollectionsAPIDistributedZkTest-jetty3-1375316016739/solr.xml
   [junit4]   2> 1189311 T2273 oasc.ConfigSolrXml.<init> Config-defined core root directory: 
   [junit4]   2> 1189312 T2273 oasc.CoreContainer.<init> New CoreContainer 1828356236
   [junit4]   2> 1189313 T2273 oasc.CoreContainer.load Loading cores into CoreContainer [instanceDir=/usr/home/hudson/hudson-slave/workspace/Lucene-Solr-Tests-trunk-Java7/solr/build/solr-core/test/J1/./org.apache.solr.cloud.CollectionsAPIDistributedZkTest-jetty3-1375316016739/]
   [junit4]   2> 1189314 T2273 oashc.HttpShardHandlerFactory.getParameter Setting socketTimeout to: 120000
   [junit4]   2> 1189315 T2273 oashc.HttpShardHandlerFactory.getParameter Setting urlScheme to: http://
   [junit4]   2> 1189315 T2273 oashc.HttpShardHandlerFactory.getParameter Setting connTimeout to: 15000
   [junit4]   2> 1189316 T2273 oashc.HttpShardHandlerFactory.getParameter Setting maxConnectionsPerHost to: 20
   [junit4]   2> 1189316 T2273 oashc.HttpShardHandlerFactory.getParameter Setting corePoolSize to: 0
   [junit4]   2> 1189317 T2273 oashc.HttpShardHandlerFactory.getParameter Setting maximumPoolSize to: 2147483647
   [junit4]   2> 1189317 T2273 oashc.HttpShardHandlerFactory.getParameter Setting maxThreadIdleTime to: 5
   [junit4]   2> 1189318 T2273 oashc.HttpShardHandlerFactory.getParameter Setting sizeOfQueue to: -1
   [junit4]   2> 1189318 T2273 oashc.HttpShardHandlerFactory.getParameter Setting fairnessPolicy to: false
   [junit4]   2> 1189319 T2273 oascsi.HttpClientUtil.createClient Creating new http client, config:maxConnectionsPerHost=20&maxConnections=10000&socketTimeout=120000&connTimeout=15000&retry=false
   [junit4]   2> 1189335 T2273 oasc.ZkContainer.initZooKeeper Zookeeper client=127.0.0.1:34583/solr
   [junit4]   2> 1189335 T2273 oasc.ZkController.checkChrootPath zkHost includes chroot
   [junit4]   2> 1189336 T2273 oascc.ConnectionManager.waitForConnected Waiting for client to connect to ZooKeeper
   [junit4]   2> 1189365 T2339 oascc.ConnectionManager.process Watcher org.apache.solr.common.cloud.ConnectionManager@65214862 name:ZooKeeperConnection Watcher:127.0.0.1:34583 got event WatchedEvent state:SyncConnected type:None path:null path:null type:None
   [junit4]   2> 1189365 T2273 oascc.ConnectionManager.waitForConnected Client is connected to ZooKeeper
   [junit4]   2> 1189368 T2273 oascsi.HttpClientUtil.createClient Creating new http client, config:maxConnections=500&maxConnectionsPerHost=16&socketTimeout=120000&connTimeout=15000
   [junit4]   2> 1189379 T2273 oascc.ConnectionManager.waitForConnected Waiting for client to connect to ZooKeeper
   [junit4]   2> 1189381 T2341 oascc.ConnectionManager.process Watcher org.apache.solr.common.cloud.ConnectionManager@58ed925f name:ZooKeeperConnection Watcher:127.0.0.1:34583/solr got event WatchedEvent state:SyncConnected type:None path:null path:null type:None
   [junit4]   2> 1189381 T2273 oascc.ConnectionManager.waitForConnected Client is connected to ZooKeeper
   [junit4]   2> 1189392 T2273 oascc.ZkStateReader.createClusterStateWatchersAndUpdate Updating cluster state from ZooKeeper... 
   [junit4]   2> 1190395 T2273 oasc.ZkController.createEphemeralLiveNode Register node as live in ZooKeeper:/live_nodes/127.0.0.1:34596_mpwv%2Fy
   [junit4]   2> 1190397 T2273 oascc.SolrZkClient.makePath makePath: /live_nodes/127.0.0.1:34596_mpwv%2Fy
   [junit4]   2> 1190401 T2313 oascc.ZkStateReader$3.process Updating live nodes... (4)
   [junit4]   2> 1190401 T2327 oascc.ZkStateReader$3.process Updating live nodes... (4)
   [junit4]   2> 1190401 T2341 oascc.ZkStateReader$3.process Updating live nodes... (4)
   [junit4]   2> 1190401 T2295 oascc.ZkStateReader$3.process Updating live nodes... (4)
   [junit4]   2> 1190401 T2300 oascc.ZkStateReader$3.process Updating live nodes... (4)
   [junit4]   2> 1190420 T2273 oasc.CorePropertiesLocator.discover Looking for core definitions underneath /usr/home/hudson/hudson-slave/workspace/Lucene-Solr-Tests-trunk-Java7/solr/build/solr-core/test/J1/./org.apache.solr.cloud.CollectionsAPIDistributedZkTest-jetty3-1375316016739
   [junit4]   2> 1190425 T2273 oasc.CorePropertiesLocator.discoverUnder Found core conf in /usr/home/hudson/hudson-slave/workspace/Lucene-Solr-Tests-trunk-Java7/solr/build/solr-core/test/J1/./org.apache.solr.cloud.CollectionsAPIDistributedZkTest-jetty3-1375316016739/conf/
   [junit4]   2> 1190594 T2273 oasc.CorePropertiesLocator.discover Found 1 core definitions
   [junit4]   2> 1190594 T2273 oass.SolrDispatchFilter.init user.dir=/usr/home/hudson/hudson-slave/workspace/Lucene-Solr-Tests-trunk-Java7/solr/build/solr-core/test/J1
   [junit4]   2> 1190595 T2273 oass.SolrDispatchFilter.init SolrDispatchFilter.init() done
   [junit4]   2> 1190595 T2273 oascsi.HttpClientUtil.createClient Creating new http client, config:maxConnections=128&maxConnectionsPerHost=32&followRedirects=false
   [junit4]   2> 1190891 T2273 oejs.Server.doStart jetty-8.1.10.v20130312
   [junit4]   2> 1190894 T2273 oejs.AbstractConnector.doStart Started SocketConnector@127.0.0.1:34599
   [junit4]   2> 1190894 T2273 oass.SolrDispatchFilter.init SolrDispatchFilter.init()
   [junit4]   2> 1190895 T2273 oasc.SolrResourceLoader.locateSolrHome JNDI not configured for solr (NoInitialContextEx)
   [junit4]   2> 1190896 T2273 oasc.SolrResourceLoader.locateSolrHome using system property solr.solr.home: /usr/home/hudson/hudson-slave/workspace/Lucene-Solr-Tests-trunk-Java7/solr/build/solr-core/test/J1/./org.apache.solr.cloud.CollectionsAPIDistributedZkTest-jetty4-1375316018453
   [junit4]   2> 1190896 T2273 oasc.SolrResourceLoader.<init> new SolrResourceLoader for directory: '/usr/home/hudson/hudson-slave/workspace/Lucene-Solr-Tests-trunk-Java7/solr/build/solr-core/test/J1/./org.apache.solr.cloud.CollectionsAPIDistributedZkTest-jetty4-1375316018453/'
   [junit4]   2> 1190938 T2273 oasc.ConfigSolr.fromFile Loading container configuration from /usr/home/hudson/hudson-slave/workspace/Lucene-Solr-Tests-trunk-Java7/solr/build/solr-core/test/J1/./org.apache.solr.cloud.CollectionsAPIDistributedZkTest-jetty4-1375316018453/solr.xml
   [junit4]   2> 1191030 T2273 oasc.ConfigSolrXml.<init> Config-defined core root directory: 
   [junit4]   2> 1191030 T2273 oasc.CoreContainer.<init> New CoreContainer 2029685635
   [junit4]   2> 1191031 T2273 oasc.CoreContainer.load Loading cores into CoreContainer [instanceDir=/usr/home/hudson/hudson-slave/workspace/Lucene-Solr-Tests-trunk-Java7/solr/build/solr-core/test/J1/./org.apache.solr.cloud.CollectionsAPIDistributedZkTest-jetty4-1375316018453/]
   [junit4]   2> 1191033 T2273 oashc.HttpShardHandlerFactory.getParameter Setting socketTimeout to: 120000
   [junit4]   2> 1191033 T2273 oashc.HttpShardHandlerFactory.getParameter Setting urlScheme to: http://
   [junit4]   2> 1191034 T2273 oashc.HttpShardHandlerFactory.getParameter Setting connTimeout to: 15000
   [junit4]   2> 1191034 T2273 oashc.HttpShardHandlerFactory.getParameter Setting maxConnectionsPerHost to: 20
   [junit4]   2> 1191035 T2273 oashc.HttpShardHandlerFactory.getParameter Setting corePoolSize to: 0
   [junit4]   2> 1191035 T2273 oashc.HttpShardHandlerFactory.getParameter Setting maximumPoolSize to: 2147483647
   [junit4]   2> 1191036 T2273 oashc.HttpShardHandlerFactory.getParameter Setting maxThreadIdleTime to: 5
   [junit4]   2> 1191036 T2273 oashc.HttpShardHandlerFactory.getParameter Setting sizeOfQueue to: -1
   [junit4]   2> 1191037 T2273 oashc.HttpShardHandlerFactory.getParameter Setting fairnessPolicy to: false
   [junit4]   2> 1191037 T2273 oascsi.HttpClientUtil.createClient Creating new http client, config:maxConnectionsPerHost=20&maxConnections=10000&socketTimeout=120000&connTimeout=15000&retry=false
   [junit4]   2> 1191051 T2273 oasc.ZkContainer.initZooKeeper Zookeeper client=127.0.0.1:34583/solr
   [junit4]   2> 1191052 T2273 oasc.ZkController.checkChrootPath zkHost includes chroot
   [junit4]   2> 1191052 T2273 oascc.ConnectionManager.waitForConnected Waiting for client to connect to ZooKeeper
   [junit4]   2> 1191055 T2353 oascc.ConnectionManager.process Watcher org.apache.solr.common.cloud.ConnectionManager@182ac83f name:ZooKeeperConnection Watcher:127.0.0.1:34583 got event WatchedEvent state:SyncConnected type:None path:null path:null type:None
   [junit4]   2> 1191055 T2273 oascc.ConnectionManager.waitForConnected Client is connected to ZooKeeper
   [junit4]   2> 1191059 T2273 oascsi.HttpClientUtil.createClient Creating new http client, config:maxConnections=500&maxConnectionsPerHost=16&socketTimeout=120000&connTimeout=15000
   [junit4]   2> 1191067 T2273 oascc.ConnectionManager.waitForConnected Waiting for client to connect to ZooKeeper
   [junit4]   2> 1191068 T2355 oascc.ConnectionManager.process Watcher org.apache.solr.common.cloud.ConnectionManager@4923363e name:ZooKeeperConnection Watcher:127.0.0.1:34583/solr got event WatchedEvent state:SyncConnected type:None path:null path:null type:None
   [junit4]   2> 1191069 T2273 oascc.ConnectionManager.waitForConnected Client is connected to ZooKeeper
   [junit4]   2> 1191079 T2273 oascc.ZkStateReader.createClusterStateWatchersAndUpdate Updating cluster state from ZooKeeper... 
   [junit4]   2> 1192082 T2273 oasc.ZkController.createEphemeralLiveNode Register node as live in ZooKeeper:/live_nodes/127.0.0.1:34599_mpwv%2Fy
   [junit4]   2> 1192094 T2273 oascc.SolrZkClient.makePath makePath: /live_nodes/127.0.0.1:34599_mpwv%2Fy
   [junit4]   2> 1192099 T2300 oascc.ZkStateReader$3.process Updating live nodes... (5)
   [junit4]   2> 1192099 T2313 oascc.ZkStateReader$3.process Updating live nodes... (5)
   [junit4]   2> 1192099 T2355 oascc.ZkStateReader$3.process Updating live nodes... (5)
   [junit4]   2> 1192099 T2327 oascc.ZkStateReader$3.process Updating live nodes... (5)
   [junit4]   2> 1192099 T2341 oascc.ZkStateReader$3.process Updating live nodes... (5)
   [junit4]   2> 1192099 T2295 oascc.ZkStateReader$3.process Updating live nodes... (5)
   [junit4]   2> 1192114 T2273 oasc.CorePropertiesLocator.discover Looking for core definitions underneath /usr/home/hudson/hudson-slave/workspace/Lucene-Solr-Tests-trunk-Java7/solr/build/solr-core/test/J1/./org.apache.solr.cloud.CollectionsAPIDistributedZkTest-jetty4-1375316018453
   [junit4]   2> 1192281 T2273 oasc.CorePropertiesLocator.discoverUnder Found core conf in /usr/home/hudson/hudson-slave/workspace/Lucene-Solr-Tests-trunk-Java7/solr/build/solr-core/test/J1/./org.apache.solr.cloud.CollectionsAPIDistributedZkTest-jetty4-1375316018453/conf/
   [junit4]   2> 1192286 T2273 oasc.CorePropertiesLocator.discover Found 1 core definitions
   [junit4]   2> 1192287 T2273 oass.SolrDispatchFilter.init user.dir=/usr/home/hudson/hudson-slave/workspace/Lucene-Solr-Tests-trunk-Java7/solr/build/solr-core/test/J1
   [junit4]   2> 1192287 T2273 oass.SolrDispatchFilter.init SolrDispatchFilter.init() done
   [junit4]   2> 1192288 T2273 oascsi.HttpClientUtil.createClient Creating new http client, config:maxConnections=128&maxConnectionsPerHost=32&followRedirects=false
   [junit4]   2> 1192303 T2273 oascsi.HttpClientUtil.createClient Creating new http client, config:maxConnections=128&maxConnectionsPerHost=32&followRedirects=false
   [junit4]   2> 1192314 T2303 oasha.CollectionsHandler.handleCreateAction Creating Collection : numShards=2&name=nodes_used_collection&replicationFactor=2&action=CREATE&wt=javabin&version=2
   [junit4]   2> 1192316 T2295 oasc.DistributedQueue$LatchChildWatcher.process Watcher fired on path: /overseer/collection-queue-work state: SyncConnected type NodeChildrenChanged
   [junit4]   2> 1192318 T2297 oasc.OverseerCollectionProcessor.run Overseer Collection Processor: Get the message id:/overseer/collection-queue-work/qn-0000000000 message:{
   [junit4]   2> 	  "operation":"createcollection",
   [junit4]   2> 	  "numShards":"2",
   [junit4]   2> 	  "name":"nodes_used_collection",
   [junit4]   2> 	  "replicationFactor":"2"}
   [junit4]   2> 1192318 T2297 oasc.OverseerCollectionProcessor.processMessage WARN OverseerCollectionProcessor.processMessage : createcollection , {
   [junit4]   2> 	  "operation":"createcollection",
   [junit4]   2> 	  "numShards":"2",
   [junit4]   2> 	  "name":"nodes_used_collection",
   [junit4]   2> 	  "replicationFactor":"2"}
   [junit4]   2> 1192741 T2296 oascc.ZkStateReader.updateClusterState Updating cloud state from ZooKeeper... 
   [junit4]   2> 1192742 T2296 oasc.Overseer$ClusterStateUpdater.buildCollection building a new collection: nodes_used_collection
   [junit4]   2> 1192743 T2296 oasc.Overseer$ClusterStateUpdater.createCollection Create collection nodes_used_collection with shards [shard1, shard2]
   [junit4]   2> 1192753 T2313 oascc.ZkStateReader$2.process A cluster state change: WatchedEvent state:SyncConnected type:NodeDataChanged path:/clusterstate.json, has occurred - updating... (live nodes size: 5)
   [junit4]   2> 1192753 T2327 oascc.ZkStateReader$2.process A cluster state change: WatchedEvent state:SyncConnected type:NodeDataChanged path:/clusterstate.json, has occurred - updating... (live nodes size: 5)
   [junit4]   2> 1192753 T2341 oascc.ZkStateReader$2.process A cluster state change: WatchedEvent state:SyncConnected type:NodeDataChanged path:/clusterstate.json, has occurred - updating... (live nodes size: 5)
   [junit4]   2> 1192753 T2295 oascc.ZkStateReader$2.process A cluster state change: WatchedEvent state:SyncConnected type:NodeDataChanged path:/clusterstate.json, has occurred - updating... (live nodes size: 5)
   [junit4]   2> 1192753 T2355 oascc.ZkStateReader$2.process A cluster state change: WatchedEvent state:SyncConnected type:NodeDataChanged path:/clusterstate.json, has occurred - updating... (live nodes size: 5)
   [junit4]   2> 1192753 T2300 oascc.ZkStateReader$2.process A cluster state change: WatchedEvent state:SyncConnected type:NodeDataChanged path:/clusterstate.json, has occurred - updating... (live nodes size: 5)
   [junit4]   2> 1192840 T2297 oasc.OverseerCollectionProcessor.createCollection going to create cores replicas shardNames [shard1, shard2] , repFactor : 2
   [junit4]   2> 1192840 T2297 oasc.OverseerCollectionProcessor.createCollection Creating shard nodes_used_collection_shard1_replica1 as part of slice shard1 of collection nodes_used_collection on 127.0.0.1:34586_mpwv%2Fy
   [junit4]   2> 1192841 T2297 oasc.OverseerCollectionProcessor.createCollection Creating shard nodes_used_collection_shard1_replica2 as part of slice shard1 of collection nodes_used_collection on 127.0.0.1:34596_mpwv%2Fy
   [junit4]   2> 1192842 T2297 oasc.OverseerCollectionProcessor.createCollection Creating shard nodes_used_collection_shard2_replica1 as part of slice shard2 of collection nodes_used_collection on 127.0.0.1:34599_mpwv%2Fy
   [junit4]   2> 1192843 T2297 oasc.OverseerCollectionProcessor.createCollection Creating shard nodes_used_collection_shard2_replica2 as part of slice shard2 of collection nodes_used_collection on 127.0.0.1:34590_mpwv%2Fy
   [junit4]   2> 1192846 T2331 oasc.ZkController.publish publishing core=nodes_used_collection_shard1_replica2 state=down
   [junit4]   2> 1192846 T2285 oasc.ZkController.publish publishing core=nodes_used_collection_shard1_replica1 state=down
   [junit4]   2> 1192847 T2304 oasc.ZkController.publish publishing core=nodes_used_collection_shard2_replica2 state=down
   [junit4]   2> 1192846 T2345 oasc.ZkController.publish publishing core=nodes_used_collection_shard2_replica1 state=down
   [junit4]   2> 1192848 T2331 oasc.ZkController.waitForCoreNodeName look for our core node name
   [junit4]   2> 1192849 T2285 oasc.ZkController.waitForCoreNodeName look for our core node name
   [junit4]   2> 1192849 T2304 oasc.ZkController.waitForCoreNodeName look for our core node name
   [junit4]   2> 1192906 T2345 oasc.ZkController.waitForCoreNodeName look for our core node name
   [junit4]   2> 1194299 T2296 oascc.ZkStateReader.updateClusterState Updating cloud state from ZooKeeper... 
   [junit4]   2> 1194301 T2296 oasc.Overseer$ClusterStateUpdater.updateState WARN Could not find collection node for nodes_used_collection, skipping publish state
   [junit4]   2> 1194301 T2296 oasc.Overseer$ClusterStateUpdater.updateState Update state numShards=2 message={
   [junit4]   2> 	  "operation":"state",
   [junit4]   2> 	  "core_node_name":"core_node1",
   [junit4]   2> 	  "numShards":"2",
   [junit4]   2> 	  "shard":"shard1",
   [junit4]   2> 	  "roles":null,
   [junit4]   2> 	  "state":"down",
   [junit4]   2> 	  "shard_state":"active",
   [junit4]   2> 	  "core":"nodes_used_collection_shard1_replica2",
   [junit4]   2> 	  "collection":"nodes_used_collection",
   [junit4]   2> 	  "shard_range":null,
   [junit4]   2> 	  "node_name":"127.0.0.1:34596_mpwv%2Fy",
   [junit4]   2> 	  "base_url":"http://127.0.0.1:34596/mpwv/y"}
   [junit4]   2> 1194305 T2296 oasc.Overseer$ClusterStateUpdater.updateState WARN Could not find collection node for nodes_used_collection, skipping publish state
   [junit4]   2> 1194305 T2296 oasc.Overseer$ClusterStateUpdater.updateState Update state numShards=2 message={
   [junit4]   2> 	  "operation":"state",
   [junit4]   2> 	  "core_node_name":"core_node2",
   [junit4]   2> 	  "numShards":"2",
   [junit4]   2> 	  "shard":"shard1",
   [junit4]   2> 	  "roles":null,
   [junit4]   2> 	  "state":"down",
   [junit4]   2> 	  "shard_state":"active",
   [junit4]   2> 	  "core":"nodes_used_collection_shard1_replica1",
   [junit4]   2> 	  "collection":"nodes_used_collection",
   [junit4]   2> 	  "shard_range":null,
   [junit4]   2> 	  "node_name":"127.0.0.1:34586_mpwv%2Fy",
   [junit4]   2> 	  "base_url":"http://127.0.0.1:34586/mpwv/y"}
   [junit4]   2> 1194324 T2296 oasc.Overseer$ClusterStateUpdater.updateState WARN Could not find collection node for nodes_used_collection, skipping publish state
   [junit4]   2> 1194324 T2296 oasc.Overseer$ClusterStateUpdater.updateState Update state numShards=2 message={
   [junit4]   2> 	  "operation":"state",
   [junit4]   2> 	  "core_node_name":"core_node3",
   [junit4]   2> 	  "numShards":"2",
   [junit4]   2> 	  "shard":"shard2",
   [junit4]   2> 	  "roles":null,
   [junit4]   2> 	  "state":"down",
   [junit4]   2> 	  "shard_state":"active",
   [junit4]   2> 	  "core":"nodes_used_collection_shard2_replica2",
   [junit4]   2> 	  "collection":"nodes_used_collection",
   [junit4]   2> 	  "shard_range":null,
   [junit4]   2> 	  "node_name":"127.0.0.1:34590_mpwv%2Fy",
   [junit4]   2> 	  "base_url":"http://127.0.0.1:34590/mpwv/y"}
   [junit4]   2> 1194334 T2296 oasc.Overseer$ClusterStateUpdater.updateState WARN Could not find collection node for nodes_used_collection, skipping publish state
   [junit4]   2> 1194334 T2296 oasc.Overseer$ClusterStateUpdater.updateState Update state numShards=2 message={
   [junit4]   2> 	  "operation":"state",
   [junit4]   2> 	  "core_node_name":"core_node4",
   [junit4]   2> 	  "numShards":"2",
   [junit4]   2> 	  "shard":"shard2",
   [junit4]   2> 	  "roles":null,
   [junit4]   2> 	  "state":"down",
   [junit4]   2> 	  "shard_state":"active",
   [junit4]   2> 	  "core":"nodes_used_collection_shard2_replica1",
   [junit4]   2> 	  "collection":"nodes_used_collection",
   [junit4]   2> 	  "shard_range":null,
   [junit4]   2> 	  "node_name":"127.0.0.1:34599_mpwv%2Fy",
   [junit4]   2> 	  "base_url":"http://127.0.0.1:34599/mpwv/y"}
   [junit4]   2> 1194345 T2313 oascc.ZkStateReader$2.process A cluster state change: WatchedEvent state:SyncConnected type:NodeDataChanged path:/clusterstate.json, has occurred - updating... (live nodes size: 5)
   [junit4]   2> 1194345 T2341 oascc.ZkStateReader$2.process A cluster state change: WatchedEvent state:SyncConnected type:NodeDataChanged path:/clusterstate.json, has occurred - updating... (live nodes size: 5)
   [junit4]   2> 1194345 T2327 oascc.ZkStateReader$2.process A cluster state change: WatchedEvent state:SyncConnected type:NodeDataChanged path:/clusterstate.json, has occurred - updating... (live nodes size: 5)
   [junit4]   2> 1194345 T2355 oascc.ZkStateReader$2.process A cluster state change: WatchedEvent state:SyncConnected type:NodeDataChanged path:/clusterstate.json, has occurred - updating... (live nodes size: 5)
   [junit4]   2> 1194345 T2295 oascc.ZkStateReader$2.process A cluster state change: WatchedEvent state:SyncConnected type:NodeDataChanged path:/clusterstate.json, has occurred - updating... (live nodes size: 5)
   [junit4]   2> 1194345 T2300 oascc.ZkStateReader$2.process A cluster state change: WatchedEvent state:SyncConnected type:NodeDataChanged path:/clusterstate.json, has occurred - updating... (live nodes size: 5)
   [junit4]   2> 1194850 T2331 oasc.ZkController.waitForShardId waiting to find shard id in clusterstate for nodes_used_collection_shard1_replica2
   [junit4]   2> 1194851 T2331 oasc.CorePropertiesLocator.writePropertiesFile ERROR Couldn't persist core properties to /usr/home/hudson/hudson-slave/workspace/Lucene-Solr-Tests-trunk-Java7/solr/build/solr-core/test/J1/./org.apache.solr.cloud.CollectionsAPIDistributedZkTest-jetty3-1375316016739/nodes_used_collection_shard1_replica2/core.properties: java.io.FileNotFoundException: /usr/home/hudson/hudson-slave/workspace/Lucene-Solr-Tests-trunk-Java7/solr/build/solr-core/test/J1/./org.apache.solr.cloud.CollectionsAPIDistributedZkTest-jetty3-1375316016739/nodes_used_collection_shard1_replica2/core.properties (No such file or directory)
   [junit4]   2> 1194852 T2304 oasc.ZkController.waitForShardId waiting to find shard id in clusterstate for nodes_used_collection_shard2_replica2
   [junit4]   2> 1194852 T2331 oasc.CoreContainer.create Creating SolrCore 'nodes_used_collection_shard1_replica2' using instanceDir: /usr/home/hudson/hudson-slave/workspace/Lucene-Solr-Tests-trunk-Java7/solr/build/solr-core/test/J1/./org.apache.solr.cloud.CollectionsAPIDistributedZkTest-jetty3-1375316016739/nodes_used_collection_shard1_replica2
   [junit4]   2> 1194852 T2285 oasc.ZkController.waitForShardId waiting to find shard id in clusterstate for nodes_used_collection_shard1_replica1
   [junit4]   2> 1194853 T2331 oasc.ZkController.createCollectionZkNode Check for collection zkNode:nodes_used_collection
   [junit4]   2> 1194853 T2304 oasc.CorePropertiesLocator.writePropertiesFile ERROR Couldn't persist core properties to /usr/home/hudson/hudson-slave/workspace/Lucene-Solr-Tests-trunk-Java7/solr/build/solr-core/test/J1/./org.apache.solr.cloud.CollectionsAPIDistributedZkTest-jetty1-1375316013277/nodes_used_collection_shard2_replica2/core.properties: java.io.FileNotFoundException: /usr/home/hudson/hudson-slave/workspace/Lucene-Solr-Tests-trunk-Java7/solr/build/solr-core/test/J1/./org.apache.solr.cloud.CollectionsAPIDistributedZkTest-jetty1-1375316013277/nodes_used_collection_shard2_replica2/core.properties (No such file or directory)
   [junit4]   2> 1194854 T2285 oasc.CorePropertiesLocator.writePropertiesFile ERROR Couldn't persist core properties to /usr/home/hudson/hudson-slave/workspace/Lucene-Solr-Tests-trunk-Java7/solr/build/solr-core/test/J1/./org.apache.solr.cloud.CollectionsAPIDistributedZkTest-controljetty-1375316012492/nodes_used_collection_shard1_replica1/core.properties: java.io.FileNotFoundException: /usr/home/hudson/hudson-slave/workspace/Lucene-Solr-Tests-trunk-Java7/solr/build/solr-core/test/J1/./org.apache.solr.cloud.CollectionsAPIDistributedZkTest-controljetty-1375316012492/nodes_used_collection_shard1_replica1/core.properties (No such file or directory)
   [junit4]   2> 1194854 T2331 oasc.ZkController.createCollectionZkNode Creating collection in ZooKeeper:nodes_used_collection
   [junit4]   2> 1194854 T2304 oasc.CoreContainer.create Creating SolrCore 'nodes_used_collection_shard2_replica2' using instanceDir: /usr/home/hudson/hudson-slave/workspace/Lucene-Solr-Tests-trunk-Java7/solr/build/solr-core/test/J1/./org.apache.solr.cloud.CollectionsAPIDistributedZkTest-jetty1-1375316013277/nodes_used_collection_shard2_replica2
   [junit4]   2> 1194855 T2331 oasc.ZkController.getConfName Looking for collection configName
   [junit4]   2> 1194854 T2285 oasc.CoreContainer.create Creating SolrCore 'nodes_used_collection_shard1_replica1' using instanceDir: /usr/home/hudson/hudson-slave/workspace/Lucene-Solr-Tests-trunk-Java7/solr/build/solr-core/test/J1/./org.apache.solr.cloud.CollectionsAPIDistributedZkTest-controljetty-1375316012492/nodes_used_collection_shard1_replica1
   [junit4]   2> 1194855 T2304 oasc.ZkController.createCollectionZkNode Check for collection zkNode:nodes_used_collection
   [junit4]   2> 1194856 T2331 oasc.ZkController.getConfName Only one config set found in zk - using it:conf1
   [junit4]   2> 1194856 T2285 oasc.ZkController.createCollectionZkNode Check for collection zkNode:nodes_used_collection
   [junit4]   2> 1194857 T2331 oascc.SolrZkClient.makePath makePath: /collections/nodes_used_collection
   [junit4]   2> 1194857 T2304 oasc.ZkController.createCollectionZkNode Creating collection in ZooKeeper:nodes_used_collection
   [junit4]   2> 1194857 T2285 oasc.ZkController.createCollectionZkNode Creating collection in ZooKeeper:nodes_used_collection
   [junit4]   2> 1194858 T2304 oasc.ZkController.getConfName Looking for collection configName
   [junit4]   2> 1194858 T2285 oasc.ZkController.getConfName Looking for collection configName
   [junit4]   2> 1194860 T2331 oasc.ZkController.readConfigName Load collection config from:/collections/nodes_used_collection
   [junit4]   2> 1194860 T2285 oascc.SolrZkClient.makePath makePath: /collections/nodes_used_collection
   [junit4]   2> 1194860 T2304 oascc.SolrZkClient.makePath makePath: /collections/nodes_used_collection
   [junit4]   2> 1194861 T2331 oasc.SolrResourceLoader.<init> new SolrResourceLoader for directory: '/usr/home/hudson/hudson-slave/workspace/Lucene-Solr-Tests-trunk-Java7/solr/build/solr-core/test/J1/./org.apache.solr.cloud.CollectionsAPIDistributedZkTest-jetty3-1375316016739/nodes_used_collection_shard1_replica2/'
   [junit4]   2> 1194862 T2285 oasc.ZkController.readConfigName Load collection config from:/collections/nodes_used_collection
   [junit4]   2> 1194874 T2304 oasc.ZkController.readConfigName Load collection config from:/collections/nodes_used_collection
   [junit4]   2> 1194874 T2285 oasc.SolrResourceLoader.<init> new SolrResourceLoader for directory: '/usr/home/hudson/hudson-slave/workspace/Lucene-Solr-Tests-trunk-Java7/solr/build/solr-core/test/J1/./org.apache.solr.cloud.CollectionsAPIDistributedZkTest-controljetty-1375316012492/nodes_used_collection_shard1_replica1/'
   [junit4]   2> 1194875 T2304 oasc.SolrResourceLoader.<init> new SolrResourceLoader for directory: '/usr/home/hudson/hudson-slave/workspace/Lucene-Solr-Tests-trunk-Java7/solr/build/solr-core/test/J1/./org.apache.solr.cloud.CollectionsAPIDistributedZkTest-jetty1-1375316013277/nodes_used_collection_shard2_replica2/'
   [junit4]   2> 1194908 T2345 oasc.ZkController.waitForShardId waiting to find shard id in clusterstate for nodes_used_collection_shard2_replica1
   [junit4]   2> 1194909 T2345 oasc.CorePropertiesLocator.writePropertiesFile ERROR Couldn't persist core properties to /usr/home/hudson/hudson-slave/workspace/Lucene-Solr-Tests-trunk-Java7/solr/build/solr-core/test/J1/./org.apache.solr.cloud.CollectionsAPIDistributedZkTest-jetty4-1375316018453/nodes_used_collection_shard2_replica1/core.properties: java.io.FileNotFoundException: /usr/home/hudson/hudson-slave/workspace/Lucene-Solr-Tests-trunk-Java7/solr/build/solr-core/test/J1/./org.apache.solr.cloud.CollectionsAPIDistributedZkTest-jetty4-1375316018453/nodes_used_collection_shard2_replica1/core.properties (No such file or directory)
   [junit4]   2> 1194910 T2345 oasc.CoreContainer.create Creating SolrCore 'nodes_used_collection_shard2_replica1' using instanceDir: /usr/home/hudson/hudson-slave/workspace/Lucene-Solr-Tests-trunk-Java7/solr/build/solr-core/test/J1/./org.apache.solr.cloud.CollectionsAPIDistributedZkTest-jetty4-1375316018453/nodes_used_collection_shard2_replica1
   [junit4]   2> 1194910 T2345 oasc.ZkController.createCollectionZkNode Check for collection zkNode:nodes_used_collection
   [junit4]   2> 1194911 T2345 oasc.ZkController.createCollectionZkNode Collection zkNode exists
   [junit4]   2> 1194911 T2345 oasc.ZkController.readConfigName Load collection config from:/collections/nodes_used_collection
   [junit4]   2> 1194912 T2345 oasc.SolrResourceLoader.<init> new SolrResourceLoader for directory: '/usr/home/hudson/hudson-slave/workspace/Lucene-Solr-Tests-trunk-Java7/solr/build/solr-core/test/J1/./org.apache.solr.cloud.CollectionsAPIDistributedZkTest-jetty4-1375316018453/nodes_used_collection_shard2_replica1/'
   [junit4]   2> 1195026 T2285 oasc.SolrConfig.<init> Using Lucene MatchVersion: LUCENE_50
   [junit4]   2> 1195026 T2331 oasc.SolrConfig.<init> Using Lucene MatchVersion: LUCENE_50
   [junit4]   2> 1195026 T2345 oasc.SolrConfig.<init> Using Lucene MatchVersion: LUCENE_50
   [junit4]   2> 1195028 T2304 oasc.SolrConfig.<init> Using Lucene MatchVersion: LUCENE_50
   [junit4]   2> 1195106 T2285 oasc.SolrConfig.<init> Loaded SolrConfig: solrconfig.xml
   [junit4]   2> 1195106 T2345 oasc.SolrConfig.<init> Loaded SolrConfig: solrconfig.xml
   [junit4]   2> 1195107 T2331 oasc.SolrConfig.<init> Loaded SolrConfig: solrconfig.xml
   [junit4]   2> 1195109 T2304 oasc.SolrConfig.<init> Loaded SolrConfig: solrconfig.xml
   [junit4]   2> 1195208 T2285 oass.IndexSchema.readSchema Reading Solr Schema from schema.xml
   [junit4]   2> 1195209 T2345 oass.IndexSchema.readSchema Reading Solr Schema from schema.xml
   [junit4]   2> 1195209 T2331 oass.IndexSchema.readSchema Reading Solr Schema from schema.xml
   [junit4]   2> 1195211 T2304 oass.IndexSchema.readSchema Reading Solr Schema from schema.xml
   [junit4]   2> 1195220 T2285 oass.IndexSchema.readSchema [nodes_used_collection_shard1_replica1] Schema name=test
   [junit4]   2> 1195221 T2345 oass.IndexSchema.readSchema [nodes_used_collection_shard2_replica1] Schema name=test
   [junit4]   2> 1195222 T2331 oass.IndexSchema.readSchema [nodes_used_collection_shard1_replica2] Schema name=test
   [junit4]   2> 1195223 T2304 oass.IndexSchema.readSchema [nodes_used_collection_shard2_replica2] Schema name=test
   [junit4]   2> 1196109 T2304 oass.OpenExchangeRatesOrgProvider.init Initialized with rates=open-exchange-rates.json, refreshInterval=1440.
   [junit4]   2> 1196117 T2345 oass.OpenExchangeRatesOrgProvider.init Initialized with rates=open-exchange-rates.json, refreshInterval=1440.
   [junit4]   2> 1196117 T2331 oass.OpenExchangeRatesOrgProvider.init Initialized with rates=open-exchange-rates.json, refreshInterval=1440.
   [junit4]   2> 1196124 T2304 oass.IndexSchema.readSchema default search field in schema is text
   [junit4]   2> 1196124 T2285 oass.OpenExchangeRatesOrgProvider.init Initialized with rates=open-exchange-rates.json, refreshInterval=1440.
   [junit4]   2> 1196149 T2345 oass.IndexSchema.readSchema default search field in schema is text
   [junit4]   2> 1196150 T2331 oass.IndexSchema.readSchema default search field in schema is text
   [junit4]   2> 1196151 T2304 oass.IndexSchema.readSchema unique key field: id
   [junit4]   2> 1196154 T2345 oass.IndexSchema.readSchema unique key field: id
   [junit4]   2> 1196155 T2331 oass.IndexSchema.readSchema unique key field: id
   [junit4]   2> 1196157 T2285 oass.IndexSchema.readSchema default search field in schema is text
   [junit4]   2> 1196161 T2285 oass.IndexSchema.readSchema unique key field: id
   [junit4]   2> 1196167 T2304 oass.FileExchangeRateProvider.reload Reloading exchange rates from file currency.xml
   [junit4]   2> 1196170 T2345 oass.FileExchangeRateProvider.reload Reloading exchange rates from file currency.xml
   [junit4]   2> 1196170 T2331 oass.FileExchangeRateProvider.reload Reloading exchange rates from file currency.xml
   [junit4]   2> 1196173 T2304 oass.FileExchangeRateProvider.reload Reloading exchange rates from file currency.xml
   [junit4]   2> 1196175 T2285 oass.FileExchangeRateProvider.reload Reloading exchange rates from file currency.xml
   [junit4]   2> 1196176 T2331 oass.FileExchangeRateProvider.reload Reloading exchange rates from file currency.xml
   [junit4]   2> 1196176 T2345 oass.FileExchangeRateProvider.reload Reloading exchange rates from file currency.xml
   [junit4]   2> 1196178 T2304 oass.OpenExchangeRatesOrgProvider.reload Reloading exchange rates from open-exchange-rates.json
   [junit4]   2> 1196179 T2304 oass.OpenExchangeRatesOrgProvider$OpenExchangeRates.<init> WARN Unknown key IMPORTANT NOTE
   [junit4]   2> 1196180 T2304 oass.OpenExchangeRatesOrgProvider$OpenExchangeRates.<init> WARN Expected key, got STRING
   [junit4]   2> 1196180 T2304 oass.OpenExchangeRatesOrgProvider.reload Reloading exchange rates from open-exchange-rates.json
   [junit4]   2> 1196180 T2285 oass.FileExchangeRateProvider.reload Reloading exchange rates from file currency.xml
   [junit4]   2> 1196181 T2304 oass.OpenExchangeRatesOrgProvider$OpenExchangeRates.<init> WARN Unknown key IMPORTANT NOTE
   [junit4]   2> 1196181 T2331 oass.OpenExchangeRatesOrgProvider.reload Reloading exchange rates from open-exchange-rates.json
   [junit4]   2> 1196182 T2345 oass.OpenExchangeRatesOrgProvider.reload Reloading exchange rates from open-exchange-rates.json
   [junit4]   2> 1196182 T2304 oass.OpenExchangeRatesOrgProvider$OpenExchangeRates.<init> WARN Expected key, got STRING
   [junit4]   2> 1196183 T2331 oass.OpenExchangeRatesOrgProvider$OpenExchangeRates.<init> WARN Unknown key IMPORTANT NOTE
   [junit4]   2> 1196183 T2304 oasc.SolrCore.initDirectoryFactory org.apache.solr.core.MockDirectoryFactory
   [junit4]   2> 1196183 T2345 oass.OpenExchangeRatesOrgProvider$OpenExchangeRates.<init> WARN Unknown key IMPORTANT NOTE
   [junit4]   2> 1196184 T2345 oass.OpenExchangeRatesOrgProvider$OpenExchangeRates.<init> WARN Expected key, got STRING
   [junit4]   2> 1196183 T2331 oass.OpenExchangeRatesOrgProvider$OpenExchangeRates.<init> WARN Expected key, got STRING
   [junit4]   2> 1196185 T2345 oass.OpenExchangeRatesOrgProvider.reload Reloading exchange rates from open-exchange-rates.json
   [junit4]   2> 1196184 T2304 oasc.SolrCore.<init> [nodes_used_collection_shard2_replica2] Opening new SolrCore at /usr/home/hudson/hudson-slave/workspace/Lucene-Solr-Tests-trunk-Java7/solr/build/solr-core/test/J1/./org.apache.solr.cloud.CollectionsAPIDistributedZkTest-jetty1-1375316013277/nodes_used_collection_shard2_replica2/, dataDir=/usr/home/hudson/hudson-slave/workspace/Lucene-Solr-Tests-trunk-Java7/solr/build/solr-core/test/J1/./org.apache.solr.cloud.CollectionsAPIDistributedZkTest-jetty1-1375316013277//nodes_used_collection_shard2_replica2/data/
   [junit4]   2> 1196185 T2285 oass.OpenExchangeRatesOrgProvider.reload Reloading exchange rates from open-exchange-rates.json
   [junit4]   2> 1196185 T2331 oass.OpenExchangeRatesOrgProvider.reload Reloading exchange rates from open-exchange-rates.json
   [junit4]   2> 1196186 T2345 oass.OpenExchangeRatesOrgProvider$OpenExchangeRates.<init> WARN Unknown key IMPORTANT NOTE
   [junit4]   2> 1196187 T2345 oass.OpenExchangeRatesOrgProvider$OpenExchangeRates.<init> WARN Expected key, got STRING
   [junit4]   2> 1196186 T2304 oasc.JmxMonitoredMap.<init> JMX monitoring is enabled. Adding Solr mbeans to JMX Server: com.sun.jmx.mbeanserver.JmxMBeanServer@4c2ee56
   [junit4]   2> 1196188 T2345 oasc.SolrCore.initDirectoryFactory org.apache.solr.core.MockDirectoryFactory
   [junit4]   2> 1196188 T2331 oass.OpenExchangeRatesOrgProvider$OpenExchangeRates.<init> WARN Unknown key IMPORTANT NOTE
   [junit4]   2> 1196189 T2331 oass.OpenExchangeRatesOrgProvider$OpenExchangeRates.<init> WARN Expected key, got STRING
   [junit4]   2> 1196187 T2285 oass.OpenExchangeRatesOrgProvider$OpenExchangeRates.<init> WARN Unknown key IMPORTANT NOTE
   [junit4]   2> 1196189 T2331 oasc.SolrCore.initDirectoryFactory org.apache.solr.core.MockDirectoryFactory
   [junit4]   2> 1196189 T2304 oasc.CachingDirectoryFactory.get return new directory for /usr/home/hudson/hudson-slave/workspace/Lucene-Solr-Tests-trunk-Java7/solr/build/solr-core/test/J1/./org.apache.solr.cloud.CollectionsAPIDistributedZkTest-jetty1-1375316013277//nodes_used_collection_shard2_replica2/data
   [junit4]   2> 1196188 T2345 oasc.SolrCore.<init> [nodes_used_collection_shard2_replica1] Opening new SolrCore at /usr/home/hudson/hudson-slave/workspace/Lucene-Solr-Tests-trunk-Java7/solr/build/solr-core/test/J1/./org.apache.solr.cloud.CollectionsAPIDistributedZkTest-jetty4-1375316018453/nodes_used_collection_shard2_replica1/, dataDir=/usr/home/hudson/hudson-slave/workspace/Lucene-Solr-Tests-trunk-Java7/solr/build/solr-core/test/J1/./org.apache.solr.cloud.CollectionsAPIDistributedZkTest-jetty4-1375316018453//nodes_used_collection_shard2_replica1/data/
   [junit4]   2> 1196190 T2304 oasc.SolrCore.getNewIndexDir New index directory detected: old=null new=/usr/home/hudson/hudson-slave/workspace/Lucene-Solr-Tests-trunk-Java7/solr/build/solr-core/test/J1/./org.apache.solr.cloud.CollectionsAPIDistributedZkTest-jetty1-1375316013277//nodes_used_collection_shard2_replica2/data/index/
   [junit4]   2> 1196190 T2331 oasc.SolrCore.<init> [nodes_used_collection_shard1_replica2] Opening new SolrCore at /usr/home/hudson/hudson-slave/workspace/Lucene-Solr-Tests-trunk-Java7/solr/build/solr-core/test/J1/./org.apache.solr.cloud.CollectionsAPIDistributedZkTest-jetty3-1375316016739/nodes_used_collection_shard1_replica2/, dataDir=/usr/home/hudson/hudson-slave/workspace/Lucene-Solr-Tests-trunk-Java7/solr/build/solr-core/test/J1/./org.apache.solr.cloud.CollectionsAPIDistributedZkTest-jetty3-1375316016739//nodes_used_collection_shard1_replica2/data/
   [junit4]   2> 1196190 T2285 oass.OpenExchangeRatesOrgProvider$OpenExchangeRates.<init> WARN Expected key, got STRING
   [junit4]   2> 1196192 T2331 oasc.JmxMonitoredMap.<init> JMX monitoring is enabled. Adding Solr mbeans to JMX Server: com.sun.jmx.mbeanserver.JmxMBeanServer@4c2ee56
   [junit4]   2> 1196191 T2304 oasc.SolrCore.initIndex WARN [nodes_used_collection_shard2_replica2] Solr index directory '/usr/home/hudson/hudson-slave/workspace/Lucene-Solr-Tests-trunk-Java7/solr/build/solr-core/test/J1/./org.apache.solr.cloud.CollectionsAPIDistributedZkTest-jetty1-1375316013277/nodes_used_collection_shard2_replica2/data/index' doesn't exist. Creating new index...
   [junit4]   2> 1196191 T2345 oasc.JmxMonitoredMap.<init> JMX monitoring is enabled. Adding Solr mbeans to JMX Server: com.sun.jmx.mbeanserver.JmxMBeanServer@4c2ee56
   [junit4]   2> 1196193 T2331 oasc.CachingDirectoryFactory.get return new directory for /usr/home/hudson/hudson-slave/workspace/Lucene-Solr-Tests-trunk-Java7/solr/build/solr-core/test/J1/./org.apache.solr.cloud.CollectionsAPIDistributedZkTest-jetty3-1375316016739//nodes_used_collection_shard1_replica2/data
   [junit4]   2> 1196192 T2285 oass.OpenExchangeRatesOrgProvider.reload Reloading exchange rates from open-exchange-rates.json
   [junit4]   2> 1196194 T2331 oasc.SolrCore.getNewIndexDir New index directory detected: old=null new=/usr/home/hudson/hudson-slave/workspace/Lucene-Solr-Tests-trunk-Java7/solr/build/solr-core/test/J1/./org.apache.solr.cloud.CollectionsAPIDistributedZkTest-jetty3-1375316016739//nodes_used_collection_shard1_replica2/data/index/
   [junit4]   2> 1196193 T2304 oasc.CachingDirectoryFactory.get return new directory for /usr/home/hudson/hudson-slave/workspace/Lucene-Solr-Tests-trunk-Java7/solr/build/solr-core/test/J1/./org.apache.solr.cloud.CollectionsAPIDistributedZkTest-jetty1-1375316013277//nodes_used_collection_shard2_replica2/data/index
   [junit4]   2> 1196194 T2331 oasc.SolrCore.initIndex WARN [nodes_used_collection_shard1_replica2] Solr index directory '/usr/home/hudson/hudson-slave/workspace/Lucene-Solr-Tests-trunk-Java7/solr/build/solr-core/test/J1/./org.apache.solr.cloud.CollectionsAPIDistributedZkTest-jetty3-1375316016739/nodes_used_collection_shard1_replica2/data/index' doesn't exist. Creating new index...
   [junit4]   2> 1196194 T2345 oasc.CachingDirectoryFactory.get return new directory for /usr/home/hudson/hudson-slave/workspace/Lucene-Solr-Tests-trunk-Java7/solr/build/solr-core/test/J1/./org.apache.solr.cloud.CollectionsAPIDistributedZkTest-jetty4-1375316018453//nodes_used_collection_shard2_replica1/data
   [junit4]   2> 1196196 T2331 oasc.CachingDirectoryFactory.get return new directory for /usr/home/hudson/hudson-slave/workspace/Lucene-Solr-Tests-trunk-Java7/solr/build/solr-core/test/J1/./org.apache.solr.cloud.CollectionsAPIDistributedZkTest-jetty3-1375316016739//nodes_used_collection_shard1_replica2/data/index
   [junit4]   2> 1196196 T2345 oasc.SolrCore.getNewIndexDir New index directory detected: old=null new=/usr/home/hudson/hudson-slave/workspace/Lucene-Solr-Tests-trunk-Java7/solr/build/solr-core/test/J1/./org.apache.solr.cloud.CollectionsAPIDistributedZkTest-jetty4-1375316018453//nodes_used_collection_shard2_replica1/data/index/
   [junit4]   2> 1196195 T2285 oass.OpenExchangeRatesOrgProvider$OpenExchangeRates.<init> WARN Unknown key IMPORTANT NOTE
   [junit4]   2> 1196196 T2345 oasc.SolrCore.initIndex WARN [nodes_used_collection_shard2_replica1] Solr index directory '/usr/home/hudson/hudson-slave/workspace/Lucene-Solr-Tests-trunk-Java7/solr/build/solr-core/test/J1/./org.apache.solr.cloud.CollectionsAPIDistributedZkTest-jetty4-1375316018453/nodes_used_collection_shard2_replica1/data/index' doesn't exist. Creating new index...
   [junit4]   2> 1196197 T2285 oass.OpenExchangeRatesOrgProvider$OpenExchangeRates.<init> WARN Expected key, got STRING
   [junit4]   2> 1196198 T2345 oasc.CachingDirectoryFactory.get return new directory for /usr/home/hudson/hudson-slave/workspace/Lucene-Solr-Tests-trunk-Java7/solr/build/solr-core/test/J1/./org.apache.solr.cloud.CollectionsAPIDistributedZkTest-jetty4-1375316018453//nodes_used_collection_shard2_replica1/data/index
   [junit4]   2> 1196198 T2285 oasc.SolrCore.initDirectoryFactory org.apache.solr.core.MockDirectoryFactory
   [junit4]   2> 1196199 T2285 oasc.SolrCore.<init> [nodes_used_collection_shard1_replica1] Opening new SolrCore at /usr/home/hudson/hudson-slave/workspace/Lucene-Solr-Tests-trunk-Java7/solr/build/solr-core/test/J1/./org.apache.solr.cloud.CollectionsAPIDistributedZkTest-controljetty-1375316012492/nodes_used_collection_shard1_replica1/, dataDir=/usr/home/hudson/hudson-slave/workspace/Lucene-Solr-Tests-trunk-Java7/solr/build/solr-core/test/J1/./org.apache.solr.cloud.CollectionsAPIDistributedZkTest-controljetty-1375316012492//nodes_used_collection_shard1_replica1/data/
   [junit4]   2> 1196199 T2285 oasc.JmxMonitoredMap.<init> JMX monitoring is enabled. Adding Solr mbeans to JMX Server: com.sun.jmx.mbeanserver.JmxMBeanServer@4c2ee56
   [junit4]   2> 1196200 T2285 oasc.CachingDirectoryFactory.get return new directory for /usr/home/hudson/hudson-slave/workspace/Lucene-Solr-Tests-trunk-Java7/solr/build/solr-core/test/J1/./org.apache.solr.cloud.CollectionsAPIDistributedZkTest-controljetty-1375316012492//nodes_used_collection_shard1_replica1/data
   [junit4]   2> 1196201 T2304 oasc.SolrDeletionPolicy.onCommit SolrDeletionPolicy.onCommit: commits: num=1
   [junit4]   2> 		commit{dir=MockDirWrapper(NRTCachingDirectory(org.apache.lucene.store.RAMDirectory@ab948fe lockFactory=org.apache.lucene.store.NativeFSLockFactory@7747993a; maxCacheMB=0.580078125 maxMergeSizeMB=0.9423828125)),segFN=segments_1,generation=1}
   [junit4]   2> 1196201 T2285 oasc.SolrCore.getNewIndexDir New index directory detected: old=null new=/usr/home/hudson/hudson-slave/workspace/Lucene-Solr-Tests-trunk-Java7/solr/build/solr-core/test/J1/./org.apache.solr.cloud.CollectionsAPIDistributedZkTest-controljetty-1375316012492//nodes_used_collection_shard1_replica1/data/index/
   [junit4]   2> 1196201 T2304 oasc.SolrDeletionPolicy.updateCommits newest commit generation = 1
   [junit4]   2> 1196202 T2331 oasc.SolrDeletionPolicy.onCommit SolrDeletionPolicy.onCommit: commits: num=1
   [junit4]   2> 		commit{dir=MockDirWrapper(NRTCachingDirectory(org.apache.lucene.store.RAMDirectory@3b25fe07 lockFactory=org.apache.lucene.store.NativeFSLockFactory@4cbc28d9; maxCacheMB=0.580078125 maxMergeSizeMB=0.9423828125)),segFN=segments_1,generation=1}
   [junit4]   2> 1196202 T2285 oasc.SolrCore.initIndex WARN [nodes_used_collection_shard1_replica1] Solr index directory '/usr/home/hudson/hudson-slave/workspace/Lucene-Solr-Tests-trunk-Java7/solr/build/solr-core/test/J1/./org.apache.solr.cloud.CollectionsAPIDistributedZkTest-controljetty-1375316012492/nodes_used_collection_shard1_replica1/data/index' doesn't exist. Creating new index...
   [junit4]   2> 1196203 T2331 oasc.SolrDeletionPolicy.updateCommits newest commit generation = 1
   [junit4]   2> 1196203 T2285 oasc.CachingDirectoryFactory.get return new directory for /usr/home/hudson/hudson-slave/workspace/Lucene-Solr-Tests-trunk-Java7/solr/build/solr-core/test/J1/./org.apache.solr.cloud.CollectionsAPIDistributedZkTest-controljetty-1375316012492//nodes_used_collection_shard1_replica1/data/index
   [junit4]   2> 1196204 T2345 oasc.SolrDeletionPolicy.onCommit SolrDeletionPolicy.onCommit: commits: num=1
   [junit4]   2> 		commit{dir=MockDirWrapper(NRTCachingDirectory(org.apache.lucene.store.RAMDirectory@1de1914e lockFactory=org.apache.lucene.store.NativeFSLockFactory@343fbfe; maxCacheMB=0.580078125 maxMergeSizeMB=0.9423828125)),segFN=segments_1,generation=1}
   [junit4]   2> 1196205 T2345 oasc.SolrDeletionPolicy.updateCommits newest commit generation = 1
   [junit4]   2> 1196208 T2304 oasup.UpdateRequestProcessorChain.init inserting DistributedUpdateProcessorFactory into updateRequestProcessorChain "dedupe"
   [junit4]   2> 1196208 T2304 oasup.UpdateRequestProcessorChain.init inserting DistributedUpdateProcessorFactory into updateRequestProcessorChain "stored_sig"
   [junit4]   2> 1196209 T2285 oasc.SolrDeletionPolicy.onCommit SolrDeletionPolicy.onCommit: commits: num=1
   [junit4]   2> 		commit{dir=MockDirWrapper(NRTCachingDirectory(org.apache.lucene.store.RAMDirectory@115c6cab lockFactory=org.apache.lucene.store.NativeFSLockFactory@249843d6; maxCacheMB=0.580078125 maxMergeSizeMB=0.9423828125)),segFN=segments_1,generation=1}
   [junit4]   2> 1196209 T2285 oasc.SolrDeletionPolicy.updateCommits newest commit generation = 1
   [junit4]   2> 1196210 T2331 oasup.UpdateRequestProcessorChain.init inserting DistributedUpdateProcessorFactory into updateRequestProcessorChain "dedupe"
   [junit4]   2> 1196209 T2304 oasup.UpdateRequestProcessorChain.init inserting DistributedUpdateProcessorFactory into updateRequestProcessorChain "distrib-dup-test-chain-implicit"
   [junit4]   2> 1196210 T2331 oasup.UpdateRequestProcessorChain.init inserting DistributedUpdateProcessorFactory into updateRequestProcessorChain "stored_sig"
   [junit4]   2> 1196211 T2345 oasup.UpdateRequestProcessorChain.init inserting DistributedUpdateProcessorFactory into updateRequestProcessorChain "dedupe"
   [junit4]   2> 1196211 T2304 oasc.RequestHandlers.initHandlersFromConfig created standard: solr.StandardRequestHandler
   [junit4]   2> 1196212 T2331 oasup.UpdateRequestProcessorChain.init inserting DistributedUpdateProcessorFactory into updateRequestProcessorChain "distrib-dup-test-chain-implicit"
   [junit4]   2> 1196212 T2345 oasup.UpdateRequestProcessorChain.init inserting DistributedUpdateProcessorFactory into updateRequestProcessorChain "stored_sig"
   [junit4]   2> 1196212 T2304 oasc.RequestHandlers.initHandlersFromConfig created /get: solr.RealTimeGetHandler
   [junit4]   2> 1196213 T2331 oasc.RequestHandlers.initHandlersFromConfig created standard: solr.StandardRequestHandler
   [junit4]   2> 1196213 T2345 oasup.UpdateRequestProcessorChain.init inserting DistributedUpdateProcessorFactory into updateRequestProcessorChain "distrib-dup-test-chain-implicit"
   [junit4]   2> 1196213 T2304 oasc.RequestHandlers.initHandlersFromConfig adding lazy requestHandler: solr.ReplicationHandler
   [junit4]   2> 1196214 T2331 oasc.RequestHandlers.initHandlersFromConfig created /get: solr.RealTimeGetHandler
   [junit4]   2> 1196214 T2304 oasc.RequestHandlers.initHandlersFromConfig created /replication: solr.ReplicationHandler
   [junit4]   2> 1196214 T2345 oasc.RequestHandlers.initHandlersFromConfig created standard: solr.StandardRequestHandler
   [junit4]   2> 1196215 T2285 oasup.UpdateRequestProcessorChain.init inserting DistributedUpdateProcessorFactory into updateRequestProcessorChain "dedupe"
   [junit4]   2> 1196215 T2331 oasc.RequestHandlers.initHandlersFromConfig adding lazy requestHandler: solr.ReplicationHandler
   [junit4]   2> 1196216 T2285 oasup.UpdateRequestProcessorChain.init inserting DistributedUpdateProcessorFactory into updateRequestProcessorChain "stored_sig"
   [junit4]   2> 1196216 T2345 oasc.RequestHandlers.initHandlersFromConfig created /get: solr.RealTimeGetHandler
   [junit4]   2> 1196217 T2345 oasc.RequestHandlers.initHandlersFromConfig adding lazy requestHandler: solr.ReplicationHandler
   [junit4]   2> 1196215 T2304 oasc.RequestHandlers.initHandlersFromConfig created /update: solr.UpdateRequestHandler
   [junit4]   2> 1196217 T2345 oasc.RequestHandlers.initHandlersFromConfig created /replication: solr.ReplicationHandler
   [junit4]   2> 1196217 T2285 oasup.UpdateRequestProcessorChain.init inserting DistributedUpdateProcessorFactory into updateRequestProcessorChain "distrib-dup-test-chain-implicit"
   [junit4]   2> 1196216 T2331 oasc.RequestHandlers.initHandlersFromConfig created /replication: solr.ReplicationHandler
   [junit4]   2> 1196218 T2345 oasc.RequestHandlers.initHandlersFromConfig created /update: solr.UpdateRequestHandler
   [junit4]   2> 1196218 T2304 oasc.RequestHandlers.initHandlersFromConfig created /admin/: org.apache.solr.handler.admin.AdminHandlers
   [junit4]   2> 1196219 T2345 oasc.RequestHandlers.initHandlersFromConfig created /admin/: org.apache.solr.handler.admin.AdminHandlers
   [junit4]   2> 1196219 T2331 oasc.RequestHandlers.initHandlersFromConfig created /update: solr.UpdateRequestHandler
   [junit4]   2> 1196219 T2285 oasc.RequestHandlers.initHandlersFromConfig created standard: solr.StandardRequestHandler
   [junit4]   2> 1196221 T2331 oasc.RequestHandlers.initHandlersFromConfig created /admin/: org.apache.solr.handler.admin.AdminHandlers
   [junit4]   2> 1196221 T2285 oasc.RequestHandlers.initHandlersFromConfig created /get: solr.RealTimeGetHandler
   [junit4]   2> 1196222 T2285 oasc.RequestHandlers.initHandlersFromConfig adding lazy requestHandler: solr.ReplicationHandler
   [junit4]   2> 1196222 T2285 oasc.RequestHandlers.initHandlersFromConfig created /replication: solr.ReplicationHandler
   [junit4]   2> 1196223 T2285 oasc.RequestHandlers.initHandlersFromConfig created /update: solr.UpdateRequestHandler
   [junit4]   2> 1196223 T2285 oasc.RequestHandlers.initHandlersFromConfig created /admin/: org.apache.solr.handler.admin.AdminHandlers
   [junit4]   2> 1196252 T2345 oashl.XMLLoader.init xsltCacheLifetimeSeconds=60
   [junit4]   2> 1196253 T2304 oashl.XMLLoader.init xsltCacheLifetimeSeconds=60
   [junit4]   2> 1196253 T2285 oashl.XMLLoader.init xsltCacheLifetimeSeconds=60
   [junit4]   2> 1196253 T2331 oashl.XMLLoader.init xsltCacheLifetimeSeconds=60
   [junit4]   2> 1196265 T2345 oass.SolrIndexSearcher.<init> Opening Searcher@272c9362 main
   [junit4]   2> 1196265 T2331 oass.SolrIndexSearcher.<init> Opening Searcher@181b7fed main
   [junit4]   2> 1196265 T2304 oass.SolrIndexSearcher.<init> Opening Searcher@4caab910 main
   [junit4]   2> 1196265 T2285 oass.SolrIndexSearcher.<init> Opening Searcher@536e163e main
   [junit4]   2> 1196267 T2345 oasu.CommitTracker.<init> Hard AutoCommit: disabled
   [junit4]   2> 1196268 T2331 oasu.CommitTracker.<init> Hard AutoCommit: disabled
   [junit4]   2> 1196268 T2304 oasu.CommitTracker.<init> Hard AutoCommit: disabled
   [junit4]   2> 1196268 T2345 oasu.CommitTracker.<init> Soft AutoCommit: disabled
   [junit4]   2> 1196268 T2304 oasu.CommitTracker.<init> Soft AutoCommit: disabled
   [junit4]   2> 1196268 T2285 oasu.CommitTracker.<init> Hard AutoCommit: disabled
   [junit4]   2> 1196268 T2331 oasu.CommitTracker.<init> Soft AutoCommit: disabled
   [junit4]   2> 1196270 T2285 oasu.CommitTracker.<init> Soft AutoCommit: disabled
   [junit4]   2> 1196273 T2361 oasc.SolrCore.registerSearcher [nodes_used_collection_shard2_replica1] Registered new searcher Searcher@272c9362 main{StandardDirectoryReader(segments_1:1)}
   [junit4]   2> 1196274 T2363 oasc.SolrCore.registerSearcher [nodes_used_collection_shard2_replica2] Registered new searcher Searcher@4caab910 main{StandardDirectoryReader(segments_1:1)}
   [junit4]   2> 1196274 T2364 oasc.SolrCore.registerSearcher [nodes_used_collection_shard1_replica2] Registered new searcher Searcher@181b7fed main{StandardDirectoryReader(segments_1:1)}
   [junit4]   2> 1196275 T2362 oasc.SolrCore.registerSearcher [nodes_used_collection_shard1_replica1] Registered new searcher Searcher@536e163e main{StandardDirectoryReader(segments_1:1)}
   [junit4]   2> 1196276 T2345 oasc.CoreContainer.registerCore registering core: nodes_used_collection_shard2_replica1
   [junit4]   2> 1196276 T2304 oasc.CoreContainer.registerCore registering core: nodes_used_collection_shard2_replica2
   [junit4]   2> 1196277 T2331 oasc.CoreContainer.registerCore registering core: nodes_used_collection_shard1_replica2
   [junit4]   2> 1196277 T2345 oasc.ZkController.register Register replica - core:nodes_used_collection_shard2_replica1 address:http://127.0.0.1:34599/mpwv/y collection:nodes_used_collection shard:shard2
   [junit4]   2> 1196277 T2331 oasc.ZkController.register Register replica - core:nodes_used_collection_shard1_replica2 address:http://127.0.0.1:34596/mpwv/y collection:nodes_used_collection shard:shard1
   [junit4]   2> 1196277 T2285 oasc.CoreContainer.registerCore registering core: nodes_used_collection_shard1_replica1
   [junit4]   2> 1196277 T2304 oasc.ZkController.register Register replica - core:nodes_used_collection_shard2_replica2 address:http://127.0.0.1:34590/mpwv/y collection:nodes_used_collection shard:shard2
   [junit4]   2> 1196279 T2285 oasc.ZkController.register Register replica - core:nodes_used_collection_shard1_replica1 address:http://127.0.0.1:34586/mpwv/y collection:nodes_used_collection shard:shard1
   [junit4]   2> 1196278 T2331 oascsi.HttpClientUtil.createClient Creating new http client, config:maxConnections=10000&maxConnectionsPerHost=20&connTimeout=15000&socketTimeout=30000&retry=false
   [junit4]   2> 1196278 T2345 oascsi.HttpClientUtil.createClient Creating new http client, config:maxConnections=10000&maxConnectionsPerHost=20&connTimeout=15000&socketTimeout=30000&retry=false
   [junit4]   2> 1196279 T2285 oascsi.HttpClientUtil.createClient Creating new http client, config:maxConnections=10000&maxConnectionsPerHost=20&connTimeout=15000&socketTimeout=30000&retry=false
   [junit4]   2> 1196279 T2304 oascsi.HttpClientUtil.createClient Creating new http client, config:maxConnections=10000&maxConnectionsPerHost=20&connTimeout=15000&socketTimeout=30000&retry=false
   [junit4]   2> 1196309 T2345 oascc.SolrZkClient.makePath makePath: /collections/nodes_used_collection/leader_elect/shard2/election
   [junit4]   2> 1196309 T2304 oascc.SolrZkClient.makePath makePath: /collections/nodes_used_collection/leader_elect/shard2/election
   [junit4]   2> 1196309 T2285 oascc.SolrZkClient.makePath makePath: /collections/nodes_used_collection/leader_elect/shard1/election
   [junit4]   2> 1196309 T2331 oascc.SolrZkClient.makePath makePath: /collections/nodes_used_collection/leader_elect/shard1/election
   [junit4]   2> 1196337 T2304 oasc.ShardLeaderElectionContext.runLeaderProcess Running the leader process for shard shard2
   [junit4]   2> 1196338 T2331 oasc.ShardLeaderElectionContext.runLeaderProcess Running the leader process for shard shard1
   [junit4]   2> 1196341 T2304 oasc.ShardLeaderElectionContext.waitForReplicasToComeUp Enough replicas found to continue.
   [junit4]   2> 1196341 T2331 oasc.ShardLeaderElectionContext.waitForReplicasToComeUp Enough replicas found to continue.
   [junit4]   2> 1196341 T2304 oasc.ShardLeaderElectionContext.runLeaderProcess I may be the new leader - try and sync
   [junit4]   2> 1196341 T2331 oasc.ShardLeaderElectionContext.runLeaderProcess I may be the new leader - try and sync
   [junit4]   2> 1196342 T2304 oasc.SyncStrategy.sync Sync replicas to http://127.0.0.1:34590/mpwv/y/nodes_used_collection_shard2_replica2/
   [junit4]   2> 1196342 T2331 oasc.SyncStrategy.sync Sync replicas to http://127.0.0.1:34596/mpwv/y/nodes_used_collection_shard1_replica2/
   [junit4]   2> 1196343 T2304 oasu.PeerSync.sync PeerSync: core=nodes_used_collection_shard2_replica2 url=http://127.0.0.1:34590/mpwv/y START replicas=[http://127.0.0.1:34599/mpwv/y/nodes_used_collection_shard2_replica1/] nUpdates=100
   [junit4]   2> 1196343 T2331 oasu.PeerSync.sync PeerSync: core=nodes_used_collection_shard1_replica2 url=http://127.0.0.1:34596/mpwv/y START replicas=[http://127.0.0.1:34586/mpwv/y/nodes_used_collection_shard1_replica1/] nUpdates=100
   [junit4]   2> 1196344 T2304 oasu.PeerSync.sync PeerSync: core=nodes_used_collection_shard2_replica2 url=http://127.0.0.1:34590/mpwv/y DONE.  We have no versions.  sync failed.
   [junit4]   2> 1196344 T2331 oasu.PeerSync.sync PeerSync: core=nodes_used_collection_shard1_replica2 url=http://127.0.0.1:34596/mpwv/y DONE.  We have no versions.  sync failed.
   [junit4]   2> 1196345 T2331 oasc.SyncStrategy.syncReplicas Leader's attempt to sync with shard failed, moving to the next candidate
   [junit4]   2> 1196344 T2304 oasc.SyncStrategy.syncReplicas Leader's attempt to sync with shard failed, moving to the next candidate
   [junit4]   2> 1196345 T2331 oasc.ShardLeaderElectionContext.runLeaderProcess We failed sync, but we have no versions - we can't sync in that case - we were active before, so become leader anyway
   [junit4]   2> 1196345 T2304 oasc.ShardLeaderElectionContext.runLeaderProcess We failed sync, but we have no versions - we can't sync in that case - we were active before, so become leader anyway
   [junit4]   2> 1196346 

[...truncated too long message...]

)
   [junit4]    > Caused by: org.apache.http.conn.ConnectTimeoutException: Connect to 127.0.0.1:34590 timed out
   [junit4]    > 	at org.apache.http.conn.scheme.PlainSocketFactory.connectSocket(PlainSocketFactory.java:129)
   [junit4]    > 	at org.apache.http.impl.conn.DefaultClientConnectionOperator.openConnection(DefaultClientConnectionOperator.java:180)
   [junit4]    > 	at org.apache.http.impl.conn.ManagedClientConnectionImpl.open(ManagedClientConnectionImpl.java:294)
   [junit4]    > 	at org.apache.http.impl.client.DefaultRequestDirector.tryConnect(DefaultRequestDirector.java:645)
   [junit4]    > 	at org.apache.http.impl.client.DefaultRequestDirector.execute(DefaultRequestDirector.java:480)
   [junit4]    > 	at org.apache.http.impl.client.AbstractHttpClient.execute(AbstractHttpClient.java:906)
   [junit4]    > 	at org.apache.http.impl.client.AbstractHttpClient.execute(AbstractHttpClient.java:805)
   [junit4]    > 	at org.apache.http.impl.client.AbstractHttpClient.execute(AbstractHttpClient.java:784)
   [junit4]    > 	at org.apache.solr.client.solrj.impl.HttpSolrServer.request(HttpSolrServer.java:365)
   [junit4]    > 	... 45 more
   [junit4]   2> 1344461 T2273 oas.SolrTestCaseJ4.deleteCore ###deleteCore
   [junit4]   2> 160136 T2272 ccr.ThreadLeakControl.checkThreadLeaks WARNING Will linger awaiting termination of 2 leaked thread(s).
   [junit4]   2> 1345547 T2355 oasc.LeaderElector$1.process WARN  org.apache.zookeeper.KeeperException$SessionExpiredException: KeeperErrorCode = Session expired for /collections/new_implicit_coll_1/leader_elect/c/election
   [junit4]   2> 	at org.apache.zookeeper.KeeperException.create(KeeperException.java:127)
   [junit4]   2> 	at org.apache.zookeeper.KeeperException.create(KeeperException.java:51)
   [junit4]   2> 	at org.apache.zookeeper.ZooKeeper.getChildren(ZooKeeper.java:1468)
   [junit4]   2> 	at org.apache.solr.common.cloud.SolrZkClient$6.execute(SolrZkClient.java:235)
   [junit4]   2> 	at org.apache.solr.common.cloud.SolrZkClient$6.execute(SolrZkClient.java:232)
   [junit4]   2> 	at org.apache.solr.common.cloud.ZkCmdExecutor.retryOperation(ZkCmdExecutor.java:65)
   [junit4]   2> 	at org.apache.solr.common.cloud.SolrZkClient.getChildren(SolrZkClient.java:232)
   [junit4]   2> 	at org.apache.solr.cloud.LeaderElector.checkIfIamLeader(LeaderElector.java:84)
   [junit4]   2> 	at org.apache.solr.cloud.LeaderElector.access$000(LeaderElector.java:55)
   [junit4]   2> 	at org.apache.solr.cloud.LeaderElector$1.process(LeaderElector.java:129)
   [junit4]   2> 	at org.apache.zookeeper.ClientCnxn$EventThread.processEvent(ClientCnxn.java:519)
   [junit4]   2> 	at org.apache.zookeeper.ClientCnxn$EventThread.run(ClientCnxn.java:495)
   [junit4]   2> 
   [junit4]   2> 1345547 T2355 oasc.LeaderElector$1.process WARN  org.apache.zookeeper.KeeperException$SessionExpiredException: KeeperErrorCode = Session expired for /collections/new_implicit_coll_1/leader_elect/d/election
   [junit4]   2> 	at org.apache.zookeeper.KeeperException.create(KeeperException.java:127)
   [junit4]   2> 	at org.apache.zookeeper.KeeperException.create(KeeperException.java:51)
   [junit4]   2> 	at org.apache.zookeeper.ZooKeeper.getChildren(ZooKeeper.java:1468)
   [junit4]   2> 	at org.apache.solr.common.cloud.SolrZkClient$6.execute(SolrZkClient.java:235)
   [junit4]   2> 	at org.apache.solr.common.cloud.SolrZkClient$6.execute(SolrZkClient.java:232)
   [junit4]   2> 	at org.apache.solr.common.cloud.ZkCmdExecutor.retryOperation(ZkCmdExecutor.java:65)
   [junit4]   2> 	at org.apache.solr.common.cloud.SolrZkClient.getChildren(SolrZkClient.java:232)
   [junit4]   2> 	at org.apache.solr.cloud.LeaderElector.checkIfIamLeader(LeaderElector.java:84)
   [junit4]   2> 	at org.apache.solr.cloud.LeaderElector.access$000(LeaderElector.java:55)
   [junit4]   2> 	at org.apache.solr.cloud.LeaderElector$1.process(LeaderElector.java:129)
   [junit4]   2> 	at org.apache.zookeeper.ClientCnxn$EventThread.processEvent(ClientCnxn.java:519)
   [junit4]   2> 	at org.apache.zookeeper.ClientCnxn$EventThread.run(ClientCnxn.java:495)
   [junit4]   2> 
   [junit4]   2> 1345548 T2355 oascc.ZkStateReader$3.process WARN ZooKeeper watch triggered, but Solr cannot talk to ZK
   [junit4]   2> 1345548 T2355 oascc.ZkStateReader$2.process A cluster state change: WatchedEvent state:SyncConnected type:NodeChildrenChanged path:/live_nodes, has occurred - updating... (live nodes size: 1)
   [junit4]   2> 1345549 T2355 oascc.ZkStateReader$2.process WARN ZooKeeper watch triggered, but Solr cannot talk to ZK
   [junit4]   2> 1345549 T2355 oasc.LeaderElector$1.process WARN  org.apache.zookeeper.KeeperException$SessionExpiredException: KeeperErrorCode = Session expired for /collections/new_implicit_coll_1/leader_elect/a/election
   [junit4]   2> 	at org.apache.zookeeper.KeeperException.create(KeeperException.java:127)
   [junit4]   2> 	at org.apache.zookeeper.KeeperException.create(KeeperException.java:51)
   [junit4]   2> 	at org.apache.zookeeper.ZooKeeper.getChildren(ZooKeeper.java:1468)
   [junit4]   2> 	at org.apache.solr.common.cloud.SolrZkClient$6.execute(SolrZkClient.java:235)
   [junit4]   2> 	at org.apache.solr.common.cloud.SolrZkClient$6.execute(SolrZkClient.java:232)
   [junit4]   2> 	at org.apache.solr.common.cloud.ZkCmdExecutor.retryOperation(ZkCmdExecutor.java:65)
   [junit4]   2> 	at org.apache.solr.common.cloud.SolrZkClient.getChildren(SolrZkClient.java:232)
   [junit4]   2> 	at org.apache.solr.cloud.LeaderElector.checkIfIamLeader(LeaderElector.java:84)
   [junit4]   2> 	at org.apache.solr.cloud.LeaderElector.access$000(LeaderElector.java:55)
   [junit4]   2> 	at org.apache.solr.cloud.LeaderElector$1.process(LeaderElector.java:129)
   [junit4]   2> 	at org.apache.zookeeper.ClientCnxn$EventThread.processEvent(ClientCnxn.java:519)
   [junit4]   2> 	at org.apache.zookeeper.ClientCnxn$EventThread.run(ClientCnxn.java:495)
   [junit4]   2> 
   [junit4]   2> NOTE: test params are: codec=Lucene42: {timestamp=PostingsFormat(name=TestBloomFilteredLucene41Postings), range_facet_l=PostingsFormat(name=TestBloomFilteredLucene41Postings), id=PostingsFormat(name=Lucene41WithOrds), range_facet_sl=PostingsFormat(name=Lucene41WithOrds), a_t=PostingsFormat(name=TestBloomFilteredLucene41Postings), text=PostingsFormat(name=SimpleText), range_facet_si=PostingsFormat(name=TestBloomFilteredLucene41Postings), _version_=PostingsFormat(name=Memory doPackFST= true), other_tl1=PostingsFormat(name=Memory doPackFST= true), multiDefault=PostingsFormat(name=TestBloomFilteredLucene41Postings), a_si=PostingsFormat(name=Memory doPackFST= true), intDefault=PostingsFormat(name=Memory doPackFST= true)}, docValues:{timestamp=DocValuesFormat(name=Lucene42)}, sim=DefaultSimilarity, locale=ru, timezone=NZ-CHAT
   [junit4]   2> NOTE: FreeBSD 9.1-RELEASE-p3 amd64/Oracle Corporation 1.7.0_25 (64-bit)/cpus=16,threads=11,free=239866032,total=536870912
   [junit4]   2> NOTE: All tests run in this JVM: [TestBM25SimilarityFactory, ZkSolrClientTest, TestLuceneMatchVersion, TestAtomicUpdateErrorCases, TestSolrXMLSerializer, RequestHandlersTest, ShardRoutingCustomTest, ConvertedLegacyTest, SortByFunctionTest, DeleteShardTest, TermVectorComponentDistributedTest, SuggesterWFSTTest, TestCodecSupport, SimplePostToolTest, TestHashPartitioner, OpenExchangeRatesOrgProviderTest, SampleTest, DocValuesMultiTest, TestAnalyzedSuggestions, SolrCmdDistributorTest, BlockCacheTest, TestUniqueKeyFieldResource, PingRequestHandlerTest, IndexReaderFactoryTest, TestPartialUpdateDeduplication, SolrCoreCheckLockOnStartupTest, FieldAnalysisRequestHandlerTest, TestRandomFaceting, TestPropInject, TestQuerySenderNoQuery, TestWordDelimiterFilterFactory, CurrencyFieldOpenExchangeTest, TestFieldCollectionResource, QueryResultKeyTest, HdfsRecoveryZkTest, TestBinaryField, TestSchemaSimilarityResource, LeaderElectionIntegrationTest, HdfsDirectoryTest, TestManagedSchemaFieldResource, UpdateParamsTest, TestMergePolicyConfig, StandardRequestHandlerTest, HdfsSyncSliceTest, TestCollationField, TestJmxMonitoredMap, HdfsUnloadDistributedZkTest, TestManagedSchema, TestSchemaResource, DOMUtilTest, TestCopyFieldCollectionResource, TimeZoneUtilsTest, MultiTermTest, BadIndexSchemaTest, TestSystemIdResolver, TestZkChroot, TestRecovery, TestCSVResponseWriter, ClusterStateTest, TestSolr4Spatial, TestBinaryResponseWriter, EchoParamsTest, URLClassifyProcessorTest, RequiredFieldsTest, TestCoreDiscovery, TestFoldingMultitermQuery, BasicZkTest, DirectSolrSpellCheckerTest, TestOmitPositions, TestReload, TestComponentsName, ChaosMonkeySafeLeaderTest, BasicDistributedZk2Test, CollectionsAPIDistributedZkTest]
   [junit4] Completed on J1 in 161.43s, 1 test, 1 error <<< FAILURES!

[...truncated 505 lines...]
BUILD FAILED
/usr/home/hudson/hudson-slave/workspace/Lucene-Solr-Tests-trunk-Java7/build.xml:389: The following error occurred while executing this line:
/usr/home/hudson/hudson-slave/workspace/Lucene-Solr-Tests-trunk-Java7/build.xml:369: The following error occurred while executing this line:
/usr/home/hudson/hudson-slave/workspace/Lucene-Solr-Tests-trunk-Java7/build.xml:39: The following error occurred while executing this line:
/usr/home/hudson/hudson-slave/workspace/Lucene-Solr-Tests-trunk-Java7/solr/build.xml:181: The following error occurred while executing this line:
/usr/home/hudson/hudson-slave/workspace/Lucene-Solr-Tests-trunk-Java7/solr/common-build.xml:449: The following error occurred while executing this line:
/usr/home/hudson/hudson-slave/workspace/Lucene-Solr-Tests-trunk-Java7/lucene/common-build.xml:1230: The following error occurred while executing this line:
/usr/home/hudson/hudson-slave/workspace/Lucene-Solr-Tests-trunk-Java7/lucene/common-build.xml:873: There were test failures: 320 suites, 1345 tests, 1 error, 34 ignored (6 assumptions)

Total time: 60 minutes 35 seconds
Build step 'Invoke Ant' marked build as failure
Archiving artifacts
Recording test results
Email was triggered for: Failure
Sending email for trigger: Failure



Mime
View raw message