lucene-dev mailing list archives

Site index · List index
Message view « Date » · « Thread »
Top « Date » · « Thread »
From Apache Jenkins Server <jenk...@builds.apache.org>
Subject [JENKINS] Lucene-Solr-Tests-trunk-Java7 - Build # 4207 - Still Failing
Date Sat, 03 Aug 2013 15:24:17 GMT
Build: https://builds.apache.org/job/Lucene-Solr-Tests-trunk-Java7/4207/

1 tests failed.
FAILED:  org.apache.solr.cloud.CollectionsAPIDistributedZkTest.testDistribSearch

Error Message:
IOException occured when talking to server at: http://127.0.0.1:22940

Stack Trace:
org.apache.solr.client.solrj.SolrServerException: IOException occured when talking to server at: http://127.0.0.1:22940
	at __randomizedtesting.SeedInfo.seed([A0DBC4A68435BE3C:213D4ABEF36ADE00]:0)
	at org.apache.solr.client.solrj.impl.HttpSolrServer.request(HttpSolrServer.java:435)
	at org.apache.solr.client.solrj.impl.HttpSolrServer.request(HttpSolrServer.java:180)
	at org.apache.solr.cloud.AbstractFullDistribZkTestBase.createCollection(AbstractFullDistribZkTestBase.java:1535)
	at org.apache.solr.cloud.CollectionsAPIDistributedZkTest.testCustomCollectionsAPI(CollectionsAPIDistributedZkTest.java:677)
	at org.apache.solr.cloud.CollectionsAPIDistributedZkTest.doTest(CollectionsAPIDistributedZkTest.java:159)
	at org.apache.solr.BaseDistributedSearchTestCase.testDistribSearch(BaseDistributedSearchTestCase.java:835)
	at sun.reflect.NativeMethodAccessorImpl.invoke0(Native Method)
	at sun.reflect.NativeMethodAccessorImpl.invoke(NativeMethodAccessorImpl.java:57)
	at sun.reflect.DelegatingMethodAccessorImpl.invoke(DelegatingMethodAccessorImpl.java:43)
	at java.lang.reflect.Method.invoke(Method.java:606)
	at com.carrotsearch.randomizedtesting.RandomizedRunner.invoke(RandomizedRunner.java:1559)
	at com.carrotsearch.randomizedtesting.RandomizedRunner.access$600(RandomizedRunner.java:79)
	at com.carrotsearch.randomizedtesting.RandomizedRunner$6.evaluate(RandomizedRunner.java:737)
	at com.carrotsearch.randomizedtesting.RandomizedRunner$7.evaluate(RandomizedRunner.java:773)
	at com.carrotsearch.randomizedtesting.RandomizedRunner$8.evaluate(RandomizedRunner.java:787)
	at com.carrotsearch.randomizedtesting.rules.SystemPropertiesRestoreRule$1.evaluate(SystemPropertiesRestoreRule.java:53)
	at org.apache.lucene.util.TestRuleSetupTeardownChained$1.evaluate(TestRuleSetupTeardownChained.java:50)
	at org.apache.lucene.util.TestRuleFieldCacheSanity$1.evaluate(TestRuleFieldCacheSanity.java:51)
	at org.apache.lucene.util.AbstractBeforeAfterRule$1.evaluate(AbstractBeforeAfterRule.java:46)
	at com.carrotsearch.randomizedtesting.rules.SystemPropertiesInvariantRule$1.evaluate(SystemPropertiesInvariantRule.java:55)
	at org.apache.lucene.util.TestRuleThreadAndTestName$1.evaluate(TestRuleThreadAndTestName.java:49)
	at org.apache.lucene.util.TestRuleIgnoreAfterMaxFailures$1.evaluate(TestRuleIgnoreAfterMaxFailures.java:70)
	at org.apache.lucene.util.TestRuleMarkFailure$1.evaluate(TestRuleMarkFailure.java:48)
	at com.carrotsearch.randomizedtesting.rules.StatementAdapter.evaluate(StatementAdapter.java:36)
	at com.carrotsearch.randomizedtesting.ThreadLeakControl$StatementRunner.run(ThreadLeakControl.java:358)
	at com.carrotsearch.randomizedtesting.ThreadLeakControl.forkTimeoutingTask(ThreadLeakControl.java:782)
	at com.carrotsearch.randomizedtesting.ThreadLeakControl$3.evaluate(ThreadLeakControl.java:442)
	at com.carrotsearch.randomizedtesting.RandomizedRunner.runSingleTest(RandomizedRunner.java:746)
	at com.carrotsearch.randomizedtesting.RandomizedRunner$3.evaluate(RandomizedRunner.java:648)
	at com.carrotsearch.randomizedtesting.RandomizedRunner$4.evaluate(RandomizedRunner.java:682)
	at com.carrotsearch.randomizedtesting.RandomizedRunner$5.evaluate(RandomizedRunner.java:693)
	at com.carrotsearch.randomizedtesting.rules.StatementAdapter.evaluate(StatementAdapter.java:36)
	at com.carrotsearch.randomizedtesting.rules.SystemPropertiesRestoreRule$1.evaluate(SystemPropertiesRestoreRule.java:53)
	at org.apache.lucene.util.AbstractBeforeAfterRule$1.evaluate(AbstractBeforeAfterRule.java:46)
	at org.apache.lucene.util.TestRuleStoreClassName$1.evaluate(TestRuleStoreClassName.java:42)
	at com.carrotsearch.randomizedtesting.rules.SystemPropertiesInvariantRule$1.evaluate(SystemPropertiesInvariantRule.java:55)
	at com.carrotsearch.randomizedtesting.rules.NoShadowingOrOverridesOnMethodsRule$1.evaluate(NoShadowingOrOverridesOnMethodsRule.java:39)
	at com.carrotsearch.randomizedtesting.rules.NoShadowingOrOverridesOnMethodsRule$1.evaluate(NoShadowingOrOverridesOnMethodsRule.java:39)
	at com.carrotsearch.randomizedtesting.rules.StatementAdapter.evaluate(StatementAdapter.java:36)
	at org.apache.lucene.util.TestRuleAssertionsRequired$1.evaluate(TestRuleAssertionsRequired.java:43)
	at org.apache.lucene.util.TestRuleMarkFailure$1.evaluate(TestRuleMarkFailure.java:48)
	at org.apache.lucene.util.TestRuleIgnoreAfterMaxFailures$1.evaluate(TestRuleIgnoreAfterMaxFailures.java:70)
	at org.apache.lucene.util.TestRuleIgnoreTestSuites$1.evaluate(TestRuleIgnoreTestSuites.java:55)
	at com.carrotsearch.randomizedtesting.rules.StatementAdapter.evaluate(StatementAdapter.java:36)
	at com.carrotsearch.randomizedtesting.ThreadLeakControl$StatementRunner.run(ThreadLeakControl.java:358)
	at java.lang.Thread.run(Thread.java:724)
Caused by: org.apache.http.conn.ConnectTimeoutException: Connect to 127.0.0.1:22940 timed out
	at org.apache.http.conn.scheme.PlainSocketFactory.connectSocket(PlainSocketFactory.java:129)
	at org.apache.http.impl.conn.DefaultClientConnectionOperator.openConnection(DefaultClientConnectionOperator.java:180)
	at org.apache.http.impl.conn.ManagedClientConnectionImpl.open(ManagedClientConnectionImpl.java:294)
	at org.apache.http.impl.client.DefaultRequestDirector.tryConnect(DefaultRequestDirector.java:645)
	at org.apache.http.impl.client.DefaultRequestDirector.execute(DefaultRequestDirector.java:480)
	at org.apache.http.impl.client.AbstractHttpClient.execute(AbstractHttpClient.java:906)
	at org.apache.http.impl.client.AbstractHttpClient.execute(AbstractHttpClient.java:805)
	at org.apache.http.impl.client.AbstractHttpClient.execute(AbstractHttpClient.java:784)
	at org.apache.solr.client.solrj.impl.HttpSolrServer.request(HttpSolrServer.java:365)
	... 45 more




Build Log:
[...truncated 9698 lines...]
   [junit4] Suite: org.apache.solr.cloud.CollectionsAPIDistributedZkTest
   [junit4]   2> 823023 T2115 oas.BaseDistributedSearchTestCase.initHostContext Setting hostContext system property: /
   [junit4]   2> 823027 T2115 oas.SolrTestCaseJ4.setUp ###Starting testDistribSearch
   [junit4]   2> Creating dataDir: /usr/home/hudson/hudson-slave/workspace/Lucene-Solr-Tests-trunk-Java7/solr/build/solr-core/test/J1/./solrtest-CollectionsAPIDistributedZkTest-1375542114809
   [junit4]   2> 823028 T2115 oasc.ZkTestServer.run STARTING ZK TEST SERVER
   [junit4]   2> 823029 T2116 oasc.ZkTestServer$ZKServerMain.runFromConfig Starting server
   [junit4]   2> 823130 T2115 oasc.ZkTestServer.run start zk server on port:22930
   [junit4]   2> 823131 T2115 oascc.ConnectionManager.waitForConnected Waiting for client to connect to ZooKeeper
   [junit4]   2> 823136 T2122 oascc.ConnectionManager.process Watcher org.apache.solr.common.cloud.ConnectionManager@5355e98d name:ZooKeeperConnection Watcher:127.0.0.1:22930 got event WatchedEvent state:SyncConnected type:None path:null path:null type:None
   [junit4]   2> 823136 T2115 oascc.ConnectionManager.waitForConnected Client is connected to ZooKeeper
   [junit4]   2> 823137 T2115 oascc.SolrZkClient.makePath makePath: /solr
   [junit4]   2> 823154 T2115 oascc.ConnectionManager.waitForConnected Waiting for client to connect to ZooKeeper
   [junit4]   2> 823156 T2124 oascc.ConnectionManager.process Watcher org.apache.solr.common.cloud.ConnectionManager@4f015c6b name:ZooKeeperConnection Watcher:127.0.0.1:22930/solr got event WatchedEvent state:SyncConnected type:None path:null path:null type:None
   [junit4]   2> 823156 T2115 oascc.ConnectionManager.waitForConnected Client is connected to ZooKeeper
   [junit4]   2> 823157 T2115 oascc.SolrZkClient.makePath makePath: /collections/collection1
   [junit4]   2> 823167 T2115 oascc.SolrZkClient.makePath makePath: /collections/collection1/shards
   [junit4]   2> 823170 T2115 oascc.SolrZkClient.makePath makePath: /collections/control_collection
   [junit4]   2> 823172 T2115 oascc.SolrZkClient.makePath makePath: /collections/control_collection/shards
   [junit4]   2> 823176 T2115 oasc.AbstractZkTestCase.putConfig put /usr/home/hudson/hudson-slave/workspace/Lucene-Solr-Tests-trunk-Java7/solr/build/solr-core/test-files/solr/collection1/conf/solrconfig-tlog.xml to /configs/conf1/solrconfig.xml
   [junit4]   2> 823177 T2115 oascc.SolrZkClient.makePath makePath: /configs/conf1/solrconfig.xml
   [junit4]   2> 823189 T2115 oasc.AbstractZkTestCase.putConfig put /usr/home/hudson/hudson-slave/workspace/Lucene-Solr-Tests-trunk-Java7/solr/build/solr-core/test-files/solr/collection1/conf/schema.xml to /configs/conf1/schema.xml
   [junit4]   2> 823190 T2115 oascc.SolrZkClient.makePath makePath: /configs/conf1/schema.xml
   [junit4]   2> 823295 T2115 oasc.AbstractZkTestCase.putConfig put /usr/home/hudson/hudson-slave/workspace/Lucene-Solr-Tests-trunk-Java7/solr/build/solr-core/test-files/solr/collection1/conf/stopwords.txt to /configs/conf1/stopwords.txt
   [junit4]   2> 823296 T2115 oascc.SolrZkClient.makePath makePath: /configs/conf1/stopwords.txt
   [junit4]   2> 823299 T2115 oasc.AbstractZkTestCase.putConfig put /usr/home/hudson/hudson-slave/workspace/Lucene-Solr-Tests-trunk-Java7/solr/build/solr-core/test-files/solr/collection1/conf/protwords.txt to /configs/conf1/protwords.txt
   [junit4]   2> 823300 T2115 oascc.SolrZkClient.makePath makePath: /configs/conf1/protwords.txt
   [junit4]   2> 823310 T2115 oasc.AbstractZkTestCase.putConfig put /usr/home/hudson/hudson-slave/workspace/Lucene-Solr-Tests-trunk-Java7/solr/build/solr-core/test-files/solr/collection1/conf/currency.xml to /configs/conf1/currency.xml
   [junit4]   2> 823310 T2115 oascc.SolrZkClient.makePath makePath: /configs/conf1/currency.xml
   [junit4]   2> 823314 T2115 oasc.AbstractZkTestCase.putConfig put /usr/home/hudson/hudson-slave/workspace/Lucene-Solr-Tests-trunk-Java7/solr/build/solr-core/test-files/solr/collection1/conf/open-exchange-rates.json to /configs/conf1/open-exchange-rates.json
   [junit4]   2> 823315 T2115 oascc.SolrZkClient.makePath makePath: /configs/conf1/open-exchange-rates.json
   [junit4]   2> 823318 T2115 oasc.AbstractZkTestCase.putConfig put /usr/home/hudson/hudson-slave/workspace/Lucene-Solr-Tests-trunk-Java7/solr/build/solr-core/test-files/solr/collection1/conf/mapping-ISOLatin1Accent.txt to /configs/conf1/mapping-ISOLatin1Accent.txt
   [junit4]   2> 823319 T2115 oascc.SolrZkClient.makePath makePath: /configs/conf1/mapping-ISOLatin1Accent.txt
   [junit4]   2> 823322 T2115 oasc.AbstractZkTestCase.putConfig put /usr/home/hudson/hudson-slave/workspace/Lucene-Solr-Tests-trunk-Java7/solr/build/solr-core/test-files/solr/collection1/conf/old_synonyms.txt to /configs/conf1/old_synonyms.txt
   [junit4]   2> 823323 T2115 oascc.SolrZkClient.makePath makePath: /configs/conf1/old_synonyms.txt
   [junit4]   2> 823326 T2115 oasc.AbstractZkTestCase.putConfig put /usr/home/hudson/hudson-slave/workspace/Lucene-Solr-Tests-trunk-Java7/solr/build/solr-core/test-files/solr/collection1/conf/synonyms.txt to /configs/conf1/synonyms.txt
   [junit4]   2> 823327 T2115 oascc.SolrZkClient.makePath makePath: /configs/conf1/synonyms.txt
   [junit4]   2> 823612 T2115 oejs.Server.doStart jetty-8.1.10.v20130312
   [junit4]   2> 823618 T2115 oejs.AbstractConnector.doStart Started SocketConnector@127.0.0.1:22933
   [junit4]   2> 823618 T2115 oass.SolrDispatchFilter.init SolrDispatchFilter.init()
   [junit4]   2> 823619 T2115 oasc.SolrResourceLoader.locateSolrHome JNDI not configured for solr (NoInitialContextEx)
   [junit4]   2> 823620 T2115 oasc.SolrResourceLoader.locateSolrHome using system property solr.solr.home: /usr/home/hudson/hudson-slave/workspace/Lucene-Solr-Tests-trunk-Java7/solr/build/solr-core/test/J1/./org.apache.solr.cloud.CollectionsAPIDistributedZkTest-controljetty-1375542115112
   [junit4]   2> 823620 T2115 oasc.SolrResourceLoader.<init> new SolrResourceLoader for directory: '/usr/home/hudson/hudson-slave/workspace/Lucene-Solr-Tests-trunk-Java7/solr/build/solr-core/test/J1/./org.apache.solr.cloud.CollectionsAPIDistributedZkTest-controljetty-1375542115112/'
   [junit4]   2> 823662 T2115 oasc.ConfigSolr.fromFile Loading container configuration from /usr/home/hudson/hudson-slave/workspace/Lucene-Solr-Tests-trunk-Java7/solr/build/solr-core/test/J1/./org.apache.solr.cloud.CollectionsAPIDistributedZkTest-controljetty-1375542115112/solr.xml
   [junit4]   2> 823756 T2115 oasc.ConfigSolrXml.<init> Config-defined core root directory: 
   [junit4]   2> 823757 T2115 oasc.CoreContainer.<init> New CoreContainer 855685611
   [junit4]   2> 823758 T2115 oasc.CoreContainer.load Loading cores into CoreContainer [instanceDir=/usr/home/hudson/hudson-slave/workspace/Lucene-Solr-Tests-trunk-Java7/solr/build/solr-core/test/J1/./org.apache.solr.cloud.CollectionsAPIDistributedZkTest-controljetty-1375542115112/]
   [junit4]   2> 823760 T2115 oashc.HttpShardHandlerFactory.getParameter Setting socketTimeout to: 120000
   [junit4]   2> 823761 T2115 oashc.HttpShardHandlerFactory.getParameter Setting urlScheme to: http://
   [junit4]   2> 823761 T2115 oashc.HttpShardHandlerFactory.getParameter Setting connTimeout to: 15000
   [junit4]   2> 823761 T2115 oashc.HttpShardHandlerFactory.getParameter Setting maxConnectionsPerHost to: 20
   [junit4]   2> 823762 T2115 oashc.HttpShardHandlerFactory.getParameter Setting corePoolSize to: 0
   [junit4]   2> 823762 T2115 oashc.HttpShardHandlerFactory.getParameter Setting maximumPoolSize to: 2147483647
   [junit4]   2> 823763 T2115 oashc.HttpShardHandlerFactory.getParameter Setting maxThreadIdleTime to: 5
   [junit4]   2> 823763 T2115 oashc.HttpShardHandlerFactory.getParameter Setting sizeOfQueue to: -1
   [junit4]   2> 823764 T2115 oashc.HttpShardHandlerFactory.getParameter Setting fairnessPolicy to: false
   [junit4]   2> 823765 T2115 oascsi.HttpClientUtil.createClient Creating new http client, config:maxConnectionsPerHost=20&maxConnections=10000&socketTimeout=120000&connTimeout=15000&retry=false
   [junit4]   2> 823783 T2115 oasc.ZkContainer.initZooKeeper Zookeeper client=127.0.0.1:22930/solr
   [junit4]   2> 823784 T2115 oasc.ZkController.checkChrootPath zkHost includes chroot
   [junit4]   2> 823785 T2115 oascc.ConnectionManager.waitForConnected Waiting for client to connect to ZooKeeper
   [junit4]   2> 823788 T2135 oascc.ConnectionManager.process Watcher org.apache.solr.common.cloud.ConnectionManager@660e378c name:ZooKeeperConnection Watcher:127.0.0.1:22930 got event WatchedEvent state:SyncConnected type:None path:null path:null type:None
   [junit4]   2> 823788 T2115 oascc.ConnectionManager.waitForConnected Client is connected to ZooKeeper
   [junit4]   2> 823798 T2115 oascsi.HttpClientUtil.createClient Creating new http client, config:maxConnections=500&maxConnectionsPerHost=16&socketTimeout=120000&connTimeout=15000
   [junit4]   2> 823811 T2115 oascc.ConnectionManager.waitForConnected Waiting for client to connect to ZooKeeper
   [junit4]   2> 823813 T2137 oascc.ConnectionManager.process Watcher org.apache.solr.common.cloud.ConnectionManager@4a5833ae name:ZooKeeperConnection Watcher:127.0.0.1:22930/solr got event WatchedEvent state:SyncConnected type:None path:null path:null type:None
   [junit4]   2> 823813 T2115 oascc.ConnectionManager.waitForConnected Client is connected to ZooKeeper
   [junit4]   2> 823816 T2115 oascc.SolrZkClient.makePath makePath: /overseer/queue
   [junit4]   2> 823825 T2115 oascc.SolrZkClient.makePath makePath: /overseer/collection-queue-work
   [junit4]   2> 823829 T2115 oascc.SolrZkClient.makePath makePath: /live_nodes
   [junit4]   2> 823859 T2115 oasc.ZkController.createEphemeralLiveNode Register node as live in ZooKeeper:/live_nodes/127.0.0.1:22933_
   [junit4]   2> 823861 T2115 oascc.SolrZkClient.makePath makePath: /live_nodes/127.0.0.1:22933_
   [junit4]   2> 823871 T2115 oascc.SolrZkClient.makePath makePath: /overseer_elect/election
   [junit4]   2> 823884 T2115 oascc.SolrZkClient.makePath makePath: /overseer_elect/leader
   [junit4]   2> 823888 T2115 oasc.Overseer.start Overseer (id=90147528036450307-127.0.0.1:22933_-n_0000000000) starting
   [junit4]   2> 823899 T2115 oascc.SolrZkClient.makePath makePath: /overseer/queue-work
   [junit4]   2> 823909 T2139 oasc.OverseerCollectionProcessor.run Process current queue of collection creations
   [junit4]   2> 823909 T2115 oascc.SolrZkClient.makePath makePath: /clusterstate.json
   [junit4]   2> 823912 T2115 oascc.SolrZkClient.makePath makePath: /aliases.json
   [junit4]   2> 823919 T2115 oascc.ZkStateReader.createClusterStateWatchersAndUpdate Updating cluster state from ZooKeeper... 
   [junit4]   2> 823922 T2138 oasc.Overseer$ClusterStateUpdater.run Starting to work on the main queue
   [junit4]   2> 823926 T2115 oasc.CorePropertiesLocator.discover Looking for core definitions underneath /usr/home/hudson/hudson-slave/workspace/Lucene-Solr-Tests-trunk-Java7/solr/build/solr-core/test/J1/./org.apache.solr.cloud.CollectionsAPIDistributedZkTest-controljetty-1375542115112
   [junit4]   2> 823930 T2115 oasc.CorePropertiesLocator.discoverUnder Found core conf in /usr/home/hudson/hudson-slave/workspace/Lucene-Solr-Tests-trunk-Java7/solr/build/solr-core/test/J1/./org.apache.solr.cloud.CollectionsAPIDistributedZkTest-controljetty-1375542115112/conf/
   [junit4]   2> 824106 T2115 oasc.CorePropertiesLocator.discover Found 1 core definitions
   [junit4]   2> 824107 T2115 oass.SolrDispatchFilter.init user.dir=/usr/home/hudson/hudson-slave/workspace/Lucene-Solr-Tests-trunk-Java7/solr/build/solr-core/test/J1
   [junit4]   2> 824107 T2115 oass.SolrDispatchFilter.init SolrDispatchFilter.init() done
   [junit4]   2> 824108 T2115 oascsi.HttpClientUtil.createClient Creating new http client, config:maxConnections=128&maxConnectionsPerHost=32&followRedirects=false
   [junit4]   2> 824126 T2115 oascsi.HttpClientUtil.createClient Creating new http client, config:
   [junit4]   2> 824128 T2115 oascc.ConnectionManager.waitForConnected Waiting for client to connect to ZooKeeper
   [junit4]   2> 824130 T2142 oascc.ConnectionManager.process Watcher org.apache.solr.common.cloud.ConnectionManager@4805376d name:ZooKeeperConnection Watcher:127.0.0.1:22930/solr got event WatchedEvent state:SyncConnected type:None path:null path:null type:None
   [junit4]   2> 824130 T2115 oascc.ConnectionManager.waitForConnected Client is connected to ZooKeeper
   [junit4]   2> 824133 T2115 oascc.ZkStateReader.createClusterStateWatchersAndUpdate Updating cluster state from ZooKeeper... 
   [junit4]   2> 824135 T2115 oasc.ChaosMonkey.monkeyLog monkey: init - expire sessions:true cause connection loss:true
   [junit4]   2> 824427 T2115 oejs.Server.doStart jetty-8.1.10.v20130312
   [junit4]   2> 824430 T2115 oejs.AbstractConnector.doStart Started SocketConnector@127.0.0.1:22937
   [junit4]   2> 824431 T2115 oass.SolrDispatchFilter.init SolrDispatchFilter.init()
   [junit4]   2> 824431 T2115 oasc.SolrResourceLoader.locateSolrHome JNDI not configured for solr (NoInitialContextEx)
   [junit4]   2> 824432 T2115 oasc.SolrResourceLoader.locateSolrHome using system property solr.solr.home: /usr/home/hudson/hudson-slave/workspace/Lucene-Solr-Tests-trunk-Java7/solr/build/solr-core/test/J1/./org.apache.solr.cloud.CollectionsAPIDistributedZkTest-jetty1-1375542115917
   [junit4]   2> 824432 T2115 oasc.SolrResourceLoader.<init> new SolrResourceLoader for directory: '/usr/home/hudson/hudson-slave/workspace/Lucene-Solr-Tests-trunk-Java7/solr/build/solr-core/test/J1/./org.apache.solr.cloud.CollectionsAPIDistributedZkTest-jetty1-1375542115917/'
   [junit4]   2> 824477 T2115 oasc.ConfigSolr.fromFile Loading container configuration from /usr/home/hudson/hudson-slave/workspace/Lucene-Solr-Tests-trunk-Java7/solr/build/solr-core/test/J1/./org.apache.solr.cloud.CollectionsAPIDistributedZkTest-jetty1-1375542115917/solr.xml
   [junit4]   2> 824575 T2115 oasc.ConfigSolrXml.<init> Config-defined core root directory: 
   [junit4]   2> 824576 T2115 oasc.CoreContainer.<init> New CoreContainer 1345369951
   [junit4]   2> 824576 T2115 oasc.CoreContainer.load Loading cores into CoreContainer [instanceDir=/usr/home/hudson/hudson-slave/workspace/Lucene-Solr-Tests-trunk-Java7/solr/build/solr-core/test/J1/./org.apache.solr.cloud.CollectionsAPIDistributedZkTest-jetty1-1375542115917/]
   [junit4]   2> 824578 T2115 oashc.HttpShardHandlerFactory.getParameter Setting socketTimeout to: 120000
   [junit4]   2> 824578 T2115 oashc.HttpShardHandlerFactory.getParameter Setting urlScheme to: http://
   [junit4]   2> 824578 T2115 oashc.HttpShardHandlerFactory.getParameter Setting connTimeout to: 15000
   [junit4]   2> 824579 T2115 oashc.HttpShardHandlerFactory.getParameter Setting maxConnectionsPerHost to: 20
   [junit4]   2> 824579 T2115 oashc.HttpShardHandlerFactory.getParameter Setting corePoolSize to: 0
   [junit4]   2> 824579 T2115 oashc.HttpShardHandlerFactory.getParameter Setting maximumPoolSize to: 2147483647
   [junit4]   2> 824580 T2115 oashc.HttpShardHandlerFactory.getParameter Setting maxThreadIdleTime to: 5
   [junit4]   2> 824580 T2115 oashc.HttpShardHandlerFactory.getParameter Setting sizeOfQueue to: -1
   [junit4]   2> 824580 T2115 oashc.HttpShardHandlerFactory.getParameter Setting fairnessPolicy to: false
   [junit4]   2> 824581 T2115 oascsi.HttpClientUtil.createClient Creating new http client, config:maxConnectionsPerHost=20&maxConnections=10000&socketTimeout=120000&connTimeout=15000&retry=false
   [junit4]   2> 824593 T2115 oasc.ZkContainer.initZooKeeper Zookeeper client=127.0.0.1:22930/solr
   [junit4]   2> 824593 T2115 oasc.ZkController.checkChrootPath zkHost includes chroot
   [junit4]   2> 824594 T2115 oascc.ConnectionManager.waitForConnected Waiting for client to connect to ZooKeeper
   [junit4]   2> 824597 T2153 oascc.ConnectionManager.process Watcher org.apache.solr.common.cloud.ConnectionManager@25ffdefe name:ZooKeeperConnection Watcher:127.0.0.1:22930 got event WatchedEvent state:SyncConnected type:None path:null path:null type:None
   [junit4]   2> 824597 T2115 oascc.ConnectionManager.waitForConnected Client is connected to ZooKeeper
   [junit4]   2> 824612 T2115 oascsi.HttpClientUtil.createClient Creating new http client, config:maxConnections=500&maxConnectionsPerHost=16&socketTimeout=120000&connTimeout=15000
   [junit4]   2> 824620 T2115 oascc.ConnectionManager.waitForConnected Waiting for client to connect to ZooKeeper
   [junit4]   2> 824622 T2155 oascc.ConnectionManager.process Watcher org.apache.solr.common.cloud.ConnectionManager@137554fc name:ZooKeeperConnection Watcher:127.0.0.1:22930/solr got event WatchedEvent state:SyncConnected type:None path:null path:null type:None
   [junit4]   2> 824622 T2115 oascc.ConnectionManager.waitForConnected Client is connected to ZooKeeper
   [junit4]   2> 824631 T2115 oascc.ZkStateReader.createClusterStateWatchersAndUpdate Updating cluster state from ZooKeeper... 
   [junit4]   2> 825633 T2115 oasc.ZkController.createEphemeralLiveNode Register node as live in ZooKeeper:/live_nodes/127.0.0.1:22937_
   [junit4]   2> 825636 T2115 oascc.SolrZkClient.makePath makePath: /live_nodes/127.0.0.1:22937_
   [junit4]   2> 825639 T2137 oascc.ZkStateReader$3.process Updating live nodes... (2)
   [junit4]   2> 825639 T2142 oascc.ZkStateReader$3.process Updating live nodes... (2)
   [junit4]   2> 825639 T2155 oascc.ZkStateReader$3.process Updating live nodes... (2)
   [junit4]   2> 825646 T2115 oasc.CorePropertiesLocator.discover Looking for core definitions underneath /usr/home/hudson/hudson-slave/workspace/Lucene-Solr-Tests-trunk-Java7/solr/build/solr-core/test/J1/./org.apache.solr.cloud.CollectionsAPIDistributedZkTest-jetty1-1375542115917
   [junit4]   2> 825649 T2115 oasc.CorePropertiesLocator.discoverUnder Found core conf in /usr/home/hudson/hudson-slave/workspace/Lucene-Solr-Tests-trunk-Java7/solr/build/solr-core/test/J1/./org.apache.solr.cloud.CollectionsAPIDistributedZkTest-jetty1-1375542115917/conf/
   [junit4]   2> 825850 T2115 oasc.CorePropertiesLocator.discover Found 1 core definitions
   [junit4]   2> 825852 T2115 oass.SolrDispatchFilter.init user.dir=/usr/home/hudson/hudson-slave/workspace/Lucene-Solr-Tests-trunk-Java7/solr/build/solr-core/test/J1
   [junit4]   2> 825852 T2115 oass.SolrDispatchFilter.init SolrDispatchFilter.init() done
   [junit4]   2> 825853 T2115 oascsi.HttpClientUtil.createClient Creating new http client, config:maxConnections=128&maxConnectionsPerHost=32&followRedirects=false
   [junit4]   2> 826163 T2115 oejs.Server.doStart jetty-8.1.10.v20130312
   [junit4]   2> 826167 T2115 oejs.AbstractConnector.doStart Started SocketConnector@127.0.0.1:22940
   [junit4]   2> 826168 T2115 oass.SolrDispatchFilter.init SolrDispatchFilter.init()
   [junit4]   2> 826168 T2115 oasc.SolrResourceLoader.locateSolrHome JNDI not configured for solr (NoInitialContextEx)
   [junit4]   2> 826169 T2115 oasc.SolrResourceLoader.locateSolrHome using system property solr.solr.home: /usr/home/hudson/hudson-slave/workspace/Lucene-Solr-Tests-trunk-Java7/solr/build/solr-core/test/J1/./org.apache.solr.cloud.CollectionsAPIDistributedZkTest-jetty2-1375542117652
   [junit4]   2> 826169 T2115 oasc.SolrResourceLoader.<init> new SolrResourceLoader for directory: '/usr/home/hudson/hudson-slave/workspace/Lucene-Solr-Tests-trunk-Java7/solr/build/solr-core/test/J1/./org.apache.solr.cloud.CollectionsAPIDistributedZkTest-jetty2-1375542117652/'
   [junit4]   2> 826213 T2115 oasc.ConfigSolr.fromFile Loading container configuration from /usr/home/hudson/hudson-slave/workspace/Lucene-Solr-Tests-trunk-Java7/solr/build/solr-core/test/J1/./org.apache.solr.cloud.CollectionsAPIDistributedZkTest-jetty2-1375542117652/solr.xml
   [junit4]   2> 826314 T2115 oasc.ConfigSolrXml.<init> Config-defined core root directory: 
   [junit4]   2> 826315 T2115 oasc.CoreContainer.<init> New CoreContainer 208878040
   [junit4]   2> 826315 T2115 oasc.CoreContainer.load Loading cores into CoreContainer [instanceDir=/usr/home/hudson/hudson-slave/workspace/Lucene-Solr-Tests-trunk-Java7/solr/build/solr-core/test/J1/./org.apache.solr.cloud.CollectionsAPIDistributedZkTest-jetty2-1375542117652/]
   [junit4]   2> 826317 T2115 oashc.HttpShardHandlerFactory.getParameter Setting socketTimeout to: 120000
   [junit4]   2> 826318 T2115 oashc.HttpShardHandlerFactory.getParameter Setting urlScheme to: http://
   [junit4]   2> 826318 T2115 oashc.HttpShardHandlerFactory.getParameter Setting connTimeout to: 15000
   [junit4]   2> 826319 T2115 oashc.HttpShardHandlerFactory.getParameter Setting maxConnectionsPerHost to: 20
   [junit4]   2> 826319 T2115 oashc.HttpShardHandlerFactory.getParameter Setting corePoolSize to: 0
   [junit4]   2> 826320 T2115 oashc.HttpShardHandlerFactory.getParameter Setting maximumPoolSize to: 2147483647
   [junit4]   2> 826320 T2115 oashc.HttpShardHandlerFactory.getParameter Setting maxThreadIdleTime to: 5
   [junit4]   2> 826321 T2115 oashc.HttpShardHandlerFactory.getParameter Setting sizeOfQueue to: -1
   [junit4]   2> 826321 T2115 oashc.HttpShardHandlerFactory.getParameter Setting fairnessPolicy to: false
   [junit4]   2> 826322 T2115 oascsi.HttpClientUtil.createClient Creating new http client, config:maxConnectionsPerHost=20&maxConnections=10000&socketTimeout=120000&connTimeout=15000&retry=false
   [junit4]   2> 826340 T2115 oasc.ZkContainer.initZooKeeper Zookeeper client=127.0.0.1:22930/solr
   [junit4]   2> 826340 T2115 oasc.ZkController.checkChrootPath zkHost includes chroot
   [junit4]   2> 826341 T2115 oascc.ConnectionManager.waitForConnected Waiting for client to connect to ZooKeeper
   [junit4]   2> 826344 T2167 oascc.ConnectionManager.process Watcher org.apache.solr.common.cloud.ConnectionManager@5b597106 name:ZooKeeperConnection Watcher:127.0.0.1:22930 got event WatchedEvent state:SyncConnected type:None path:null path:null type:None
   [junit4]   2> 826344 T2115 oascc.ConnectionManager.waitForConnected Client is connected to ZooKeeper
   [junit4]   2> 826347 T2115 oascsi.HttpClientUtil.createClient Creating new http client, config:maxConnections=500&maxConnectionsPerHost=16&socketTimeout=120000&connTimeout=15000
   [junit4]   2> 826360 T2115 oascc.ConnectionManager.waitForConnected Waiting for client to connect to ZooKeeper
   [junit4]   2> 826362 T2169 oascc.ConnectionManager.process Watcher org.apache.solr.common.cloud.ConnectionManager@15f2b91a name:ZooKeeperConnection Watcher:127.0.0.1:22930/solr got event WatchedEvent state:SyncConnected type:None path:null path:null type:None
   [junit4]   2> 826362 T2115 oascc.ConnectionManager.waitForConnected Client is connected to ZooKeeper
   [junit4]   2> 826373 T2115 oascc.ZkStateReader.createClusterStateWatchersAndUpdate Updating cluster state from ZooKeeper... 
   [junit4]   2> 827376 T2115 oasc.ZkController.createEphemeralLiveNode Register node as live in ZooKeeper:/live_nodes/127.0.0.1:22940_
   [junit4]   2> 827384 T2115 oascc.SolrZkClient.makePath makePath: /live_nodes/127.0.0.1:22940_
   [junit4]   2> 827387 T2155 oascc.ZkStateReader$3.process Updating live nodes... (3)
   [junit4]   2> 827388 T2142 oascc.ZkStateReader$3.process Updating live nodes... (3)
   [junit4]   2> 827388 T2137 oascc.ZkStateReader$3.process Updating live nodes... (3)
   [junit4]   2> 827388 T2169 oascc.ZkStateReader$3.process Updating live nodes... (3)
   [junit4]   2> 827402 T2115 oasc.CorePropertiesLocator.discover Looking for core definitions underneath /usr/home/hudson/hudson-slave/workspace/Lucene-Solr-Tests-trunk-Java7/solr/build/solr-core/test/J1/./org.apache.solr.cloud.CollectionsAPIDistributedZkTest-jetty2-1375542117652
   [junit4]   2> 827580 T2115 oasc.CorePropertiesLocator.discoverUnder Found core conf in /usr/home/hudson/hudson-slave/workspace/Lucene-Solr-Tests-trunk-Java7/solr/build/solr-core/test/J1/./org.apache.solr.cloud.CollectionsAPIDistributedZkTest-jetty2-1375542117652/conf/
   [junit4]   2> 827587 T2115 oasc.CorePropertiesLocator.discover Found 1 core definitions
   [junit4]   2> 827588 T2115 oass.SolrDispatchFilter.init user.dir=/usr/home/hudson/hudson-slave/workspace/Lucene-Solr-Tests-trunk-Java7/solr/build/solr-core/test/J1
   [junit4]   2> 827588 T2115 oass.SolrDispatchFilter.init SolrDispatchFilter.init() done
   [junit4]   2> 827589 T2115 oascsi.HttpClientUtil.createClient Creating new http client, config:maxConnections=128&maxConnectionsPerHost=32&followRedirects=false
   [junit4]   2> 827887 T2115 oejs.Server.doStart jetty-8.1.10.v20130312
   [junit4]   2> 827890 T2115 oejs.AbstractConnector.doStart Started SocketConnector@127.0.0.1:22943
   [junit4]   2> 827891 T2115 oass.SolrDispatchFilter.init SolrDispatchFilter.init()
   [junit4]   2> 827892 T2115 oasc.SolrResourceLoader.locateSolrHome JNDI not configured for solr (NoInitialContextEx)
   [junit4]   2> 827892 T2115 oasc.SolrResourceLoader.locateSolrHome using system property solr.solr.home: /usr/home/hudson/hudson-slave/workspace/Lucene-Solr-Tests-trunk-Java7/solr/build/solr-core/test/J1/./org.apache.solr.cloud.CollectionsAPIDistributedZkTest-jetty3-1375542119385
   [junit4]   2> 827893 T2115 oasc.SolrResourceLoader.<init> new SolrResourceLoader for directory: '/usr/home/hudson/hudson-slave/workspace/Lucene-Solr-Tests-trunk-Java7/solr/build/solr-core/test/J1/./org.apache.solr.cloud.CollectionsAPIDistributedZkTest-jetty3-1375542119385/'
   [junit4]   2> 827933 T2115 oasc.ConfigSolr.fromFile Loading container configuration from /usr/home/hudson/hudson-slave/workspace/Lucene-Solr-Tests-trunk-Java7/solr/build/solr-core/test/J1/./org.apache.solr.cloud.CollectionsAPIDistributedZkTest-jetty3-1375542119385/solr.xml
   [junit4]   2> 828025 T2115 oasc.ConfigSolrXml.<init> Config-defined core root directory: 
   [junit4]   2> 828026 T2115 oasc.CoreContainer.<init> New CoreContainer 333352415
   [junit4]   2> 828026 T2115 oasc.CoreContainer.load Loading cores into CoreContainer [instanceDir=/usr/home/hudson/hudson-slave/workspace/Lucene-Solr-Tests-trunk-Java7/solr/build/solr-core/test/J1/./org.apache.solr.cloud.CollectionsAPIDistributedZkTest-jetty3-1375542119385/]
   [junit4]   2> 828028 T2115 oashc.HttpShardHandlerFactory.getParameter Setting socketTimeout to: 120000
   [junit4]   2> 828029 T2115 oashc.HttpShardHandlerFactory.getParameter Setting urlScheme to: http://
   [junit4]   2> 828029 T2115 oashc.HttpShardHandlerFactory.getParameter Setting connTimeout to: 15000
   [junit4]   2> 828030 T2115 oashc.HttpShardHandlerFactory.getParameter Setting maxConnectionsPerHost to: 20
   [junit4]   2> 828030 T2115 oashc.HttpShardHandlerFactory.getParameter Setting corePoolSize to: 0
   [junit4]   2> 828031 T2115 oashc.HttpShardHandlerFactory.getParameter Setting maximumPoolSize to: 2147483647
   [junit4]   2> 828031 T2115 oashc.HttpShardHandlerFactory.getParameter Setting maxThreadIdleTime to: 5
   [junit4]   2> 828032 T2115 oashc.HttpShardHandlerFactory.getParameter Setting sizeOfQueue to: -1
   [junit4]   2> 828032 T2115 oashc.HttpShardHandlerFactory.getParameter Setting fairnessPolicy to: false
   [junit4]   2> 828033 T2115 oascsi.HttpClientUtil.createClient Creating new http client, config:maxConnectionsPerHost=20&maxConnections=10000&socketTimeout=120000&connTimeout=15000&retry=false
   [junit4]   2> 828049 T2115 oasc.ZkContainer.initZooKeeper Zookeeper client=127.0.0.1:22930/solr
   [junit4]   2> 828050 T2115 oasc.ZkController.checkChrootPath zkHost includes chroot
   [junit4]   2> 828052 T2115 oascc.ConnectionManager.waitForConnected Waiting for client to connect to ZooKeeper
   [junit4]   2> 828057 T2181 oascc.ConnectionManager.process Watcher org.apache.solr.common.cloud.ConnectionManager@ef1ad77 name:ZooKeeperConnection Watcher:127.0.0.1:22930 got event WatchedEvent state:SyncConnected type:None path:null path:null type:None
   [junit4]   2> 828057 T2115 oascc.ConnectionManager.waitForConnected Client is connected to ZooKeeper
   [junit4]   2> 828061 T2115 oascsi.HttpClientUtil.createClient Creating new http client, config:maxConnections=500&maxConnectionsPerHost=16&socketTimeout=120000&connTimeout=15000
   [junit4]   2> 828072 T2115 oascc.ConnectionManager.waitForConnected Waiting for client to connect to ZooKeeper
   [junit4]   2> 828074 T2183 oascc.ConnectionManager.process Watcher org.apache.solr.common.cloud.ConnectionManager@1033c7d name:ZooKeeperConnection Watcher:127.0.0.1:22930/solr got event WatchedEvent state:SyncConnected type:None path:null path:null type:None
   [junit4]   2> 828074 T2115 oascc.ConnectionManager.waitForConnected Client is connected to ZooKeeper
   [junit4]   2> 828086 T2115 oascc.ZkStateReader.createClusterStateWatchersAndUpdate Updating cluster state from ZooKeeper... 
   [junit4]   2> 829089 T2115 oasc.ZkController.createEphemeralLiveNode Register node as live in ZooKeeper:/live_nodes/127.0.0.1:22943_
   [junit4]   2> 829092 T2115 oascc.SolrZkClient.makePath makePath: /live_nodes/127.0.0.1:22943_
   [junit4]   2> 829095 T2169 oascc.ZkStateReader$3.process Updating live nodes... (4)
   [junit4]   2> 829096 T2142 oascc.ZkStateReader$3.process Updating live nodes... (4)
   [junit4]   2> 829096 T2137 oascc.ZkStateReader$3.process Updating live nodes... (4)
   [junit4]   2> 829096 T2183 oascc.ZkStateReader$3.process Updating live nodes... (4)
   [junit4]   2> 829095 T2155 oascc.ZkStateReader$3.process Updating live nodes... (4)
   [junit4]   2> 829113 T2115 oasc.CorePropertiesLocator.discover Looking for core definitions underneath /usr/home/hudson/hudson-slave/workspace/Lucene-Solr-Tests-trunk-Java7/solr/build/solr-core/test/J1/./org.apache.solr.cloud.CollectionsAPIDistributedZkTest-jetty3-1375542119385
   [junit4]   2> 829313 T2115 oasc.CorePropertiesLocator.discoverUnder Found core conf in /usr/home/hudson/hudson-slave/workspace/Lucene-Solr-Tests-trunk-Java7/solr/build/solr-core/test/J1/./org.apache.solr.cloud.CollectionsAPIDistributedZkTest-jetty3-1375542119385/conf/
   [junit4]   2> 829317 T2115 oasc.CorePropertiesLocator.discover Found 1 core definitions
   [junit4]   2> 829317 T2115 oass.SolrDispatchFilter.init user.dir=/usr/home/hudson/hudson-slave/workspace/Lucene-Solr-Tests-trunk-Java7/solr/build/solr-core/test/J1
   [junit4]   2> 829318 T2115 oass.SolrDispatchFilter.init SolrDispatchFilter.init() done
   [junit4]   2> 829318 T2115 oascsi.HttpClientUtil.createClient Creating new http client, config:maxConnections=128&maxConnectionsPerHost=32&followRedirects=false
   [junit4]   2> 829637 T2115 oejs.Server.doStart jetty-8.1.10.v20130312
   [junit4]   2> 829641 T2115 oejs.AbstractConnector.doStart Started SocketConnector@127.0.0.1:16058
   [junit4]   2> 829641 T2115 oass.SolrDispatchFilter.init SolrDispatchFilter.init()
   [junit4]   2> 829642 T2115 oasc.SolrResourceLoader.locateSolrHome JNDI not configured for solr (NoInitialContextEx)
   [junit4]   2> 829642 T2115 oasc.SolrResourceLoader.locateSolrHome using system property solr.solr.home: /usr/home/hudson/hudson-slave/workspace/Lucene-Solr-Tests-trunk-Java7/solr/build/solr-core/test/J1/./org.apache.solr.cloud.CollectionsAPIDistributedZkTest-jetty4-1375542121117
   [junit4]   2> 829643 T2115 oasc.SolrResourceLoader.<init> new SolrResourceLoader for directory: '/usr/home/hudson/hudson-slave/workspace/Lucene-Solr-Tests-trunk-Java7/solr/build/solr-core/test/J1/./org.apache.solr.cloud.CollectionsAPIDistributedZkTest-jetty4-1375542121117/'
   [junit4]   2> 829685 T2115 oasc.ConfigSolr.fromFile Loading container configuration from /usr/home/hudson/hudson-slave/workspace/Lucene-Solr-Tests-trunk-Java7/solr/build/solr-core/test/J1/./org.apache.solr.cloud.CollectionsAPIDistributedZkTest-jetty4-1375542121117/solr.xml
   [junit4]   2> 829777 T2115 oasc.ConfigSolrXml.<init> Config-defined core root directory: 
   [junit4]   2> 829778 T2115 oasc.CoreContainer.<init> New CoreContainer 1512990020
   [junit4]   2> 829778 T2115 oasc.CoreContainer.load Loading cores into CoreContainer [instanceDir=/usr/home/hudson/hudson-slave/workspace/Lucene-Solr-Tests-trunk-Java7/solr/build/solr-core/test/J1/./org.apache.solr.cloud.CollectionsAPIDistributedZkTest-jetty4-1375542121117/]
   [junit4]   2> 829781 T2115 oashc.HttpShardHandlerFactory.getParameter Setting socketTimeout to: 120000
   [junit4]   2> 829781 T2115 oashc.HttpShardHandlerFactory.getParameter Setting urlScheme to: http://
   [junit4]   2> 829782 T2115 oashc.HttpShardHandlerFactory.getParameter Setting connTimeout to: 15000
   [junit4]   2> 829782 T2115 oashc.HttpShardHandlerFactory.getParameter Setting maxConnectionsPerHost to: 20
   [junit4]   2> 829783 T2115 oashc.HttpShardHandlerFactory.getParameter Setting corePoolSize to: 0
   [junit4]   2> 829783 T2115 oashc.HttpShardHandlerFactory.getParameter Setting maximumPoolSize to: 2147483647
   [junit4]   2> 829784 T2115 oashc.HttpShardHandlerFactory.getParameter Setting maxThreadIdleTime to: 5
   [junit4]   2> 829784 T2115 oashc.HttpShardHandlerFactory.getParameter Setting sizeOfQueue to: -1
   [junit4]   2> 829785 T2115 oashc.HttpShardHandlerFactory.getParameter Setting fairnessPolicy to: false
   [junit4]   2> 829785 T2115 oascsi.HttpClientUtil.createClient Creating new http client, config:maxConnectionsPerHost=20&maxConnections=10000&socketTimeout=120000&connTimeout=15000&retry=false
   [junit4]   2> 829802 T2115 oasc.ZkContainer.initZooKeeper Zookeeper client=127.0.0.1:22930/solr
   [junit4]   2> 829803 T2115 oasc.ZkController.checkChrootPath zkHost includes chroot
   [junit4]   2> 829804 T2115 oascc.ConnectionManager.waitForConnected Waiting for client to connect to ZooKeeper
   [junit4]   2> 829832 T2195 oascc.ConnectionManager.process Watcher org.apache.solr.common.cloud.ConnectionManager@451dbab3 name:ZooKeeperConnection Watcher:127.0.0.1:22930 got event WatchedEvent state:SyncConnected type:None path:null path:null type:None
   [junit4]   2> 829832 T2115 oascc.ConnectionManager.waitForConnected Client is connected to ZooKeeper
   [junit4]   2> 829835 T2115 oascsi.HttpClientUtil.createClient Creating new http client, config:maxConnections=500&maxConnectionsPerHost=16&socketTimeout=120000&connTimeout=15000
   [junit4]   2> 829846 T2115 oascc.ConnectionManager.waitForConnected Waiting for client to connect to ZooKeeper
   [junit4]   2> 829848 T2197 oascc.ConnectionManager.process Watcher org.apache.solr.common.cloud.ConnectionManager@dd8901e name:ZooKeeperConnection Watcher:127.0.0.1:22930/solr got event WatchedEvent state:SyncConnected type:None path:null path:null type:None
   [junit4]   2> 829848 T2115 oascc.ConnectionManager.waitForConnected Client is connected to ZooKeeper
   [junit4]   2> 829860 T2115 oascc.ZkStateReader.createClusterStateWatchersAndUpdate Updating cluster state from ZooKeeper... 
   [junit4]   2> 830864 T2115 oasc.ZkController.createEphemeralLiveNode Register node as live in ZooKeeper:/live_nodes/127.0.0.1:16058_
   [junit4]   2> 830869 T2115 oascc.SolrZkClient.makePath makePath: /live_nodes/127.0.0.1:16058_
   [junit4]   2> 830874 T2169 oascc.ZkStateReader$3.process Updating live nodes... (5)
   [junit4]   2> 830874 T2183 oascc.ZkStateReader$3.process Updating live nodes... (5)
   [junit4]   2> 830874 T2197 oascc.ZkStateReader$3.process Updating live nodes... (5)
   [junit4]   2> 830874 T2142 oascc.ZkStateReader$3.process Updating live nodes... (5)
   [junit4]   2> 830874 T2137 oascc.ZkStateReader$3.process Updating live nodes... (5)
   [junit4]   2> 830874 T2155 oascc.ZkStateReader$3.process Updating live nodes... (5)
   [junit4]   2> 830889 T2115 oasc.CorePropertiesLocator.discover Looking for core definitions underneath /usr/home/hudson/hudson-slave/workspace/Lucene-Solr-Tests-trunk-Java7/solr/build/solr-core/test/J1/./org.apache.solr.cloud.CollectionsAPIDistributedZkTest-jetty4-1375542121117
   [junit4]   2> 830892 T2115 oasc.CorePropertiesLocator.discoverUnder Found core conf in /usr/home/hudson/hudson-slave/workspace/Lucene-Solr-Tests-trunk-Java7/solr/build/solr-core/test/J1/./org.apache.solr.cloud.CollectionsAPIDistributedZkTest-jetty4-1375542121117/conf/
   [junit4]   2> 831083 T2115 oasc.CorePropertiesLocator.discover Found 1 core definitions
   [junit4]   2> 831084 T2115 oass.SolrDispatchFilter.init user.dir=/usr/home/hudson/hudson-slave/workspace/Lucene-Solr-Tests-trunk-Java7/solr/build/solr-core/test/J1
   [junit4]   2> 831085 T2115 oass.SolrDispatchFilter.init SolrDispatchFilter.init() done
   [junit4]   2> 831085 T2115 oascsi.HttpClientUtil.createClient Creating new http client, config:maxConnections=128&maxConnectionsPerHost=32&followRedirects=false
   [junit4]   2> 831102 T2115 oascsi.HttpClientUtil.createClient Creating new http client, config:maxConnections=128&maxConnectionsPerHost=32&followRedirects=false
   [junit4]   2> 831114 T2145 oasha.CollectionsHandler.handleCreateAction Creating Collection : numShards=2&name=nodes_used_collection&replicationFactor=2&action=CREATE&wt=javabin&version=2
   [junit4]   2> 831116 T2137 oasc.DistributedQueue$LatchChildWatcher.process Watcher fired on path: /overseer/collection-queue-work state: SyncConnected type NodeChildrenChanged
   [junit4]   2> 831118 T2139 oasc.OverseerCollectionProcessor.run Overseer Collection Processor: Get the message id:/overseer/collection-queue-work/qn-0000000000 message:{
   [junit4]   2> 	  "operation":"createcollection",
   [junit4]   2> 	  "numShards":"2",
   [junit4]   2> 	  "name":"nodes_used_collection",
   [junit4]   2> 	  "replicationFactor":"2"}
   [junit4]   2> 831118 T2139 oasc.OverseerCollectionProcessor.processMessage WARN OverseerCollectionProcessor.processMessage : createcollection , {
   [junit4]   2> 	  "operation":"createcollection",
   [junit4]   2> 	  "numShards":"2",
   [junit4]   2> 	  "name":"nodes_used_collection",
   [junit4]   2> 	  "replicationFactor":"2"}
   [junit4]   2> 831435 T2138 oascc.ZkStateReader.updateClusterState Updating cloud state from ZooKeeper... 
   [junit4]   2> 831436 T2138 oasc.Overseer$ClusterStateUpdater.buildCollection building a new collection: nodes_used_collection
   [junit4]   2> 831436 T2138 oasc.Overseer$ClusterStateUpdater.createCollection Create collection nodes_used_collection with shards [shard1, shard2]
   [junit4]   2> 831450 T2155 oascc.ZkStateReader$2.process A cluster state change: WatchedEvent state:SyncConnected type:NodeDataChanged path:/clusterstate.json, has occurred - updating... (live nodes size: 5)
   [junit4]   2> 831450 T2197 oascc.ZkStateReader$2.process A cluster state change: WatchedEvent state:SyncConnected type:NodeDataChanged path:/clusterstate.json, has occurred - updating... (live nodes size: 5)
   [junit4]   2> 831450 T2142 oascc.ZkStateReader$2.process A cluster state change: WatchedEvent state:SyncConnected type:NodeDataChanged path:/clusterstate.json, has occurred - updating... (live nodes size: 5)
   [junit4]   2> 831450 T2137 oascc.ZkStateReader$2.process A cluster state change: WatchedEvent state:SyncConnected type:NodeDataChanged path:/clusterstate.json, has occurred - updating... (live nodes size: 5)
   [junit4]   2> 831450 T2183 oascc.ZkStateReader$2.process A cluster state change: WatchedEvent state:SyncConnected type:NodeDataChanged path:/clusterstate.json, has occurred - updating... (live nodes size: 5)
   [junit4]   2> 831450 T2169 oascc.ZkStateReader$2.process A cluster state change: WatchedEvent state:SyncConnected type:NodeDataChanged path:/clusterstate.json, has occurred - updating... (live nodes size: 5)
   [junit4]   2> 831538 T2139 oasc.OverseerCollectionProcessor.createCollection going to create cores replicas shardNames [shard1, shard2] , repFactor : 2
   [junit4]   2> 831538 T2139 oasc.OverseerCollectionProcessor.createCollection Creating shard nodes_used_collection_shard1_replica1 as part of slice shard1 of collection nodes_used_collection on 127.0.0.1:22937_
   [junit4]   2> 831539 T2139 oasc.OverseerCollectionProcessor.createCollection Creating shard nodes_used_collection_shard1_replica2 as part of slice shard1 of collection nodes_used_collection on 127.0.0.1:22933_
   [junit4]   2> 831540 T2139 oasc.OverseerCollectionProcessor.createCollection Creating shard nodes_used_collection_shard2_replica1 as part of slice shard2 of collection nodes_used_collection on 127.0.0.1:16058_
   [junit4]   2> 831541 T2139 oasc.OverseerCollectionProcessor.createCollection Creating shard nodes_used_collection_shard2_replica2 as part of slice shard2 of collection nodes_used_collection on 127.0.0.1:22943_
   [junit4]   2> 831544 T2146 oasc.ZkController.publish publishing core=nodes_used_collection_shard1_replica1 state=down
   [junit4]   2> 831545 T2173 oasc.ZkController.publish publishing core=nodes_used_collection_shard2_replica2 state=down
   [junit4]   2> 831544 T2187 oasc.ZkController.publish publishing core=nodes_used_collection_shard2_replica1 state=down
   [junit4]   2> 831544 T2127 oasc.ZkController.publish publishing core=nodes_used_collection_shard1_replica2 state=down
   [junit4]   2> 831547 T2146 oasc.ZkController.waitForCoreNodeName look for our core node name
   [junit4]   2> 831547 T2173 oasc.ZkController.waitForCoreNodeName look for our core node name
   [junit4]   2> 831547 T2187 oasc.ZkController.waitForCoreNodeName look for our core node name
   [junit4]   2> 831558 T2127 oasc.ZkController.waitForCoreNodeName look for our core node name
   [junit4]   2> 832956 T2138 oascc.ZkStateReader.updateClusterState Updating cloud state from ZooKeeper... 
   [junit4]   2> 832958 T2138 oasc.Overseer$ClusterStateUpdater.updateState WARN Could not find collection node for nodes_used_collection, skipping publish state
   [junit4]   2> 832958 T2138 oasc.Overseer$ClusterStateUpdater.updateState Update state numShards=2 message={
   [junit4]   2> 	  "operation":"state",
   [junit4]   2> 	  "core_node_name":"core_node1",
   [junit4]   2> 	  "numShards":"2",
   [junit4]   2> 	  "shard":"shard1",
   [junit4]   2> 	  "roles":null,
   [junit4]   2> 	  "state":"down",
   [junit4]   2> 	  "shard_state":"active",
   [junit4]   2> 	  "core":"nodes_used_collection_shard1_replica1",
   [junit4]   2> 	  "collection":"nodes_used_collection",
   [junit4]   2> 	  "shard_range":null,
   [junit4]   2> 	  "node_name":"127.0.0.1:22937_",
   [junit4]   2> 	  "base_url":"http://127.0.0.1:22937"}
   [junit4]   2> 832968 T2138 oasc.Overseer$ClusterStateUpdater.updateState WARN Could not find collection node for nodes_used_collection, skipping publish state
   [junit4]   2> 832968 T2138 oasc.Overseer$ClusterStateUpdater.updateState Update state numShards=2 message={
   [junit4]   2> 	  "operation":"state",
   [junit4]   2> 	  "core_node_name":"core_node2",
   [junit4]   2> 	  "numShards":"2",
   [junit4]   2> 	  "shard":"shard2",
   [junit4]   2> 	  "roles":null,
   [junit4]   2> 	  "state":"down",
   [junit4]   2> 	  "shard_state":"active",
   [junit4]   2> 	  "core":"nodes_used_collection_shard2_replica2",
   [junit4]   2> 	  "collection":"nodes_used_collection",
   [junit4]   2> 	  "shard_range":null,
   [junit4]   2> 	  "node_name":"127.0.0.1:22943_",
   [junit4]   2> 	  "base_url":"http://127.0.0.1:22943"}
   [junit4]   2> 832988 T2138 oasc.Overseer$ClusterStateUpdater.updateState WARN Could not find collection node for nodes_used_collection, skipping publish state
   [junit4]   2> 832988 T2138 oasc.Overseer$ClusterStateUpdater.updateState Update state numShards=2 message={
   [junit4]   2> 	  "operation":"state",
   [junit4]   2> 	  "core_node_name":"core_node3",
   [junit4]   2> 	  "numShards":"2",
   [junit4]   2> 	  "shard":"shard2",
   [junit4]   2> 	  "roles":null,
   [junit4]   2> 	  "state":"down",
   [junit4]   2> 	  "shard_state":"active",
   [junit4]   2> 	  "core":"nodes_used_collection_shard2_replica1",
   [junit4]   2> 	  "collection":"nodes_used_collection",
   [junit4]   2> 	  "shard_range":null,
   [junit4]   2> 	  "node_name":"127.0.0.1:16058_",
   [junit4]   2> 	  "base_url":"http://127.0.0.1:16058"}
   [junit4]   2> 833001 T2138 oasc.Overseer$ClusterStateUpdater.updateState WARN Could not find collection node for nodes_used_collection, skipping publish state
   [junit4]   2> 833001 T2138 oasc.Overseer$ClusterStateUpdater.updateState Update state numShards=2 message={
   [junit4]   2> 	  "operation":"state",
   [junit4]   2> 	  "core_node_name":"core_node4",
   [junit4]   2> 	  "numShards":"2",
   [junit4]   2> 	  "shard":"shard1",
   [junit4]   2> 	  "roles":null,
   [junit4]   2> 	  "state":"down",
   [junit4]   2> 	  "shard_state":"active",
   [junit4]   2> 	  "core":"nodes_used_collection_shard1_replica2",
   [junit4]   2> 	  "collection":"nodes_used_collection",
   [junit4]   2> 	  "shard_range":null,
   [junit4]   2> 	  "node_name":"127.0.0.1:22933_",
   [junit4]   2> 	  "base_url":"http://127.0.0.1:22933"}
   [junit4]   2> 833023 T2169 oascc.ZkStateReader$2.process A cluster state change: WatchedEvent state:SyncConnected type:NodeDataChanged path:/clusterstate.json, has occurred - updating... (live nodes size: 5)
   [junit4]   2> 833023 T2142 oascc.ZkStateReader$2.process A cluster state change: WatchedEvent state:SyncConnected type:NodeDataChanged path:/clusterstate.json, has occurred - updating... (live nodes size: 5)
   [junit4]   2> 833023 T2197 oascc.ZkStateReader$2.process A cluster state change: WatchedEvent state:SyncConnected type:NodeDataChanged path:/clusterstate.json, has occurred - updating... (live nodes size: 5)
   [junit4]   2> 833023 T2183 oascc.ZkStateReader$2.process A cluster state change: WatchedEvent state:SyncConnected type:NodeDataChanged path:/clusterstate.json, has occurred - updating... (live nodes size: 5)
   [junit4]   2> 833023 T2137 oascc.ZkStateReader$2.process A cluster state change: WatchedEvent state:SyncConnected type:NodeDataChanged path:/clusterstate.json, has occurred - updating... (live nodes size: 5)
   [junit4]   2> 833023 T2155 oascc.ZkStateReader$2.process A cluster state change: WatchedEvent state:SyncConnected type:NodeDataChanged path:/clusterstate.json, has occurred - updating... (live nodes size: 5)
   [junit4]   2> 833549 T2146 oasc.ZkController.waitForShardId waiting to find shard id in clusterstate for nodes_used_collection_shard1_replica1
   [junit4]   2> 833549 T2173 oasc.ZkController.waitForShardId waiting to find shard id in clusterstate for nodes_used_collection_shard2_replica2
   [junit4]   2> 833550 T2187 oasc.ZkController.waitForShardId waiting to find shard id in clusterstate for nodes_used_collection_shard2_replica1
   [junit4]   2> 833550 T2146 oasc.CorePropertiesLocator.writePropertiesFile ERROR Couldn't persist core properties to /usr/home/hudson/hudson-slave/workspace/Lucene-Solr-Tests-trunk-Java7/solr/build/solr-core/test/J1/./org.apache.solr.cloud.CollectionsAPIDistributedZkTest-jetty1-1375542115917/nodes_used_collection_shard1_replica1/core.properties: java.io.FileNotFoundException: /usr/home/hudson/hudson-slave/workspace/Lucene-Solr-Tests-trunk-Java7/solr/build/solr-core/test/J1/./org.apache.solr.cloud.CollectionsAPIDistributedZkTest-jetty1-1375542115917/nodes_used_collection_shard1_replica1/core.properties (No such file or directory)
   [junit4]   2> 833551 T2146 oasc.CoreContainer.create Creating SolrCore 'nodes_used_collection_shard1_replica1' using instanceDir: /usr/home/hudson/hudson-slave/workspace/Lucene-Solr-Tests-trunk-Java7/solr/build/solr-core/test/J1/./org.apache.solr.cloud.CollectionsAPIDistributedZkTest-jetty1-1375542115917/nodes_used_collection_shard1_replica1
   [junit4]   2> 833551 T2146 oasc.ZkController.createCollectionZkNode Check for collection zkNode:nodes_used_collection
   [junit4]   2> 833551 T2173 oasc.CorePropertiesLocator.writePropertiesFile ERROR Couldn't persist core properties to /usr/home/hudson/hudson-slave/workspace/Lucene-Solr-Tests-trunk-Java7/solr/build/solr-core/test/J1/./org.apache.solr.cloud.CollectionsAPIDistributedZkTest-jetty3-1375542119385/nodes_used_collection_shard2_replica2/core.properties: java.io.FileNotFoundException: /usr/home/hudson/hudson-slave/workspace/Lucene-Solr-Tests-trunk-Java7/solr/build/solr-core/test/J1/./org.apache.solr.cloud.CollectionsAPIDistributedZkTest-jetty3-1375542119385/nodes_used_collection_shard2_replica2/core.properties (No such file or directory)
   [junit4]   2> 833551 T2187 oasc.CorePropertiesLocator.writePropertiesFile ERROR Couldn't persist core properties to /usr/home/hudson/hudson-slave/workspace/Lucene-Solr-Tests-trunk-Java7/solr/build/solr-core/test/J1/./org.apache.solr.cloud.CollectionsAPIDistributedZkTest-jetty4-1375542121117/nodes_used_collection_shard2_replica1/core.properties: java.io.FileNotFoundException: /usr/home/hudson/hudson-slave/workspace/Lucene-Solr-Tests-trunk-Java7/solr/build/solr-core/test/J1/./org.apache.solr.cloud.CollectionsAPIDistributedZkTest-jetty4-1375542121117/nodes_used_collection_shard2_replica1/core.properties (No such file or directory)
   [junit4]   2> 833552 T2146 oasc.ZkController.createCollectionZkNode Creating collection in ZooKeeper:nodes_used_collection
   [junit4]   2> 833552 T2173 oasc.CoreContainer.create Creating SolrCore 'nodes_used_collection_shard2_replica2' using instanceDir: /usr/home/hudson/hudson-slave/workspace/Lucene-Solr-Tests-trunk-Java7/solr/build/solr-core/test/J1/./org.apache.solr.cloud.CollectionsAPIDistributedZkTest-jetty3-1375542119385/nodes_used_collection_shard2_replica2
   [junit4]   2> 833553 T2146 oasc.ZkController.getConfName Looking for collection configName
   [junit4]   2> 833552 T2187 oasc.CoreContainer.create Creating SolrCore 'nodes_used_collection_shard2_replica1' using instanceDir: /usr/home/hudson/hudson-slave/workspace/Lucene-Solr-Tests-trunk-Java7/solr/build/solr-core/test/J1/./org.apache.solr.cloud.CollectionsAPIDistributedZkTest-jetty4-1375542121117/nodes_used_collection_shard2_replica1
   [junit4]   2> 833553 T2173 oasc.ZkController.createCollectionZkNode Check for collection zkNode:nodes_used_collection
   [junit4]   2> 833554 T2187 oasc.ZkController.createCollectionZkNode Check for collection zkNode:nodes_used_collection
   [junit4]   2> 833554 T2146 oasc.ZkController.getConfName Only one config set found in zk - using it:conf1
   [junit4]   2> 833554 T2173 oasc.ZkController.createCollectionZkNode Creating collection in ZooKeeper:nodes_used_collection
   [junit4]   2> 833555 T2187 oasc.ZkController.createCollectionZkNode Creating collection in ZooKeeper:nodes_used_collection
   [junit4]   2> 833555 T2146 oascc.SolrZkClient.makePath makePath: /collections/nodes_used_collection
   [junit4]   2> 833555 T2187 oasc.ZkController.getConfName Looking for collection configName
   [junit4]   2> 833555 T2173 oasc.ZkController.getConfName Looking for collection configName
   [junit4]   2> 833557 T2187 oasc.ZkController.getConfName Only one config set found in zk - using it:conf1
   [junit4]   2> 833557 T2187 oascc.SolrZkClient.makePath makePath: /collections/nodes_used_collection
   [junit4]   2> 833560 T2127 oasc.ZkController.waitForShardId waiting to find shard id in clusterstate for nodes_used_collection_shard1_replica2
   [junit4]   2> 833561 T2127 oasc.CorePropertiesLocator.writePropertiesFile ERROR Couldn't persist core properties to /usr/home/hudson/hudson-slave/workspace/Lucene-Solr-Tests-trunk-Java7/solr/build/solr-core/test/J1/./org.apache.solr.cloud.CollectionsAPIDistributedZkTest-controljetty-1375542115112/nodes_used_collection_shard1_replica2/core.properties: java.io.FileNotFoundException: /usr/home/hudson/hudson-slave/workspace/Lucene-Solr-Tests-trunk-Java7/solr/build/solr-core/test/J1/./org.apache.solr.cloud.CollectionsAPIDistributedZkTest-controljetty-1375542115112/nodes_used_collection_shard1_replica2/core.properties (No such file or directory)
   [junit4]   2> 833561 T2127 oasc.CoreContainer.create Creating SolrCore 'nodes_used_collection_shard1_replica2' using instanceDir: /usr/home/hudson/hudson-slave/workspace/Lucene-Solr-Tests-trunk-Java7/solr/build/solr-core/test/J1/./org.apache.solr.cloud.CollectionsAPIDistributedZkTest-controljetty-1375542115112/nodes_used_collection_shard1_replica2
   [junit4]   2> 833562 T2127 oasc.ZkController.createCollectionZkNode Check for collection zkNode:nodes_used_collection
   [junit4]   2> 833567 T2173 oasc.ZkController.getConfName Only one config set found in zk - using it:conf1
   [junit4]   2> 833567 T2146 oasc.ZkController.readConfigName Load collection config from:/collections/nodes_used_collection
   [junit4]   2> 833567 T2127 oasc.ZkController.createCollectionZkNode Collection zkNode exists
   [junit4]   2> 833568 T2127 oasc.ZkController.readConfigName Load collection config from:/collections/nodes_used_collection
   [junit4]   2> 833568 T2173 oascc.SolrZkClient.makePath makePath: /collections/nodes_used_collection
   [junit4]   2> 833569 T2187 oasc.ZkController.readConfigName Load collection config from:/collections/nodes_used_collection
   [junit4]   2> 833569 T2146 oasc.SolrResourceLoader.<init> new SolrResourceLoader for directory: '/usr/home/hudson/hudson-slave/workspace/Lucene-Solr-Tests-trunk-Java7/solr/build/solr-core/test/J1/./org.apache.solr.cloud.CollectionsAPIDistributedZkTest-jetty1-1375542115917/nodes_used_collection_shard1_replica1/'
   [junit4]   2> 833570 T2127 oasc.SolrResourceLoader.<init> new SolrResourceLoader for directory: '/usr/home/hudson/hudson-slave/workspace/Lucene-Solr-Tests-trunk-Java7/solr/build/solr-core/test/J1/./org.apache.solr.cloud.CollectionsAPIDistributedZkTest-controljetty-1375542115112/nodes_used_collection_shard1_replica2/'
   [junit4]   2> 833571 T2173 oasc.ZkController.readConfigName Load collection config from:/collections/nodes_used_collection
   [junit4]   2> 833571 T2187 oasc.SolrResourceLoader.<init> new SolrResourceLoader for directory: '/usr/home/hudson/hudson-slave/workspace/Lucene-Solr-Tests-trunk-Java7/solr/build/solr-core/test/J1/./org.apache.solr.cloud.CollectionsAPIDistributedZkTest-jetty4-1375542121117/nodes_used_collection_shard2_replica1/'
   [junit4]   2> 833572 T2173 oasc.SolrResourceLoader.<init> new SolrResourceLoader for directory: '/usr/home/hudson/hudson-slave/workspace/Lucene-Solr-Tests-trunk-Java7/solr/build/solr-core/test/J1/./org.apache.solr.cloud.CollectionsAPIDistributedZkTest-jetty3-1375542119385/nodes_used_collection_shard2_replica2/'
   [junit4]   2> 833701 T2187 oasc.SolrConfig.<init> Using Lucene MatchVersion: LUCENE_50
   [junit4]   2> 833701 T2173 oasc.SolrConfig.<init> Using Lucene MatchVersion: LUCENE_50
   [junit4]   2> 833715 T2146 oasc.SolrConfig.<init> Using Lucene MatchVersion: LUCENE_50
   [junit4]   2> 833715 T2127 oasc.SolrConfig.<init> Using Lucene MatchVersion: LUCENE_50
   [junit4]   2> 833787 T2173 oasc.SolrConfig.<init> Loaded SolrConfig: solrconfig.xml
   [junit4]   2> 833799 T2187 oasc.SolrConfig.<init> Loaded SolrConfig: solrconfig.xml
   [junit4]   2> 833816 T2146 oasc.SolrConfig.<init> Loaded SolrConfig: solrconfig.xml
   [junit4]   2> 833817 T2127 oasc.SolrConfig.<init> Loaded SolrConfig: solrconfig.xml
   [junit4]   2> 833889 T2173 oass.IndexSchema.readSchema Reading Solr Schema from schema.xml
   [junit4]   2> 833900 T2187 oass.IndexSchema.readSchema Reading Solr Schema from schema.xml
   [junit4]   2> 833901 T2173 oass.IndexSchema.readSchema [nodes_used_collection_shard2_replica2] Schema name=test
   [junit4]   2> 833909 T2187 oass.IndexSchema.readSchema [nodes_used_collection_shard2_replica1] Schema name=test
   [junit4]   2> 833918 T2146 oass.IndexSchema.readSchema Reading Solr Schema from schema.xml
   [junit4]   2> 833918 T2127 oass.IndexSchema.readSchema Reading Solr Schema from schema.xml
   [junit4]   2> 833931 T2146 oass.IndexSchema.readSchema [nodes_used_collection_shard1_replica1] Schema name=test
   [junit4]   2> 833931 T2127 oass.IndexSchema.readSchema [nodes_used_collection_shard1_replica2] Schema name=test
   [junit4]   2> 834669 T2127 oass.OpenExchangeRatesOrgProvider.init Initialized with rates=open-exchange-rates.json, refreshInterval=1440.
   [junit4]   2> 834669 T2187 oass.OpenExchangeRatesOrgProvider.init Initialized with rates=open-exchange-rates.json, refreshInterval=1440.
   [junit4]   2> 834680 T2127 oass.IndexSchema.readSchema default search field in schema is text
   [junit4]   2> 834681 T2187 oass.IndexSchema.readSchema default search field in schema is text
   [junit4]   2> 834684 T2127 oass.IndexSchema.readSchema unique key field: id
   [junit4]   2> 834687 T2187 oass.IndexSchema.readSchema unique key field: id
   [junit4]   2> 834697 T2127 oass.FileExchangeRateProvider.reload Reloading exchange rates from file currency.xml
   [junit4]   2> 834700 T2187 oass.FileExchangeRateProvider.reload Reloading exchange rates from file currency.xml
   [junit4]   2> 834701 T2127 oass.FileExchangeRateProvider.reload Reloading exchange rates from file currency.xml
   [junit4]   2> 834706 T2187 oass.FileExchangeRateProvider.reload Reloading exchange rates from file currency.xml
   [junit4]   2> 834706 T2127 oass.OpenExchangeRatesOrgProvider.reload Reloading exchange rates from open-exchange-rates.json
   [junit4]   2> 834708 T2127 oass.OpenExchangeRatesOrgProvider$OpenExchangeRates.<init> WARN Unknown key IMPORTANT NOTE
   [junit4]   2> 834708 T2127 oass.OpenExchangeRatesOrgProvider$OpenExchangeRates.<init> WARN Expected key, got STRING
   [junit4]   2> 834708 T2127 oass.OpenExchangeRatesOrgProvider.reload Reloading exchange rates from open-exchange-rates.json
   [junit4]   2> 834709 T2127 oass.OpenExchangeRatesOrgProvider$OpenExchangeRates.<init> WARN Unknown key IMPORTANT NOTE
   [junit4]   2> 834710 T2127 oass.OpenExchangeRatesOrgProvider$OpenExchangeRates.<init> WARN Expected key, got STRING
   [junit4]   2> 834710 T2127 oasc.SolrCore.initDirectoryFactory org.apache.solr.core.MockDirectoryFactory
   [junit4]   2> 834710 T2127 oasc.SolrCore.<init> [nodes_used_collection_shard1_replica2] Opening new SolrCore at /usr/home/hudson/hudson-slave/workspace/Lucene-Solr-Tests-trunk-Java7/solr/build/solr-core/test/J1/./org.apache.solr.cloud.CollectionsAPIDistributedZkTest-controljetty-1375542115112/nodes_used_collection_shard1_replica2/, dataDir=/usr/home/hudson/hudson-slave/workspace/Lucene-Solr-Tests-trunk-Java7/solr/build/solr-core/test/J1/./org.apache.solr.cloud.CollectionsAPIDistributedZkTest-controljetty-1375542115112//nodes_used_collection_shard1_replica2/data/
   [junit4]   2> 834711 T2127 oasc.JmxMonitoredMap.<init> JMX monitoring is enabled. Adding Solr mbeans to JMX Server: com.sun.jmx.mbeanserver.JmxMBeanServer@1ba1f28e
   [junit4]   2> 834712 T2187 oass.OpenExchangeRatesOrgProvider.reload Reloading exchange rates from open-exchange-rates.json
   [junit4]   2> 834712 T2127 oasc.CachingDirectoryFactory.get return new directory for /usr/home/hudson/hudson-slave/workspace/Lucene-Solr-Tests-trunk-Java7/solr/build/solr-core/test/J1/./org.apache.solr.cloud.CollectionsAPIDistributedZkTest-controljetty-1375542115112//nodes_used_collection_shard1_replica2/data
   [junit4]   2> 834712 T2127 oasc.SolrCore.getNewIndexDir New index directory detected: old=null new=/usr/home/hudson/hudson-slave/workspace/Lucene-Solr-Tests-trunk-Java7/solr/build/solr-core/test/J1/./org.apache.solr.cloud.CollectionsAPIDistributedZkTest-controljetty-1375542115112//nodes_used_collection_shard1_replica2/data/index/
   [junit4]   2> 834713 T2127 oasc.SolrCore.initIndex WARN [nodes_used_collection_shard1_replica2] Solr index directory '/usr/home/hudson/hudson-slave/workspace/Lucene-Solr-Tests-trunk-Java7/solr/build/solr-core/test/J1/./org.apache.solr.cloud.CollectionsAPIDistributedZkTest-controljetty-1375542115112/nodes_used_collection_shard1_replica2/data/index' doesn't exist. Creating new index...
   [junit4]   2> 834713 T2187 oass.OpenExchangeRatesOrgProvider$OpenExchangeRates.<init> WARN Unknown key IMPORTANT NOTE
   [junit4]   2> 834713 T2127 oasc.CachingDirectoryFactory.get return new directory for /usr/home/hudson/hudson-slave/workspace/Lucene-Solr-Tests-trunk-Java7/solr/build/solr-core/test/J1/./org.apache.solr.cloud.CollectionsAPIDistributedZkTest-controljetty-1375542115112//nodes_used_collection_shard1_replica2/data/index
   [junit4]   2> 834713 T2187 oass.OpenExchangeRatesOrgProvider$OpenExchangeRates.<init> WARN Expected key, got STRING
   [junit4]   2> 834714 T2187 oass.OpenExchangeRatesOrgProvider.reload Reloading exchange rates from open-exchange-rates.json
   [junit4]   2> 834715 T2187 oass.OpenExchangeRatesOrgProvider$OpenExchangeRates.<init> WARN Unknown key IMPORTANT NOTE
   [junit4]   2> 834716 T2187 oass.OpenExchangeRatesOrgProvider$OpenExchangeRates.<init> WARN Expected key, got STRING
   [junit4]   2> 834716 T2187 oasc.SolrCore.initDirectoryFactory org.apache.solr.core.MockDirectoryFactory
   [junit4]   2> 834717 T2187 oasc.SolrCore.<init> [nodes_used_collection_shard2_replica1] Opening new SolrCore at /usr/home/hudson/hudson-slave/workspace/Lucene-Solr-Tests-trunk-Java7/solr/build/solr-core/test/J1/./org.apache.solr.cloud.CollectionsAPIDistributedZkTest-jetty4-1375542121117/nodes_used_collection_shard2_replica1/, dataDir=/usr/home/hudson/hudson-slave/workspace/Lucene-Solr-Tests-trunk-Java7/solr/build/solr-core/test/J1/./org.apache.solr.cloud.CollectionsAPIDistributedZkTest-jetty4-1375542121117//nodes_used_collection_shard2_replica1/data/
   [junit4]   2> 834717 T2187 oasc.JmxMonitoredMap.<init> JMX monitoring is enabled. Adding Solr mbeans to JMX Server: com.sun.jmx.mbeanserver.JmxMBeanServer@1ba1f28e
   [junit4]   2> 834718 T2127 oasc.SolrDeletionPolicy.onCommit SolrDeletionPolicy.onCommit: commits: num=1
   [junit4]   2> 		commit{dir=MockDirWrapper(org.apache.lucene.store.RAMDirectory@6292a3e3 lockFactory=org.apache.lucene.store.NativeFSLockFactory@2629dd18),segFN=segments_1,generation=1}
   [junit4]   2> 834718 T2127 oasc.SolrDeletionPolicy.updateCommits newest commit generation = 1
   [junit4]   2> 834718 T2187 oasc.CachingDirectoryFactory.get return new directory for /usr/home/hudson/hudson-slave/workspace/Lucene-Solr-Tests-trunk-Java7/solr/build/solr-core/test/J1/./org.apache.solr.cloud.CollectionsAPIDistributedZkTest-jetty4-1375542121117//nodes_used_collection_shard2_replica1/data
   [junit4]   2> 834719 T2187 oasc.SolrCore.getNewIndexDir New index directory detected: old=null new=/usr/home/hudson/hudson-slave/workspace/Lucene-Solr-Tests-trunk-Java7/solr/build/solr-core/test/J1/./org.apache.solr.cloud.CollectionsAPIDistributedZkTest-jetty4-1375542121117//nodes_used_collection_shard2_replica1/data/index/
   [junit4]   2> 834719 T2187 oasc.SolrCore.initIndex WARN [nodes_used_collection_shard2_replica1] Solr index directory '/usr/home/hudson/hudson-slave/workspace/Lucene-Solr-Tests-trunk-Java7/solr/build/solr-core/test/J1/./org.apache.solr.cloud.CollectionsAPIDistributedZkTest-jetty4-1375542121117/nodes_used_collection_shard2_replica1/data/index' doesn't exist. Creating new index...
   [junit4]   2> 834720 T2187 oasc.CachingDirectoryFactory.get return new directory for /usr/home/hudson/hudson-slave/workspace/Lucene-Solr-Tests-trunk-Java7/solr/build/solr-core/test/J1/./org.apache.solr.cloud.CollectionsAPIDistributedZkTest-jetty4-1375542121117//nodes_used_collection_shard2_replica1/data/index
   [junit4]   2> 834723 T2127 oasup.UpdateRequestProcessorChain.init inserting DistributedUpdateProcessorFactory into updateRequestProcessorChain "dedupe"
   [junit4]   2> 834723 T2127 oasup.UpdateRequestProcessorChain.init inserting DistributedUpdateProcessorFactory into updateRequestProcessorChain "stored_sig"
   [junit4]   2> 834724 T2127 oasup.UpdateRequestProcessorChain.init inserting DistributedUpdateProcessorFactory into updateRequestProcessorChain "distrib-dup-test-chain-implicit"
   [junit4]   2> 834725 T2127 oasc.RequestHandlers.initHandlersFromConfig created standard: solr.StandardRequestHandler
   [junit4]   2> 834725 T2127 oasc.RequestHandlers.initHandlersFromConfig created /get: solr.RealTimeGetHandler
   [junit4]   2> 834726 T2127 oasc.RequestHandlers.initHandlersFromConfig adding lazy requestHandler: solr.ReplicationHandler
   [junit4]   2> 834726 T2127 oasc.RequestHandlers.initHandlersFromConfig created /replication: solr.ReplicationHandler
   [junit4]   2> 834726 T2187 oasc.SolrDeletionPolicy.onCommit SolrDeletionPolicy.onCommit: commits: num=1
   [junit4]   2> 		commit{dir=MockDirWrapper(org.apache.lucene.store.RAMDirectory@1117b2b0 lockFactory=org.apache.lucene.store.NativeFSLockFactory@31df042a),segFN=segments_1,generation=1}
   [junit4]   2> 834726 T2127 oasc.RequestHandlers.initHandlersFromConfig created /update: solr.UpdateRequestHandler
   [junit4]   2> 834727 T2187 oasc.SolrDeletionPolicy.updateCommits newest commit generation = 1
   [junit4]   2> 834727 T2127 oasc.RequestHandlers.initHandlersFromConfig created /admin/: org.apache.solr.handler.admin.AdminHandlers
   [junit4]   2> 834728 T2146 oass.OpenExchangeRatesOrgProvider.init Initialized with rates=open-exchange-rates.json, refreshInterval=1440.
   [junit4]   2> 834734 T2187 oasup.UpdateRequestProcessorChain.init inserting DistributedUpdateProcessorFactory into updateRequestProcessorChain "dedupe"
   [junit4]   2> 834734 T2187 oasup.UpdateRequestProcessorChain.init inserting DistributedUpdateProcessorFactory into updateRequestProcessorChain "stored_sig"
   [junit4]   2> 834735 T2187 oasup.UpdateRequestProcessorChain.init inserting DistributedUpdateProcessorFactory into updateRequestProcessorChain "distrib-dup-test-chain-implicit"
   [junit4]   2> 834736 T2187 oasc.RequestHandlers.initHandlersFromConfig created standard: solr.StandardRequestHandler
   [junit4]   2> 834737 T2187 oasc.RequestHandlers.initHandlersFromConfig created /get: solr.RealTimeGetHandler
   [junit4]   2> 834737 T2187 oasc.RequestHandlers.initHandlersFromConfig adding lazy requestHandler: solr.ReplicationHandler
   [junit4]   2> 834738 T2187 oasc.RequestHandlers.initHandlersFromConfig created /replication: solr.ReplicationHandler
   [junit4]   2> 834739 T2187 oasc.RequestHandlers.initHandlersFromConfig created /update: solr.UpdateRequestHandler
   [junit4]   2> 834739 T2187 oasc.RequestHandlers.initHandlersFromConfig created /admin/: org.apache.solr.handler.admin.AdminHandlers
   [junit4]   2> 834749 T2127 oashl.XMLLoader.init xsltCacheLifetimeSeconds=60
   [junit4]   2> 834749 T2187 oashl.XMLLoader.init xsltCacheLifetimeSeconds=60
   [junit4]   2> 834751 T2146 oass.IndexSchema.readSchema default search field in schema is text
   [junit4]   2> 834752 T2127 oass.SolrIndexSearcher.<init> Opening Searcher@5ea2a935 main
   [junit4]   2> 834753 T2187 oass.SolrIndexSearcher.<init> Opening Searcher@4b21f9cc main
   [junit4]   2> 834754 T2127 oasu.CommitTracker.<init> Hard AutoCommit: disabled
   [junit4]   2> 834754 T2127 oasu.CommitTracker.<init> Soft AutoCommit: disabled
   [junit4]   2> 834755 T2187 oasu.CommitTracker.<init> Hard AutoCommit: disabled
   [junit4]   2> 834756 T2187 oasu.CommitTracker.<init> Soft AutoCommit: disabled
   [junit4]   2> 834756 T2146 oass.IndexSchema.readSchema unique key field: id
   [junit4]   2> 834758 T2203 oasc.SolrCore.registerSearcher [nodes_used_collection_shard1_replica2] Registered new searcher Searcher@5ea2a935 main{StandardDirectoryReader(segments_1:1)}
   [junit4]   2> 834759 T2127 oasc.CoreContainer.registerCore registering core: nodes_used_collection_shard1_replica2
   [junit4]   2> 834760 T2127 oasc.ZkController.register Register replica - core:nodes_used_collection_shard1_replica2 address:http://127.0.0.1:22933 collection:nodes_used_collection shard:shard1
   [junit4]   2> 834760 T2204 oasc.SolrCore.registerSearcher [nodes_used_collection_shard2_replica1] Registered new searcher Searcher@4b21f9cc main{StandardDirectoryReader(segments_1:1)}
   [junit4]   2> 834760 T2127 oascsi.HttpClientUtil.createClient Creating new http client, config:maxConnections=10000&maxConnectionsPerHost=20&connTimeout=15000&socketTimeout=30000&retry=false
   [junit4]   2> 834762 T2187 oasc.CoreContainer.registerCore registering core: nodes_used_collection_shard2_replica1
   [junit4]   2> 834763 T2187 oasc.ZkController.register Register replica - core:nodes_used_collection_shard2_replica1 address:http://127.0.0.1:16058 collection:nodes_used_collection shard:shard2
   [junit4]   2> 834763 T2187 oascsi.HttpClientUtil.createClient Creating new http client, config:maxConnections=10000&maxConnectionsPerHost=20&connTimeout=15000&socketTimeout=30000&retry=false
   [junit4]   2> 834771 T2173 oass.OpenExchangeRatesOrgProvider.init Initialized with rates=open-exchange-rates.json, refreshInterval=1440.
   [junit4]   2> 834773 T2146 oass.FileExchangeRateProvider.reload Reloading exchange rates from file currency.xml
   [junit4]   2> 834776 T2127 oascc.SolrZkClient.makePath makePath: /collections/nodes_used_collection/leader_elect/shard1/election
   [junit4]   2> 834779 T2187 oascc.SolrZkClient.makePath makePath: /collections/nodes_used_collection/leader_elect/shard2/election
   [junit4]   2> 834782 T2173 oass.IndexSchema.readSchema default search field in schema is text
   [junit4]   2> 834786 T2173 oass.IndexSchema.readSchema unique key field: id
   [junit4]   2> 834797 T2127 oasc.ShardLeaderElectionContext.runLeaderProcess Running the leader process for shard shard1
   [junit4]   2> 834797 T2146 oass.FileExchangeRateProvider.reload Reloading exchange rates from file currency.xml
   [junit4]   2> 834810 T2187 oasc.ShardLeaderElectionContext.runLeaderProcess Running the leader process for shard shard2
   [junit4]   2> 834811 T2127 oasc.ShardLeaderElectionContext.waitForReplicasToComeUp Waiting until we see more replicas up for shard shard1: total=2 found=1 timeoutin=179999
   [junit4]   2> 834813 T2187 oasc.ShardLeaderElectionContext.waitForReplicasToComeUp Waiting until we see more replicas up for shard shard2: total=2 found=1 timeoutin=179999
   [junit4]   2> 834813 T2146 oass.OpenExchangeRatesOrgProvider.reload Reloading exchange rates from open-exchange-rates.json
   [junit4]   2> 834815 T2146 oass.OpenExchangeRatesOrgProvider$OpenExchangeRates.<init> WARN Unknown key IMPORTANT NOTE
   [junit4]   2> 834815 T2146 oass.OpenExchangeRatesOrgProvider$OpenExchangeRates.<init> WARN Expected key, got STRING
   [junit4]   2> 834816 T2146 oass.OpenExchangeRatesOrgProvider.reload Reloading exchange rates from open-exchange-rates.json
   [junit4]   2> 834816 T2173 oass.FileExchangeRateProvider.reload Reloading exchange rates from file currency.xml
   [junit4]   2> 834817 T2146 oass.OpenExchangeRatesOrgProvider$OpenExchangeRates.<init> WARN Unknown key IMPORTANT NOTE
   [junit4]   2> 834817 T2146 oass.OpenExchangeRatesOrgProvider$OpenExchangeRates.<init> WARN Expected key, got STRING
   [junit4]   2> 834818 T2146 oasc.SolrCore.initDirectoryFactory org.apache.solr.core.MockDirectoryFactory
   [junit4]   2> 834818 T2146 oasc.SolrCore.<init> [nodes_used_collection_shard1_replica1] Opening new SolrCore at /usr/home/hudson/hudson-slave/workspace/Lucene-Solr-Tests-trunk-Java7/solr/build/solr-core/test/J1/./org.apache.solr.cloud.CollectionsAPIDistributedZkTest-jetty1-1375542115917/nodes_used_collection_shard1_replica1/, dataDir=/usr/home/hudson/hudson-slave/workspace/Lucene-Solr-Tests-trunk-Java7/solr/build/solr-core/test/J1/./org.apache.solr.cloud.CollectionsAPIDistributedZkTest-jetty1-1375542115917//nodes_used_collection_shard1_replica1/data/
   [junit4]   2> 834819 T2146 oasc.JmxMonitoredMap.<init> JMX monitoring is enabled. Adding Solr mbeans to JMX Server: com.sun.jmx.mbeanserver.JmxMBeanServer@1ba1f28e
   [junit4]   2> 834820 T2146 oasc.CachingDirectoryFactory.get return new directory for /usr/home/hudson/hudson-slave/workspace/Lucene-Solr-Tests-trunk-Java7/solr/build/solr-core/test/J1/./org.apache.solr.cloud.CollectionsAPIDistributedZkTest-jetty1-1375542115917//nodes_used_collection_shard1_replica1/data
   [junit4]   2> 834821 T2173 oass.FileExchangeRateProvider.reload Reloading exchange rates from file currency.xml
   [junit4]   2> 834821 T2146 oasc.SolrCore.getNewIndexDir New index directory detected: old=null new=/usr/home/hudson/hudson-slave/workspace/Lucene-Solr-Tests-trunk-Java7/solr/build/solr-core/test/J1/./org.apache.solr.cloud.CollectionsAPIDistributedZkTest-jetty1-1375542115917//nodes_used_collection_shard1_replica1/data/index/
   [junit4]   2> 834821 T2146 oasc.SolrCore.initIndex WARN [nodes_used_collection_shard1_replica1] Solr index directory '/usr/home/hudson/hudson-slave/workspace/Lucene-Solr-Tests-trunk-Java7/solr/build/solr-core/test/J1/./org.apache.solr.cloud.CollectionsAPIDistributedZkTest-jetty1-1375542115917/nodes_used_collection_shard1_replica1/data/index' doesn't exist. Creating new index...
   [junit4]   2> 834822 T2146 oasc.CachingDirectoryFactory.get return new directory for /usr/home/hudson/hudson-slave/workspace/Lucene-Solr-Tests-trunk-Java7/solr/build/solr-core/test/J1/./org.apache.solr.cloud.CollectionsAPIDistributedZkTest-jetty1-1375542115917//nodes_used_collection_shard1_replica1/data/index
   [junit4]   2> 834825 T2173 oass.OpenExchangeRatesOrgProvider.reload Reloading exchange rates from open-exchange-rates.json
   [junit4]   2> 834826 T2173 oass.OpenExchangeRatesOrgProvider$OpenExchangeRates.<init> WARN Unknown key IMPORTANT NOTE
   [junit4]   2> 834826 T2173 oass.OpenExchangeRatesOrgProvider$OpenExchangeRates.<init> WARN Expected key, got STRING
   [junit4]   2> 834827 T2173 oass.OpenExchangeRatesOrgProvider.reload Reloading exchange rates from open-exchange-rates.json
   [junit4]   2> 834828 T2173 oass.OpenExchangeRatesOrgProvider$OpenExchangeRates.<init> WARN Unknown key IMPORTANT NOTE
   [junit4]   2> 834828 T2146 oasc.SolrDeletionPolicy.onCommit SolrDeletionPolicy.onCommit: commits: num=1
   [junit4]   2> 		commit{dir=MockDirWrapper(org.apache.lucene.store.RAMDirectory@af80dfd lockFactory=org.apache.lucene.store.NativeFSLockFactory@5dce9f66),segFN=segments_1,generation=1}
   [junit4]   2> 834828 T2173 oass.OpenExchangeRatesOrgProvider$OpenExchangeRates.<init> WARN Expected key, got STRING
   [junit4]   2> 834829 T2146 oasc.SolrDeletionPolicy.updateCommits newest commit generation = 1
   [junit4]   2> 834829 T2173 oasc.SolrCore.initDirectoryFactory org.apache.solr.core.MockDirectoryFactory
   [junit4]   2> 834830 T2173 oasc.SolrCore.<init> [nodes_used_collection_shard2_replica2] Opening new SolrCore at /usr/home/hudson/hudson-slave/workspace/Lucene-Solr-Tests-trunk-Java7/solr/build/solr-core/test/J1/./org.apache.solr.cloud.CollectionsAPIDistributedZkTest-jetty3-1375542119385/nodes_used_collection_shard2_replica2/, dataDir=/usr/home/hudson/hudson-slave/workspace/Lucene-Solr-Tests-trunk-Java7/solr/build/solr-core/test/J1/./org.apache.solr.cloud.CollectionsAPIDistributedZkTest-jetty3-1375542119385//nodes_used_collection_shard2_replica2/data/
   [junit4]   2> 834830 T2173 oasc.JmxMonitoredMap.<init> JMX monitoring is enabled. Adding Solr mbeans to JMX Server: com.sun.jmx.mbeanserver.JmxMBeanServer@1ba1f28e
   [junit4]   2> 834831 T2173 oasc.CachingDirectoryFactory.get return new directory for /usr/home/hudson/hudson-slave/workspace/Lucene-Solr-Tests-trunk-Java7/solr/build/solr-core/test/J1/./org.apache.solr.cloud.CollectionsAPIDistributedZkTest-jetty3-1375542119385//nodes_used_collection_shard2_replica2/data
   [junit4]   2> 834831 T2173 oasc.SolrCore.getNewIndexDir New index directory detected: old=null new=/usr/home/hudson/hudson-slave/workspace/Lucene-Solr-Tests-trunk-Java7/solr/build/solr-core/test/J1/./org.apache.solr.cloud.CollectionsAPIDistributedZkTest-jetty3-1375542119385//nodes_used_collection_shard2_replica2/data/index/
   [junit4]   2> 834832 T2173 oasc.SolrCore.initIndex WARN [nodes_used_collection_shard2_replica2] Solr index directory '/usr/home/hudson/hudson-slave/workspace/Lucene-Solr-Tests-trunk-Java7/solr/build/solr-core/test/J1/./org.apache.solr.cloud.CollectionsAPIDistributedZkTest-jetty3-1375542119385/nodes_used_collection_shard2_replica2/data/index' doesn't exist. Creating new index...
   [junit4]   2> 834832 T2173 oasc.CachingDirectoryFactory.get return new directory for /usr/home/hudson/hudson-slave/workspace/Lucene-Solr-Tests-trunk-Java7/solr/build/solr-core/test/J1/./org.apache.solr.cloud.CollectionsAPIDistributedZkTest-jetty3-1375542119385//nodes_used_collection_shard2_replica2/data/index
   [junit4]   2> 834835 T2146 oasup.UpdateRequestProcessorChain.init inserting DistributedUpdateProcessorFactory into updateRequestProcessorChain "dedupe"
   [junit4]   2> 834835 T2146 oasup.UpdateRequestProcessorChain.init inserting DistributedUpdateProcessorFactory into updateRequestProcessorChain "stored_sig"
   [junit4]   2> 834836 T2173 oasc.SolrDeletionPolicy.onCommit SolrDeletionPolicy.onCommit: commits: num=1
   [junit4]   2> 		commit{dir=MockDirWrapper(org.apache.lucene.store.RAMDirectory@50a9d5c2 lockFactory=org.apache.lucene.store.NativeFSLockFactory@4635a980),segFN=segments_1,generation=1}
   [junit4]   2> 834836 T2173 oasc.SolrDeletionPolicy.updateCommits newest commit generation = 1
   [junit4]   2> 834836 T2146 oasup.UpdateRequestProcessorChain.init inserting DistributedUpdateProcessorFactory into updateRequestProcessorChain "distrib-dup-test-chain-implicit"
   [junit4]   2> 834837 T2146 oasc.RequestHandlers.initHandlersFromConfig created standard: solr.StandardRequestHandler
   [junit4]   2> 834838 T2146 oasc.RequestHandlers.initHandlersFromConfig created /get: solr.RealTimeGetHandler
   [junit4]   2> 834838 T2146 oasc.RequestHandlers.initHandlersFromConfig adding lazy requestHandler: solr.ReplicationHandler
   [junit4]   2> 834839 T2146 oasc.RequestHandlers.initHandlersFromConfig created /replication: solr.ReplicationHandler
   [junit4]   2> 834840 T2146 oasc.RequestHandlers.initHandlersFromConfig created /update: solr.UpdateRequestHandler
   [junit4]   2> 834840 T2146 oasc.RequestHandlers.initHandlersFromConfig created /admin/: org.apache.solr.handler.admin.AdminHandlers
   [junit4]   2> 834840 T2173 oasup.UpdateRequestProcessorChain.init inserting DistributedUpdateProcessorFactory into updateRequestProcessorChain "dedupe"
   [junit4]   2> 834841 T2173 oasup.UpdateRequestProcessorChain.init inserting DistributedUpdateProcessorFactory into updateRequestProcessorChain "stored_sig"
   [junit4]   2> 834842 T2173 oasup.UpdateRequestProcessorChain.init inserting DistributedUpdateProcessorFactory into updateRequestProcessorChain "distrib-dup-test-chain-implicit"
   [junit4]   2> 834843 T2173 oasc.RequestHandlers.initHandlersFromConfig created standard: solr.StandardRequestHandler
   [junit4]   2> 834843 T2173 oasc.RequestHandlers.initHandlersFromConfig created /get: solr.RealTimeGetHandler
   [junit4]   2> 834843 T2173 oasc.RequestHandlers.initHandlersFromConfig adding lazy requestHandler: solr.ReplicationHandler
   [junit4]   2> 834844 T2173 oasc.RequestHandlers.initHandlersFromConfig created /replication: solr.ReplicationHandler
   [junit4]   2> 834844 T2173 oasc.RequestHandlers.initHandlersFromConfig created /update: solr.UpdateRequestHandler
   [junit4]   2> 834845 T2173 oasc.RequestHandlers.initHandlersFromConfig created /admin/: org.apache.solr.handler.admin.AdminHandlers
   [junit4]   2> 834860 T2173 oashl.XMLLoader.init xsltCacheLifetimeSeconds=60
   [junit4]   2> 834860 T2146 oashl.XMLLoader.init xsltCacheLifetimeSeconds=60
   [junit4]   2> 834868 T2173 oass.SolrIndexSearcher.<init> Opening Searcher@2775fbc0 main
   [junit4]   2> 834869 T2146 oass.SolrIndexSearcher.<init> Opening Searcher@3bb21a0c main
   [junit4]   2> 834870 T2173 oasu.CommitTracker.<init> Hard AutoCommit: disabled
   [junit4]   2> 834870 T2173 oasu.CommitTracker.<init> Soft AutoCommit: disabled
   [junit4]   2> 834871 T2146 oasu.CommitTracker.<init> Hard AutoCommit: disabled
   [junit4]   2> 834872 T2146 oasu.CommitTracker.<init> Soft AutoCommit: disabled
   [junit4]   2> 834874 T2205 oasc.SolrCore.registerSearcher [nodes_used_collection_shard2_replica2] Registered new searcher Searcher@2775fbc0 main{StandardDirectoryReader(segments_1:1)}
   [junit4]   2> 834876 T2173 oasc.CoreContainer.registerCore registering core: nodes_used_collection_shard2_replica2
   [junit4]   2> 834876 T2206 oasc.SolrCore.registerSearcher [nodes_used_collection_shard1_replica1] Registered new searcher Searcher@3bb21a0c main{StandardDirectoryReader(segments_1:1)}
   [junit4]   2> 834876 T2173 oasc.ZkController.register Register replica - core:nodes_used_collection_shard2_replica2 address:http://127.0.0.1:22943 collection:nodes_used_collection shard:shard2
   [junit4]   2> 834877 T2173 oascsi.HttpClientUtil.createClient Creating new http client, config:maxConnections=10000&maxConnectionsPerHost=20&connTimeout=15000&socketTimeout=30000&retry=false
   [junit4]   2> 834878 T2146 oasc.CoreContainer.registerCore registering core: nodes_used_collection_shard1_replica1
   [junit4]   2> 834879 T2146 oasc.ZkController.register Register replica - core:nodes_used_collection_shard1_replica1 address:http://127.0.0.1:22937 collection:nodes_used_collection shard:shard1
   [junit4]   2> 834879 T2146 oascsi.HttpClientUtil.createClient Creating new http client, config:maxConnections=10000&maxConnectionsPerHost=20&connTimeout=15000&socketTimeout=30000&retry=false
   [junit4]   2> 835313 T2127 oasc.ShardLeaderElectionContext.waitForReplicasToComeUp Enough replicas found to continue.
   [junit4]   2> 835314 T2187 oasc.ShardLeaderElectionContext.waitForReplicasToComeUp Enough replicas found to continue.
   [junit4]   2> 835314 T2127 oasc.ShardLeaderElectionContext.runLeaderProcess I may be the new leader - try and sync
   [junit4]   2> 835315 T2187 oasc.ShardLeaderElectionContext.runLeaderProcess I may be the new leader - try and sync
   [junit4]   2> 835315 T2127 oasc.SyncStrategy.sync Sync replicas to http://127.0.0.1:22933/nodes_used_collection_shard1_replica2/
   [junit4]   2> 835315 T2187 oasc.SyncStrategy.sync Sync replicas to http://127.0.0.1:16058/nodes_used_collection_shard2_replica1/
   [junit4]   2> 835316 T2127 oasu.PeerSync.sync PeerSync: core=nodes_used_collection_shard1_replica2 url=http://127.0.0.1:22933 START replicas=[http://127.0.0.1:22937/nodes_used_collection_shard1_replica1/] nUpdates=100
   [junit4]   2> 835316 T2187 oasu.PeerSync.sync PeerSync: core=nodes_used_collection_shard2_replica1 url=http://127.0.0.1:16058 START replicas=[http://127.0.0.1:22943/nodes_used_collection_shard2_replica2/] nUpdates=100
   [junit4]   2> 835317 T2127 oasu.PeerSync.sync PeerSync: core=nodes_used_collection_shard1_replica2 url=http://127.0.0.1:22933 DONE.  We have no versions.  sync failed.
   [junit4]   2> 835318 T2127 oasc.SyncStrategy.syncReplicas Leader's attempt to sync with shard failed, moving to the next candidate
   [junit4]   2> 835317 T2187 oasu.PeerSync.sync PeerSync: core=nodes_used_collection_shard2_replica1 url=http://127.0.0.1:16058 DONE.  We have no versions.  sync failed.
   [junit4]   2> 835320 T2187 oasc.SyncStrategy.syncReplicas Leader's attempt to sync with shard failed, moving to the next candidate
   [junit4]   2> 835319 T2127 oasc.ShardLeaderElectionContext.runLeaderProcess We failed sync, but we have no versions - we can't sync in that case - we were active before, so become leader anyway
   [junit4]   2> 835320 T2187 oasc.ShardLeaderElectionContext.runLeaderProcess We failed sync, but we have no versions - we can't sync in that case - we were active before, so become leader anyway
   [junit4]   2> 835321 T2127 oasc.ShardLeaderElectionContext.runLeaderProcess I am the new leader: http://127.0.0.1:22933/nodes_used_collection_shard1_replica2/ shard1
   [junit4]   2> 835321 T2187 oasc.ShardLeaderElectionContext.runLeaderProcess I am the new leader: http://127.0.0.1:16058/nodes_used_collection_shard2_replica1/ shard2
   [junit4]   2> 835321 T2127 oascc.SolrZkClient.makePath makePath: /collections/nodes_used_collection/leaders/shard1
   [junit4]   2> 835322 T2187 oascc.SolrZkClient.makePath makePath: /collections/nodes_used_collection/leaders/shard2
   [junit4]   2> ASYNC  NEW_CORE C2193 name=nodes_used_collection_shard1_replica1 org.apache.solr.core.SolrCore@abd6eb9 url=http://127.0.0.1:22937/nodes_used_collection_shard1_replica1 node=127.0.0.1:22937_ C2193_STATE=coll:nodes_used_collection co

[...truncated too long message...]

 0 - closing IndexWriter
   [junit4]   2> 952428 T2115 oasu.DefaultSolrCoreState.closeIndexWriter closing IndexWriter with IndexWriterCloser
   [junit4]   2> 952431 T2115 oasc.SolrCore.closeSearcher [new_implicit_coll_1_a_replica1] Closing main searcher on request.
   [junit4]   2> 952431 T2115 oasc.CachingDirectoryFactory.close Closing MockDirectoryFactory - 2 directories currently being tracked
   [junit4]   2> 952432 T2115 oasc.CachingDirectoryFactory.closeCacheValue looking to close /usr/home/hudson/hudson-slave/workspace/Lucene-Solr-Tests-trunk-Java7/solr/build/solr-core/test/J1/./org.apache.solr.cloud.CollectionsAPIDistributedZkTest-jetty4-1375542121117//new_implicit_coll_1_a_replica1/data/index [CachedDir<<refCount=0;path=/usr/home/hudson/hudson-slave/workspace/Lucene-Solr-Tests-trunk-Java7/solr/build/solr-core/test/J1/./org.apache.solr.cloud.CollectionsAPIDistributedZkTest-jetty4-1375542121117//new_implicit_coll_1_a_replica1/data/index;done=false>>]
   [junit4]   2> 952432 T2115 oasc.CachingDirectoryFactory.close Closing directory: /usr/home/hudson/hudson-slave/workspace/Lucene-Solr-Tests-trunk-Java7/solr/build/solr-core/test/J1/./org.apache.solr.cloud.CollectionsAPIDistributedZkTest-jetty4-1375542121117//new_implicit_coll_1_a_replica1/data/index
   [junit4]   2> 952433 T2115 oasc.CachingDirectoryFactory.closeCacheValue looking to close /usr/home/hudson/hudson-slave/workspace/Lucene-Solr-Tests-trunk-Java7/solr/build/solr-core/test/J1/./org.apache.solr.cloud.CollectionsAPIDistributedZkTest-jetty4-1375542121117//new_implicit_coll_1_a_replica1/data [CachedDir<<refCount=0;path=/usr/home/hudson/hudson-slave/workspace/Lucene-Solr-Tests-trunk-Java7/solr/build/solr-core/test/J1/./org.apache.solr.cloud.CollectionsAPIDistributedZkTest-jetty4-1375542121117//new_implicit_coll_1_a_replica1/data;done=false>>]
   [junit4]   2> 952433 T2115 oasc.CachingDirectoryFactory.close Closing directory: /usr/home/hudson/hudson-slave/workspace/Lucene-Solr-Tests-trunk-Java7/solr/build/solr-core/test/J1/./org.apache.solr.cloud.CollectionsAPIDistributedZkTest-jetty4-1375542121117//new_implicit_coll_1_a_replica1/data
   [junit4]   2> 952435 T2425 oasc.Overseer$ClusterStateUpdater.amILeader According to ZK I (id=90147528036450316-127.0.0.1:16058_-n_0000000004) am no longer a leader.
   [junit4]   2> 952440 T2115 oejsh.ContextHandler.doStop stopped o.e.j.s.ServletContextHandler{/,null}
   [junit4]   2> 952496 T2115 oas.SolrTestCaseJ4.tearDown ###Ending testDistribSearch
   [junit4]   2> 952499 T2115 oasc.ZkTestServer.send4LetterWord connecting to 127.0.0.1:22930 22930
   [junit4]   1> client port:0.0.0.0/0.0.0.0:0
   [junit4]   2> NOTE: reproduce with: ant test  -Dtestcase=CollectionsAPIDistributedZkTest -Dtests.method=testDistribSearch -Dtests.seed=A0DBC4A68435BE3C -Dtests.multiplier=3 -Dtests.slow=true -Dtests.locale=th -Dtests.timezone=Europe/Dublin -Dtests.file.encoding=ISO-8859-1
   [junit4] ERROR    130s J1 | CollectionsAPIDistributedZkTest.testDistribSearch <<<
   [junit4]    > Throwable #1: org.apache.solr.client.solrj.SolrServerException: IOException occured when talking to server at: http://127.0.0.1:22940
   [junit4]    > 	at __randomizedtesting.SeedInfo.seed([A0DBC4A68435BE3C:213D4ABEF36ADE00]:0)
   [junit4]    > 	at org.apache.solr.client.solrj.impl.HttpSolrServer.request(HttpSolrServer.java:435)
   [junit4]    > 	at org.apache.solr.client.solrj.impl.HttpSolrServer.request(HttpSolrServer.java:180)
   [junit4]    > 	at org.apache.solr.cloud.AbstractFullDistribZkTestBase.createCollection(AbstractFullDistribZkTestBase.java:1535)
   [junit4]    > 	at org.apache.solr.cloud.CollectionsAPIDistributedZkTest.testCustomCollectionsAPI(CollectionsAPIDistributedZkTest.java:677)
   [junit4]    > 	at org.apache.solr.cloud.CollectionsAPIDistributedZkTest.doTest(CollectionsAPIDistributedZkTest.java:159)
   [junit4]    > 	at org.apache.solr.BaseDistributedSearchTestCase.testDistribSearch(BaseDistributedSearchTestCase.java:835)
   [junit4]    > 	at java.lang.Thread.run(Thread.java:724)
   [junit4]    > Caused by: org.apache.http.conn.ConnectTimeoutException: Connect to 127.0.0.1:22940 timed out
   [junit4]    > 	at org.apache.http.conn.scheme.PlainSocketFactory.connectSocket(PlainSocketFactory.java:129)
   [junit4]    > 	at org.apache.http.impl.conn.DefaultClientConnectionOperator.openConnection(DefaultClientConnectionOperator.java:180)
   [junit4]    > 	at org.apache.http.impl.conn.ManagedClientConnectionImpl.open(ManagedClientConnectionImpl.java:294)
   [junit4]    > 	at org.apache.http.impl.client.DefaultRequestDirector.tryConnect(DefaultRequestDirector.java:645)
   [junit4]    > 	at org.apache.http.impl.client.DefaultRequestDirector.execute(DefaultRequestDirector.java:480)
   [junit4]    > 	at org.apache.http.impl.client.AbstractHttpClient.execute(AbstractHttpClient.java:906)
   [junit4]    > 	at org.apache.http.impl.client.AbstractHttpClient.execute(AbstractHttpClient.java:805)
   [junit4]    > 	at org.apache.http.impl.client.AbstractHttpClient.execute(AbstractHttpClient.java:784)
   [junit4]    > 	at org.apache.solr.client.solrj.impl.HttpSolrServer.request(HttpSolrServer.java:365)
   [junit4]    > 	... 45 more
   [junit4]   2> 952586 T2115 oas.SolrTestCaseJ4.deleteCore ###deleteCore
   [junit4]   2> 129573 T2114 ccr.ThreadLeakControl.checkThreadLeaks WARNING Will linger awaiting termination of 2 leaked thread(s).
   [junit4]   2> 953740 T2197 oascc.ZkStateReader$3.process WARN ZooKeeper watch triggered, but Solr cannot talk to ZK
   [junit4]   2> 953740 T2197 oascc.ZkStateReader$2.process A cluster state change: WatchedEvent state:SyncConnected type:NodeChildrenChanged path:/live_nodes, has occurred - updating... (live nodes size: 1)
   [junit4]   2> 953740 T2197 oascc.ZkStateReader$2.process WARN ZooKeeper watch triggered, but Solr cannot talk to ZK
   [junit4]   2> NOTE: test params are: codec=Lucene42: {timestamp=PostingsFormat(name=MockRandom), range_facet_l=PostingsFormat(name=MockRandom), id=PostingsFormat(name=Lucene41VarGapFixedInterval), range_facet_sl=Pulsing41(freqCutoff=20 minBlockSize=77 maxBlockSize=238), a_t=PostingsFormat(name=MockRandom), text=Pulsing41(freqCutoff=20 minBlockSize=77 maxBlockSize=238), range_facet_si=PostingsFormat(name=Memory doPackFST= false), _version_=PostingsFormat(name=MockRandom), other_tl1=PostingsFormat(name=MockRandom), multiDefault=PostingsFormat(name=Memory doPackFST= false), a_si=PostingsFormat(name=Memory doPackFST= false), intDefault=PostingsFormat(name=MockRandom)}, docValues:{timestamp=DocValuesFormat(name=Disk)}, sim=DefaultSimilarity, locale=th, timezone=Europe/Dublin
   [junit4]   2> NOTE: FreeBSD 9.1-RELEASE-p3 amd64/Oracle Corporation 1.7.0_25 (64-bit)/cpus=16,threads=3,free=162674248,total=483393536
   [junit4]   2> NOTE: All tests run in this JVM: [QueryResultKeyTest, PathHierarchyTokenizerFactoryTest, TestJmxIntegration, SuggesterWFSTTest, TestBinaryField, DirectUpdateHandlerTest, OpenExchangeRatesOrgProviderTest, TestPostingsSolrHighlighter, TestManagedSchemaFieldResource, TestRandomFaceting, BadCopyFieldTest, SampleTest, DeleteShardTest, TestRecoveryHdfs, XsltUpdateRequestHandlerTest, TestZkChroot, TestCloudManagedSchema, TestNumberUtils, HdfsRecoveryZkTest, TestAddFieldRealTimeGet, OpenCloseCoreStressTest, DateMathParserTest, TestDFRSimilarityFactory, SimplePostToolTest, TestFieldCollectionResource, StatsComponentTest, TestFoldingMultitermQuery, TestLazyCores, TestDefaultSimilarityFactory, TermVectorComponentDistributedTest, RequestHandlersTest, TestUniqueKeyFieldResource, TestSolrJ, TestCoreDiscovery, TestHashPartitioner, ShardRoutingCustomTest, SpellCheckCollatorTest, TestLuceneMatchVersion, CoreContainerCoreInitFailuresTest, TimeZoneUtilsTest, TestMergePolicyConfig, TestClassNameShortening, MultiTermTest, DisMaxRequestHandlerTest, HdfsDirectoryTest, CurrencyFieldOpenExchangeTest, FileUtilsTest, TestQueryTypes, SolrPluginUtilsTest, DOMUtilTest, TestReloadAndDeleteDocs, HighlighterTest, TestFastOutputStream, IndexSchemaRuntimeFieldTest, TestBinaryResponseWriter, FieldAnalysisRequestHandlerTest, HighlighterConfigTest, TestJmxMonitoredMap, TestInfoStreamLogging, DefaultValueUpdateProcessorTest, HdfsUnloadDistributedZkTest, ZkNodePropsTest, HardAutoCommitTest, SolrRequestParserTest, IndexBasedSpellCheckerTest, TestBM25SimilarityFactory, TestUtils, HdfsCollectionsAPIDistributedZkTest, TestSuggestSpellingConverter, TestManagedSchema, RequiredFieldsTest, BadIndexSchemaTest, HdfsBasicDistributedZk2Test, TestPartialUpdateDeduplication, TestIndexSearcher, ChaosMonkeySafeLeaderTest, BasicDistributedZk2Test, CollectionsAPIDistributedZkTest]
   [junit4] Completed on J1 in 130.85s, 1 test, 1 error <<< FAILURES!

[...truncated 596 lines...]
BUILD FAILED
/usr/home/hudson/hudson-slave/workspace/Lucene-Solr-Tests-trunk-Java7/build.xml:389: The following error occurred while executing this line:
/usr/home/hudson/hudson-slave/workspace/Lucene-Solr-Tests-trunk-Java7/build.xml:369: The following error occurred while executing this line:
/usr/home/hudson/hudson-slave/workspace/Lucene-Solr-Tests-trunk-Java7/build.xml:39: The following error occurred while executing this line:
/usr/home/hudson/hudson-slave/workspace/Lucene-Solr-Tests-trunk-Java7/solr/build.xml:181: The following error occurred while executing this line:
/usr/home/hudson/hudson-slave/workspace/Lucene-Solr-Tests-trunk-Java7/solr/common-build.xml:449: The following error occurred while executing this line:
/usr/home/hudson/hudson-slave/workspace/Lucene-Solr-Tests-trunk-Java7/lucene/common-build.xml:1230: The following error occurred while executing this line:
/usr/home/hudson/hudson-slave/workspace/Lucene-Solr-Tests-trunk-Java7/lucene/common-build.xml:873: There were test failures: 320 suites, 1347 tests, 1 error, 34 ignored (6 assumptions)

Total time: 57 minutes 54 seconds
Build step 'Invoke Ant' marked build as failure
Archiving artifacts
Recording test results
Email was triggered for: Failure
Sending email for trigger: Failure



Mime
View raw message