lucene-dev mailing list archives

Site index · List index
Message view « Date » · « Thread »
Top « Date » · « Thread »
From Policeman Jenkins Server <jenk...@thetaphi.de>
Subject [JENKINS] Lucene-Solr-4.x-MacOSX (64bit/jdk1.7.0) - Build # 681 - Still Failing!
Date Fri, 02 Aug 2013 10:28:29 GMT
Build: http://jenkins.thetaphi.de/job/Lucene-Solr-4.x-MacOSX/681/
Java: 64bit/jdk1.7.0 -XX:+UseCompressedOops -XX:+UseG1GC

1 tests failed.
FAILED:  org.apache.solr.cloud.CollectionsAPIDistributedZkTest.testDistribSearch

Error Message:
Server refused connection at: http://127.0.0.1:53655

Stack Trace:
org.apache.solr.client.solrj.SolrServerException: Server refused connection at: http://127.0.0.1:53655
	at __randomizedtesting.SeedInfo.seed([5883E769884528A5:D9656971FF1A4899]:0)
	at org.apache.solr.client.solrj.impl.HttpSolrServer.request(HttpSolrServer.java:428)
	at org.apache.solr.client.solrj.impl.HttpSolrServer.request(HttpSolrServer.java:180)
	at org.apache.solr.cloud.CollectionsAPIDistributedZkTest.testCustomCollectionsAPI(CollectionsAPIDistributedZkTest.java:764)
	at org.apache.solr.cloud.CollectionsAPIDistributedZkTest.doTest(CollectionsAPIDistributedZkTest.java:159)
	at org.apache.solr.BaseDistributedSearchTestCase.testDistribSearch(BaseDistributedSearchTestCase.java:835)
	at sun.reflect.NativeMethodAccessorImpl.invoke0(Native Method)
	at sun.reflect.NativeMethodAccessorImpl.invoke(NativeMethodAccessorImpl.java:57)
	at sun.reflect.DelegatingMethodAccessorImpl.invoke(DelegatingMethodAccessorImpl.java:43)
	at java.lang.reflect.Method.invoke(Method.java:606)
	at com.carrotsearch.randomizedtesting.RandomizedRunner.invoke(RandomizedRunner.java:1559)
	at com.carrotsearch.randomizedtesting.RandomizedRunner.access$600(RandomizedRunner.java:79)
	at com.carrotsearch.randomizedtesting.RandomizedRunner$6.evaluate(RandomizedRunner.java:737)
	at com.carrotsearch.randomizedtesting.RandomizedRunner$7.evaluate(RandomizedRunner.java:773)
	at com.carrotsearch.randomizedtesting.RandomizedRunner$8.evaluate(RandomizedRunner.java:787)
	at com.carrotsearch.randomizedtesting.rules.SystemPropertiesRestoreRule$1.evaluate(SystemPropertiesRestoreRule.java:53)
	at org.apache.lucene.util.TestRuleSetupTeardownChained$1.evaluate(TestRuleSetupTeardownChained.java:50)
	at org.apache.lucene.util.TestRuleFieldCacheSanity$1.evaluate(TestRuleFieldCacheSanity.java:51)
	at org.apache.lucene.util.AbstractBeforeAfterRule$1.evaluate(AbstractBeforeAfterRule.java:46)
	at com.carrotsearch.randomizedtesting.rules.SystemPropertiesInvariantRule$1.evaluate(SystemPropertiesInvariantRule.java:55)
	at org.apache.lucene.util.TestRuleThreadAndTestName$1.evaluate(TestRuleThreadAndTestName.java:49)
	at org.apache.lucene.util.TestRuleIgnoreAfterMaxFailures$1.evaluate(TestRuleIgnoreAfterMaxFailures.java:70)
	at org.apache.lucene.util.TestRuleMarkFailure$1.evaluate(TestRuleMarkFailure.java:48)
	at com.carrotsearch.randomizedtesting.rules.StatementAdapter.evaluate(StatementAdapter.java:36)
	at com.carrotsearch.randomizedtesting.ThreadLeakControl$StatementRunner.run(ThreadLeakControl.java:358)
	at com.carrotsearch.randomizedtesting.ThreadLeakControl.forkTimeoutingTask(ThreadLeakControl.java:782)
	at com.carrotsearch.randomizedtesting.ThreadLeakControl$3.evaluate(ThreadLeakControl.java:442)
	at com.carrotsearch.randomizedtesting.RandomizedRunner.runSingleTest(RandomizedRunner.java:746)
	at com.carrotsearch.randomizedtesting.RandomizedRunner$3.evaluate(RandomizedRunner.java:648)
	at com.carrotsearch.randomizedtesting.RandomizedRunner$4.evaluate(RandomizedRunner.java:682)
	at com.carrotsearch.randomizedtesting.RandomizedRunner$5.evaluate(RandomizedRunner.java:693)
	at com.carrotsearch.randomizedtesting.rules.StatementAdapter.evaluate(StatementAdapter.java:36)
	at com.carrotsearch.randomizedtesting.rules.SystemPropertiesRestoreRule$1.evaluate(SystemPropertiesRestoreRule.java:53)
	at org.apache.lucene.util.AbstractBeforeAfterRule$1.evaluate(AbstractBeforeAfterRule.java:46)
	at org.apache.lucene.util.TestRuleStoreClassName$1.evaluate(TestRuleStoreClassName.java:42)
	at com.carrotsearch.randomizedtesting.rules.SystemPropertiesInvariantRule$1.evaluate(SystemPropertiesInvariantRule.java:55)
	at com.carrotsearch.randomizedtesting.rules.NoShadowingOrOverridesOnMethodsRule$1.evaluate(NoShadowingOrOverridesOnMethodsRule.java:39)
	at com.carrotsearch.randomizedtesting.rules.NoShadowingOrOverridesOnMethodsRule$1.evaluate(NoShadowingOrOverridesOnMethodsRule.java:39)
	at com.carrotsearch.randomizedtesting.rules.StatementAdapter.evaluate(StatementAdapter.java:36)
	at org.apache.lucene.util.TestRuleAssertionsRequired$1.evaluate(TestRuleAssertionsRequired.java:43)
	at org.apache.lucene.util.TestRuleMarkFailure$1.evaluate(TestRuleMarkFailure.java:48)
	at org.apache.lucene.util.TestRuleIgnoreAfterMaxFailures$1.evaluate(TestRuleIgnoreAfterMaxFailures.java:70)
	at org.apache.lucene.util.TestRuleIgnoreTestSuites$1.evaluate(TestRuleIgnoreTestSuites.java:55)
	at com.carrotsearch.randomizedtesting.rules.StatementAdapter.evaluate(StatementAdapter.java:36)
	at com.carrotsearch.randomizedtesting.ThreadLeakControl$StatementRunner.run(ThreadLeakControl.java:358)
	at java.lang.Thread.run(Thread.java:724)
Caused by: org.apache.http.conn.HttpHostConnectException: Connection to http://127.0.0.1:53655 refused
	at org.apache.http.impl.conn.DefaultClientConnectionOperator.openConnection(DefaultClientConnectionOperator.java:190)
	at org.apache.http.impl.conn.ManagedClientConnectionImpl.open(ManagedClientConnectionImpl.java:294)
	at org.apache.http.impl.client.DefaultRequestDirector.tryConnect(DefaultRequestDirector.java:645)
	at org.apache.http.impl.client.DefaultRequestDirector.execute(DefaultRequestDirector.java:480)
	at org.apache.http.impl.client.AbstractHttpClient.execute(AbstractHttpClient.java:906)
	at org.apache.http.impl.client.AbstractHttpClient.execute(AbstractHttpClient.java:805)
	at org.apache.http.impl.client.AbstractHttpClient.execute(AbstractHttpClient.java:784)
	at org.apache.solr.client.solrj.impl.HttpSolrServer.request(HttpSolrServer.java:365)
	... 44 more
Caused by: java.net.ConnectException: Connection refused
	at java.net.PlainSocketImpl.socketConnect(Native Method)
	at java.net.AbstractPlainSocketImpl.doConnect(AbstractPlainSocketImpl.java:339)
	at java.net.AbstractPlainSocketImpl.connectToAddress(AbstractPlainSocketImpl.java:200)
	at java.net.AbstractPlainSocketImpl.connect(AbstractPlainSocketImpl.java:182)
	at java.net.SocksSocketImpl.connect(SocksSocketImpl.java:392)
	at java.net.Socket.connect(Socket.java:579)
	at org.apache.http.conn.scheme.PlainSocketFactory.connectSocket(PlainSocketFactory.java:127)
	at org.apache.http.impl.conn.DefaultClientConnectionOperator.openConnection(DefaultClientConnectionOperator.java:180)
	... 51 more




Build Log:
[...truncated 9871 lines...]
   [junit4] Suite: org.apache.solr.cloud.CollectionsAPIDistributedZkTest
   [junit4]   2> 2956215 T5392 oas.BaseDistributedSearchTestCase.initHostContext Setting hostContext system property: /
   [junit4]   2> 2956224 T5392 oas.SolrTestCaseJ4.setUp ###Starting testDistribSearch
   [junit4]   2> Creating dataDir: /Users/jenkins/jenkins-slave/workspace/Lucene-Solr-4.x-MacOSX/solr/build/solr-core/test/J0/./solrtest-CollectionsAPIDistributedZkTest-1375437685483
   [junit4]   2> 2956226 T5392 oasc.ZkTestServer.run STARTING ZK TEST SERVER
   [junit4]   2> 2956227 T5393 oasc.ZkTestServer$ZKServerMain.runFromConfig Starting server
   [junit4]   2> 2956328 T5392 oasc.ZkTestServer.run start zk server on port:53648
   [junit4]   2> 2956331 T5392 oascc.ConnectionManager.waitForConnected Waiting for client to connect to ZooKeeper
   [junit4]   2> 2956348 T5399 oascc.ConnectionManager.process Watcher org.apache.solr.common.cloud.ConnectionManager@49e2ec62 name:ZooKeeperConnection Watcher:127.0.0.1:53648 got event WatchedEvent state:SyncConnected type:None path:null path:null type:None
   [junit4]   2> 2956349 T5392 oascc.ConnectionManager.waitForConnected Client is connected to ZooKeeper
   [junit4]   2> 2956350 T5392 oascc.SolrZkClient.makePath makePath: /solr
   [junit4]   2> 2956359 T5392 oascc.ConnectionManager.waitForConnected Waiting for client to connect to ZooKeeper
   [junit4]   2> 2956364 T5401 oascc.ConnectionManager.process Watcher org.apache.solr.common.cloud.ConnectionManager@21982d15 name:ZooKeeperConnection Watcher:127.0.0.1:53648/solr got event WatchedEvent state:SyncConnected type:None path:null path:null type:None
   [junit4]   2> 2956364 T5392 oascc.ConnectionManager.waitForConnected Client is connected to ZooKeeper
   [junit4]   2> 2956365 T5392 oascc.SolrZkClient.makePath makePath: /collections/collection1
   [junit4]   2> 2956372 T5392 oascc.SolrZkClient.makePath makePath: /collections/collection1/shards
   [junit4]   2> 2956378 T5392 oascc.SolrZkClient.makePath makePath: /collections/control_collection
   [junit4]   2> 2956383 T5392 oascc.SolrZkClient.makePath makePath: /collections/control_collection/shards
   [junit4]   2> 2956388 T5392 oasc.AbstractZkTestCase.putConfig put /Users/jenkins/jenkins-slave/workspace/Lucene-Solr-4.x-MacOSX/solr/build/solr-core/test-files/solr/collection1/conf/solrconfig-tlog.xml to /configs/conf1/solrconfig.xml
   [junit4]   2> 2956389 T5392 oascc.SolrZkClient.makePath makePath: /configs/conf1/solrconfig.xml
   [junit4]   2> 2956402 T5392 oasc.AbstractZkTestCase.putConfig put /Users/jenkins/jenkins-slave/workspace/Lucene-Solr-4.x-MacOSX/solr/build/solr-core/test-files/solr/collection1/conf/schema.xml to /configs/conf1/schema.xml
   [junit4]   2> 2956403 T5392 oascc.SolrZkClient.makePath makePath: /configs/conf1/schema.xml
   [junit4]   2> 2956417 T5392 oasc.AbstractZkTestCase.putConfig put /Users/jenkins/jenkins-slave/workspace/Lucene-Solr-4.x-MacOSX/solr/build/solr-core/test-files/solr/collection1/conf/stopwords.txt to /configs/conf1/stopwords.txt
   [junit4]   2> 2956418 T5392 oascc.SolrZkClient.makePath makePath: /configs/conf1/stopwords.txt
   [junit4]   2> 2956426 T5392 oasc.AbstractZkTestCase.putConfig put /Users/jenkins/jenkins-slave/workspace/Lucene-Solr-4.x-MacOSX/solr/build/solr-core/test-files/solr/collection1/conf/protwords.txt to /configs/conf1/protwords.txt
   [junit4]   2> 2956427 T5392 oascc.SolrZkClient.makePath makePath: /configs/conf1/protwords.txt
   [junit4]   2> 2956436 T5392 oasc.AbstractZkTestCase.putConfig put /Users/jenkins/jenkins-slave/workspace/Lucene-Solr-4.x-MacOSX/solr/build/solr-core/test-files/solr/collection1/conf/currency.xml to /configs/conf1/currency.xml
   [junit4]   2> 2956437 T5392 oascc.SolrZkClient.makePath makePath: /configs/conf1/currency.xml
   [junit4]   2> 2956443 T5392 oasc.AbstractZkTestCase.putConfig put /Users/jenkins/jenkins-slave/workspace/Lucene-Solr-4.x-MacOSX/solr/build/solr-core/test-files/solr/collection1/conf/open-exchange-rates.json to /configs/conf1/open-exchange-rates.json
   [junit4]   2> 2956444 T5392 oascc.SolrZkClient.makePath makePath: /configs/conf1/open-exchange-rates.json
   [junit4]   2> 2956449 T5392 oasc.AbstractZkTestCase.putConfig put /Users/jenkins/jenkins-slave/workspace/Lucene-Solr-4.x-MacOSX/solr/build/solr-core/test-files/solr/collection1/conf/mapping-ISOLatin1Accent.txt to /configs/conf1/mapping-ISOLatin1Accent.txt
   [junit4]   2> 2956450 T5392 oascc.SolrZkClient.makePath makePath: /configs/conf1/mapping-ISOLatin1Accent.txt
   [junit4]   2> 2956455 T5392 oasc.AbstractZkTestCase.putConfig put /Users/jenkins/jenkins-slave/workspace/Lucene-Solr-4.x-MacOSX/solr/build/solr-core/test-files/solr/collection1/conf/old_synonyms.txt to /configs/conf1/old_synonyms.txt
   [junit4]   2> 2956456 T5392 oascc.SolrZkClient.makePath makePath: /configs/conf1/old_synonyms.txt
   [junit4]   2> 2956462 T5392 oasc.AbstractZkTestCase.putConfig put /Users/jenkins/jenkins-slave/workspace/Lucene-Solr-4.x-MacOSX/solr/build/solr-core/test-files/solr/collection1/conf/synonyms.txt to /configs/conf1/synonyms.txt
   [junit4]   2> 2956463 T5392 oascc.SolrZkClient.makePath makePath: /configs/conf1/synonyms.txt
   [junit4]   2> 2956951 T5392 oejs.Server.doStart jetty-8.1.10.v20130312
   [junit4]   2> 2956957 T5392 oejs.AbstractConnector.doStart Started SelectChannelConnector@127.0.0.1:53651
   [junit4]   2> 2956959 T5392 oass.SolrDispatchFilter.init SolrDispatchFilter.init()
   [junit4]   2> 2956960 T5392 oasc.SolrResourceLoader.locateSolrHome JNDI not configured for solr (NoInitialContextEx)
   [junit4]   2> 2956961 T5392 oasc.SolrResourceLoader.locateSolrHome using system property solr.solr.home: /Users/jenkins/jenkins-slave/workspace/Lucene-Solr-4.x-MacOSX/solr/build/solr-core/test/J0/./org.apache.solr.cloud.CollectionsAPIDistributedZkTest-controljetty-1375437685734
   [junit4]   2> 2956961 T5392 oasc.SolrResourceLoader.<init> new SolrResourceLoader for directory: '/Users/jenkins/jenkins-slave/workspace/Lucene-Solr-4.x-MacOSX/solr/build/solr-core/test/J0/./org.apache.solr.cloud.CollectionsAPIDistributedZkTest-controljetty-1375437685734/'
   [junit4]   2> 2957021 T5392 oasc.ConfigSolr.fromFile Loading container configuration from /Users/jenkins/jenkins-slave/workspace/Lucene-Solr-4.x-MacOSX/solr/build/solr-core/test/J0/./org.apache.solr.cloud.CollectionsAPIDistributedZkTest-controljetty-1375437685734/solr.xml
   [junit4]   2> 2957143 T5392 oasc.ConfigSolrXml.<init> Config-defined core root directory: 
   [junit4]   2> 2957145 T5392 oasc.CoreContainer.<init> New CoreContainer 605837945
   [junit4]   2> 2957146 T5392 oasc.CoreContainer.load Loading cores into CoreContainer [instanceDir=/Users/jenkins/jenkins-slave/workspace/Lucene-Solr-4.x-MacOSX/solr/build/solr-core/test/J0/./org.apache.solr.cloud.CollectionsAPIDistributedZkTest-controljetty-1375437685734/]
   [junit4]   2> 2957148 T5392 oashc.HttpShardHandlerFactory.getParameter Setting socketTimeout to: 120000
   [junit4]   2> 2957149 T5392 oashc.HttpShardHandlerFactory.getParameter Setting urlScheme to: http://
   [junit4]   2> 2957149 T5392 oashc.HttpShardHandlerFactory.getParameter Setting connTimeout to: 15000
   [junit4]   2> 2957150 T5392 oashc.HttpShardHandlerFactory.getParameter Setting maxConnectionsPerHost to: 20
   [junit4]   2> 2957150 T5392 oashc.HttpShardHandlerFactory.getParameter Setting corePoolSize to: 0
   [junit4]   2> 2957151 T5392 oashc.HttpShardHandlerFactory.getParameter Setting maximumPoolSize to: 2147483647
   [junit4]   2> 2957152 T5392 oashc.HttpShardHandlerFactory.getParameter Setting maxThreadIdleTime to: 5
   [junit4]   2> 2957152 T5392 oashc.HttpShardHandlerFactory.getParameter Setting sizeOfQueue to: -1
   [junit4]   2> 2957153 T5392 oashc.HttpShardHandlerFactory.getParameter Setting fairnessPolicy to: false
   [junit4]   2> 2957153 T5392 oascsi.HttpClientUtil.createClient Creating new http client, config:maxConnectionsPerHost=20&maxConnections=10000&socketTimeout=120000&connTimeout=15000&retry=false
   [junit4]   2> 2957176 T5392 oasc.ZkContainer.initZooKeeper Zookeeper client=127.0.0.1:53648/solr
   [junit4]   2> 2957177 T5392 oasc.ZkController.checkChrootPath zkHost includes chroot
   [junit4]   2> 2957188 T5392 oascc.ConnectionManager.waitForConnected Waiting for client to connect to ZooKeeper
   [junit4]   2> 2957190 T5412 oascc.ConnectionManager.process Watcher org.apache.solr.common.cloud.ConnectionManager@509a11b8 name:ZooKeeperConnection Watcher:127.0.0.1:53648 got event WatchedEvent state:SyncConnected type:None path:null path:null type:None
   [junit4]   2> 2957190 T5392 oascc.ConnectionManager.waitForConnected Client is connected to ZooKeeper
   [junit4]   2> 2957193 T5392 oascsi.HttpClientUtil.createClient Creating new http client, config:maxConnections=500&maxConnectionsPerHost=16&socketTimeout=120000&connTimeout=15000
   [junit4]   2> 2957215 T5392 oascc.ConnectionManager.waitForConnected Waiting for client to connect to ZooKeeper
   [junit4]   2> 2957222 T5414 oascc.ConnectionManager.process Watcher org.apache.solr.common.cloud.ConnectionManager@53d4b8ed name:ZooKeeperConnection Watcher:127.0.0.1:53648/solr got event WatchedEvent state:SyncConnected type:None path:null path:null type:None
   [junit4]   2> 2957223 T5392 oascc.ConnectionManager.waitForConnected Client is connected to ZooKeeper
   [junit4]   2> 2957226 T5392 oascc.SolrZkClient.makePath makePath: /overseer/queue
   [junit4]   2> 2957234 T5392 oascc.SolrZkClient.makePath makePath: /overseer/collection-queue-work
   [junit4]   2> 2957242 T5392 oascc.SolrZkClient.makePath makePath: /live_nodes
   [junit4]   2> 2957247 T5392 oasc.ZkController.createEphemeralLiveNode Register node as live in ZooKeeper:/live_nodes/127.0.0.1:53651_
   [junit4]   2> 2957249 T5392 oascc.SolrZkClient.makePath makePath: /live_nodes/127.0.0.1:53651_
   [junit4]   2> 2957257 T5392 oascc.SolrZkClient.makePath makePath: /overseer_elect/election
   [junit4]   2> 2957268 T5392 oascc.SolrZkClient.makePath makePath: /overseer_elect/leader
   [junit4]   2> 2957274 T5392 oasc.Overseer.start Overseer (id=90140684156338179-127.0.0.1:53651_-n_0000000000) starting
   [junit4]   2> 2957296 T5392 oascc.SolrZkClient.makePath makePath: /overseer/queue-work
   [junit4]   2> 2957306 T5416 oasc.OverseerCollectionProcessor.run Process current queue of collection creations
   [junit4]   2> 2957309 T5392 oascc.SolrZkClient.makePath makePath: /clusterstate.json
   [junit4]   2> 2957315 T5392 oascc.SolrZkClient.makePath makePath: /aliases.json
   [junit4]   2> 2957319 T5392 oascc.ZkStateReader.createClusterStateWatchersAndUpdate Updating cluster state from ZooKeeper... 
   [junit4]   2> 2957330 T5392 oasc.CorePropertiesLocator.discover Looking for core definitions underneath /Users/jenkins/jenkins-slave/workspace/Lucene-Solr-4.x-MacOSX/solr/build/solr-core/test/J0/./org.apache.solr.cloud.CollectionsAPIDistributedZkTest-controljetty-1375437685734
   [junit4]   2> 2957336 T5415 oasc.Overseer$ClusterStateUpdater.run Starting to work on the main queue
   [junit4]   2> 2957504 T5392 oasc.CorePropertiesLocator.discoverUnder Found core conf in /Users/jenkins/jenkins-slave/workspace/Lucene-Solr-4.x-MacOSX/solr/build/solr-core/test/J0/./org.apache.solr.cloud.CollectionsAPIDistributedZkTest-controljetty-1375437685734/conf/
   [junit4]   2> 2957515 T5392 oasc.CorePropertiesLocator.discover Found 1 core definitions
   [junit4]   2> 2957517 T5392 oass.SolrDispatchFilter.init user.dir=/Users/jenkins/jenkins-slave/workspace/Lucene-Solr-4.x-MacOSX/solr/build/solr-core/test/J0
   [junit4]   2> 2957517 T5392 oass.SolrDispatchFilter.init SolrDispatchFilter.init() done
   [junit4]   2> 2957518 T5392 oascsi.HttpClientUtil.createClient Creating new http client, config:maxConnections=128&maxConnectionsPerHost=32&followRedirects=false
   [junit4]   2> 2957545 T5392 oascsi.HttpClientUtil.createClient Creating new http client, config:
   [junit4]   2> 2957548 T5392 oascc.ConnectionManager.waitForConnected Waiting for client to connect to ZooKeeper
   [junit4]   2> 2957552 T5419 oascc.ConnectionManager.process Watcher org.apache.solr.common.cloud.ConnectionManager@5e5b430 name:ZooKeeperConnection Watcher:127.0.0.1:53648/solr got event WatchedEvent state:SyncConnected type:None path:null path:null type:None
   [junit4]   2> 2957553 T5392 oascc.ConnectionManager.waitForConnected Client is connected to ZooKeeper
   [junit4]   2> 2957556 T5392 oascc.ZkStateReader.createClusterStateWatchersAndUpdate Updating cluster state from ZooKeeper... 
   [junit4]   2> 2957562 T5392 oasc.ChaosMonkey.monkeyLog monkey: init - expire sessions:true cause connection loss:true
   [junit4]   2> 2958027 T5392 oejs.Server.doStart jetty-8.1.10.v20130312
   [junit4]   2> 2958032 T5392 oejs.AbstractConnector.doStart Started SelectChannelConnector@127.0.0.1:53655
   [junit4]   2> 2958035 T5392 oass.SolrDispatchFilter.init SolrDispatchFilter.init()
   [junit4]   2> 2958035 T5392 oasc.SolrResourceLoader.locateSolrHome JNDI not configured for solr (NoInitialContextEx)
   [junit4]   2> 2958036 T5392 oasc.SolrResourceLoader.locateSolrHome using system property solr.solr.home: /Users/jenkins/jenkins-slave/workspace/Lucene-Solr-4.x-MacOSX/solr/build/solr-core/test/J0/./org.apache.solr.cloud.CollectionsAPIDistributedZkTest-jetty1-1375437686820
   [junit4]   2> 2958036 T5392 oasc.SolrResourceLoader.<init> new SolrResourceLoader for directory: '/Users/jenkins/jenkins-slave/workspace/Lucene-Solr-4.x-MacOSX/solr/build/solr-core/test/J0/./org.apache.solr.cloud.CollectionsAPIDistributedZkTest-jetty1-1375437686820/'
   [junit4]   2> 2958094 T5392 oasc.ConfigSolr.fromFile Loading container configuration from /Users/jenkins/jenkins-slave/workspace/Lucene-Solr-4.x-MacOSX/solr/build/solr-core/test/J0/./org.apache.solr.cloud.CollectionsAPIDistributedZkTest-jetty1-1375437686820/solr.xml
   [junit4]   2> 2958220 T5392 oasc.ConfigSolrXml.<init> Config-defined core root directory: 
   [junit4]   2> 2958221 T5392 oasc.CoreContainer.<init> New CoreContainer 1653600801
   [junit4]   2> 2958222 T5392 oasc.CoreContainer.load Loading cores into CoreContainer [instanceDir=/Users/jenkins/jenkins-slave/workspace/Lucene-Solr-4.x-MacOSX/solr/build/solr-core/test/J0/./org.apache.solr.cloud.CollectionsAPIDistributedZkTest-jetty1-1375437686820/]
   [junit4]   2> 2958226 T5392 oashc.HttpShardHandlerFactory.getParameter Setting socketTimeout to: 120000
   [junit4]   2> 2958227 T5392 oashc.HttpShardHandlerFactory.getParameter Setting urlScheme to: http://
   [junit4]   2> 2958228 T5392 oashc.HttpShardHandlerFactory.getParameter Setting connTimeout to: 15000
   [junit4]   2> 2958228 T5392 oashc.HttpShardHandlerFactory.getParameter Setting maxConnectionsPerHost to: 20
   [junit4]   2> 2958229 T5392 oashc.HttpShardHandlerFactory.getParameter Setting corePoolSize to: 0
   [junit4]   2> 2958229 T5392 oashc.HttpShardHandlerFactory.getParameter Setting maximumPoolSize to: 2147483647
   [junit4]   2> 2958230 T5392 oashc.HttpShardHandlerFactory.getParameter Setting maxThreadIdleTime to: 5
   [junit4]   2> 2958230 T5392 oashc.HttpShardHandlerFactory.getParameter Setting sizeOfQueue to: -1
   [junit4]   2> 2958231 T5392 oashc.HttpShardHandlerFactory.getParameter Setting fairnessPolicy to: false
   [junit4]   2> 2958231 T5392 oascsi.HttpClientUtil.createClient Creating new http client, config:maxConnectionsPerHost=20&maxConnections=10000&socketTimeout=120000&connTimeout=15000&retry=false
   [junit4]   2> 2958250 T5392 oasc.ZkContainer.initZooKeeper Zookeeper client=127.0.0.1:53648/solr
   [junit4]   2> 2958251 T5392 oasc.ZkController.checkChrootPath zkHost includes chroot
   [junit4]   2> 2958254 T5392 oascc.ConnectionManager.waitForConnected Waiting for client to connect to ZooKeeper
   [junit4]   2> 2958259 T5430 oascc.ConnectionManager.process Watcher org.apache.solr.common.cloud.ConnectionManager@2c2ce77 name:ZooKeeperConnection Watcher:127.0.0.1:53648 got event WatchedEvent state:SyncConnected type:None path:null path:null type:None
   [junit4]   2> 2958260 T5392 oascc.ConnectionManager.waitForConnected Client is connected to ZooKeeper
   [junit4]   2> 2958265 T5392 oascsi.HttpClientUtil.createClient Creating new http client, config:maxConnections=500&maxConnectionsPerHost=16&socketTimeout=120000&connTimeout=15000
   [junit4]   2> 2958290 T5392 oascc.ConnectionManager.waitForConnected Waiting for client to connect to ZooKeeper
   [junit4]   2> 2958297 T5432 oascc.ConnectionManager.process Watcher org.apache.solr.common.cloud.ConnectionManager@77a29b6d name:ZooKeeperConnection Watcher:127.0.0.1:53648/solr got event WatchedEvent state:SyncConnected type:None path:null path:null type:None
   [junit4]   2> 2958297 T5392 oascc.ConnectionManager.waitForConnected Client is connected to ZooKeeper
   [junit4]   2> 2958309 T5392 oascc.ZkStateReader.createClusterStateWatchersAndUpdate Updating cluster state from ZooKeeper... 
   [junit4]   2> 2959321 T5392 oasc.ZkController.createEphemeralLiveNode Register node as live in ZooKeeper:/live_nodes/127.0.0.1:53655_
   [junit4]   2> 2959327 T5392 oascc.SolrZkClient.makePath makePath: /live_nodes/127.0.0.1:53655_
   [junit4]   2> 2959331 T5432 oascc.ZkStateReader$3.process Updating live nodes... (2)
   [junit4]   2> 2959347 T5419 oascc.ZkStateReader$3.process Updating live nodes... (2)
   [junit4]   2> 2959347 T5414 oascc.ZkStateReader$3.process Updating live nodes... (2)
   [junit4]   2> 2959347 T5392 oasc.CorePropertiesLocator.discover Looking for core definitions underneath /Users/jenkins/jenkins-slave/workspace/Lucene-Solr-4.x-MacOSX/solr/build/solr-core/test/J0/./org.apache.solr.cloud.CollectionsAPIDistributedZkTest-jetty1-1375437686820
   [junit4]   2> 2959515 T5392 oasc.CorePropertiesLocator.discoverUnder Found core conf in /Users/jenkins/jenkins-slave/workspace/Lucene-Solr-4.x-MacOSX/solr/build/solr-core/test/J0/./org.apache.solr.cloud.CollectionsAPIDistributedZkTest-jetty1-1375437686820/conf/
   [junit4]   2> 2959531 T5392 oasc.CorePropertiesLocator.discover Found 1 core definitions
   [junit4]   2> 2959534 T5392 oass.SolrDispatchFilter.init user.dir=/Users/jenkins/jenkins-slave/workspace/Lucene-Solr-4.x-MacOSX/solr/build/solr-core/test/J0
   [junit4]   2> 2959534 T5392 oass.SolrDispatchFilter.init SolrDispatchFilter.init() done
   [junit4]   2> 2959535 T5392 oascsi.HttpClientUtil.createClient Creating new http client, config:maxConnections=128&maxConnectionsPerHost=32&followRedirects=false
   [junit4]   2> 2960059 T5392 oejs.Server.doStart jetty-8.1.10.v20130312
   [junit4]   2> 2960069 T5392 oejs.AbstractConnector.doStart Started SelectChannelConnector@127.0.0.1:53658
   [junit4]   2> 2960075 T5392 oass.SolrDispatchFilter.init SolrDispatchFilter.init()
   [junit4]   2> 2960076 T5392 oasc.SolrResourceLoader.locateSolrHome JNDI not configured for solr (NoInitialContextEx)
   [junit4]   2> 2960077 T5392 oasc.SolrResourceLoader.locateSolrHome using system property solr.solr.home: /Users/jenkins/jenkins-slave/workspace/Lucene-Solr-4.x-MacOSX/solr/build/solr-core/test/J0/./org.apache.solr.cloud.CollectionsAPIDistributedZkTest-jetty2-1375437688829
   [junit4]   2> 2960079 T5392 oasc.SolrResourceLoader.<init> new SolrResourceLoader for directory: '/Users/jenkins/jenkins-slave/workspace/Lucene-Solr-4.x-MacOSX/solr/build/solr-core/test/J0/./org.apache.solr.cloud.CollectionsAPIDistributedZkTest-jetty2-1375437688829/'
   [junit4]   2> 2960131 T5392 oasc.ConfigSolr.fromFile Loading container configuration from /Users/jenkins/jenkins-slave/workspace/Lucene-Solr-4.x-MacOSX/solr/build/solr-core/test/J0/./org.apache.solr.cloud.CollectionsAPIDistributedZkTest-jetty2-1375437688829/solr.xml
   [junit4]   2> 2960250 T5392 oasc.ConfigSolrXml.<init> Config-defined core root directory: 
   [junit4]   2> 2960251 T5392 oasc.CoreContainer.<init> New CoreContainer 109723055
   [junit4]   2> 2960252 T5392 oasc.CoreContainer.load Loading cores into CoreContainer [instanceDir=/Users/jenkins/jenkins-slave/workspace/Lucene-Solr-4.x-MacOSX/solr/build/solr-core/test/J0/./org.apache.solr.cloud.CollectionsAPIDistributedZkTest-jetty2-1375437688829/]
   [junit4]   2> 2960255 T5392 oashc.HttpShardHandlerFactory.getParameter Setting socketTimeout to: 120000
   [junit4]   2> 2960255 T5392 oashc.HttpShardHandlerFactory.getParameter Setting urlScheme to: http://
   [junit4]   2> 2960256 T5392 oashc.HttpShardHandlerFactory.getParameter Setting connTimeout to: 15000
   [junit4]   2> 2960256 T5392 oashc.HttpShardHandlerFactory.getParameter Setting maxConnectionsPerHost to: 20
   [junit4]   2> 2960257 T5392 oashc.HttpShardHandlerFactory.getParameter Setting corePoolSize to: 0
   [junit4]   2> 2960257 T5392 oashc.HttpShardHandlerFactory.getParameter Setting maximumPoolSize to: 2147483647
   [junit4]   2> 2960258 T5392 oashc.HttpShardHandlerFactory.getParameter Setting maxThreadIdleTime to: 5
   [junit4]   2> 2960258 T5392 oashc.HttpShardHandlerFactory.getParameter Setting sizeOfQueue to: -1
   [junit4]   2> 2960259 T5392 oashc.HttpShardHandlerFactory.getParameter Setting fairnessPolicy to: false
   [junit4]   2> 2960260 T5392 oascsi.HttpClientUtil.createClient Creating new http client, config:maxConnectionsPerHost=20&maxConnections=10000&socketTimeout=120000&connTimeout=15000&retry=false
   [junit4]   2> 2960368 T5392 oasc.ZkContainer.initZooKeeper Zookeeper client=127.0.0.1:53648/solr
   [junit4]   2> 2960369 T5392 oasc.ZkController.checkChrootPath zkHost includes chroot
   [junit4]   2> 2960373 T5392 oascc.ConnectionManager.waitForConnected Waiting for client to connect to ZooKeeper
   [junit4]   2> 2960378 T5444 oascc.ConnectionManager.process Watcher org.apache.solr.common.cloud.ConnectionManager@534d36c3 name:ZooKeeperConnection Watcher:127.0.0.1:53648 got event WatchedEvent state:SyncConnected type:None path:null path:null type:None
   [junit4]   2> 2960378 T5392 oascc.ConnectionManager.waitForConnected Client is connected to ZooKeeper
   [junit4]   2> 2960382 T5392 oascsi.HttpClientUtil.createClient Creating new http client, config:maxConnections=500&maxConnectionsPerHost=16&socketTimeout=120000&connTimeout=15000
   [junit4]   2> 2960405 T5392 oascc.ConnectionManager.waitForConnected Waiting for client to connect to ZooKeeper
   [junit4]   2> 2960410 T5446 oascc.ConnectionManager.process Watcher org.apache.solr.common.cloud.ConnectionManager@4add0b4b name:ZooKeeperConnection Watcher:127.0.0.1:53648/solr got event WatchedEvent state:SyncConnected type:None path:null path:null type:None
   [junit4]   2> 2960411 T5392 oascc.ConnectionManager.waitForConnected Client is connected to ZooKeeper
   [junit4]   2> 2960421 T5392 oascc.ZkStateReader.createClusterStateWatchersAndUpdate Updating cluster state from ZooKeeper... 
   [junit4]   2> 2961429 T5392 oasc.ZkController.createEphemeralLiveNode Register node as live in ZooKeeper:/live_nodes/127.0.0.1:53658_
   [junit4]   2> 2961432 T5392 oascc.SolrZkClient.makePath makePath: /live_nodes/127.0.0.1:53658_
   [junit4]   2> 2961443 T5446 oascc.ZkStateReader$3.process Updating live nodes... (3)
   [junit4]   2> 2961443 T5432 oascc.ZkStateReader$3.process Updating live nodes... (3)
   [junit4]   2> 2961444 T5414 oascc.ZkStateReader$3.process Updating live nodes... (3)
   [junit4]   2> 2961444 T5419 oascc.ZkStateReader$3.process Updating live nodes... (3)
   [junit4]   2> 2961454 T5392 oasc.CorePropertiesLocator.discover Looking for core definitions underneath /Users/jenkins/jenkins-slave/workspace/Lucene-Solr-4.x-MacOSX/solr/build/solr-core/test/J0/./org.apache.solr.cloud.CollectionsAPIDistributedZkTest-jetty2-1375437688829
   [junit4]   2> 2961631 T5392 oasc.CorePropertiesLocator.discoverUnder Found core conf in /Users/jenkins/jenkins-slave/workspace/Lucene-Solr-4.x-MacOSX/solr/build/solr-core/test/J0/./org.apache.solr.cloud.CollectionsAPIDistributedZkTest-jetty2-1375437688829/conf/
   [junit4]   2> 2961638 T5392 oasc.CorePropertiesLocator.discover Found 1 core definitions
   [junit4]   2> 2961639 T5392 oass.SolrDispatchFilter.init user.dir=/Users/jenkins/jenkins-slave/workspace/Lucene-Solr-4.x-MacOSX/solr/build/solr-core/test/J0
   [junit4]   2> 2961640 T5392 oass.SolrDispatchFilter.init SolrDispatchFilter.init() done
   [junit4]   2> 2961640 T5392 oascsi.HttpClientUtil.createClient Creating new http client, config:maxConnections=128&maxConnectionsPerHost=32&followRedirects=false
   [junit4]   2> 2962159 T5392 oejs.Server.doStart jetty-8.1.10.v20130312
   [junit4]   2> 2962169 T5392 oejs.AbstractConnector.doStart Started SelectChannelConnector@127.0.0.1:53661
   [junit4]   2> 2962172 T5392 oass.SolrDispatchFilter.init SolrDispatchFilter.init()
   [junit4]   2> 2962174 T5392 oasc.SolrResourceLoader.locateSolrHome JNDI not configured for solr (NoInitialContextEx)
   [junit4]   2> 2962175 T5392 oasc.SolrResourceLoader.locateSolrHome using system property solr.solr.home: /Users/jenkins/jenkins-slave/workspace/Lucene-Solr-4.x-MacOSX/solr/build/solr-core/test/J0/./org.apache.solr.cloud.CollectionsAPIDistributedZkTest-jetty3-1375437690922
   [junit4]   2> 2962176 T5392 oasc.SolrResourceLoader.<init> new SolrResourceLoader for directory: '/Users/jenkins/jenkins-slave/workspace/Lucene-Solr-4.x-MacOSX/solr/build/solr-core/test/J0/./org.apache.solr.cloud.CollectionsAPIDistributedZkTest-jetty3-1375437690922/'
   [junit4]   2> 2962251 T5392 oasc.ConfigSolr.fromFile Loading container configuration from /Users/jenkins/jenkins-slave/workspace/Lucene-Solr-4.x-MacOSX/solr/build/solr-core/test/J0/./org.apache.solr.cloud.CollectionsAPIDistributedZkTest-jetty3-1375437690922/solr.xml
   [junit4]   2> 2962400 T5392 oasc.ConfigSolrXml.<init> Config-defined core root directory: 
   [junit4]   2> 2962401 T5392 oasc.CoreContainer.<init> New CoreContainer 1551035313
   [junit4]   2> 2962402 T5392 oasc.CoreContainer.load Loading cores into CoreContainer [instanceDir=/Users/jenkins/jenkins-slave/workspace/Lucene-Solr-4.x-MacOSX/solr/build/solr-core/test/J0/./org.apache.solr.cloud.CollectionsAPIDistributedZkTest-jetty3-1375437690922/]
   [junit4]   2> 2962404 T5392 oashc.HttpShardHandlerFactory.getParameter Setting socketTimeout to: 120000
   [junit4]   2> 2962405 T5392 oashc.HttpShardHandlerFactory.getParameter Setting urlScheme to: http://
   [junit4]   2> 2962405 T5392 oashc.HttpShardHandlerFactory.getParameter Setting connTimeout to: 15000
   [junit4]   2> 2962406 T5392 oashc.HttpShardHandlerFactory.getParameter Setting maxConnectionsPerHost to: 20
   [junit4]   2> 2962406 T5392 oashc.HttpShardHandlerFactory.getParameter Setting corePoolSize to: 0
   [junit4]   2> 2962407 T5392 oashc.HttpShardHandlerFactory.getParameter Setting maximumPoolSize to: 2147483647
   [junit4]   2> 2962408 T5392 oashc.HttpShardHandlerFactory.getParameter Setting maxThreadIdleTime to: 5
   [junit4]   2> 2962408 T5392 oashc.HttpShardHandlerFactory.getParameter Setting sizeOfQueue to: -1
   [junit4]   2> 2962408 T5392 oashc.HttpShardHandlerFactory.getParameter Setting fairnessPolicy to: false
   [junit4]   2> 2962409 T5392 oascsi.HttpClientUtil.createClient Creating new http client, config:maxConnectionsPerHost=20&maxConnections=10000&socketTimeout=120000&connTimeout=15000&retry=false
   [junit4]   2> 2962434 T5392 oasc.ZkContainer.initZooKeeper Zookeeper client=127.0.0.1:53648/solr
   [junit4]   2> 2962435 T5392 oasc.ZkController.checkChrootPath zkHost includes chroot
   [junit4]   2> 2962438 T5392 oascc.ConnectionManager.waitForConnected Waiting for client to connect to ZooKeeper
   [junit4]   2> 2962442 T5458 oascc.ConnectionManager.process Watcher org.apache.solr.common.cloud.ConnectionManager@35268ef2 name:ZooKeeperConnection Watcher:127.0.0.1:53648 got event WatchedEvent state:SyncConnected type:None path:null path:null type:None
   [junit4]   2> 2962443 T5392 oascc.ConnectionManager.waitForConnected Client is connected to ZooKeeper
   [junit4]   2> 2962448 T5392 oascsi.HttpClientUtil.createClient Creating new http client, config:maxConnections=500&maxConnectionsPerHost=16&socketTimeout=120000&connTimeout=15000
   [junit4]   2> 2962468 T5392 oascc.ConnectionManager.waitForConnected Waiting for client to connect to ZooKeeper
   [junit4]   2> 2962480 T5460 oascc.ConnectionManager.process Watcher org.apache.solr.common.cloud.ConnectionManager@598abadf name:ZooKeeperConnection Watcher:127.0.0.1:53648/solr got event WatchedEvent state:SyncConnected type:None path:null path:null type:None
   [junit4]   2> 2962480 T5392 oascc.ConnectionManager.waitForConnected Client is connected to ZooKeeper
   [junit4]   2> 2962492 T5392 oascc.ZkStateReader.createClusterStateWatchersAndUpdate Updating cluster state from ZooKeeper... 
   [junit4]   2> 2963501 T5392 oasc.ZkController.createEphemeralLiveNode Register node as live in ZooKeeper:/live_nodes/127.0.0.1:53661_
   [junit4]   2> 2963504 T5392 oascc.SolrZkClient.makePath makePath: /live_nodes/127.0.0.1:53661_
   [junit4]   2> 2963511 T5460 oascc.ZkStateReader$3.process Updating live nodes... (4)
   [junit4]   2> 2963526 T5392 oasc.CorePropertiesLocator.discover Looking for core definitions underneath /Users/jenkins/jenkins-slave/workspace/Lucene-Solr-4.x-MacOSX/solr/build/solr-core/test/J0/./org.apache.solr.cloud.CollectionsAPIDistributedZkTest-jetty3-1375437690922
   [junit4]   2> 2963540 T5446 oascc.ZkStateReader$3.process Updating live nodes... (4)
   [junit4]   2> 2963549 T5414 oascc.ZkStateReader$3.process Updating live nodes... (4)
   [junit4]   2> 2963549 T5419 oascc.ZkStateReader$3.process Updating live nodes... (4)
   [junit4]   2> 2963550 T5432 oascc.ZkStateReader$3.process Updating live nodes... (4)
   [junit4]   2> 2963711 T5392 oasc.CorePropertiesLocator.discoverUnder Found core conf in /Users/jenkins/jenkins-slave/workspace/Lucene-Solr-4.x-MacOSX/solr/build/solr-core/test/J0/./org.apache.solr.cloud.CollectionsAPIDistributedZkTest-jetty3-1375437690922/conf/
   [junit4]   2> 2963717 T5392 oasc.CorePropertiesLocator.discover Found 1 core definitions
   [junit4]   2> 2963717 T5392 oass.SolrDispatchFilter.init user.dir=/Users/jenkins/jenkins-slave/workspace/Lucene-Solr-4.x-MacOSX/solr/build/solr-core/test/J0
   [junit4]   2> 2963718 T5392 oass.SolrDispatchFilter.init SolrDispatchFilter.init() done
   [junit4]   2> 2963718 T5392 oascsi.HttpClientUtil.createClient Creating new http client, config:maxConnections=128&maxConnectionsPerHost=32&followRedirects=false
   [junit4]   2> 2964258 T5392 oejs.Server.doStart jetty-8.1.10.v20130312
   [junit4]   2> 2964265 T5392 oejs.AbstractConnector.doStart Started SelectChannelConnector@127.0.0.1:53664
   [junit4]   2> 2964267 T5392 oass.SolrDispatchFilter.init SolrDispatchFilter.init()
   [junit4]   2> 2964267 T5392 oasc.SolrResourceLoader.locateSolrHome JNDI not configured for solr (NoInitialContextEx)
   [junit4]   2> 2964268 T5392 oasc.SolrResourceLoader.locateSolrHome using system property solr.solr.home: /Users/jenkins/jenkins-slave/workspace/Lucene-Solr-4.x-MacOSX/solr/build/solr-core/test/J0/./org.apache.solr.cloud.CollectionsAPIDistributedZkTest-jetty4-1375437692997
   [junit4]   2> 2964268 T5392 oasc.SolrResourceLoader.<init> new SolrResourceLoader for directory: '/Users/jenkins/jenkins-slave/workspace/Lucene-Solr-4.x-MacOSX/solr/build/solr-core/test/J0/./org.apache.solr.cloud.CollectionsAPIDistributedZkTest-jetty4-1375437692997/'
   [junit4]   2> 2964324 T5392 oasc.ConfigSolr.fromFile Loading container configuration from /Users/jenkins/jenkins-slave/workspace/Lucene-Solr-4.x-MacOSX/solr/build/solr-core/test/J0/./org.apache.solr.cloud.CollectionsAPIDistributedZkTest-jetty4-1375437692997/solr.xml
   [junit4]   2> 2964460 T5392 oasc.ConfigSolrXml.<init> Config-defined core root directory: 
   [junit4]   2> 2964461 T5392 oasc.CoreContainer.<init> New CoreContainer 1616462533
   [junit4]   2> 2964462 T5392 oasc.CoreContainer.load Loading cores into CoreContainer [instanceDir=/Users/jenkins/jenkins-slave/workspace/Lucene-Solr-4.x-MacOSX/solr/build/solr-core/test/J0/./org.apache.solr.cloud.CollectionsAPIDistributedZkTest-jetty4-1375437692997/]
   [junit4]   2> 2964465 T5392 oashc.HttpShardHandlerFactory.getParameter Setting socketTimeout to: 120000
   [junit4]   2> 2964468 T5392 oashc.HttpShardHandlerFactory.getParameter Setting urlScheme to: http://
   [junit4]   2> 2964469 T5392 oashc.HttpShardHandlerFactory.getParameter Setting connTimeout to: 15000
   [junit4]   2> 2964470 T5392 oashc.HttpShardHandlerFactory.getParameter Setting maxConnectionsPerHost to: 20
   [junit4]   2> 2964471 T5392 oashc.HttpShardHandlerFactory.getParameter Setting corePoolSize to: 0
   [junit4]   2> 2964471 T5392 oashc.HttpShardHandlerFactory.getParameter Setting maximumPoolSize to: 2147483647
   [junit4]   2> 2964472 T5392 oashc.HttpShardHandlerFactory.getParameter Setting maxThreadIdleTime to: 5
   [junit4]   2> 2964472 T5392 oashc.HttpShardHandlerFactory.getParameter Setting sizeOfQueue to: -1
   [junit4]   2> 2964473 T5392 oashc.HttpShardHandlerFactory.getParameter Setting fairnessPolicy to: false
   [junit4]   2> 2964473 T5392 oascsi.HttpClientUtil.createClient Creating new http client, config:maxConnectionsPerHost=20&maxConnections=10000&socketTimeout=120000&connTimeout=15000&retry=false
   [junit4]   2> 2964493 T5392 oasc.ZkContainer.initZooKeeper Zookeeper client=127.0.0.1:53648/solr
   [junit4]   2> 2964494 T5392 oasc.ZkController.checkChrootPath zkHost includes chroot
   [junit4]   2> 2964498 T5392 oascc.ConnectionManager.waitForConnected Waiting for client to connect to ZooKeeper
   [junit4]   2> 2964503 T5472 oascc.ConnectionManager.process Watcher org.apache.solr.common.cloud.ConnectionManager@82628ca name:ZooKeeperConnection Watcher:127.0.0.1:53648 got event WatchedEvent state:SyncConnected type:None path:null path:null type:None
   [junit4]   2> 2964505 T5392 oascc.ConnectionManager.waitForConnected Client is connected to ZooKeeper
   [junit4]   2> 2964516 T5392 oascsi.HttpClientUtil.createClient Creating new http client, config:maxConnections=500&maxConnectionsPerHost=16&socketTimeout=120000&connTimeout=15000
   [junit4]   2> 2964536 T5392 oascc.ConnectionManager.waitForConnected Waiting for client to connect to ZooKeeper
   [junit4]   2> 2964541 T5474 oascc.ConnectionManager.process Watcher org.apache.solr.common.cloud.ConnectionManager@1b2357d8 name:ZooKeeperConnection Watcher:127.0.0.1:53648/solr got event WatchedEvent state:SyncConnected type:None path:null path:null type:None
   [junit4]   2> 2964542 T5392 oascc.ConnectionManager.waitForConnected Client is connected to ZooKeeper
   [junit4]   2> 2964555 T5392 oascc.ZkStateReader.createClusterStateWatchersAndUpdate Updating cluster state from ZooKeeper... 
   [junit4]   2> 2965564 T5392 oasc.ZkController.createEphemeralLiveNode Register node as live in ZooKeeper:/live_nodes/127.0.0.1:53664_
   [junit4]   2> 2965566 T5392 oascc.SolrZkClient.makePath makePath: /live_nodes/127.0.0.1:53664_
   [junit4]   2> 2965573 T5474 oascc.ZkStateReader$3.process Updating live nodes... (5)
   [junit4]   2> 2965574 T5460 oascc.ZkStateReader$3.process Updating live nodes... (5)
   [junit4]   2> 2965583 T5419 oascc.ZkStateReader$3.process Updating live nodes... (5)
   [junit4]   2> 2965584 T5432 oascc.ZkStateReader$3.process Updating live nodes... (5)
   [junit4]   2> 2965584 T5414 oascc.ZkStateReader$3.process Updating live nodes... (5)
   [junit4]   2> 2965584 T5446 oascc.ZkStateReader$3.process Updating live nodes... (5)
   [junit4]   2> 2965593 T5392 oasc.CorePropertiesLocator.discover Looking for core definitions underneath /Users/jenkins/jenkins-slave/workspace/Lucene-Solr-4.x-MacOSX/solr/build/solr-core/test/J0/./org.apache.solr.cloud.CollectionsAPIDistributedZkTest-jetty4-1375437692997
   [junit4]   2> 2965756 T5392 oasc.CorePropertiesLocator.discoverUnder Found core conf in /Users/jenkins/jenkins-slave/workspace/Lucene-Solr-4.x-MacOSX/solr/build/solr-core/test/J0/./org.apache.solr.cloud.CollectionsAPIDistributedZkTest-jetty4-1375437692997/conf/
   [junit4]   2> 2965764 T5392 oasc.CorePropertiesLocator.discover Found 1 core definitions
   [junit4]   2> 2965765 T5392 oass.SolrDispatchFilter.init user.dir=/Users/jenkins/jenkins-slave/workspace/Lucene-Solr-4.x-MacOSX/solr/build/solr-core/test/J0
   [junit4]   2> 2965766 T5392 oass.SolrDispatchFilter.init SolrDispatchFilter.init() done
   [junit4]   2> 2965767 T5392 oascsi.HttpClientUtil.createClient Creating new http client, config:maxConnections=128&maxConnectionsPerHost=32&followRedirects=false
   [junit4]   2> 2965796 T5392 oascsi.HttpClientUtil.createClient Creating new http client, config:maxConnections=128&maxConnectionsPerHost=32&followRedirects=false
   [junit4]   2> 2965815 T5424 oasha.CollectionsHandler.handleCreateAction Creating Collection : numShards=2&name=nodes_used_collection&replicationFactor=2&action=CREATE&wt=javabin&version=2
   [junit4]   2> 2965819 T5414 oasc.DistributedQueue$LatchChildWatcher.process Watcher fired on path: /overseer/collection-queue-work state: SyncConnected type NodeChildrenChanged
   [junit4]   2> 2965823 T5416 oasc.OverseerCollectionProcessor.run Overseer Collection Processor: Get the message id:/overseer/collection-queue-work/qn-0000000000 message:{
   [junit4]   2> 	  "operation":"createcollection",
   [junit4]   2> 	  "numShards":"2",
   [junit4]   2> 	  "name":"nodes_used_collection",
   [junit4]   2> 	  "replicationFactor":"2"}
   [junit4]   2> 2965823 T5416 oasc.OverseerCollectionProcessor.processMessage WARN OverseerCollectionProcessor.processMessage : createcollection , {
   [junit4]   2> 	  "operation":"createcollection",
   [junit4]   2> 	  "numShards":"2",
   [junit4]   2> 	  "name":"nodes_used_collection",
   [junit4]   2> 	  "replicationFactor":"2"}
   [junit4]   2> 2966385 T5415 oascc.ZkStateReader.updateClusterState Updating cloud state from ZooKeeper... 
   [junit4]   2> 2966387 T5415 oasc.Overseer$ClusterStateUpdater.buildCollection building a new collection: nodes_used_collection
   [junit4]   2> 2966387 T5415 oasc.Overseer$ClusterStateUpdater.createCollection Create collection nodes_used_collection with shards [shard1, shard2]
   [junit4]   2> 2966396 T5446 oascc.ZkStateReader$2.process A cluster state change: WatchedEvent state:SyncConnected type:NodeDataChanged path:/clusterstate.json, has occurred - updating... (live nodes size: 5)
   [junit4]   2> 2966396 T5419 oascc.ZkStateReader$2.process A cluster state change: WatchedEvent state:SyncConnected type:NodeDataChanged path:/clusterstate.json, has occurred - updating... (live nodes size: 5)
   [junit4]   2> 2966397 T5432 oascc.ZkStateReader$2.process A cluster state change: WatchedEvent state:SyncConnected type:NodeDataChanged path:/clusterstate.json, has occurred - updating... (live nodes size: 5)
   [junit4]   2> 2966397 T5460 oascc.ZkStateReader$2.process A cluster state change: WatchedEvent state:SyncConnected type:NodeDataChanged path:/clusterstate.json, has occurred - updating... (live nodes size: 5)
   [junit4]   2> 2966398 T5414 oascc.ZkStateReader$2.process A cluster state change: WatchedEvent state:SyncConnected type:NodeDataChanged path:/clusterstate.json, has occurred - updating... (live nodes size: 5)
   [junit4]   2> 2966397 T5474 oascc.ZkStateReader$2.process A cluster state change: WatchedEvent state:SyncConnected type:NodeDataChanged path:/clusterstate.json, has occurred - updating... (live nodes size: 5)
   [junit4]   2> 2966443 T5416 oasc.OverseerCollectionProcessor.createCollection going to create cores replicas shardNames [shard1, shard2] , repFactor : 2
   [junit4]   2> 2966444 T5416 oasc.OverseerCollectionProcessor.createCollection Creating shard nodes_used_collection_shard1_replica1 as part of slice shard1 of collection nodes_used_collection on 127.0.0.1:53658_
   [junit4]   2> 2966445 T5416 oasc.OverseerCollectionProcessor.createCollection Creating shard nodes_used_collection_shard1_replica2 as part of slice shard1 of collection nodes_used_collection on 127.0.0.1:53664_
   [junit4]   2> 2966445 T5416 oasc.OverseerCollectionProcessor.createCollection Creating shard nodes_used_collection_shard2_replica1 as part of slice shard2 of collection nodes_used_collection on 127.0.0.1:53651_
   [junit4]   2> 2966446 T5416 oasc.OverseerCollectionProcessor.createCollection Creating shard nodes_used_collection_shard2_replica2 as part of slice shard2 of collection nodes_used_collection on 127.0.0.1:53661_
   [junit4]   2> 2966457 T5440 oasc.ZkController.publish publishing core=nodes_used_collection_shard1_replica1 state=down
   [junit4]   2> 2966458 T5454 oasc.ZkController.publish publishing core=nodes_used_collection_shard2_replica2 state=down
   [junit4]   2> 2966459 T5407 oasc.ZkController.publish publishing core=nodes_used_collection_shard2_replica1 state=down
   [junit4]   2> 2966460 T5470 oasc.ZkController.publish publishing core=nodes_used_collection_shard1_replica2 state=down
   [junit4]   2> 2966463 T5454 oasc.ZkController.waitForCoreNodeName look for our core node name
   [junit4]   2> 2966463 T5440 oasc.ZkController.waitForCoreNodeName look for our core node name
   [junit4]   2> 2966464 T5470 oasc.ZkController.waitForCoreNodeName look for our core node name
   [junit4]   2> 2966464 T5407 oasc.ZkController.waitForCoreNodeName look for our core node name
   [junit4]   2> 2967915 T5415 oascc.ZkStateReader.updateClusterState Updating cloud state from ZooKeeper... 
   [junit4]   2> 2967918 T5415 oasc.Overseer$ClusterStateUpdater.updateState WARN Could not find collection node for nodes_used_collection, skipping publish state
   [junit4]   2> 2967918 T5415 oasc.Overseer$ClusterStateUpdater.updateState Update state numShards=2 message={
   [junit4]   2> 	  "operation":"state",
   [junit4]   2> 	  "core_node_name":"core_node1",
   [junit4]   2> 	  "numShards":"2",
   [junit4]   2> 	  "shard":"shard2",
   [junit4]   2> 	  "roles":null,
   [junit4]   2> 	  "state":"down",
   [junit4]   2> 	  "shard_state":"active",
   [junit4]   2> 	  "core":"nodes_used_collection_shard2_replica2",
   [junit4]   2> 	  "collection":"nodes_used_collection",
   [junit4]   2> 	  "shard_range":null,
   [junit4]   2> 	  "node_name":"127.0.0.1:53661_",
   [junit4]   2> 	  "base_url":"http://127.0.0.1:53661"}
   [junit4]   2> 2967929 T5415 oasc.Overseer$ClusterStateUpdater.updateState WARN Could not find collection node for nodes_used_collection, skipping publish state
   [junit4]   2> 2967930 T5415 oasc.Overseer$ClusterStateUpdater.updateState Update state numShards=2 message={
   [junit4]   2> 	  "operation":"state",
   [junit4]   2> 	  "core_node_name":"core_node2",
   [junit4]   2> 	  "numShards":"2",
   [junit4]   2> 	  "shard":"shard1",
   [junit4]   2> 	  "roles":null,
   [junit4]   2> 	  "state":"down",
   [junit4]   2> 	  "shard_state":"active",
   [junit4]   2> 	  "core":"nodes_used_collection_shard1_replica1",
   [junit4]   2> 	  "collection":"nodes_used_collection",
   [junit4]   2> 	  "shard_range":null,
   [junit4]   2> 	  "node_name":"127.0.0.1:53658_",
   [junit4]   2> 	  "base_url":"http://127.0.0.1:53658"}
   [junit4]   2> 2967940 T5415 oasc.Overseer$ClusterStateUpdater.updateState WARN Could not find collection node for nodes_used_collection, skipping publish state
   [junit4]   2> 2967941 T5415 oasc.Overseer$ClusterStateUpdater.updateState Update state numShards=2 message={
   [junit4]   2> 	  "operation":"state",
   [junit4]   2> 	  "core_node_name":"core_node3",
   [junit4]   2> 	  "numShards":"2",
   [junit4]   2> 	  "shard":"shard2",
   [junit4]   2> 	  "roles":null,
   [junit4]   2> 	  "state":"down",
   [junit4]   2> 	  "shard_state":"active",
   [junit4]   2> 	  "core":"nodes_used_collection_shard2_replica1",
   [junit4]   2> 	  "collection":"nodes_used_collection",
   [junit4]   2> 	  "shard_range":null,
   [junit4]   2> 	  "node_name":"127.0.0.1:53651_",
   [junit4]   2> 	  "base_url":"http://127.0.0.1:53651"}
   [junit4]   2> 2967950 T5415 oasc.Overseer$ClusterStateUpdater.updateState WARN Could not find collection node for nodes_used_collection, skipping publish state
   [junit4]   2> 2967951 T5415 oasc.Overseer$ClusterStateUpdater.updateState Update state numShards=2 message={
   [junit4]   2> 	  "operation":"state",
   [junit4]   2> 	  "core_node_name":"core_node4",
   [junit4]   2> 	  "numShards":"2",
   [junit4]   2> 	  "shard":"shard1",
   [junit4]   2> 	  "roles":null,
   [junit4]   2> 	  "state":"down",
   [junit4]   2> 	  "shard_state":"active",
   [junit4]   2> 	  "core":"nodes_used_collection_shard1_replica2",
   [junit4]   2> 	  "collection":"nodes_used_collection",
   [junit4]   2> 	  "shard_range":null,
   [junit4]   2> 	  "node_name":"127.0.0.1:53664_",
   [junit4]   2> 	  "base_url":"http://127.0.0.1:53664"}
   [junit4]   2> 2967962 T5419 oascc.ZkStateReader$2.process A cluster state change: WatchedEvent state:SyncConnected type:NodeDataChanged path:/clusterstate.json, has occurred - updating... (live nodes size: 5)
   [junit4]   2> 2967963 T5414 oascc.ZkStateReader$2.process A cluster state change: WatchedEvent state:SyncConnected type:NodeDataChanged path:/clusterstate.json, has occurred - updating... (live nodes size: 5)
   [junit4]   2> 2967963 T5432 oascc.ZkStateReader$2.process A cluster state change: WatchedEvent state:SyncConnected type:NodeDataChanged path:/clusterstate.json, has occurred - updating... (live nodes size: 5)
   [junit4]   2> 2967973 T5446 oascc.ZkStateReader$2.process A cluster state change: WatchedEvent state:SyncConnected type:NodeDataChanged path:/clusterstate.json, has occurred - updating... (live nodes size: 5)
   [junit4]   2> 2967974 T5460 oascc.ZkStateReader$2.process A cluster state change: WatchedEvent state:SyncConnected type:NodeDataChanged path:/clusterstate.json, has occurred - updating... (live nodes size: 5)
   [junit4]   2> 2967973 T5474 oascc.ZkStateReader$2.process A cluster state change: WatchedEvent state:SyncConnected type:NodeDataChanged path:/clusterstate.json, has occurred - updating... (live nodes size: 5)
   [junit4]   2> 2968466 T5454 oasc.ZkController.waitForShardId waiting to find shard id in clusterstate for nodes_used_collection_shard2_replica2
   [junit4]   2> 2968466 T5440 oasc.ZkController.waitForShardId waiting to find shard id in clusterstate for nodes_used_collection_shard1_replica1
   [junit4]   2> 2968468 T5454 oasc.CorePropertiesLocator.writePropertiesFile ERROR Couldn't persist core properties to /Users/jenkins/jenkins-slave/workspace/Lucene-Solr-4.x-MacOSX/solr/build/solr-core/test/J0/./org.apache.solr.cloud.CollectionsAPIDistributedZkTest-jetty3-1375437690922/nodes_used_collection_shard2_replica2/core.properties: java.io.FileNotFoundException: /Users/jenkins/jenkins-slave/workspace/Lucene-Solr-4.x-MacOSX/solr/build/solr-core/test/J0/./org.apache.solr.cloud.CollectionsAPIDistributedZkTest-jetty3-1375437690922/nodes_used_collection_shard2_replica2/core.properties (No such file or directory)
   [junit4]   2> 2968469 T5454 oasc.CoreContainer.create Creating SolrCore 'nodes_used_collection_shard2_replica2' using instanceDir: /Users/jenkins/jenkins-slave/workspace/Lucene-Solr-4.x-MacOSX/solr/build/solr-core/test/J0/./org.apache.solr.cloud.CollectionsAPIDistributedZkTest-jetty3-1375437690922/nodes_used_collection_shard2_replica2
   [junit4]   2> 2968470 T5454 oasc.ZkController.createCollectionZkNode Check for collection zkNode:nodes_used_collection
   [junit4]   2> 2968468 T5440 oasc.CorePropertiesLocator.writePropertiesFile ERROR Couldn't persist core properties to /Users/jenkins/jenkins-slave/workspace/Lucene-Solr-4.x-MacOSX/solr/build/solr-core/test/J0/./org.apache.solr.cloud.CollectionsAPIDistributedZkTest-jetty2-1375437688829/nodes_used_collection_shard1_replica1/core.properties: java.io.FileNotFoundException: /Users/jenkins/jenkins-slave/workspace/Lucene-Solr-4.x-MacOSX/solr/build/solr-core/test/J0/./org.apache.solr.cloud.CollectionsAPIDistributedZkTest-jetty2-1375437688829/nodes_used_collection_shard1_replica1/core.properties (No such file or directory)
   [junit4]   2> 2968471 T5440 oasc.CoreContainer.create Creating SolrCore 'nodes_used_collection_shard1_replica1' using instanceDir: /Users/jenkins/jenkins-slave/workspace/Lucene-Solr-4.x-MacOSX/solr/build/solr-core/test/J0/./org.apache.solr.cloud.CollectionsAPIDistributedZkTest-jetty2-1375437688829/nodes_used_collection_shard1_replica1
   [junit4]   2> 2968472 T5440 oasc.ZkController.createCollectionZkNode Check for collection zkNode:nodes_used_collection
   [junit4]   2> 2968473 T5454 oasc.ZkController.createCollectionZkNode Creating collection in ZooKeeper:nodes_used_collection
   [junit4]   2> 2968474 T5454 oasc.ZkController.getConfName Looking for collection configName
   [junit4]   2> 2968471 T5407 oasc.ZkController.waitForShardId waiting to find shard id in clusterstate for nodes_used_collection_shard2_replica1
   [junit4]   2> 2968471 T5470 oasc.ZkController.waitForShardId waiting to find shard id in clusterstate for nodes_used_collection_shard1_replica2
   [junit4]   2> 2968477 T5407 oasc.CorePropertiesLocator.writePropertiesFile ERROR Couldn't persist core properties to /Users/jenkins/jenkins-slave/workspace/Lucene-Solr-4.x-MacOSX/solr/build/solr-core/test/J0/./org.apache.solr.cloud.CollectionsAPIDistributedZkTest-controljetty-1375437685734/nodes_used_collection_shard2_replica1/core.properties: java.io.FileNotFoundException: /Users/jenkins/jenkins-slave/workspace/Lucene-Solr-4.x-MacOSX/solr/build/solr-core/test/J0/./org.apache.solr.cloud.CollectionsAPIDistributedZkTest-controljetty-1375437685734/nodes_used_collection_shard2_replica1/core.properties (No such file or directory)
   [junit4]   2> 2968478 T5407 oasc.CoreContainer.create Creating SolrCore 'nodes_used_collection_shard2_replica1' using instanceDir: /Users/jenkins/jenkins-slave/workspace/Lucene-Solr-4.x-MacOSX/solr/build/solr-core/test/J0/./org.apache.solr.cloud.CollectionsAPIDistributedZkTest-controljetty-1375437685734/nodes_used_collection_shard2_replica1
   [junit4]   2> 2968478 T5407 oasc.ZkController.createCollectionZkNode Check for collection zkNode:nodes_used_collection
   [junit4]   2> 2968477 T5470 oasc.CorePropertiesLocator.writePropertiesFile ERROR Couldn't persist core properties to /Users/jenkins/jenkins-slave/workspace/Lucene-Solr-4.x-MacOSX/solr/build/solr-core/test/J0/./org.apache.solr.cloud.CollectionsAPIDistributedZkTest-jetty4-1375437692997/nodes_used_collection_shard1_replica2/core.properties: java.io.FileNotFoundException: /Users/jenkins/jenkins-slave/workspace/Lucene-Solr-4.x-MacOSX/solr/build/solr-core/test/J0/./org.apache.solr.cloud.CollectionsAPIDistributedZkTest-jetty4-1375437692997/nodes_used_collection_shard1_replica2/core.properties (No such file or directory)
   [junit4]   2> 2968480 T5470 oasc.CoreContainer.create Creating SolrCore 'nodes_used_collection_shard1_replica2' using instanceDir: /Users/jenkins/jenkins-slave/workspace/Lucene-Solr-4.x-MacOSX/solr/build/solr-core/test/J0/./org.apache.solr.cloud.CollectionsAPIDistributedZkTest-jetty4-1375437692997/nodes_used_collection_shard1_replica2
   [junit4]   2> 2968481 T5470 oasc.ZkController.createCollectionZkNode Check for collection zkNode:nodes_used_collection
   [junit4]   2> 2968481 T5407 oasc.ZkController.createCollectionZkNode Creating collection in ZooKeeper:nodes_used_collection
   [junit4]   2> 2968482 T5407 oasc.ZkController.getConfName Looking for collection configName
   [junit4]   2> 2968482 T5440 oasc.ZkController.createCollectionZkNode Creating collection in ZooKeeper:nodes_used_collection
   [junit4]   2> 2968483 T5440 oasc.ZkController.getConfName Looking for collection configName
   [junit4]   2> 2968484 T5470 oasc.ZkController.createCollectionZkNode Creating collection in ZooKeeper:nodes_used_collection
   [junit4]   2> 2968485 T5470 oasc.ZkController.getConfName Looking for collection configName
   [junit4]   2> 2968486 T5454 oasc.ZkController.getConfName Only one config set found in zk - using it:conf1
   [junit4]   2> 2968486 T5454 oascc.SolrZkClient.makePath makePath: /collections/nodes_used_collection
   [junit4]   2> 2968485 T5407 oasc.ZkController.getConfName Only one config set found in zk - using it:conf1
   [junit4]   2> 2968487 T5407 oascc.SolrZkClient.makePath makePath: /collections/nodes_used_collection
   [junit4]   2> 2968489 T5440 oasc.ZkController.getConfName Only one config set found in zk - using it:conf1
   [junit4]   2> 2968489 T5440 oascc.SolrZkClient.makePath makePath: /collections/nodes_used_collection
   [junit4]   2> 2968492 T5470 oasc.ZkController.getConfName Only one config set found in zk - using it:conf1
   [junit4]   2> 2968493 T5470 oascc.SolrZkClient.makePath makePath: /collections/nodes_used_collection
   [junit4]   2> 2968497 T5407 oasc.ZkController.readConfigName Load collection config from:/collections/nodes_used_collection
   [junit4]   2> 2968498 T5454 oasc.ZkController.readConfigName Load collection config from:/collections/nodes_used_collection
   [junit4]   2> 2968499 T5440 oasc.ZkController.readConfigName Load collection config from:/collections/nodes_used_collection
   [junit4]   2> 2968501 T5470 oasc.ZkController.readConfigName Load collection config from:/collections/nodes_used_collection
   [junit4]   2> 2968503 T5407 oasc.SolrResourceLoader.<init> new SolrResourceLoader for directory: '/Users/jenkins/jenkins-slave/workspace/Lucene-Solr-4.x-MacOSX/solr/build/solr-core/test/J0/./org.apache.solr.cloud.CollectionsAPIDistributedZkTest-controljetty-1375437685734/nodes_used_collection_shard2_replica1/'
   [junit4]   2> 2968514 T5454 oasc.SolrResourceLoader.<init> new SolrResourceLoader for directory: '/Users/jenkins/jenkins-slave/workspace/Lucene-Solr-4.x-MacOSX/solr/build/solr-core/test/J0/./org.apache.solr.cloud.CollectionsAPIDistributedZkTest-jetty3-1375437690922/nodes_used_collection_shard2_replica2/'
   [junit4]   2> 2968515 T5440 oasc.SolrResourceLoader.<init> new SolrResourceLoader for directory: '/Users/jenkins/jenkins-slave/workspace/Lucene-Solr-4.x-MacOSX/solr/build/solr-core/test/J0/./org.apache.solr.cloud.CollectionsAPIDistributedZkTest-jetty2-1375437688829/nodes_used_collection_shard1_replica1/'
   [junit4]   2> 2968517 T5470 oasc.SolrResourceLoader.<init> new SolrResourceLoader for directory: '/Users/jenkins/jenkins-slave/workspace/Lucene-Solr-4.x-MacOSX/solr/build/solr-core/test/J0/./org.apache.solr.cloud.CollectionsAPIDistributedZkTest-jetty4-1375437692997/nodes_used_collection_shard1_replica2/'
   [junit4]   2> 2968783 T5454 oasc.SolrConfig.<init> Using Lucene MatchVersion: LUCENE_45
   [junit4]   2> 2968802 T5407 oasc.SolrConfig.<init> Using Lucene MatchVersion: LUCENE_45
   [junit4]   2> 2968841 T5440 oasc.SolrConfig.<init> Using Lucene MatchVersion: LUCENE_45
   [junit4]   2> 2968846 T5470 oasc.SolrConfig.<init> Using Lucene MatchVersion: LUCENE_45
   [junit4]   2> 2969083 T5454 oasc.SolrConfig.<init> Loaded SolrConfig: solrconfig.xml
   [junit4]   2> 2969092 T5470 oasc.SolrConfig.<init> Loaded SolrConfig: solrconfig.xml
   [junit4]   2> 2969096 T5470 oass.IndexSchema.readSchema Reading Solr Schema from schema.xml
   [junit4]   2> 2969106 T5407 oasc.SolrConfig.<init> Loaded SolrConfig: solrconfig.xml
   [junit4]   2> 2969117 T5470 oass.IndexSchema.readSchema [nodes_used_collection_shard1_replica2] Schema name=test
   [junit4]   2> 2969122 T5454 oass.IndexSchema.readSchema Reading Solr Schema from schema.xml
   [junit4]   2> 2969124 T5407 oass.IndexSchema.readSchema Reading Solr Schema from schema.xml
   [junit4]   2> 2969139 T5407 oass.IndexSchema.readSchema [nodes_used_collection_shard2_replica1] Schema name=test
   [junit4]   2> 2969151 T5454 oass.IndexSchema.readSchema [nodes_used_collection_shard2_replica2] Schema name=test
   [junit4]   2> 2969180 T5440 oasc.SolrConfig.<init> Loaded SolrConfig: solrconfig.xml
   [junit4]   2> 2969189 T5440 oass.IndexSchema.readSchema Reading Solr Schema from schema.xml
   [junit4]   2> 2969216 T5440 oass.IndexSchema.readSchema [nodes_used_collection_shard1_replica1] Schema name=test
   [junit4]   2> 2972181 T5470 oass.ByteField.init WARN ByteField is deprecated and will be removed in 5.0. You should use TrieIntField instead.
   [junit4]   2> 2972182 T5470 oass.ShortField.init WARN ShortField is deprecated and will be removed in 5.0. You should use TrieIntField instead.
   [junit4]   2> 2972183 T5470 oass.OpenExchangeRatesOrgProvider.init Initialized with rates=open-exchange-rates.json, refreshInterval=1440.
   [junit4]   2> 2972318 T5470 oass.IndexSchema.readSchema default search field in schema is text
   [junit4]   2> 2972324 T5470 oass.IndexSchema.readSchema unique key field: id
   [junit4]   2> 2972341 T5440 oass.ByteField.init WARN ByteField is deprecated and will be removed in 5.0. You should use TrieIntField instead.
   [junit4]   2> 2972342 T5440 oass.ShortField.init WARN ShortField is deprecated and will be removed in 5.0. You should use TrieIntField instead.
   [junit4]   2> 2972354 T5440 oass.OpenExchangeRatesOrgProvider.init Initialized with rates=open-exchange-rates.json, refreshInterval=1440.
   [junit4]   2> 2972369 T5440 oass.IndexSchema.readSchema default search field in schema is text
   [junit4]   2> 2972374 T5454 oass.ByteField.init WARN ByteField is deprecated and will be removed in 5.0. You should use TrieIntField instead.
   [junit4]   2> 2972376 T5454 oass.ShortField.init WARN ShortField is deprecated and will be removed in 5.0. You should use TrieIntField instead.
   [junit4]   2> 2972378 T5454 oass.OpenExchangeRatesOrgProvider.init Initialized with rates=open-exchange-rates.json, refreshInterval=1440.
   [junit4]   2> 2972391 T5440 oass.IndexSchema.readSchema unique key field: id
   [junit4]   2> 2972396 T5407 oass.ByteField.init WARN ByteField is deprecated and will be removed in 5.0. You should use TrieIntField instead.
   [junit4]   2> 2972402 T5407 oass.ShortField.init WARN ShortField is deprecated and will be removed in 5.0. You should use TrieIntField instead.
   [junit4]   2> 2972403 T5407 oass.OpenExchangeRatesOrgProvider.init Initialized with rates=open-exchange-rates.json, refreshInterval=1440.
   [junit4]   2> 2972399 T5454 oass.IndexSchema.readSchema default search field in schema is text
   [junit4]   2> 2972416 T5407 oass.IndexSchema.readSchema default search field in schema is text
   [junit4]   2> 2972417 T5454 oass.IndexSchema.readSchema unique key field: id
   [junit4]   2> 2972422 T5407 oass.IndexSchema.readSchema unique key field: id
   [junit4]   2> 2972507 T5470 oass.FileExchangeRateProvider.reload Reloading exchange rates from file currency.xml
   [junit4]   2> 2972522 T5470 oass.FileExchangeRateProvider.reload Reloading exchange rates from file currency.xml
   [junit4]   2> 2972535 T5470 oass.OpenExchangeRatesOrgProvider.reload Reloading exchange rates from open-exchange-rates.json
   [junit4]   2> 2972537 T5440 oass.FileExchangeRateProvider.reload Reloading exchange rates from file currency.xml
   [junit4]   2> 2972540 T5454 oass.FileExchangeRateProvider.reload Reloading exchange rates from file currency.xml
   [junit4]   2> 2972550 T5454 oass.FileExchangeRateProvider.reload Reloading exchange rates from file currency.xml
   [junit4]   2> 2972551 T5470 oass.OpenExchangeRatesOrgProvider$OpenExchangeRates.<init> WARN Unknown key IMPORTANT NOTE
   [junit4]   2> 2972552 T5470 oass.OpenExchangeRatesOrgProvider$OpenExchangeRates.<init> WARN Expected key, got STRING
   [junit4]   2> 2972552 T5470 oass.OpenExchangeRatesOrgProvider.reload Reloading exchange rates from open-exchange-rates.json
   [junit4]   2> 2972563 T5470 oass.OpenExchangeRatesOrgProvider$OpenExchangeRates.<init> WARN Unknown key IMPORTANT NOTE
   [junit4]   2> 2972563 T5470 oass.OpenExchangeRatesOrgProvider$OpenExchangeRates.<init> WARN Expected key, got STRING
   [junit4]   2> 2972564 T5470 oasc.SolrCore.initDirectoryFactory org.apache.solr.core.MockDirectoryFactory
   [junit4]   2> 2972564 T5470 oasc.SolrCore.<init> [nodes_used_collection_shard1_replica2] Opening new SolrCore at /Users/jenkins/jenkins-slave/workspace/Lucene-Solr-4.x-MacOSX/solr/build/solr-core/test/J0/./org.apache.solr.cloud.CollectionsAPIDistributedZkTest-jetty4-1375437692997/nodes_used_collection_shard1_replica2/, dataDir=/Users/jenkins/jenkins-slave/workspace/Lucene-Solr-4.x-MacOSX/solr/build/solr-core/test/J0/./org.apache.solr.cloud.CollectionsAPIDistributedZkTest-jetty4-1375437692997//nodes_used_collection_shard1_replica2/data/
   [junit4]   2> 2972565 T5470 oasc.JmxMonitoredMap.<init> JMX monitoring is enabled. Adding Solr mbeans to JMX Server: com.sun.jmx.mbeanserver.JmxMBeanServer@7d36d23
   [junit4]   2> 2972570 T5440 oass.FileExchangeRateProvider.reload Reloading exchange rates from file currency.xml
   [junit4]   2> 2972575 T5470 oasc.CachingDirectoryFactory.get return new directory for /Users/jenkins/jenkins-slave/workspace/Lucene-Solr-4.x-MacOSX/solr/build/solr-core/test/J0/./org.apache.solr.cloud.CollectionsAPIDistributedZkTest-jetty4-1375437692997//nodes_used_collection_shard1_replica2/data
   [junit4]   2> 2972576 T5470 oasc.SolrCore.getNewIndexDir New index directory detected: old=null new=/Users/jenkins/jenkins-slave/workspace/Lucene-Solr-4.x-MacOSX/solr/build/solr-core/test/J0/./org.apache.solr.cloud.CollectionsAPIDistributedZkTest-jetty4-1375437692997//nodes_used_collection_shard1_replica2/data/index/
   [junit4]   2> 2972577 T5470 oasc.SolrCore.initIndex WARN [nodes_used_collection_shard1_replica2] Solr index directory '/Users/jenkins/jenkins-slave/workspace/Lucene-Solr-4.x-MacOSX/solr/build/solr-core/test/J0/./org.apache.solr.cloud.CollectionsAPIDistributedZkTest-jetty4-1375437692997/nodes_used_collection_shard1_replica2/data/index' doesn't exist. Creating new index...
   [junit4]   2> 2972578 T5470 oasc.CachingDirectoryFactory.get return new directory for /Users/jenkins/jenkins-slave/workspace/Lucene-Solr-4.x-MacOSX/solr/build/solr-core/test/J0/./org.apache.solr.cloud.CollectionsAPIDistributedZkTest-jetty4-1375437692997//nodes_used_collection_shard1_replica2/data/index
   [junit4]   2> 2972586 T5454 oass.OpenExchangeRatesOrgProvider.reload Reloading exchange rates from open-exchange-rates.json
   [junit4]   2> 2972597 T5470 oasc.SolrDeletionPolicy.onCommit SolrDeletionPolicy.onCommit: commits: num=1
   [junit4]   2> 		commit{dir=MockDirWrapper(org.apache.lucene.store.RAMDirectory@219674da lockFactory=org.apache.lucene.store.NativeFSLockFactory@70428ee3),segFN=segments_1,generation=1}
   [junit4]   2> 2972598 T5470 oasc.SolrDeletionPolicy.updateCommits newest commit generation = 1
   [junit4]   2> 2972597 T5440 oass.OpenExchangeRatesOrgProvider.reload Reloading exchange rates from open-exchange-rates.json
   [junit4]   2> 2972608 T5440 oass.OpenExchangeRatesOrgProvider$OpenExchangeRates.<init> WARN Unknown key IMPORTANT NOTE
   [junit4]   2> 2972609 T5440 oass.OpenExchangeRatesOrgProvider$OpenExchangeRates.<init> WARN Expected key, got STRING
   [junit4]   2> 2972609 T5440 oass.OpenExchangeRatesOrgProvider.reload Reloading exchange rates from open-exchange-rates.json
   [junit4]   2> 2972610 T5454 oass.OpenExchangeRatesOrgProvider$OpenExchangeRates.<init> WARN Unknown key IMPORTANT NOTE
   [junit4]   2> 2972610 T5454 oass.OpenExchangeRatesOrgProvider$OpenExchangeRates.<init> WARN Expected key, got STRING
   [junit4]   2> 2972611 T5454 oass.OpenExchangeRatesOrgProvider.reload Reloading exchange rates from open-exchange-rates.json
   [junit4]   2> 2972610 T5470 oasup.UpdateRequestProcessorChain.init inserting DistributedUpdateProcessorFactory into updateRequestProcessorChain "dedupe"
   [junit4]   2> 2972612 T5470 oasup.UpdateRequestProcessorChain.init inserting DistributedUpdateProcessorFactory into updateRequestProcessorChain "stored_sig"
   [junit4]   2> 2972615 T5440 oass.OpenExchangeRatesOrgProvider$OpenExchangeRates.<init> WARN Unknown key IMPORTANT NOTE
   [junit4]   2> 2972616 T5440 oass.OpenExchangeRatesOrgProvider$OpenExchangeRates.<init> WARN Expected key, got STRING
   [junit4]   2> 2972617 T5440 oasc.SolrCore.initDirectoryFactory org.apache.solr.core.MockDirectoryFactory
   [junit4]   2> 2972618 T5440 oasc.SolrCore.<init> [nodes_used_collection_shard1_replica1] Opening new SolrCore at /Users/jenkins/jenkins-slave/workspace/Lucene-Solr-4.x-MacOSX/solr/build/solr-core/test/J0/./org.apache.solr.cloud.CollectionsAPIDistributedZkTest-jetty2-1375437688829/nodes_used_collection_shard1_replica1/, dataDir=/Users/jenkins/jenkins-slave/workspace/Lucene-Solr-4.x-MacOSX/solr/build/solr-core/test/J0/./org.apache.solr.cloud.CollectionsAPIDistributedZkTest-jetty2-1375437688829//nodes_used_collection_shard1_replica1/data/
   [junit4]   2> 2972618 T5440 oasc.JmxMonitoredMap.<init> JMX monitoring is enabled. Adding Solr mbeans to JMX Server: com.sun.jmx.mbeanserver.JmxMBeanServer@7d36d23
   [junit4]   2> 2972620 T5440 oasc.CachingDirectoryFactory.get return new directory for /Users/jenkins/jenkins-slave/workspace/Lucene-Solr-4.x-MacOSX/solr/build/solr-core/test/J0/./org.apache.solr.cloud.CollectionsAPIDistributedZkTest-jetty2-1375437688829//nodes_used_collection_shard1_replica1/data
   [junit4]   2> 2972620 T5440 oasc.SolrCore.getNewIndexDir New index directory detected: old=null new=/Users/jenkins/jenkins-slave/workspace/Lucene-Solr-4.x-MacOSX/solr/build/solr-core/test/J0/./org.apache.solr.cloud.CollectionsAPIDistributedZkTest-jetty2-1375437688829//nodes_used_collection_shard1_replica1/data/index/
   [junit4]   2> 2972621 T5440 oasc.SolrCore.initIndex WARN [nodes_used_collection_shard1_replica1] Solr index directory '/Users/jenkins/jenkins-slave/workspace/Lucene-Solr-4.x-MacOSX/solr/build/solr-core/test/J0/./org.apache.solr.cloud.CollectionsAPIDistributedZkTest-jetty2-1375437688829/nodes_used_collection_shard1_replica1/data/index' doesn't exist. Creating new index...
   [junit4]   2> 2972622 T5440 oasc.CachingDirectoryFactory.get return new directory for /Users/jenkins/jenkins-slave/workspace/Lucene-Solr-4.x-MacOSX/solr/build/solr-core/test/J0/./org.apache.solr.cloud.CollectionsAPIDistributedZkTest-jetty2-1375437688829//nodes_used_collection_shard1_replica1/data/index
   [junit4]   2> 2972616 T5470 oasup.UpdateRequestProcessorChain.init inserting DistributedUpdateProcessorFactory into updateRequestProcessorChain "distrib-dup-test-chain-implicit"
   [junit4]   2> 2972627 T5470 oasc.RequestHandlers.initHandlersFromConfig created standard: solr.StandardRequestHandler
   [junit4]   2> 2972628 T5470 oasc.RequestHandlers.initHandlersFromConfig created /get: solr.RealTimeGetHandler
   [junit4]   2> 2972628 T5470 oasc.RequestHandlers.initHandlersFromConfig adding lazy requestHandler: solr.ReplicationHandler
   [junit4]   2> 2972629 T5470 oasc.RequestHandlers.initHandlersFromConfig created /replication: solr.ReplicationHandler
   [junit4]   2> 2972630 T5470 oasc.RequestHandlers.initHandlersFromConfig created /update: solr.UpdateRequestHandler
   [junit4]   2> 2972631 T5470 oasc.RequestHandlers.initHandlersFromConfig created /admin/: org.apache.solr.handler.admin.AdminHandlers
   [junit4]   2> 2972616 T5454 oass.OpenExchangeRatesOrgProvider$OpenExchangeRates.<init> WARN Unknown key IMPORTANT NOTE
   [junit4]   2> 2972633 T5454 oass.OpenExchangeRatesOrgProvider$OpenExchangeRates.<init> WARN Expected key, got STRING
   [junit4]   2> 2972633 T5454 oasc.SolrCore.initDirectoryFactory org.apache.solr.core.MockDirectoryFactory
   [junit4]   2> 2972628 T5440 oasc.SolrDeletionPolicy.onCommit SolrDeletionPolicy.onCommit: commits: num=1
   [junit4]   2> 		commit{dir=MockDirWrapper(org.apache.lucene.store.RAMDirectory@459a402b lockFactory=org.apache.lucene.store.NativeFSLockFactory@5631d918),segFN=segments_1,generation=1}
   [junit4]   2> 2972634 T5440 oasc.SolrDeletionPolicy.updateCommits newest commit generation = 1
   [junit4]   2> 2972636 T5454 oasc.SolrCore.<init> [nodes_used_collection_shard2_replica2] Opening new SolrCore at /Users/jenkins/jenkins-slave/workspace/Lucene-Solr-4.x-MacOSX/solr/build/solr-core/test/J0/./org.apache.solr.cloud.CollectionsAPIDistributedZkTest-jetty3-1375437690922/nodes_used_collection_shard2_replica2/, dataDir=/Users/jenkins/jenkins-slave/workspace/Lucene-Solr-4.x-MacOSX/solr/build/solr-core/test/J0/./org.apache.solr.cloud.CollectionsAPIDistributedZkTest-jetty3-1375437690922//nodes_used_collection_shard2_replica2/data/
   [junit4]   2> 2972636 T5454 oasc.JmxMonitoredMap.<init> JMX monitoring is enabled. Adding Solr mbeans to JMX Server: com.sun.jmx.mbeanserver.JmxMBeanServer@7d36d23
   [junit4]   2> 2972637 T5407 oass.FileExchangeRateProvider.reload Reloading exchange rates from file currency.xml
   [junit4]   2> 2972646 T5454 oasc.CachingDirectoryFactory.get return new directory for /Users/jenkins/jenkins-slave/workspace/Lucene-Solr-4.x-MacOSX/solr/build/solr-core/test/J0/./org.apache.solr.cloud.CollectionsAPIDistributedZkTest-jetty3-1375437690922//nodes_used_collection_shard2_replica2/data
   [junit4]   2> 2972647 T5454 oasc.SolrCore.getNewIndexDir New index directory detected: old=null new=/Users/jenkins/jenkins-slave/workspace/Lucene-Solr-4.x-MacOSX/solr/build/solr-core/test/J0/./org.apache.solr.cloud.CollectionsAPIDistributedZkTest-jetty3-1375437690922//nodes_used_collection_shard2_replica2/data/index/
   [junit4]   2> 2972647 T5454 oasc.SolrCore.initIndex WARN [nodes_used_collection_shard2_replica2] Solr index directory '/Users/jenkins/jenkins-slave/workspace/Lucene-Solr-4.x-MacOSX/solr/build/solr-core/test/J0/./org.apache.solr.cloud.CollectionsAPIDistributedZkTest-jetty3-1375437690922/nodes_used_collection_shard2_replica2/data/index' doesn't exist. Creating new index...
   [junit4]   2> 2972648 T5454 oasc.CachingDirectoryFactory.get return new directory for /Users/jenkins/jenkins-slave/workspace/Lucene-Solr-4.x-MacOSX/solr/build/solr-core/test/J0/./org.apache.solr.cloud.CollectionsAPIDistributedZkTest-jetty3-1375437690922//nodes_used_collection_shard2_replica2/data/index
   [junit4]   2> 2972657 T5440 oasup.UpdateRequestProcessorChain.init inserting DistributedUpdateProcessorFactory into updateRequestProcessorChain "dedupe"
   [junit4]   2> 2972658 T5440 oasup.UpdateRequestProcessorChain.init inserting DistributedUpdateProcessorFactory into updateRequestProcessorChain "stored_sig"
   [junit4]   2> 2972659 T5440 oasup.UpdateRequestProcessorChain.init inserting DistributedUpdateProcessorFactory into updateRequestProcessorChain "distrib-dup-test-chain-implicit"
   [junit4]   2> 2972661 T5440 oasc.RequestHandlers.initHandlersFromConfig created standard: solr.StandardRequestHandler
   [junit4]   2> 2972662 T5440 oasc.RequestHandlers.initHandlersFromConfig created /get: solr.RealTimeGetHandler
   [junit4]   2> 2972662 T5440 oasc.RequestHandlers.initHandlersFromConfig adding lazy requestHandler: solr.ReplicationHandler
   [junit4]   2> 2972663 T5440 oasc.RequestHandlers.initHandlersFromConfig created /replication: solr.ReplicationHandler
   [junit4]   2> 2972664 T5440 oasc.RequestHandlers.initHandlersFromConfig created /update: solr.UpdateRequestHandler
   [junit4]   2> 2972665 T5440 oasc.RequestHandlers.initHandlersFromConfig created /admin/: org.apache.solr.handler.admin.AdminHandlers
   [junit4]   2> 2972687 T5454 oasc.SolrDeletionPolicy.onCommit SolrDeletionPolicy.onCommit: commits: num=1
   [junit4]   2> 		commit{dir=MockDirWrapper(org.apache.lucene.store.RAMDirectory@15b8608c lockFactory=org.apache.lucene.store.NativeFSLockFactory@5ea55a03),segFN=segments_1,generation=1}
   [junit4]   2> 2972688 T5454 oasc.SolrDeletionPolicy.updateCommits newest commit generation = 1
   [junit4]   2> 2972691 T5470 oashl.XMLLoader.init xsltCacheLifetimeSeconds=60
   [junit4]   2> 2972694 T5440 oashl.XMLLoader.init xsltCacheLifetimeSeconds=60
   [junit4]   2> 2972704 T5407 oass.FileExchangeRateProvider.reload Reloading exchange rates from file currency.xml
   [junit4]   2> 2972714 T5454 oasup.UpdateRequestProcessorChain.init inserting DistributedUpdateProcessorFactory into updateRequestProcessorChain "dedupe"
   [junit4]   2> 2972716 T5454 oasup.UpdateRequestProcessorChain.init inserting DistributedUpdateProcessorFactory into updateRequestProcessorChain "stored_sig"
   [junit4]   2> 2972717 T5470 oass.SolrIndexSearcher.<init> Opening Searcher@b40a469 main
   [junit4]   2> 2972719 T5454 oasup.UpdateRequestProcessorChain.init inserting DistributedUpdateProcessorFactory into updateRequestProcessorChain "distrib-dup-test-chain-implicit"
   [junit4]   2> 2972721 T5454 oasc.RequestHandlers.initHandlersFromConfig created standard: solr.StandardRequestHandler
   [junit4]   2> 2972722 T5454 oasc.RequestHandlers.initHandlersFromConfig created /get: solr.RealTimeGetHandler
   [junit4]   2> 2972722 T5454 oasc.RequestHandlers.initHandlersFromConfig adding lazy requestHandler: solr.ReplicationHandler
   [junit4]   2> 2972723 T5454 oasc.RequestHandlers.initHandlersFromConfig created /replication: solr.ReplicationHandler
   [junit4]   2> 2972724 T5454 oasc.RequestHandlers.initHandlersFromConfig created /update: solr.UpdateRequestHandler
   [junit4]   2> 2972725 T5454 oasc.RequestHandlers.initHandlersFromConfig created /admin/: org.apache.solr.handler.admin.AdminHandlers
   [junit4]   2> 2972729 T5470 oasu.CommitTracker.<init> Hard AutoCommit: disabled
   [junit4]   2> 2972730 T5470 oasu.CommitTracker.<init> Soft AutoCommit: disabled
   [junit4]   2> 2972734 T5407 oass.OpenExchangeRatesOrgProvider.reload Reloading exchange rates from open-exchange-rates.json
   [junit4]   2> 2972735 T5480 oasc.SolrCore.registerSearcher [nodes_used_collection_shard1_replica2] Registered new searcher Searcher@b40a469 main{StandardDirectoryReader(segments_1:1)}
   [junit4]   2> 2972737 T5440 oass.SolrIndexSearcher.<init> Opening Searcher@2b4b0891 main
   [junit4]   2> 2972738 T5470 oasc.CoreContainer.registerCore registering core: nodes_used_collection_shard1_replica2
   [junit4]   2> 2972739 T5470 oasc.ZkController.register Register replica - core:nodes_used_collection_shard1_replica2 address:http://127.0.0.1:53664 collection:nodes_used_collection shard:shard1
   [junit4]   2> 2972739 T5470 oascsi.HttpClientUtil.createClient Creating new http client, config:maxConnections=10000&maxConnectionsPerHost=20&connTimeout=15000&socketTimeout=30000&retry=false
   [junit4]   2> 2972739 T5440 oasu.CommitTracker.<init> Hard AutoCommit: disabled
   [junit4]   2> 2972740 T5440 oasu.CommitTracker.<init> Soft AutoCommit: disabled
   [junit4]   2> 2972746 T5481 oasc.SolrCore.registerSearcher [nodes_used_collection_shard1_replica1] Registered new searcher Searcher@2b4b0891 main{StandardDirectoryReader(segments_1:1)}
   [junit4]   2> 2972748 T5440 oasc.CoreContainer.registerCore registering core: nodes_used_collection_shard1_replica1
   [junit4]   2> 2972748 T5440 oasc.ZkController.register Register replica - core:nodes_used_collection_shard1_replica1 address:http://127.0.0.1:53658 collection:nodes_used_collection shard:shard1
   [junit4]   2> 2972749 T5440 oascsi.HttpClientUtil.createClient Creating new http client, config:maxConnections=10000&maxConnectionsPerHost=20&connTimeout=15000&socketTimeout=30000&retry=false
   [junit4]   2> 2972759 T5407 oass.OpenExchangeRatesOrgProvider$OpenExchangeRates.<init> WARN Unknown key IMPORTANT NOTE
   [junit4]   2> 2972760 T5407 oass.OpenExchangeRatesOrgProvider$OpenExchangeRates.<init> WARN Expected key, got STRING
   [junit4]   2> 2972760 T5407 oass.OpenExchangeRatesOrgProvider.reload Reloading exchange rates from open-exchange-rates.json
   [junit4]   2> 2972782 T5454 oashl.XMLLoader.init xsltCacheLifetimeSeconds=60
   [junit4]   2> 2972798 T5407 oass.OpenExchangeRatesOrgProvider$OpenExchangeRates.<init> WARN Unknown key IMPORTANT NOTE
   [junit4]   2> 2972800 T5407 oass.OpenExchangeRatesOrgProvider$OpenExchangeRates.<init> WARN Expected key, got STRING
   [junit4]   2> 2972800 T5407 oasc.SolrCore.initDirectoryFactory org.apache.solr.core.MockDirectoryFactory
   [junit4]   2> 2972801 T5407 oasc.SolrCore.<init> [nodes_used_collection_shard2_replica1] Opening new SolrCore at /Users/jenkins/jenkins-slave/workspace/Lucene-Solr-4.x-MacOSX/solr/build/solr-core/test/J0/./org.apache.solr.cloud.CollectionsAPIDistributedZkTest-controljetty-1375437685734/nodes_used_collection_shard2_replica1/, dataDir=/Users/jenkins/jenkins-slave/workspace/Lucene-Solr-4.x-MacOSX/solr/build/solr-core/test/J0/./org.apache.solr.cloud.CollectionsAPIDistributedZkTest-controljetty-1375437685734//nodes_used_collection_shard2_replica1/data/
   [junit4]   2> 2972809 T5407 oasc.JmxMonitoredMap.<init> JMX monitoring is enabled. Adding Solr mbeans to JMX Server: com.sun.jmx.mbeanserver.JmxMBeanServer@7d36d23
   [junit4]   2> 2972811 T5454 oass.SolrIndexSearcher.<init> Opening Searcher@72fdf4e2 main
   [junit4]   2> 2972814 T5454 oasu.CommitTracker.<init> Hard AutoCommit: disabled
   [junit4]   2> 2972815 T5454 oasu.CommitTracker.<init> Soft AutoCommit: disabled
   [junit4]   2> 2972821 T5482 oasc.SolrCore.registerSearcher [nodes_used_collection_shard2_replica2] Registered new searcher Searcher@72fdf4e2 main{StandardDirectoryReader(segments_1:1)}
   [junit4]   2> 2972824 T5440 oascc.SolrZkClient.makePath makePath: /collections/nodes_used_collection/leader_elect/shard1/election
   [junit4]   2> 2972825 T5407 oasc.CachingDirectoryFactory.get return new directory for /Users/jenkins/jenkins-slave/workspace/Lucene-Solr-4.x-MacOSX/solr/build/solr-core/test/J0/./org.apache.solr.cloud.CollectionsAPIDistributedZkTest-controljetty-1375437685734//nodes_used_collection_shard2_replica1/data
   [junit4]   2> 2972830 T5407 oasc.SolrCore.getNewIndexDir New index directory detected: old=null new=/Users/jenkins/jenkins-slave/workspace/Lucene-Solr-4.x-MacOSX/solr/build/solr-core/test/J0/./org.apache.solr.cloud.CollectionsAPIDistributedZkTest-controljetty-1375437685734//nodes_used_collection_shard2_replica1/data/index/
   [junit4]   2> 2972830 T5407 oasc.SolrCore.initIndex WARN [nodes_used_collection_shard2_replica1] Solr index directory '/Users/jenkins/jenkins-slave/workspace/Lucene-Solr-4.x-MacOSX/solr/build/solr-core/test/J0/./org.apache.solr.cloud.CollectionsAPIDistributedZkTest-controljetty-1375437685734/nodes_used_collection_shard2_replica1/data/index' doesn't exist. Creating new index...
   [junit4]   2> 2972838 T5407 oasc.CachingDirectoryFactory.get return new directory for /Users/jenkins/jenkins-slave/workspace/Lucene-Solr-4.x-MacOSX/solr/build/solr-core/test/J0/./org.apache.solr.cloud.CollectionsAPIDistributedZkTest-controljetty-1375437685734//nodes_used_collection_shard2_replica1/data/index
   [junit4]   2> 2972825 T5470 oascc.SolrZkClient.makePath makePath: /collections/nodes_used_collection/leader_elect/shard1/election
   [junit4]   2> 2972839 T5454 oasc.CoreContainer.registerCore registering core: nodes_used_collection_shard2_replica2
   [junit4]   2> 2972849 T5454 oasc.ZkController.register Register replica - core:nodes_used_collection_shard2_replica2 address:http://127.0.0.1:53661 collection:nodes_used_collection shard:shard2
   [junit4]   2> 2972850 T5454 oascsi.HttpClientUtil.createClient Creating new http client, config:maxConnections=10000&maxConnectionsPerHost=20&connTimeout=15000&socketTimeout=30000&retry=false
   [junit4]   2> 2972852 T5407 oasc.SolrDeletionPolicy.onCommit SolrDeletionPolicy.onCommit: commits: num=1
   [junit4]   2> 		commit{dir=MockDirWrapper(org.apache.lucene.store.RAMDirectory@6879a2e3 lockFactory=org.apache.lucene.store.NativeFSLockFactory@27c1bb91),segFN=segments_1,generation=1}
   [junit4]   2> 2972853 T5407 oasc.SolrDeletionPolicy.updateCommits newest commit generation = 1
   [junit4]   2> 2972866 T5407 oasup.UpdateRequestProcessorChain.init inserting DistributedUpdateProcessorFactory into updateRequestProcessorChain "dedupe"
   [junit4]   2> 2972878 T5407 oasup.UpdateRequestProcessorChain.init inserting DistributedUpdateProcessorFactory into updateRequestProcessorChain "stored_sig"
   [junit4]   2> 2972891 T5407 oasup.UpdateRequestProcessorChain.init inserting DistributedUpdateProcessorFactory into updateRequestProcessorChain "distrib-dup-test-chain-implicit"
   [junit4]   2> 2972892 T5407 oasc.RequestHandlers.initHandlersFromConfig created standard: solr.StandardRequestHandler
   [junit4]   2> 2972894 T5407 oasc.RequestHandlers.initHandlersFromConfig created /get: solr.RealTimeGetHandler
   [junit4]   2> 2972894 T5407 oasc.RequestHandlers.initHandlersFromConfig adding lazy requestHandler: solr.ReplicationHandler
   [junit4]   2> 2972895 T5407 oasc.RequestHandlers.initHandlersFromConfig created /replication: solr.ReplicationHandler
   [junit4]   2> 2972896 T5407 oasc.RequestHandlers.initHandlersFromConfig created /update: solr.UpdateRequestHandler
   [junit4]   2> 2972896 T5407 oasc.RequestHandlers.initHandlersFromConfig created /admin/: org.apache.solr.handler.admin.AdminHandlers
   [junit4]   2> 2972918 T5454 oascc.SolrZkClient.makePath makePath: /collections/nodes_used_collection/leader_elect/shard2/election
   [junit4]   2> 2972921 T5407 oashl.XMLLoader.init xsltCacheLifetimeSeconds=60
   [junit4]   2> 2972936 T5470 oasc.ShardLeaderElectionContext.runLeaderProcess Running the leader process for shard shard1
   [junit4]   2> 2972940 T5407 oass.SolrIndexSearcher.<init> Opening Searcher@5f2431ff main
   [junit4]   2> 2972945 T5407 oasu.CommitTracker.<init> Hard AutoCommit: disabled
   [junit4]   2> 2972949 T5407 oasu.CommitTracker.<init> Soft AutoCommit: disabled
   [junit4]   2> 2972954 T5470 oasc.ShardLeaderElectionContext.waitForReplicasToComeUp Enough replicas found to continue.
   [junit4]   2> 2972956 T5470 oasc.ShardLeaderElectionContext.runLeaderProcess I may be the new leader - try and sync
   [junit4]   2> 2972956 T5470 oasc.SyncStrategy.sync Sync replicas to http://127.0.0.1:53664/nodes_used_collection_shard1_replica2/
   [junit4]   2> 2972960 T5470 oasu.PeerSync.sync PeerSync: core=nodes_used_collection_shard1_replica2 url=http://127.0.0.1:53664 START replicas=[http://127.0.0.1:53658/nodes_used_collection_shard1_replica1/] nUpdates=100
   [junit4]   2> 2972962 T5470 oasu.PeerSync.sync PeerSync: core=nodes_used_collection_shard1_replica2 url=http://127.0.0.1:53664 DONE.  We have no versions.  sync failed.
   [junit4]   2> 2972963 T5470 oasc.SyncStrategy.syncReplicas Leader's attempt to sync with shard failed, moving to the next candidate
   [junit4]   2> ASYNC  NEW_CORE C1278 name=nodes_used_collection_shard1_replica1 org.apache.solr.core.SolrCore@319a06c6 url=http://127.0.0.1:53658/nodes_used_collection_shard1_replica1 node=127.0.0.1:53658_ C1278_STATE=coll:nodes_used_collection core:nodes_used_collection_shard1_replica1 props:{state=down, core=nodes_used_collection_shard1_replica1, node_name=127.0.0.1:53658_, base_url=http://127.0.0.1:53658}
   [junit4]   2> 2972980 T5442 C1278 P53658 oasc.SolrCore.execute [nodes_used_collection_shard1_replica1] webapp= path=/get params={getVersions=100&distrib=false&wt=javabin&qt=/get&version=2} status=0 QTime=5 
   [junit4]   2> 2972982 T5483 oasc.SolrCore.registerSearcher [nodes_used_collection_shard2_replica1] Registered new searcher Searcher@5f2431ff main{StandardDirectoryReader(segments_1:1)}
   [junit4]   2> 2972964 T5454 oasc.ShardLeaderElectionContext.runLeaderProcess Running the leader process for shard shard2
   [junit4]   2> 2972982 T5470 oasc.ShardLeaderElectionContext.runLeaderProcess We failed sync, but we have no versions - we can't sync in that case - we were active before, so become leader anyway
   [junit4]   2> 2972983 T5470 oasc.ShardLeaderElectionContext.runLeaderProcess I am the new leader: http://127.0.0.1:53664/nodes

[...truncated too long message...]

]    > 	at org.apache.http.impl.client.DefaultRequestDirector.execute(DefaultRequestDirector.java:480)
   [junit4]    > 	at org.apache.http.impl.client.AbstractHttpClient.execute(AbstractHttpClient.java:906)
   [junit4]    > 	at org.apache.http.impl.client.AbstractHttpClient.execute(AbstractHttpClient.java:805)
   [junit4]    > 	at org.apache.http.impl.client.AbstractHttpClient.execute(AbstractHttpClient.java:784)
   [junit4]    > 	at org.apache.solr.client.solrj.impl.HttpSolrServer.request(HttpSolrServer.java:365)
   [junit4]    > 	... 44 more
   [junit4]    > Caused by: java.net.ConnectException: Connection refused
   [junit4]    > 	at java.net.PlainSocketImpl.socketConnect(Native Method)
   [junit4]    > 	at java.net.AbstractPlainSocketImpl.doConnect(AbstractPlainSocketImpl.java:339)
   [junit4]    > 	at java.net.AbstractPlainSocketImpl.connectToAddress(AbstractPlainSocketImpl.java:200)
   [junit4]    > 	at java.net.AbstractPlainSocketImpl.connect(AbstractPlainSocketImpl.java:182)
   [junit4]    > 	at java.net.SocksSocketImpl.connect(SocksSocketImpl.java:392)
   [junit4]    > 	at java.net.Socket.connect(Socket.java:579)
   [junit4]    > 	at org.apache.http.conn.scheme.PlainSocketFactory.connectSocket(PlainSocketFactory.java:127)
   [junit4]    > 	at org.apache.http.impl.conn.DefaultClientConnectionOperator.openConnection(DefaultClientConnectionOperator.java:180)
   [junit4]    > 	... 51 more
   [junit4]   2> 3162874 T5392 oas.SolrTestCaseJ4.deleteCore ###deleteCore
   [junit4]   2> 206672 T5391 ccr.ThreadLeakControl.checkThreadLeaks WARNING Will linger awaiting termination of 1 leaked thread(s).
   [junit4]   2> 3163952 T5474 oasc.LeaderElector$1.process WARN  org.apache.zookeeper.KeeperException$SessionExpiredException: KeeperErrorCode = Session expired for /collections/new_implicit_coll_1/leader_elect/d/election
   [junit4]   2> 	at org.apache.zookeeper.KeeperException.create(KeeperException.java:127)
   [junit4]   2> 	at org.apache.zookeeper.KeeperException.create(KeeperException.java:51)
   [junit4]   2> 	at org.apache.zookeeper.ZooKeeper.getChildren(ZooKeeper.java:1468)
   [junit4]   2> 	at org.apache.solr.common.cloud.SolrZkClient$6.execute(SolrZkClient.java:235)
   [junit4]   2> 	at org.apache.solr.common.cloud.SolrZkClient$6.execute(SolrZkClient.java:232)
   [junit4]   2> 	at org.apache.solr.common.cloud.ZkCmdExecutor.retryOperation(ZkCmdExecutor.java:65)
   [junit4]   2> 	at org.apache.solr.common.cloud.SolrZkClient.getChildren(SolrZkClient.java:232)
   [junit4]   2> 	at org.apache.solr.cloud.LeaderElector.checkIfIamLeader(LeaderElector.java:84)
   [junit4]   2> 	at org.apache.solr.cloud.LeaderElector.access$000(LeaderElector.java:55)
   [junit4]   2> 	at org.apache.solr.cloud.LeaderElector$1.process(LeaderElector.java:129)
   [junit4]   2> 	at org.apache.zookeeper.ClientCnxn$EventThread.processEvent(ClientCnxn.java:519)
   [junit4]   2> 	at org.apache.zookeeper.ClientCnxn$EventThread.run(ClientCnxn.java:495)
   [junit4]   2> 
   [junit4]   2> 3163953 T5474 oasc.LeaderElector$1.process WARN  org.apache.zookeeper.KeeperException$SessionExpiredException: KeeperErrorCode = Session expired for /collections/new_implicit_coll_1/leader_elect/a/election
   [junit4]   2> 	at org.apache.zookeeper.KeeperException.create(KeeperException.java:127)
   [junit4]   2> 	at org.apache.zookeeper.KeeperException.create(KeeperException.java:51)
   [junit4]   2> 	at org.apache.zookeeper.ZooKeeper.getChildren(ZooKeeper.java:1468)
   [junit4]   2> 	at org.apache.solr.common.cloud.SolrZkClient$6.execute(SolrZkClient.java:235)
   [junit4]   2> 	at org.apache.solr.common.cloud.SolrZkClient$6.execute(SolrZkClient.java:232)
   [junit4]   2> 	at org.apache.solr.common.cloud.ZkCmdExecutor.retryOperation(ZkCmdExecutor.java:65)
   [junit4]   2> 	at org.apache.solr.common.cloud.SolrZkClient.getChildren(SolrZkClient.java:232)
   [junit4]   2> 	at org.apache.solr.cloud.LeaderElector.checkIfIamLeader(LeaderElector.java:84)
   [junit4]   2> 	at org.apache.solr.cloud.LeaderElector.access$000(LeaderElector.java:55)
   [junit4]   2> 	at org.apache.solr.cloud.LeaderElector$1.process(LeaderElector.java:129)
   [junit4]   2> 	at org.apache.zookeeper.ClientCnxn$EventThread.processEvent(ClientCnxn.java:519)
   [junit4]   2> 	at org.apache.zookeeper.ClientCnxn$EventThread.run(ClientCnxn.java:495)
   [junit4]   2> 
   [junit4]   2> 3163954 T5474 oascc.ZkStateReader$3.process WARN ZooKeeper watch triggered, but Solr cannot talk to ZK
   [junit4]   2> 3163954 T5474 oascc.ZkStateReader$2.process A cluster state change: WatchedEvent state:SyncConnected type:NodeChildrenChanged path:/live_nodes, has occurred - updating... (live nodes size: 1)
   [junit4]   2> 3163954 T5474 oascc.ZkStateReader$2.process WARN ZooKeeper watch triggered, but Solr cannot talk to ZK
   [junit4]   2> NOTE: test params are: codec=Lucene40, sim=DefaultSimilarity, locale=en_NZ, timezone=America/Pangnirtung
   [junit4]   2> NOTE: Mac OS X 10.8.4 x86_64/Oracle Corporation 1.7.0_25 (64-bit)/cpus=2,threads=1,free=213590192,total=523239424
   [junit4]   2> NOTE: All tests run in this JVM: [HdfsBasicDistributedZkTest, TestFastOutputStream, ShardRoutingCustomTest, ShardRoutingTest, TestCoreDiscovery, TestSolrXmlPersistence, TestQueryTypes, LeaderElectionTest, LeaderElectionIntegrationTest, TestZkChroot, StandardRequestHandlerTest, FileUtilsTest, RAMDirectoryFactoryTest, TestLazyCores, QueryParsingTest, TestFastLRUCache, TestStressReorder, TestCharFilters, TestPropInject, DirectUpdateHandlerTest, DefaultValueUpdateProcessorTest, TestStressRecovery, SolrRequestParserTest, TestReversedWildcardFilterFactory, TestJmxMonitoredMap, TestQueryUtils, SolrCoreCheckLockOnStartupTest, TestDefaultSimilarityFactory, TestCollationKeyRangeQueries, StatsComponentTest, TestFieldTypeResource, TimeZoneUtilsTest, TestCodecSupport, BlockDirectoryTest, PrimUtilsTest, TestUniqueKeyFieldResource, QueryEqualityTest, SuggesterTest, TestBadConfig, ZkNodePropsTest, PathHierarchyTokenizerFactoryTest, TestWordDelimiterFilterFactory, SimpleFacetsTest, TestRandomDVFaceting, TestWriterPerf, TestCollationField, TestAtomicUpdateErrorCases, PreAnalyzedUpdateProcessorTest, TestOmitPositions, ParsingFieldUpdateProcessorsTest, XsltUpdateRequestHandlerTest, UUIDFieldTest, ReturnFieldsTest, SolrTestCaseJ4Test, PrimitiveFieldTypeTest, TestSolrCoreProperties, OpenExchangeRatesOrgProviderTest, MinimalSchemaTest, RegexBoostProcessorTest, DisMaxRequestHandlerTest, UnloadDistributedZkTest, TestPHPSerializedResponseWriter, TestDistributedSearch, SpatialFilterTest, BasicZkTest, BadCopyFieldTest, CSVRequestHandlerTest, BasicDistributedZkTest, QueryElevationComponentTest, TestSolrIndexConfig, FieldAnalysisRequestHandlerTest, TestAddFieldRealTimeGet, TestStressVersions, SolrInfoMBeanTest, TestRemoteStreaming, DirectSolrConnectionTest, TestRangeQuery, TestFunctionQuery, TestCopyFieldCollectionResource, TestPostingsSolrHighlighter, SignatureUpdateProcessorFactoryTest, BlockCacheTest, TestBM25SimilarityFactory, TestFieldResource, StressHdfsTest, HdfsLockFactoryTest, TestDocumentBuilder, ConvertedLegacyTest, TestQuerySenderListener, TestRecoveryHdfs, AutoCommitTest, TestRecovery, TestManagedSchemaFieldResource, TestRealTimeGet, HdfsChaosMonkeySafeLeaderTest, TestComponentsName, SearchHandlerTest, TestPartialUpdateDeduplication, ZkCLITest, TermVectorComponentTest, TestSystemIdResolver, JSONWriterTest, TestSuggestSpellingConverter, HdfsUnloadDistributedZkTest, DocValuesMultiTest, DocumentBuilderTest, InfoHandlerTest, CopyFieldTest, TestDynamicFieldCollectionResource, SampleTest, SuggesterFSTTest, DebugComponentTest, DocumentAnalysisRequestHandlerTest, ChaosMonkeySafeLeaderTest, TestPropInjectDefaults, TestGroupingSearch, CoreAdminHandlerTest, ChaosMonkeyNothingIsSafeTest, TestSchemaVersionResource, MBeansHandlerTest, TestCSVResponseWriter, DeleteShardTest, SolrCmdDistributorTest, TestLMDirichletSimilarityFactory, HdfsBasicDistributedZk2Test, TestShardHandlerFactory, URLClassifyProcessorTest, CircularListTest, TestRandomMergePolicy, AliasIntegrationTest, TestFieldTypeCollectionResource, TestConfig, HighlighterTest, LukeRequestHandlerTest, TestSolrQueryParserResource, TestJmxIntegration, TestLuceneMatchVersion, TestSolrXMLSerializer, TestMergePolicyConfig, MultiTermTest, TestReplicationHandler, TestCoreContainer, CoreMergeIndexesAdminHandlerTest, TestCloudManagedSchema, RequiredFieldsTest, SynonymTokenizerTest, TestFastWriter, PeerSyncTest, TestUpdate, TestAnalyzedSuggestions, FileBasedSpellCheckerTest, DateFieldTest, OverseerTest, BasicDistributedZk2Test, CollectionsAPIDistributedZkTest]
   [junit4] Completed in 207.99s, 1 test, 1 error <<< FAILURES!

[...truncated 497 lines...]
BUILD FAILED
/Users/jenkins/jenkins-slave/workspace/Lucene-Solr-4.x-MacOSX/build.xml:395: The following error occurred while executing this line:
/Users/jenkins/jenkins-slave/workspace/Lucene-Solr-4.x-MacOSX/build.xml:375: The following error occurred while executing this line:
/Users/jenkins/jenkins-slave/workspace/Lucene-Solr-4.x-MacOSX/build.xml:39: The following error occurred while executing this line:
/Users/jenkins/jenkins-slave/workspace/Lucene-Solr-4.x-MacOSX/solr/build.xml:181: The following error occurred while executing this line:
/Users/jenkins/jenkins-slave/workspace/Lucene-Solr-4.x-MacOSX/solr/common-build.xml:449: The following error occurred while executing this line:
/Users/jenkins/jenkins-slave/workspace/Lucene-Solr-4.x-MacOSX/lucene/common-build.xml:1233: The following error occurred while executing this line:
/Users/jenkins/jenkins-slave/workspace/Lucene-Solr-4.x-MacOSX/lucene/common-build.xml:876: There were test failures: 321 suites, 1352 tests, 1 error, 40 ignored (6 assumptions)

Total time: 129 minutes 32 seconds
Build step 'Invoke Ant' marked build as failure
Description set: Java: 64bit/jdk1.7.0 -XX:+UseCompressedOops -XX:+UseG1GC
Archiving artifacts
Recording test results
Email was triggered for: Failure
Sending email for trigger: Failure



Mime
View raw message