lucene-dev mailing list archives

Site index · List index
Message view « Date » · « Thread »
Top « Date » · « Thread »
From Apache Jenkins Server <jenk...@builds.apache.org>
Subject [JENKINS] Lucene-Solr-Tests-4.x-Java6 - Build # 1867 - Still Failing
Date Sat, 03 Aug 2013 01:14:55 GMT
Build: https://builds.apache.org/job/Lucene-Solr-Tests-4.x-Java6/1867/

1 tests failed.
FAILED:  org.apache.solr.cloud.CollectionsAPIDistributedZkTest.testDistribSearch

Error Message:
IOException occured when talking to server at: http://127.0.0.1:31876/_

Stack Trace:
org.apache.solr.client.solrj.SolrServerException: IOException occured when talking to server at: http://127.0.0.1:31876/_
	at __randomizedtesting.SeedInfo.seed([4B790670815C0CCF:CA9F8868F6036CF3]:0)
	at org.apache.solr.client.solrj.impl.HttpSolrServer.request(HttpSolrServer.java:435)
	at org.apache.solr.client.solrj.impl.HttpSolrServer.request(HttpSolrServer.java:180)
	at org.apache.solr.cloud.AbstractFullDistribZkTestBase.createCollection(AbstractFullDistribZkTestBase.java:1535)
	at org.apache.solr.cloud.CollectionsAPIDistributedZkTest.testCustomCollectionsAPI(CollectionsAPIDistributedZkTest.java:677)
	at org.apache.solr.cloud.CollectionsAPIDistributedZkTest.doTest(CollectionsAPIDistributedZkTest.java:159)
	at org.apache.solr.BaseDistributedSearchTestCase.testDistribSearch(BaseDistributedSearchTestCase.java:835)
	at sun.reflect.NativeMethodAccessorImpl.invoke0(Native Method)
	at sun.reflect.NativeMethodAccessorImpl.invoke(NativeMethodAccessorImpl.java:57)
	at sun.reflect.DelegatingMethodAccessorImpl.invoke(DelegatingMethodAccessorImpl.java:43)
	at java.lang.reflect.Method.invoke(Method.java:616)
	at com.carrotsearch.randomizedtesting.RandomizedRunner.invoke(RandomizedRunner.java:1559)
	at com.carrotsearch.randomizedtesting.RandomizedRunner.access$600(RandomizedRunner.java:79)
	at com.carrotsearch.randomizedtesting.RandomizedRunner$6.evaluate(RandomizedRunner.java:737)
	at com.carrotsearch.randomizedtesting.RandomizedRunner$7.evaluate(RandomizedRunner.java:773)
	at com.carrotsearch.randomizedtesting.RandomizedRunner$8.evaluate(RandomizedRunner.java:787)
	at com.carrotsearch.randomizedtesting.rules.SystemPropertiesRestoreRule$1.evaluate(SystemPropertiesRestoreRule.java:53)
	at org.apache.lucene.util.TestRuleSetupTeardownChained$1.evaluate(TestRuleSetupTeardownChained.java:50)
	at org.apache.lucene.util.TestRuleFieldCacheSanity$1.evaluate(TestRuleFieldCacheSanity.java:51)
	at org.apache.lucene.util.AbstractBeforeAfterRule$1.evaluate(AbstractBeforeAfterRule.java:46)
	at com.carrotsearch.randomizedtesting.rules.SystemPropertiesInvariantRule$1.evaluate(SystemPropertiesInvariantRule.java:55)
	at org.apache.lucene.util.TestRuleThreadAndTestName$1.evaluate(TestRuleThreadAndTestName.java:49)
	at org.apache.lucene.util.TestRuleIgnoreAfterMaxFailures$1.evaluate(TestRuleIgnoreAfterMaxFailures.java:70)
	at org.apache.lucene.util.TestRuleMarkFailure$1.evaluate(TestRuleMarkFailure.java:48)
	at com.carrotsearch.randomizedtesting.rules.StatementAdapter.evaluate(StatementAdapter.java:36)
	at com.carrotsearch.randomizedtesting.ThreadLeakControl$StatementRunner.run(ThreadLeakControl.java:358)
	at com.carrotsearch.randomizedtesting.ThreadLeakControl.forkTimeoutingTask(ThreadLeakControl.java:782)
	at com.carrotsearch.randomizedtesting.ThreadLeakControl$3.evaluate(ThreadLeakControl.java:442)
	at com.carrotsearch.randomizedtesting.RandomizedRunner.runSingleTest(RandomizedRunner.java:746)
	at com.carrotsearch.randomizedtesting.RandomizedRunner$3.evaluate(RandomizedRunner.java:648)
	at com.carrotsearch.randomizedtesting.RandomizedRunner$4.evaluate(RandomizedRunner.java:682)
	at com.carrotsearch.randomizedtesting.RandomizedRunner$5.evaluate(RandomizedRunner.java:693)
	at com.carrotsearch.randomizedtesting.rules.StatementAdapter.evaluate(StatementAdapter.java:36)
	at com.carrotsearch.randomizedtesting.rules.SystemPropertiesRestoreRule$1.evaluate(SystemPropertiesRestoreRule.java:53)
	at org.apache.lucene.util.AbstractBeforeAfterRule$1.evaluate(AbstractBeforeAfterRule.java:46)
	at org.apache.lucene.util.TestRuleStoreClassName$1.evaluate(TestRuleStoreClassName.java:42)
	at com.carrotsearch.randomizedtesting.rules.SystemPropertiesInvariantRule$1.evaluate(SystemPropertiesInvariantRule.java:55)
	at com.carrotsearch.randomizedtesting.rules.NoShadowingOrOverridesOnMethodsRule$1.evaluate(NoShadowingOrOverridesOnMethodsRule.java:39)
	at com.carrotsearch.randomizedtesting.rules.NoShadowingOrOverridesOnMethodsRule$1.evaluate(NoShadowingOrOverridesOnMethodsRule.java:39)
	at com.carrotsearch.randomizedtesting.rules.StatementAdapter.evaluate(StatementAdapter.java:36)
	at org.apache.lucene.util.TestRuleAssertionsRequired$1.evaluate(TestRuleAssertionsRequired.java:43)
	at org.apache.lucene.util.TestRuleMarkFailure$1.evaluate(TestRuleMarkFailure.java:48)
	at org.apache.lucene.util.TestRuleIgnoreAfterMaxFailures$1.evaluate(TestRuleIgnoreAfterMaxFailures.java:70)
	at org.apache.lucene.util.TestRuleIgnoreTestSuites$1.evaluate(TestRuleIgnoreTestSuites.java:55)
	at com.carrotsearch.randomizedtesting.rules.StatementAdapter.evaluate(StatementAdapter.java:36)
	at com.carrotsearch.randomizedtesting.ThreadLeakControl$StatementRunner.run(ThreadLeakControl.java:358)
	at java.lang.Thread.run(Thread.java:679)
Caused by: org.apache.http.conn.ConnectTimeoutException: Connect to 127.0.0.1:31876 timed out
	at org.apache.http.conn.scheme.PlainSocketFactory.connectSocket(PlainSocketFactory.java:129)
	at org.apache.http.impl.conn.DefaultClientConnectionOperator.openConnection(DefaultClientConnectionOperator.java:180)
	at org.apache.http.impl.conn.ManagedClientConnectionImpl.open(ManagedClientConnectionImpl.java:294)
	at org.apache.http.impl.client.DefaultRequestDirector.tryConnect(DefaultRequestDirector.java:645)
	at org.apache.http.impl.client.DefaultRequestDirector.execute(DefaultRequestDirector.java:480)
	at org.apache.http.impl.client.AbstractHttpClient.execute(AbstractHttpClient.java:906)
	at org.apache.http.impl.client.AbstractHttpClient.execute(AbstractHttpClient.java:805)
	at org.apache.http.impl.client.AbstractHttpClient.execute(AbstractHttpClient.java:784)
	at org.apache.solr.client.solrj.impl.HttpSolrServer.request(HttpSolrServer.java:365)
	... 45 more




Build Log:
[...truncated 9289 lines...]
   [junit4] Suite: org.apache.solr.cloud.CollectionsAPIDistributedZkTest
   [junit4]   2> 1466088 T2929 oas.BaseDistributedSearchTestCase.initHostContext Setting hostContext system property: /_/
   [junit4]   2> 1466093 T2929 oas.SolrTestCaseJ4.setUp ###Starting testDistribSearch
   [junit4]   2> Creating dataDir: /usr/home/hudson/hudson-slave/workspace/Lucene-Solr-Tests-4.x-Java6/solr/build/solr-core/test/J0/./solrtest-CollectionsAPIDistributedZkTest-1375491761313
   [junit4]   2> 1466095 T2929 oasc.ZkTestServer.run STARTING ZK TEST SERVER
   [junit4]   2> 1466095 T2930 oasc.ZkTestServer$ZKServerMain.runFromConfig Starting server
   [junit4]   2> 1466196 T2929 oasc.ZkTestServer.run start zk server on port:17827
   [junit4]   2> 1466197 T2929 oascc.ConnectionManager.waitForConnected Waiting for client to connect to ZooKeeper
   [junit4]   2> 1466201 T2936 oascc.ConnectionManager.process Watcher org.apache.solr.common.cloud.ConnectionManager@1a0760b0 name:ZooKeeperConnection Watcher:127.0.0.1:17827 got event WatchedEvent state:SyncConnected type:None path:null path:null type:None
   [junit4]   2> 1466201 T2929 oascc.ConnectionManager.waitForConnected Client is connected to ZooKeeper
   [junit4]   2> 1466202 T2929 oascc.SolrZkClient.makePath makePath: /solr
   [junit4]   2> 1466216 T2929 oascc.ConnectionManager.waitForConnected Waiting for client to connect to ZooKeeper
   [junit4]   2> 1466218 T2938 oascc.ConnectionManager.process Watcher org.apache.solr.common.cloud.ConnectionManager@21e16bb5 name:ZooKeeperConnection Watcher:127.0.0.1:17827/solr got event WatchedEvent state:SyncConnected type:None path:null path:null type:None
   [junit4]   2> 1466218 T2929 oascc.ConnectionManager.waitForConnected Client is connected to ZooKeeper
   [junit4]   2> 1466218 T2929 oascc.SolrZkClient.makePath makePath: /collections/collection1
   [junit4]   2> 1466222 T2929 oascc.SolrZkClient.makePath makePath: /collections/collection1/shards
   [junit4]   2> 1466229 T2929 oascc.SolrZkClient.makePath makePath: /collections/control_collection
   [junit4]   2> 1466232 T2929 oascc.SolrZkClient.makePath makePath: /collections/control_collection/shards
   [junit4]   2> 1466234 T2929 oasc.AbstractZkTestCase.putConfig put /usr/home/hudson/hudson-slave/workspace/Lucene-Solr-Tests-4.x-Java6/solr/build/solr-core/test-files/solr/collection1/conf/solrconfig-tlog.xml to /configs/conf1/solrconfig.xml
   [junit4]   2> 1466235 T2929 oascc.SolrZkClient.makePath makePath: /configs/conf1/solrconfig.xml
   [junit4]   2> 1466250 T2929 oasc.AbstractZkTestCase.putConfig put /usr/home/hudson/hudson-slave/workspace/Lucene-Solr-Tests-4.x-Java6/solr/build/solr-core/test-files/solr/collection1/conf/schema.xml to /configs/conf1/schema.xml
   [junit4]   2> 1466250 T2929 oascc.SolrZkClient.makePath makePath: /configs/conf1/schema.xml
   [junit4]   2> 1466354 T2929 oasc.AbstractZkTestCase.putConfig put /usr/home/hudson/hudson-slave/workspace/Lucene-Solr-Tests-4.x-Java6/solr/build/solr-core/test-files/solr/collection1/conf/stopwords.txt to /configs/conf1/stopwords.txt
   [junit4]   2> 1466354 T2929 oascc.SolrZkClient.makePath makePath: /configs/conf1/stopwords.txt
   [junit4]   2> 1466357 T2929 oasc.AbstractZkTestCase.putConfig put /usr/home/hudson/hudson-slave/workspace/Lucene-Solr-Tests-4.x-Java6/solr/build/solr-core/test-files/solr/collection1/conf/protwords.txt to /configs/conf1/protwords.txt
   [junit4]   2> 1466358 T2929 oascc.SolrZkClient.makePath makePath: /configs/conf1/protwords.txt
   [junit4]   2> 1466368 T2929 oasc.AbstractZkTestCase.putConfig put /usr/home/hudson/hudson-slave/workspace/Lucene-Solr-Tests-4.x-Java6/solr/build/solr-core/test-files/solr/collection1/conf/currency.xml to /configs/conf1/currency.xml
   [junit4]   2> 1466369 T2929 oascc.SolrZkClient.makePath makePath: /configs/conf1/currency.xml
   [junit4]   2> 1466371 T2929 oasc.AbstractZkTestCase.putConfig put /usr/home/hudson/hudson-slave/workspace/Lucene-Solr-Tests-4.x-Java6/solr/build/solr-core/test-files/solr/collection1/conf/open-exchange-rates.json to /configs/conf1/open-exchange-rates.json
   [junit4]   2> 1466372 T2929 oascc.SolrZkClient.makePath makePath: /configs/conf1/open-exchange-rates.json
   [junit4]   2> 1466374 T2929 oasc.AbstractZkTestCase.putConfig put /usr/home/hudson/hudson-slave/workspace/Lucene-Solr-Tests-4.x-Java6/solr/build/solr-core/test-files/solr/collection1/conf/mapping-ISOLatin1Accent.txt to /configs/conf1/mapping-ISOLatin1Accent.txt
   [junit4]   2> 1466375 T2929 oascc.SolrZkClient.makePath makePath: /configs/conf1/mapping-ISOLatin1Accent.txt
   [junit4]   2> 1466382 T2929 oasc.AbstractZkTestCase.putConfig put /usr/home/hudson/hudson-slave/workspace/Lucene-Solr-Tests-4.x-Java6/solr/build/solr-core/test-files/solr/collection1/conf/old_synonyms.txt to /configs/conf1/old_synonyms.txt
   [junit4]   2> 1466383 T2929 oascc.SolrZkClient.makePath makePath: /configs/conf1/old_synonyms.txt
   [junit4]   2> 1466385 T2929 oasc.AbstractZkTestCase.putConfig put /usr/home/hudson/hudson-slave/workspace/Lucene-Solr-Tests-4.x-Java6/solr/build/solr-core/test-files/solr/collection1/conf/synonyms.txt to /configs/conf1/synonyms.txt
   [junit4]   2> 1466386 T2929 oascc.SolrZkClient.makePath makePath: /configs/conf1/synonyms.txt
   [junit4]   2> 1466646 T2929 oejs.Server.doStart jetty-8.1.10.v20130312
   [junit4]   2> 1466652 T2929 oejs.AbstractConnector.doStart Started SocketConnector@127.0.0.1:21724
   [junit4]   2> 1466653 T2929 oass.SolrDispatchFilter.init SolrDispatchFilter.init()
   [junit4]   2> 1466653 T2929 oasc.SolrResourceLoader.locateSolrHome JNDI not configured for solr (NoInitialContextEx)
   [junit4]   2> 1466654 T2929 oasc.SolrResourceLoader.locateSolrHome using system property solr.solr.home: /usr/home/hudson/hudson-slave/workspace/Lucene-Solr-Tests-4.x-Java6/solr/build/solr-core/test/J0/./org.apache.solr.cloud.CollectionsAPIDistributedZkTest-controljetty-1375491761608
   [junit4]   2> 1466654 T2929 oasc.SolrResourceLoader.<init> new SolrResourceLoader for directory: '/usr/home/hudson/hudson-slave/workspace/Lucene-Solr-Tests-4.x-Java6/solr/build/solr-core/test/J0/./org.apache.solr.cloud.CollectionsAPIDistributedZkTest-controljetty-1375491761608/'
   [junit4]   2> 1466692 T2929 oasc.ConfigSolr.fromFile Loading container configuration from /usr/home/hudson/hudson-slave/workspace/Lucene-Solr-Tests-4.x-Java6/solr/build/solr-core/test/J0/./org.apache.solr.cloud.CollectionsAPIDistributedZkTest-controljetty-1375491761608/solr.xml
   [junit4]   2> 1466762 T2929 oasc.ConfigSolrXml.<init> Config-defined core root directory: 
   [junit4]   2> 1466763 T2929 oasc.CoreContainer.<init> New CoreContainer 1359439887
   [junit4]   2> 1466764 T2929 oasc.CoreContainer.load Loading cores into CoreContainer [instanceDir=/usr/home/hudson/hudson-slave/workspace/Lucene-Solr-Tests-4.x-Java6/solr/build/solr-core/test/J0/./org.apache.solr.cloud.CollectionsAPIDistributedZkTest-controljetty-1375491761608/]
   [junit4]   2> 1466765 T2929 oashc.HttpShardHandlerFactory.getParameter Setting socketTimeout to: 120000
   [junit4]   2> 1466766 T2929 oashc.HttpShardHandlerFactory.getParameter Setting urlScheme to: http://
   [junit4]   2> 1466766 T2929 oashc.HttpShardHandlerFactory.getParameter Setting connTimeout to: 15000
   [junit4]   2> 1466767 T2929 oashc.HttpShardHandlerFactory.getParameter Setting maxConnectionsPerHost to: 20
   [junit4]   2> 1466767 T2929 oashc.HttpShardHandlerFactory.getParameter Setting corePoolSize to: 0
   [junit4]   2> 1466768 T2929 oashc.HttpShardHandlerFactory.getParameter Setting maximumPoolSize to: 2147483647
   [junit4]   2> 1466768 T2929 oashc.HttpShardHandlerFactory.getParameter Setting maxThreadIdleTime to: 5
   [junit4]   2> 1466769 T2929 oashc.HttpShardHandlerFactory.getParameter Setting sizeOfQueue to: -1
   [junit4]   2> 1466769 T2929 oashc.HttpShardHandlerFactory.getParameter Setting fairnessPolicy to: false
   [junit4]   2> 1466770 T2929 oascsi.HttpClientUtil.createClient Creating new http client, config:maxConnectionsPerHost=20&maxConnections=10000&socketTimeout=120000&connTimeout=15000&retry=false
   [junit4]   2> 1466785 T2929 oasc.ZkContainer.initZooKeeper Zookeeper client=127.0.0.1:17827/solr
   [junit4]   2> 1466785 T2929 oasc.ZkController.checkChrootPath zkHost includes chroot
   [junit4]   2> 1466786 T2929 oascc.ConnectionManager.waitForConnected Waiting for client to connect to ZooKeeper
   [junit4]   2> 1466789 T2949 oascc.ConnectionManager.process Watcher org.apache.solr.common.cloud.ConnectionManager@3d40da58 name:ZooKeeperConnection Watcher:127.0.0.1:17827 got event WatchedEvent state:SyncConnected type:None path:null path:null type:None
   [junit4]   2> 1466789 T2929 oascc.ConnectionManager.waitForConnected Client is connected to ZooKeeper
   [junit4]   2> 1466800 T2929 oascsi.HttpClientUtil.createClient Creating new http client, config:maxConnections=500&maxConnectionsPerHost=16&socketTimeout=120000&connTimeout=15000
   [junit4]   2> 1466810 T2929 oascc.ConnectionManager.waitForConnected Waiting for client to connect to ZooKeeper
   [junit4]   2> 1466812 T2951 oascc.ConnectionManager.process Watcher org.apache.solr.common.cloud.ConnectionManager@1852e8d2 name:ZooKeeperConnection Watcher:127.0.0.1:17827/solr got event WatchedEvent state:SyncConnected type:None path:null path:null type:None
   [junit4]   2> 1466812 T2929 oascc.ConnectionManager.waitForConnected Client is connected to ZooKeeper
   [junit4]   2> 1466819 T2929 oascc.SolrZkClient.makePath makePath: /overseer/queue
   [junit4]   2> 1466822 T2929 oascc.SolrZkClient.makePath makePath: /overseer/collection-queue-work
   [junit4]   2> 1466830 T2929 oascc.SolrZkClient.makePath makePath: /live_nodes
   [junit4]   2> 1466833 T2929 oasc.ZkController.createEphemeralLiveNode Register node as live in ZooKeeper:/live_nodes/127.0.0.1:21724__
   [junit4]   2> 1466834 T2929 oascc.SolrZkClient.makePath makePath: /live_nodes/127.0.0.1:21724__
   [junit4]   2> 1466844 T2929 oascc.SolrZkClient.makePath makePath: /overseer_elect/election
   [junit4]   2> 1466858 T2929 oascc.SolrZkClient.makePath makePath: /overseer_elect/leader
   [junit4]   2> 1466865 T2929 oasc.Overseer.start Overseer (id=90144228069867523-127.0.0.1:21724__-n_0000000000) starting
   [junit4]   2> 1466869 T2929 oascc.SolrZkClient.makePath makePath: /overseer/queue-work
   [junit4]   2> 1466883 T2953 oasc.OverseerCollectionProcessor.run Process current queue of collection creations
   [junit4]   2> 1466883 T2929 oascc.SolrZkClient.makePath makePath: /clusterstate.json
   [junit4]   2> 1466885 T2929 oascc.SolrZkClient.makePath makePath: /aliases.json
   [junit4]   2> 1466887 T2929 oascc.ZkStateReader.createClusterStateWatchersAndUpdate Updating cluster state from ZooKeeper... 
   [junit4]   2> 1466889 T2952 oasc.Overseer$ClusterStateUpdater.run Starting to work on the main queue
   [junit4]   2> 1466892 T2929 oasc.CorePropertiesLocator.discover Looking for core definitions underneath /usr/home/hudson/hudson-slave/workspace/Lucene-Solr-Tests-4.x-Java6/solr/build/solr-core/test/J0/./org.apache.solr.cloud.CollectionsAPIDistributedZkTest-controljetty-1375491761608
   [junit4]   2> 1466894 T2929 oasc.CorePropertiesLocator.discoverUnder Found core conf in /usr/home/hudson/hudson-slave/workspace/Lucene-Solr-Tests-4.x-Java6/solr/build/solr-core/test/J0/./org.apache.solr.cloud.CollectionsAPIDistributedZkTest-controljetty-1375491761608/conf/
   [junit4]   2> 1467063 T2929 oasc.CorePropertiesLocator.discover Found 1 core definitions
   [junit4]   2> 1467064 T2929 oass.SolrDispatchFilter.init user.dir=/usr/home/hudson/hudson-slave/workspace/Lucene-Solr-Tests-4.x-Java6/solr/build/solr-core/test/J0
   [junit4]   2> 1467064 T2929 oass.SolrDispatchFilter.init SolrDispatchFilter.init() done
   [junit4]   2> 1467065 T2929 oascsi.HttpClientUtil.createClient Creating new http client, config:maxConnections=128&maxConnectionsPerHost=32&followRedirects=false
   [junit4]   2> 1467079 T2929 oascsi.HttpClientUtil.createClient Creating new http client, config:
   [junit4]   2> 1467081 T2929 oascc.ConnectionManager.waitForConnected Waiting for client to connect to ZooKeeper
   [junit4]   2> 1467083 T2956 oascc.ConnectionManager.process Watcher org.apache.solr.common.cloud.ConnectionManager@2071996e name:ZooKeeperConnection Watcher:127.0.0.1:17827/solr got event WatchedEvent state:SyncConnected type:None path:null path:null type:None
   [junit4]   2> 1467083 T2929 oascc.ConnectionManager.waitForConnected Client is connected to ZooKeeper
   [junit4]   2> 1467084 T2929 oascc.ZkStateReader.createClusterStateWatchersAndUpdate Updating cluster state from ZooKeeper... 
   [junit4]   2> 1467086 T2929 oasc.ChaosMonkey.monkeyLog monkey: init - expire sessions:true cause connection loss:true
   [junit4]   2> 1467349 T2929 oejs.Server.doStart jetty-8.1.10.v20130312
   [junit4]   2> 1467353 T2929 oejs.AbstractConnector.doStart Started SocketConnector@127.0.0.1:49808
   [junit4]   2> 1467353 T2929 oass.SolrDispatchFilter.init SolrDispatchFilter.init()
   [junit4]   2> 1467354 T2929 oasc.SolrResourceLoader.locateSolrHome JNDI not configured for solr (NoInitialContextEx)
   [junit4]   2> 1467354 T2929 oasc.SolrResourceLoader.locateSolrHome using system property solr.solr.home: /usr/home/hudson/hudson-slave/workspace/Lucene-Solr-Tests-4.x-Java6/solr/build/solr-core/test/J0/./org.apache.solr.cloud.CollectionsAPIDistributedZkTest-jetty1-1375491762306
   [junit4]   2> 1467355 T2929 oasc.SolrResourceLoader.<init> new SolrResourceLoader for directory: '/usr/home/hudson/hudson-slave/workspace/Lucene-Solr-Tests-4.x-Java6/solr/build/solr-core/test/J0/./org.apache.solr.cloud.CollectionsAPIDistributedZkTest-jetty1-1375491762306/'
   [junit4]   2> 1467394 T2929 oasc.ConfigSolr.fromFile Loading container configuration from /usr/home/hudson/hudson-slave/workspace/Lucene-Solr-Tests-4.x-Java6/solr/build/solr-core/test/J0/./org.apache.solr.cloud.CollectionsAPIDistributedZkTest-jetty1-1375491762306/solr.xml
   [junit4]   2> 1467466 T2929 oasc.ConfigSolrXml.<init> Config-defined core root directory: 
   [junit4]   2> 1467467 T2929 oasc.CoreContainer.<init> New CoreContainer 2112757722
   [junit4]   2> 1467467 T2929 oasc.CoreContainer.load Loading cores into CoreContainer [instanceDir=/usr/home/hudson/hudson-slave/workspace/Lucene-Solr-Tests-4.x-Java6/solr/build/solr-core/test/J0/./org.apache.solr.cloud.CollectionsAPIDistributedZkTest-jetty1-1375491762306/]
   [junit4]   2> 1467469 T2929 oashc.HttpShardHandlerFactory.getParameter Setting socketTimeout to: 120000
   [junit4]   2> 1467469 T2929 oashc.HttpShardHandlerFactory.getParameter Setting urlScheme to: http://
   [junit4]   2> 1467470 T2929 oashc.HttpShardHandlerFactory.getParameter Setting connTimeout to: 15000
   [junit4]   2> 1467470 T2929 oashc.HttpShardHandlerFactory.getParameter Setting maxConnectionsPerHost to: 20
   [junit4]   2> 1467471 T2929 oashc.HttpShardHandlerFactory.getParameter Setting corePoolSize to: 0
   [junit4]   2> 1467471 T2929 oashc.HttpShardHandlerFactory.getParameter Setting maximumPoolSize to: 2147483647
   [junit4]   2> 1467471 T2929 oashc.HttpShardHandlerFactory.getParameter Setting maxThreadIdleTime to: 5
   [junit4]   2> 1467472 T2929 oashc.HttpShardHandlerFactory.getParameter Setting sizeOfQueue to: -1
   [junit4]   2> 1467472 T2929 oashc.HttpShardHandlerFactory.getParameter Setting fairnessPolicy to: false
   [junit4]   2> 1467473 T2929 oascsi.HttpClientUtil.createClient Creating new http client, config:maxConnectionsPerHost=20&maxConnections=10000&socketTimeout=120000&connTimeout=15000&retry=false
   [junit4]   2> 1467488 T2929 oasc.ZkContainer.initZooKeeper Zookeeper client=127.0.0.1:17827/solr
   [junit4]   2> 1467488 T2929 oasc.ZkController.checkChrootPath zkHost includes chroot
   [junit4]   2> 1467489 T2929 oascc.ConnectionManager.waitForConnected Waiting for client to connect to ZooKeeper
   [junit4]   2> 1467492 T2967 oascc.ConnectionManager.process Watcher org.apache.solr.common.cloud.ConnectionManager@1c6d61cd name:ZooKeeperConnection Watcher:127.0.0.1:17827 got event WatchedEvent state:SyncConnected type:None path:null path:null type:None
   [junit4]   2> 1467493 T2929 oascc.ConnectionManager.waitForConnected Client is connected to ZooKeeper
   [junit4]   2> 1467561 T2929 oascsi.HttpClientUtil.createClient Creating new http client, config:maxConnections=500&maxConnectionsPerHost=16&socketTimeout=120000&connTimeout=15000
   [junit4]   2> 1467571 T2929 oascc.ConnectionManager.waitForConnected Waiting for client to connect to ZooKeeper
   [junit4]   2> 1467609 T2969 oascc.ConnectionManager.process Watcher org.apache.solr.common.cloud.ConnectionManager@7aa49a04 name:ZooKeeperConnection Watcher:127.0.0.1:17827/solr got event WatchedEvent state:SyncConnected type:None path:null path:null type:None
   [junit4]   2> 1467610 T2929 oascc.ConnectionManager.waitForConnected Client is connected to ZooKeeper
   [junit4]   2> 1467638 T2929 oascc.ZkStateReader.createClusterStateWatchersAndUpdate Updating cluster state from ZooKeeper... 
   [junit4]   2> 1468641 T2929 oasc.ZkController.createEphemeralLiveNode Register node as live in ZooKeeper:/live_nodes/127.0.0.1:49808__
   [junit4]   2> 1468643 T2929 oascc.SolrZkClient.makePath makePath: /live_nodes/127.0.0.1:49808__
   [junit4]   2> 1468645 T2969 oascc.ZkStateReader$3.process Updating live nodes... (2)
   [junit4]   2> 1468645 T2951 oascc.ZkStateReader$3.process Updating live nodes... (2)
   [junit4]   2> 1468645 T2956 oascc.ZkStateReader$3.process Updating live nodes... (2)
   [junit4]   2> 1468658 T2929 oasc.CorePropertiesLocator.discover Looking for core definitions underneath /usr/home/hudson/hudson-slave/workspace/Lucene-Solr-Tests-4.x-Java6/solr/build/solr-core/test/J0/./org.apache.solr.cloud.CollectionsAPIDistributedZkTest-jetty1-1375491762306
   [junit4]   2> 1468820 T2929 oasc.CorePropertiesLocator.discoverUnder Found core conf in /usr/home/hudson/hudson-slave/workspace/Lucene-Solr-Tests-4.x-Java6/solr/build/solr-core/test/J0/./org.apache.solr.cloud.CollectionsAPIDistributedZkTest-jetty1-1375491762306/conf/
   [junit4]   2> 1468827 T2929 oasc.CorePropertiesLocator.discover Found 1 core definitions
   [junit4]   2> 1468828 T2929 oass.SolrDispatchFilter.init user.dir=/usr/home/hudson/hudson-slave/workspace/Lucene-Solr-Tests-4.x-Java6/solr/build/solr-core/test/J0
   [junit4]   2> 1468828 T2929 oass.SolrDispatchFilter.init SolrDispatchFilter.init() done
   [junit4]   2> 1468829 T2929 oascsi.HttpClientUtil.createClient Creating new http client, config:maxConnections=128&maxConnectionsPerHost=32&followRedirects=false
   [junit4]   2> 1469105 T2929 oejs.Server.doStart jetty-8.1.10.v20130312
   [junit4]   2> 1469109 T2929 oejs.AbstractConnector.doStart Started SocketConnector@127.0.0.1:31876
   [junit4]   2> 1469109 T2929 oass.SolrDispatchFilter.init SolrDispatchFilter.init()
   [junit4]   2> 1469110 T2929 oasc.SolrResourceLoader.locateSolrHome JNDI not configured for solr (NoInitialContextEx)
   [junit4]   2> 1469110 T2929 oasc.SolrResourceLoader.locateSolrHome using system property solr.solr.home: /usr/home/hudson/hudson-slave/workspace/Lucene-Solr-Tests-4.x-Java6/solr/build/solr-core/test/J0/./org.apache.solr.cloud.CollectionsAPIDistributedZkTest-jetty2-1375491764064
   [junit4]   2> 1469111 T2929 oasc.SolrResourceLoader.<init> new SolrResourceLoader for directory: '/usr/home/hudson/hudson-slave/workspace/Lucene-Solr-Tests-4.x-Java6/solr/build/solr-core/test/J0/./org.apache.solr.cloud.CollectionsAPIDistributedZkTest-jetty2-1375491764064/'
   [junit4]   2> 1469148 T2929 oasc.ConfigSolr.fromFile Loading container configuration from /usr/home/hudson/hudson-slave/workspace/Lucene-Solr-Tests-4.x-Java6/solr/build/solr-core/test/J0/./org.apache.solr.cloud.CollectionsAPIDistributedZkTest-jetty2-1375491764064/solr.xml
   [junit4]   2> 1469219 T2929 oasc.ConfigSolrXml.<init> Config-defined core root directory: 
   [junit4]   2> 1469220 T2929 oasc.CoreContainer.<init> New CoreContainer 420128113
   [junit4]   2> 1469220 T2929 oasc.CoreContainer.load Loading cores into CoreContainer [instanceDir=/usr/home/hudson/hudson-slave/workspace/Lucene-Solr-Tests-4.x-Java6/solr/build/solr-core/test/J0/./org.apache.solr.cloud.CollectionsAPIDistributedZkTest-jetty2-1375491764064/]
   [junit4]   2> 1469222 T2929 oashc.HttpShardHandlerFactory.getParameter Setting socketTimeout to: 120000
   [junit4]   2> 1469222 T2929 oashc.HttpShardHandlerFactory.getParameter Setting urlScheme to: http://
   [junit4]   2> 1469223 T2929 oashc.HttpShardHandlerFactory.getParameter Setting connTimeout to: 15000
   [junit4]   2> 1469223 T2929 oashc.HttpShardHandlerFactory.getParameter Setting maxConnectionsPerHost to: 20
   [junit4]   2> 1469224 T2929 oashc.HttpShardHandlerFactory.getParameter Setting corePoolSize to: 0
   [junit4]   2> 1469224 T2929 oashc.HttpShardHandlerFactory.getParameter Setting maximumPoolSize to: 2147483647
   [junit4]   2> 1469225 T2929 oashc.HttpShardHandlerFactory.getParameter Setting maxThreadIdleTime to: 5
   [junit4]   2> 1469225 T2929 oashc.HttpShardHandlerFactory.getParameter Setting sizeOfQueue to: -1
   [junit4]   2> 1469225 T2929 oashc.HttpShardHandlerFactory.getParameter Setting fairnessPolicy to: false
   [junit4]   2> 1469226 T2929 oascsi.HttpClientUtil.createClient Creating new http client, config:maxConnectionsPerHost=20&maxConnections=10000&socketTimeout=120000&connTimeout=15000&retry=false
   [junit4]   2> 1469242 T2929 oasc.ZkContainer.initZooKeeper Zookeeper client=127.0.0.1:17827/solr
   [junit4]   2> 1469243 T2929 oasc.ZkController.checkChrootPath zkHost includes chroot
   [junit4]   2> 1469244 T2929 oascc.ConnectionManager.waitForConnected Waiting for client to connect to ZooKeeper
   [junit4]   2> 1469249 T2981 oascc.ConnectionManager.process Watcher org.apache.solr.common.cloud.ConnectionManager@9f3aa8f name:ZooKeeperConnection Watcher:127.0.0.1:17827 got event WatchedEvent state:SyncConnected type:None path:null path:null type:None
   [junit4]   2> 1469250 T2929 oascc.ConnectionManager.waitForConnected Client is connected to ZooKeeper
   [junit4]   2> 1469257 T2929 oascsi.HttpClientUtil.createClient Creating new http client, config:maxConnections=500&maxConnectionsPerHost=16&socketTimeout=120000&connTimeout=15000
   [junit4]   2> 1469268 T2929 oascc.ConnectionManager.waitForConnected Waiting for client to connect to ZooKeeper
   [junit4]   2> 1469271 T2983 oascc.ConnectionManager.process Watcher org.apache.solr.common.cloud.ConnectionManager@136ec630 name:ZooKeeperConnection Watcher:127.0.0.1:17827/solr got event WatchedEvent state:SyncConnected type:None path:null path:null type:None
   [junit4]   2> 1469271 T2929 oascc.ConnectionManager.waitForConnected Client is connected to ZooKeeper
   [junit4]   2> 1469282 T2929 oascc.ZkStateReader.createClusterStateWatchersAndUpdate Updating cluster state from ZooKeeper... 
   [junit4]   2> 1470285 T2929 oasc.ZkController.createEphemeralLiveNode Register node as live in ZooKeeper:/live_nodes/127.0.0.1:31876__
   [junit4]   2> 1470287 T2929 oascc.SolrZkClient.makePath makePath: /live_nodes/127.0.0.1:31876__
   [junit4]   2> 1470289 T2969 oascc.ZkStateReader$3.process Updating live nodes... (3)
   [junit4]   2> 1470289 T2951 oascc.ZkStateReader$3.process Updating live nodes... (3)
   [junit4]   2> 1470289 T2983 oascc.ZkStateReader$3.process Updating live nodes... (3)
   [junit4]   2> 1470289 T2956 oascc.ZkStateReader$3.process Updating live nodes... (3)
   [junit4]   2> 1470304 T2929 oasc.CorePropertiesLocator.discover Looking for core definitions underneath /usr/home/hudson/hudson-slave/workspace/Lucene-Solr-Tests-4.x-Java6/solr/build/solr-core/test/J0/./org.apache.solr.cloud.CollectionsAPIDistributedZkTest-jetty2-1375491764064
   [junit4]   2> 1470306 T2929 oasc.CorePropertiesLocator.discoverUnder Found core conf in /usr/home/hudson/hudson-slave/workspace/Lucene-Solr-Tests-4.x-Java6/solr/build/solr-core/test/J0/./org.apache.solr.cloud.CollectionsAPIDistributedZkTest-jetty2-1375491764064/conf/
   [junit4]   2> 1470472 T2929 oasc.CorePropertiesLocator.discover Found 1 core definitions
   [junit4]   2> 1470473 T2929 oass.SolrDispatchFilter.init user.dir=/usr/home/hudson/hudson-slave/workspace/Lucene-Solr-Tests-4.x-Java6/solr/build/solr-core/test/J0
   [junit4]   2> 1470473 T2929 oass.SolrDispatchFilter.init SolrDispatchFilter.init() done
   [junit4]   2> 1470474 T2929 oascsi.HttpClientUtil.createClient Creating new http client, config:maxConnections=128&maxConnectionsPerHost=32&followRedirects=false
   [junit4]   2> 1470752 T2929 oejs.Server.doStart jetty-8.1.10.v20130312
   [junit4]   2> 1470755 T2929 oejs.AbstractConnector.doStart Started SocketConnector@127.0.0.1:58137
   [junit4]   2> 1470756 T2929 oass.SolrDispatchFilter.init SolrDispatchFilter.init()
   [junit4]   2> 1470756 T2929 oasc.SolrResourceLoader.locateSolrHome JNDI not configured for solr (NoInitialContextEx)
   [junit4]   2> 1470757 T2929 oasc.SolrResourceLoader.locateSolrHome using system property solr.solr.home: /usr/home/hudson/hudson-slave/workspace/Lucene-Solr-Tests-4.x-Java6/solr/build/solr-core/test/J0/./org.apache.solr.cloud.CollectionsAPIDistributedZkTest-jetty3-1375491765709
   [junit4]   2> 1470757 T2929 oasc.SolrResourceLoader.<init> new SolrResourceLoader for directory: '/usr/home/hudson/hudson-slave/workspace/Lucene-Solr-Tests-4.x-Java6/solr/build/solr-core/test/J0/./org.apache.solr.cloud.CollectionsAPIDistributedZkTest-jetty3-1375491765709/'
   [junit4]   2> 1470795 T2929 oasc.ConfigSolr.fromFile Loading container configuration from /usr/home/hudson/hudson-slave/workspace/Lucene-Solr-Tests-4.x-Java6/solr/build/solr-core/test/J0/./org.apache.solr.cloud.CollectionsAPIDistributedZkTest-jetty3-1375491765709/solr.xml
   [junit4]   2> 1470875 T2929 oasc.ConfigSolrXml.<init> Config-defined core root directory: 
   [junit4]   2> 1470876 T2929 oasc.CoreContainer.<init> New CoreContainer 747045441
   [junit4]   2> 1470876 T2929 oasc.CoreContainer.load Loading cores into CoreContainer [instanceDir=/usr/home/hudson/hudson-slave/workspace/Lucene-Solr-Tests-4.x-Java6/solr/build/solr-core/test/J0/./org.apache.solr.cloud.CollectionsAPIDistributedZkTest-jetty3-1375491765709/]
   [junit4]   2> 1470878 T2929 oashc.HttpShardHandlerFactory.getParameter Setting socketTimeout to: 120000
   [junit4]   2> 1470878 T2929 oashc.HttpShardHandlerFactory.getParameter Setting urlScheme to: http://
   [junit4]   2> 1470879 T2929 oashc.HttpShardHandlerFactory.getParameter Setting connTimeout to: 15000
   [junit4]   2> 1470879 T2929 oashc.HttpShardHandlerFactory.getParameter Setting maxConnectionsPerHost to: 20
   [junit4]   2> 1470880 T2929 oashc.HttpShardHandlerFactory.getParameter Setting corePoolSize to: 0
   [junit4]   2> 1470880 T2929 oashc.HttpShardHandlerFactory.getParameter Setting maximumPoolSize to: 2147483647
   [junit4]   2> 1470881 T2929 oashc.HttpShardHandlerFactory.getParameter Setting maxThreadIdleTime to: 5
   [junit4]   2> 1470881 T2929 oashc.HttpShardHandlerFactory.getParameter Setting sizeOfQueue to: -1
   [junit4]   2> 1470882 T2929 oashc.HttpShardHandlerFactory.getParameter Setting fairnessPolicy to: false
   [junit4]   2> 1470882 T2929 oascsi.HttpClientUtil.createClient Creating new http client, config:maxConnectionsPerHost=20&maxConnections=10000&socketTimeout=120000&connTimeout=15000&retry=false
   [junit4]   2> 1470899 T2929 oasc.ZkContainer.initZooKeeper Zookeeper client=127.0.0.1:17827/solr
   [junit4]   2> 1470900 T2929 oasc.ZkController.checkChrootPath zkHost includes chroot
   [junit4]   2> 1470901 T2929 oascc.ConnectionManager.waitForConnected Waiting for client to connect to ZooKeeper
   [junit4]   2> 1470913 T2995 oascc.ConnectionManager.process Watcher org.apache.solr.common.cloud.ConnectionManager@79cd3fb1 name:ZooKeeperConnection Watcher:127.0.0.1:17827 got event WatchedEvent state:SyncConnected type:None path:null path:null type:None
   [junit4]   2> 1470913 T2929 oascc.ConnectionManager.waitForConnected Client is connected to ZooKeeper
   [junit4]   2> 1470924 T2929 oascsi.HttpClientUtil.createClient Creating new http client, config:maxConnections=500&maxConnectionsPerHost=16&socketTimeout=120000&connTimeout=15000
   [junit4]   2> 1470935 T2929 oascc.ConnectionManager.waitForConnected Waiting for client to connect to ZooKeeper
   [junit4]   2> 1470946 T2997 oascc.ConnectionManager.process Watcher org.apache.solr.common.cloud.ConnectionManager@52e7441f name:ZooKeeperConnection Watcher:127.0.0.1:17827/solr got event WatchedEvent state:SyncConnected type:None path:null path:null type:None
   [junit4]   2> 1470946 T2929 oascc.ConnectionManager.waitForConnected Client is connected to ZooKeeper
   [junit4]   2> 1470950 T2929 oascc.ZkStateReader.createClusterStateWatchersAndUpdate Updating cluster state from ZooKeeper... 
   [junit4]   2> 1471953 T2929 oasc.ZkController.createEphemeralLiveNode Register node as live in ZooKeeper:/live_nodes/127.0.0.1:58137__
   [junit4]   2> 1471955 T2929 oascc.SolrZkClient.makePath makePath: /live_nodes/127.0.0.1:58137__
   [junit4]   2> 1471957 T2969 oascc.ZkStateReader$3.process Updating live nodes... (4)
   [junit4]   2> 1471957 T2956 oascc.ZkStateReader$3.process Updating live nodes... (4)
   [junit4]   2> 1471957 T2997 oascc.ZkStateReader$3.process Updating live nodes... (4)
   [junit4]   2> 1471957 T2983 oascc.ZkStateReader$3.process Updating live nodes... (4)
   [junit4]   2> 1471957 T2951 oascc.ZkStateReader$3.process Updating live nodes... (4)
   [junit4]   2> 1471970 T2929 oasc.CorePropertiesLocator.discover Looking for core definitions underneath /usr/home/hudson/hudson-slave/workspace/Lucene-Solr-Tests-4.x-Java6/solr/build/solr-core/test/J0/./org.apache.solr.cloud.CollectionsAPIDistributedZkTest-jetty3-1375491765709
   [junit4]   2> 1471976 T2929 oasc.CorePropertiesLocator.discoverUnder Found core conf in /usr/home/hudson/hudson-slave/workspace/Lucene-Solr-Tests-4.x-Java6/solr/build/solr-core/test/J0/./org.apache.solr.cloud.CollectionsAPIDistributedZkTest-jetty3-1375491765709/conf/
   [junit4]   2> 1472148 T2929 oasc.CorePropertiesLocator.discover Found 1 core definitions
   [junit4]   2> 1472149 T2929 oass.SolrDispatchFilter.init user.dir=/usr/home/hudson/hudson-slave/workspace/Lucene-Solr-Tests-4.x-Java6/solr/build/solr-core/test/J0
   [junit4]   2> 1472150 T2929 oass.SolrDispatchFilter.init SolrDispatchFilter.init() done
   [junit4]   2> 1472150 T2929 oascsi.HttpClientUtil.createClient Creating new http client, config:maxConnections=128&maxConnectionsPerHost=32&followRedirects=false
   [junit4]   2> 1472434 T2929 oejs.Server.doStart jetty-8.1.10.v20130312
   [junit4]   2> 1472437 T2929 oejs.AbstractConnector.doStart Started SocketConnector@127.0.0.1:16830
   [junit4]   2> 1472438 T2929 oass.SolrDispatchFilter.init SolrDispatchFilter.init()
   [junit4]   2> 1472439 T2929 oasc.SolrResourceLoader.locateSolrHome JNDI not configured for solr (NoInitialContextEx)
   [junit4]   2> 1472439 T2929 oasc.SolrResourceLoader.locateSolrHome using system property solr.solr.home: /usr/home/hudson/hudson-slave/workspace/Lucene-Solr-Tests-4.x-Java6/solr/build/solr-core/test/J0/./org.apache.solr.cloud.CollectionsAPIDistributedZkTest-jetty4-1375491767384
   [junit4]   2> 1472440 T2929 oasc.SolrResourceLoader.<init> new SolrResourceLoader for directory: '/usr/home/hudson/hudson-slave/workspace/Lucene-Solr-Tests-4.x-Java6/solr/build/solr-core/test/J0/./org.apache.solr.cloud.CollectionsAPIDistributedZkTest-jetty4-1375491767384/'
   [junit4]   2> 1472477 T2929 oasc.ConfigSolr.fromFile Loading container configuration from /usr/home/hudson/hudson-slave/workspace/Lucene-Solr-Tests-4.x-Java6/solr/build/solr-core/test/J0/./org.apache.solr.cloud.CollectionsAPIDistributedZkTest-jetty4-1375491767384/solr.xml
   [junit4]   2> 1472548 T2929 oasc.ConfigSolrXml.<init> Config-defined core root directory: 
   [junit4]   2> 1472548 T2929 oasc.CoreContainer.<init> New CoreContainer 117260474
   [junit4]   2> 1472549 T2929 oasc.CoreContainer.load Loading cores into CoreContainer [instanceDir=/usr/home/hudson/hudson-slave/workspace/Lucene-Solr-Tests-4.x-Java6/solr/build/solr-core/test/J0/./org.apache.solr.cloud.CollectionsAPIDistributedZkTest-jetty4-1375491767384/]
   [junit4]   2> 1472550 T2929 oashc.HttpShardHandlerFactory.getParameter Setting socketTimeout to: 120000
   [junit4]   2> 1472551 T2929 oashc.HttpShardHandlerFactory.getParameter Setting urlScheme to: http://
   [junit4]   2> 1472551 T2929 oashc.HttpShardHandlerFactory.getParameter Setting connTimeout to: 15000
   [junit4]   2> 1472552 T2929 oashc.HttpShardHandlerFactory.getParameter Setting maxConnectionsPerHost to: 20
   [junit4]   2> 1472552 T2929 oashc.HttpShardHandlerFactory.getParameter Setting corePoolSize to: 0
   [junit4]   2> 1472553 T2929 oashc.HttpShardHandlerFactory.getParameter Setting maximumPoolSize to: 2147483647
   [junit4]   2> 1472553 T2929 oashc.HttpShardHandlerFactory.getParameter Setting maxThreadIdleTime to: 5
   [junit4]   2> 1472554 T2929 oashc.HttpShardHandlerFactory.getParameter Setting sizeOfQueue to: -1
   [junit4]   2> 1472554 T2929 oashc.HttpShardHandlerFactory.getParameter Setting fairnessPolicy to: false
   [junit4]   2> 1472555 T2929 oascsi.HttpClientUtil.createClient Creating new http client, config:maxConnectionsPerHost=20&maxConnections=10000&socketTimeout=120000&connTimeout=15000&retry=false
   [junit4]   2> 1472569 T2929 oasc.ZkContainer.initZooKeeper Zookeeper client=127.0.0.1:17827/solr
   [junit4]   2> 1472570 T2929 oasc.ZkController.checkChrootPath zkHost includes chroot
   [junit4]   2> 1472571 T2929 oascc.ConnectionManager.waitForConnected Waiting for client to connect to ZooKeeper
   [junit4]   2> 1472620 T3009 oascc.ConnectionManager.process Watcher org.apache.solr.common.cloud.ConnectionManager@5ca476eb name:ZooKeeperConnection Watcher:127.0.0.1:17827 got event WatchedEvent state:SyncConnected type:None path:null path:null type:None
   [junit4]   2> 1472620 T2929 oascc.ConnectionManager.waitForConnected Client is connected to ZooKeeper
   [junit4]   2> 1472623 T2929 oascsi.HttpClientUtil.createClient Creating new http client, config:maxConnections=500&maxConnectionsPerHost=16&socketTimeout=120000&connTimeout=15000
   [junit4]   2> 1472633 T2929 oascc.ConnectionManager.waitForConnected Waiting for client to connect to ZooKeeper
   [junit4]   2> 1472635 T3011 oascc.ConnectionManager.process Watcher org.apache.solr.common.cloud.ConnectionManager@44778588 name:ZooKeeperConnection Watcher:127.0.0.1:17827/solr got event WatchedEvent state:SyncConnected type:None path:null path:null type:None
   [junit4]   2> 1472635 T2929 oascc.ConnectionManager.waitForConnected Client is connected to ZooKeeper
   [junit4]   2> 1472728 T2929 oascc.ZkStateReader.createClusterStateWatchersAndUpdate Updating cluster state from ZooKeeper... 
   [junit4]   2> 1473731 T2929 oasc.ZkController.createEphemeralLiveNode Register node as live in ZooKeeper:/live_nodes/127.0.0.1:16830__
   [junit4]   2> 1473738 T2929 oascc.SolrZkClient.makePath makePath: /live_nodes/127.0.0.1:16830__
   [junit4]   2> 1473741 T2983 oascc.ZkStateReader$3.process Updating live nodes... (5)
   [junit4]   2> 1473741 T2969 oascc.ZkStateReader$3.process Updating live nodes... (5)
   [junit4]   2> 1473741 T2997 oascc.ZkStateReader$3.process Updating live nodes... (5)
   [junit4]   2> 1473741 T3011 oascc.ZkStateReader$3.process Updating live nodes... (5)
   [junit4]   2> 1473741 T2956 oascc.ZkStateReader$3.process Updating live nodes... (5)
   [junit4]   2> 1473741 T2951 oascc.ZkStateReader$3.process Updating live nodes... (5)
   [junit4]   2> 1473761 T2929 oasc.CorePropertiesLocator.discover Looking for core definitions underneath /usr/home/hudson/hudson-slave/workspace/Lucene-Solr-Tests-4.x-Java6/solr/build/solr-core/test/J0/./org.apache.solr.cloud.CollectionsAPIDistributedZkTest-jetty4-1375491767384
   [junit4]   2> 1473763 T2929 oasc.CorePropertiesLocator.discoverUnder Found core conf in /usr/home/hudson/hudson-slave/workspace/Lucene-Solr-Tests-4.x-Java6/solr/build/solr-core/test/J0/./org.apache.solr.cloud.CollectionsAPIDistributedZkTest-jetty4-1375491767384/conf/
   [junit4]   2> 1473996 T2929 oasc.CorePropertiesLocator.discover Found 1 core definitions
   [junit4]   2> 1473997 T2929 oass.SolrDispatchFilter.init user.dir=/usr/home/hudson/hudson-slave/workspace/Lucene-Solr-Tests-4.x-Java6/solr/build/solr-core/test/J0
   [junit4]   2> 1473997 T2929 oass.SolrDispatchFilter.init SolrDispatchFilter.init() done
   [junit4]   2> 1473997 T2929 oascsi.HttpClientUtil.createClient Creating new http client, config:maxConnections=128&maxConnectionsPerHost=32&followRedirects=false
   [junit4]   2> 1474013 T2929 oascsi.HttpClientUtil.createClient Creating new http client, config:maxConnections=128&maxConnectionsPerHost=32&followRedirects=false
   [junit4]   2> 1474024 T2959 oasha.CollectionsHandler.handleCreateAction Creating Collection : numShards=2&name=nodes_used_collection&replicationFactor=2&action=CREATE&wt=javabin&version=2
   [junit4]   2> 1474026 T2951 oasc.DistributedQueue$LatchChildWatcher.process Watcher fired on path: /overseer/collection-queue-work state: SyncConnected type NodeChildrenChanged
   [junit4]   2> 1474028 T2953 oasc.OverseerCollectionProcessor.run Overseer Collection Processor: Get the message id:/overseer/collection-queue-work/qn-0000000000 message:{
   [junit4]   2> 	  "operation":"createcollection",
   [junit4]   2> 	  "numShards":"2",
   [junit4]   2> 	  "name":"nodes_used_collection",
   [junit4]   2> 	  "replicationFactor":"2"}
   [junit4]   2> 1474028 T2953 oasc.OverseerCollectionProcessor.processMessage WARN OverseerCollectionProcessor.processMessage : createcollection , {
   [junit4]   2> 	  "operation":"createcollection",
   [junit4]   2> 	  "numShards":"2",
   [junit4]   2> 	  "name":"nodes_used_collection",
   [junit4]   2> 	  "replicationFactor":"2"}
   [junit4]   2> 1474399 T2952 oascc.ZkStateReader.updateClusterState Updating cloud state from ZooKeeper... 
   [junit4]   2> 1474400 T2952 oasc.Overseer$ClusterStateUpdater.buildCollection building a new collection: nodes_used_collection
   [junit4]   2> 1474400 T2952 oasc.Overseer$ClusterStateUpdater.createCollection Create collection nodes_used_collection with shards [shard1, shard2]
   [junit4]   2> 1474414 T3011 oascc.ZkStateReader$2.process A cluster state change: WatchedEvent state:SyncConnected type:NodeDataChanged path:/clusterstate.json, has occurred - updating... (live nodes size: 5)
   [junit4]   2> 1474414 T2969 oascc.ZkStateReader$2.process A cluster state change: WatchedEvent state:SyncConnected type:NodeDataChanged path:/clusterstate.json, has occurred - updating... (live nodes size: 5)
   [junit4]   2> 1474414 T2997 oascc.ZkStateReader$2.process A cluster state change: WatchedEvent state:SyncConnected type:NodeDataChanged path:/clusterstate.json, has occurred - updating... (live nodes size: 5)
   [junit4]   2> 1474414 T2983 oascc.ZkStateReader$2.process A cluster state change: WatchedEvent state:SyncConnected type:NodeDataChanged path:/clusterstate.json, has occurred - updating... (live nodes size: 5)
   [junit4]   2> 1474414 T2956 oascc.ZkStateReader$2.process A cluster state change: WatchedEvent state:SyncConnected type:NodeDataChanged path:/clusterstate.json, has occurred - updating... (live nodes size: 5)
   [junit4]   2> 1474414 T2951 oascc.ZkStateReader$2.process A cluster state change: WatchedEvent state:SyncConnected type:NodeDataChanged path:/clusterstate.json, has occurred - updating... (live nodes size: 5)
   [junit4]   2> 1474447 T2953 oasc.OverseerCollectionProcessor.createCollection going to create cores replicas shardNames [shard1, shard2] , repFactor : 2
   [junit4]   2> 1474447 T2953 oasc.OverseerCollectionProcessor.createCollection Creating shard nodes_used_collection_shard1_replica1 as part of slice shard1 of collection nodes_used_collection on 127.0.0.1:21724__
   [junit4]   2> 1474447 T2953 oasc.OverseerCollectionProcessor.createCollection Creating shard nodes_used_collection_shard1_replica2 as part of slice shard1 of collection nodes_used_collection on 127.0.0.1:16830__
   [junit4]   2> 1474448 T2953 oasc.OverseerCollectionProcessor.createCollection Creating shard nodes_used_collection_shard2_replica1 as part of slice shard2 of collection nodes_used_collection on 127.0.0.1:31876__
   [junit4]   2> 1474449 T2953 oasc.OverseerCollectionProcessor.createCollection Creating shard nodes_used_collection_shard2_replica2 as part of slice shard2 of collection nodes_used_collection on 127.0.0.1:58137__
   [junit4]   2> 1474452 T3001 oasc.ZkController.publish publishing core=nodes_used_collection_shard1_replica2 state=down
   [junit4]   2> 1474452 T2941 oasc.ZkController.publish publishing core=nodes_used_collection_shard1_replica1 state=down
   [junit4]   2> 1474453 T2973 oasc.ZkController.publish publishing core=nodes_used_collection_shard2_replica1 state=down
   [junit4]   2> 1474453 T2987 oasc.ZkController.publish publishing core=nodes_used_collection_shard2_replica2 state=down
   [junit4]   2> 1474454 T3001 oasc.ZkController.waitForCoreNodeName look for our core node name
   [junit4]   2> 1474455 T2941 oasc.ZkController.waitForCoreNodeName look for our core node name
   [junit4]   2> 1474455 T2973 oasc.ZkController.waitForCoreNodeName look for our core node name
   [junit4]   2> 1474465 T2987 oasc.ZkController.waitForCoreNodeName look for our core node name
   [junit4]   2> 1475919 T2952 oascc.ZkStateReader.updateClusterState Updating cloud state from ZooKeeper... 
   [junit4]   2> 1475920 T2952 oasc.Overseer$ClusterStateUpdater.updateState WARN Could not find collection node for nodes_used_collection, skipping publish state
   [junit4]   2> 1475921 T2952 oasc.Overseer$ClusterStateUpdater.updateState Update state numShards=2 message={
   [junit4]   2> 	  "operation":"state",
   [junit4]   2> 	  "core_node_name":"core_node1",
   [junit4]   2> 	  "numShards":"2",
   [junit4]   2> 	  "shard":"shard1",
   [junit4]   2> 	  "roles":null,
   [junit4]   2> 	  "state":"down",
   [junit4]   2> 	  "shard_state":"active",
   [junit4]   2> 	  "core":"nodes_used_collection_shard1_replica2",
   [junit4]   2> 	  "collection":"nodes_used_collection",
   [junit4]   2> 	  "shard_range":null,
   [junit4]   2> 	  "node_name":"127.0.0.1:16830__",
   [junit4]   2> 	  "base_url":"http://127.0.0.1:16830/_"}
   [junit4]   2> 1475925 T2952 oasc.Overseer$ClusterStateUpdater.updateState WARN Could not find collection node for nodes_used_collection, skipping publish state
   [junit4]   2> 1475925 T2952 oasc.Overseer$ClusterStateUpdater.updateState Update state numShards=2 message={
   [junit4]   2> 	  "operation":"state",
   [junit4]   2> 	  "core_node_name":"core_node2",
   [junit4]   2> 	  "numShards":"2",
   [junit4]   2> 	  "shard":"shard1",
   [junit4]   2> 	  "roles":null,
   [junit4]   2> 	  "state":"down",
   [junit4]   2> 	  "shard_state":"active",
   [junit4]   2> 	  "core":"nodes_used_collection_shard1_replica1",
   [junit4]   2> 	  "collection":"nodes_used_collection",
   [junit4]   2> 	  "shard_range":null,
   [junit4]   2> 	  "node_name":"127.0.0.1:21724__",
   [junit4]   2> 	  "base_url":"http://127.0.0.1:21724/_"}
   [junit4]   2> 1475939 T2952 oasc.Overseer$ClusterStateUpdater.updateState WARN Could not find collection node for nodes_used_collection, skipping publish state
   [junit4]   2> 1475939 T2952 oasc.Overseer$ClusterStateUpdater.updateState Update state numShards=2 message={
   [junit4]   2> 	  "operation":"state",
   [junit4]   2> 	  "core_node_name":"core_node3",
   [junit4]   2> 	  "numShards":"2",
   [junit4]   2> 	  "shard":"shard2",
   [junit4]   2> 	  "roles":null,
   [junit4]   2> 	  "state":"down",
   [junit4]   2> 	  "shard_state":"active",
   [junit4]   2> 	  "core":"nodes_used_collection_shard2_replica1",
   [junit4]   2> 	  "collection":"nodes_used_collection",
   [junit4]   2> 	  "shard_range":null,
   [junit4]   2> 	  "node_name":"127.0.0.1:31876__",
   [junit4]   2> 	  "base_url":"http://127.0.0.1:31876/_"}
   [junit4]   2> 1475948 T2952 oasc.Overseer$ClusterStateUpdater.updateState WARN Could not find collection node for nodes_used_collection, skipping publish state
   [junit4]   2> 1475948 T2952 oasc.Overseer$ClusterStateUpdater.updateState Update state numShards=2 message={
   [junit4]   2> 	  "operation":"state",
   [junit4]   2> 	  "core_node_name":"core_node4",
   [junit4]   2> 	  "numShards":"2",
   [junit4]   2> 	  "shard":"shard2",
   [junit4]   2> 	  "roles":null,
   [junit4]   2> 	  "state":"down",
   [junit4]   2> 	  "shard_state":"active",
   [junit4]   2> 	  "core":"nodes_used_collection_shard2_replica2",
   [junit4]   2> 	  "collection":"nodes_used_collection",
   [junit4]   2> 	  "shard_range":null,
   [junit4]   2> 	  "node_name":"127.0.0.1:58137__",
   [junit4]   2> 	  "base_url":"http://127.0.0.1:58137/_"}
   [junit4]   2> 1475957 T3011 oascc.ZkStateReader$2.process A cluster state change: WatchedEvent state:SyncConnected type:NodeDataChanged path:/clusterstate.json, has occurred - updating... (live nodes size: 5)
   [junit4]   2> 1475957 T2997 oascc.ZkStateReader$2.process A cluster state change: WatchedEvent state:SyncConnected type:NodeDataChanged path:/clusterstate.json, has occurred - updating... (live nodes size: 5)
   [junit4]   2> 1475957 T2956 oascc.ZkStateReader$2.process A cluster state change: WatchedEvent state:SyncConnected type:NodeDataChanged path:/clusterstate.json, has occurred - updating... (live nodes size: 5)
   [junit4]   2> 1475957 T2983 oascc.ZkStateReader$2.process A cluster state change: WatchedEvent state:SyncConnected type:NodeDataChanged path:/clusterstate.json, has occurred - updating... (live nodes size: 5)
   [junit4]   2> 1475957 T2969 oascc.ZkStateReader$2.process A cluster state change: WatchedEvent state:SyncConnected type:NodeDataChanged path:/clusterstate.json, has occurred - updating... (live nodes size: 5)
   [junit4]   2> 1475957 T2951 oascc.ZkStateReader$2.process A cluster state change: WatchedEvent state:SyncConnected type:NodeDataChanged path:/clusterstate.json, has occurred - updating... (live nodes size: 5)
   [junit4]   2> 1476457 T3001 oasc.ZkController.waitForShardId waiting to find shard id in clusterstate for nodes_used_collection_shard1_replica2
   [junit4]   2> 1476457 T2941 oasc.ZkController.waitForShardId waiting to find shard id in clusterstate for nodes_used_collection_shard1_replica1
   [junit4]   2> 1476458 T3001 oasc.CorePropertiesLocator.writePropertiesFile ERROR Couldn't persist core properties to /usr/home/hudson/hudson-slave/workspace/Lucene-Solr-Tests-4.x-Java6/solr/build/solr-core/test/J0/./org.apache.solr.cloud.CollectionsAPIDistributedZkTest-jetty4-1375491767384/nodes_used_collection_shard1_replica2/core.properties: java.io.FileNotFoundException: /usr/home/hudson/hudson-slave/workspace/Lucene-Solr-Tests-4.x-Java6/solr/build/solr-core/test/J0/./org.apache.solr.cloud.CollectionsAPIDistributedZkTest-jetty4-1375491767384/nodes_used_collection_shard1_replica2/core.properties (No such file or directory)
   [junit4]   2> 1476459 T3001 oasc.CoreContainer.create Creating SolrCore 'nodes_used_collection_shard1_replica2' using instanceDir: /usr/home/hudson/hudson-slave/workspace/Lucene-Solr-Tests-4.x-Java6/solr/build/solr-core/test/J0/./org.apache.solr.cloud.CollectionsAPIDistributedZkTest-jetty4-1375491767384/nodes_used_collection_shard1_replica2
   [junit4]   2> 1476459 T3001 oasc.ZkController.createCollectionZkNode Check for collection zkNode:nodes_used_collection
   [junit4]   2> 1476459 T2973 oasc.ZkController.waitForShardId waiting to find shard id in clusterstate for nodes_used_collection_shard2_replica1
   [junit4]   2> 1476459 T2941 oasc.CorePropertiesLocator.writePropertiesFile ERROR Couldn't persist core properties to /usr/home/hudson/hudson-slave/workspace/Lucene-Solr-Tests-4.x-Java6/solr/build/solr-core/test/J0/./org.apache.solr.cloud.CollectionsAPIDistributedZkTest-controljetty-1375491761608/nodes_used_collection_shard1_replica1/core.properties: java.io.FileNotFoundException: /usr/home/hudson/hudson-slave/workspace/Lucene-Solr-Tests-4.x-Java6/solr/build/solr-core/test/J0/./org.apache.solr.cloud.CollectionsAPIDistributedZkTest-controljetty-1375491761608/nodes_used_collection_shard1_replica1/core.properties (No such file or directory)
   [junit4]   2> 1476460 T3001 oasc.ZkController.createCollectionZkNode Creating collection in ZooKeeper:nodes_used_collection
   [junit4]   2> 1476460 T2941 oasc.CoreContainer.create Creating SolrCore 'nodes_used_collection_shard1_replica1' using instanceDir: /usr/home/hudson/hudson-slave/workspace/Lucene-Solr-Tests-4.x-Java6/solr/build/solr-core/test/J0/./org.apache.solr.cloud.CollectionsAPIDistributedZkTest-controljetty-1375491761608/nodes_used_collection_shard1_replica1
   [junit4]   2> 1476461 T2941 oasc.ZkController.createCollectionZkNode Check for collection zkNode:nodes_used_collection
   [junit4]   2> 1476461 T3001 oasc.ZkController.getConfName Looking for collection configName
   [junit4]   2> 1476462 T2941 oasc.ZkController.createCollectionZkNode Creating collection in ZooKeeper:nodes_used_collection
   [junit4]   2> 1476461 T2973 oasc.CorePropertiesLocator.writePropertiesFile ERROR Couldn't persist core properties to /usr/home/hudson/hudson-slave/workspace/Lucene-Solr-Tests-4.x-Java6/solr/build/solr-core/test/J0/./org.apache.solr.cloud.CollectionsAPIDistributedZkTest-jetty2-1375491764064/nodes_used_collection_shard2_replica1/core.properties: java.io.FileNotFoundException: /usr/home/hudson/hudson-slave/workspace/Lucene-Solr-Tests-4.x-Java6/solr/build/solr-core/test/J0/./org.apache.solr.cloud.CollectionsAPIDistributedZkTest-jetty2-1375491764064/nodes_used_collection_shard2_replica1/core.properties (No such file or directory)
   [junit4]   2> 1476463 T3001 oasc.ZkController.getConfName Only one config set found in zk - using it:conf1
   [junit4]   2> 1476463 T2973 oasc.CoreContainer.create Creating SolrCore 'nodes_used_collection_shard2_replica1' using instanceDir: /usr/home/hudson/hudson-slave/workspace/Lucene-Solr-Tests-4.x-Java6/solr/build/solr-core/test/J0/./org.apache.solr.cloud.CollectionsAPIDistributedZkTest-jetty2-1375491764064/nodes_used_collection_shard2_replica1
   [junit4]   2> 1476462 T2941 oasc.ZkController.getConfName Looking for collection configName
   [junit4]   2> 1476463 T2973 oasc.ZkController.createCollectionZkNode Check for collection zkNode:nodes_used_collection
   [junit4]   2> 1476463 T3001 oascc.SolrZkClient.makePath makePath: /collections/nodes_used_collection
   [junit4]   2> 1476464 T2973 oasc.ZkController.createCollectionZkNode Creating collection in ZooKeeper:nodes_used_collection
   [junit4]   2> 1476464 T2941 oasc.ZkController.getConfName Only one config set found in zk - using it:conf1
   [junit4]   2> 1476465 T2973 oasc.ZkController.getConfName Looking for collection configName
   [junit4]   2> 1476465 T2941 oascc.SolrZkClient.makePath makePath: /collections/nodes_used_collection
   [junit4]   2> 1476467 T3001 oasc.ZkController.readConfigName Load collection config from:/collections/nodes_used_collection
   [junit4]   2> 1476467 T2973 oascc.SolrZkClient.makePath makePath: /collections/nodes_used_collection
   [junit4]   2> 1476468 T2987 oasc.ZkController.waitForShardId waiting to find shard id in clusterstate for nodes_used_collection_shard2_replica2
   [junit4]   2> 1476468 T2941 oasc.ZkController.readConfigName Load collection config from:/collections/nodes_used_collection
   [junit4]   2> 1476469 T3001 oasc.SolrResourceLoader.<init> new SolrResourceLoader for directory: '/usr/home/hudson/hudson-slave/workspace/Lucene-Solr-Tests-4.x-Java6/solr/build/solr-core/test/J0/./org.apache.solr.cloud.CollectionsAPIDistributedZkTest-jetty4-1375491767384/nodes_used_collection_shard1_replica2/'
   [junit4]   2> 1476469 T2987 oasc.CorePropertiesLocator.writePropertiesFile ERROR Couldn't persist core properties to /usr/home/hudson/hudson-slave/workspace/Lucene-Solr-Tests-4.x-Java6/solr/build/solr-core/test/J0/./org.apache.solr.cloud.CollectionsAPIDistributedZkTest-jetty3-1375491765709/nodes_used_collection_shard2_replica2/core.properties: java.io.FileNotFoundException: /usr/home/hudson/hudson-slave/workspace/Lucene-Solr-Tests-4.x-Java6/solr/build/solr-core/test/J0/./org.apache.solr.cloud.CollectionsAPIDistributedZkTest-jetty3-1375491765709/nodes_used_collection_shard2_replica2/core.properties (No such file or directory)
   [junit4]   2> 1476470 T2987 oasc.CoreContainer.create Creating SolrCore 'nodes_used_collection_shard2_replica2' using instanceDir: /usr/home/hudson/hudson-slave/workspace/Lucene-Solr-Tests-4.x-Java6/solr/build/solr-core/test/J0/./org.apache.solr.cloud.CollectionsAPIDistributedZkTest-jetty3-1375491765709/nodes_used_collection_shard2_replica2
   [junit4]   2> 1476470 T2987 oasc.ZkController.createCollectionZkNode Check for collection zkNode:nodes_used_collection
   [junit4]   2> 1476479 T2973 oasc.ZkController.readConfigName Load collection config from:/collections/nodes_used_collection
   [junit4]   2> 1476480 T2941 oasc.SolrResourceLoader.<init> new SolrResourceLoader for directory: '/usr/home/hudson/hudson-slave/workspace/Lucene-Solr-Tests-4.x-Java6/solr/build/solr-core/test/J0/./org.apache.solr.cloud.CollectionsAPIDistributedZkTest-controljetty-1375491761608/nodes_used_collection_shard1_replica1/'
   [junit4]   2> 1476480 T2987 oasc.ZkController.createCollectionZkNode Collection zkNode exists
   [junit4]   2> 1476481 T2973 oasc.SolrResourceLoader.<init> new SolrResourceLoader for directory: '/usr/home/hudson/hudson-slave/workspace/Lucene-Solr-Tests-4.x-Java6/solr/build/solr-core/test/J0/./org.apache.solr.cloud.CollectionsAPIDistributedZkTest-jetty2-1375491764064/nodes_used_collection_shard2_replica1/'
   [junit4]   2> 1476481 T2987 oasc.ZkController.readConfigName Load collection config from:/collections/nodes_used_collection
   [junit4]   2> 1476482 T2987 oasc.SolrResourceLoader.<init> new SolrResourceLoader for directory: '/usr/home/hudson/hudson-slave/workspace/Lucene-Solr-Tests-4.x-Java6/solr/build/solr-core/test/J0/./org.apache.solr.cloud.CollectionsAPIDistributedZkTest-jetty3-1375491765709/nodes_used_collection_shard2_replica2/'
   [junit4]   2> 1476582 T2987 oasc.SolrConfig.<init> Using Lucene MatchVersion: LUCENE_45
   [junit4]   2> 1476583 T2973 oasc.SolrConfig.<init> Using Lucene MatchVersion: LUCENE_45
   [junit4]   2> 1476583 T3001 oasc.SolrConfig.<init> Using Lucene MatchVersion: LUCENE_45
   [junit4]   2> 1476585 T2941 oasc.SolrConfig.<init> Using Lucene MatchVersion: LUCENE_45
   [junit4]   2> 1476666 T2987 oasc.SolrConfig.<init> Loaded SolrConfig: solrconfig.xml
   [junit4]   2> 1476670 T2973 oasc.SolrConfig.<init> Loaded SolrConfig: solrconfig.xml
   [junit4]   2> 1476671 T3001 oasc.SolrConfig.<init> Loaded SolrConfig: solrconfig.xml
   [junit4]   2> 1476675 T2941 oasc.SolrConfig.<init> Loaded SolrConfig: solrconfig.xml
   [junit4]   2> 1476767 T2987 oass.IndexSchema.readSchema Reading Solr Schema from schema.xml
   [junit4]   2> 1476771 T2973 oass.IndexSchema.readSchema Reading Solr Schema from schema.xml
   [junit4]   2> 1476773 T3001 oass.IndexSchema.readSchema Reading Solr Schema from schema.xml
   [junit4]   2> 1476776 T2941 oass.IndexSchema.readSchema Reading Solr Schema from schema.xml
   [junit4]   2> 1476779 T2987 oass.IndexSchema.readSchema [nodes_used_collection_shard2_replica2] Schema name=test
   [junit4]   2> 1476785 T2973 oass.IndexSchema.readSchema [nodes_used_collection_shard2_replica1] Schema name=test
   [junit4]   2> 1476787 T3001 oass.IndexSchema.readSchema [nodes_used_collection_shard1_replica2] Schema name=test
   [junit4]   2> 1476787 T2941 oass.IndexSchema.readSchema [nodes_used_collection_shard1_replica1] Schema name=test
   [junit4]   2> 1477600 T2987 oass.ByteField.init WARN ByteField is deprecated and will be removed in 5.0. You should use TrieIntField instead.
   [junit4]   2> 1477601 T3001 oass.ByteField.init WARN ByteField is deprecated and will be removed in 5.0. You should use TrieIntField instead.
   [junit4]   2> 1477601 T2987 oass.ShortField.init WARN ShortField is deprecated and will be removed in 5.0. You should use TrieIntField instead.
   [junit4]   2> 1477601 T3001 oass.ShortField.init WARN ShortField is deprecated and will be removed in 5.0. You should use TrieIntField instead.
   [junit4]   2> 1477603 T2987 oass.OpenExchangeRatesOrgProvider.init Initialized with rates=open-exchange-rates.json, refreshInterval=1440.
   [junit4]   2> 1477603 T3001 oass.OpenExchangeRatesOrgProvider.init Initialized with rates=open-exchange-rates.json, refreshInterval=1440.
   [junit4]   2> 1477605 T2973 oass.ByteField.init WARN ByteField is deprecated and will be removed in 5.0. You should use TrieIntField instead.
   [junit4]   2> 1477605 T2973 oass.ShortField.init WARN ShortField is deprecated and will be removed in 5.0. You should use TrieIntField instead.
   [junit4]   2> 1477606 T2973 oass.OpenExchangeRatesOrgProvider.init Initialized with rates=open-exchange-rates.json, refreshInterval=1440.
   [junit4]   2> 1477609 T2941 oass.ByteField.init WARN ByteField is deprecated and will be removed in 5.0. You should use TrieIntField instead.
   [junit4]   2> 1477610 T2941 oass.ShortField.init WARN ShortField is deprecated and will be removed in 5.0. You should use TrieIntField instead.
   [junit4]   2> 1477615 T2941 oass.OpenExchangeRatesOrgProvider.init Initialized with rates=open-exchange-rates.json, refreshInterval=1440.
   [junit4]   2> 1477617 T2987 oass.IndexSchema.readSchema default search field in schema is text
   [junit4]   2> 1477620 T2973 oass.IndexSchema.readSchema default search field in schema is text
   [junit4]   2> 1477621 T3001 oass.IndexSchema.readSchema default search field in schema is text
   [junit4]   2> 1477623 T2987 oass.IndexSchema.readSchema unique key field: id
   [junit4]   2> 1477626 T2941 oass.IndexSchema.readSchema default search field in schema is text
   [junit4]   2> 1477627 T3001 oass.IndexSchema.readSchema unique key field: id
   [junit4]   2> 1477627 T2973 oass.IndexSchema.readSchema unique key field: id
   [junit4]   2> 1477630 T2941 oass.IndexSchema.readSchema unique key field: id
   [junit4]   2> 1477640 T2987 oass.FileExchangeRateProvider.reload Reloading exchange rates from file currency.xml
   [junit4]   2> 1477641 T3001 oass.FileExchangeRateProvider.reload Reloading exchange rates from file currency.xml
   [junit4]   2> 1477642 T2973 oass.FileExchangeRateProvider.reload Reloading exchange rates from file currency.xml
   [junit4]   2> 1477645 T2941 oass.FileExchangeRateProvider.reload Reloading exchange rates from file currency.xml
   [junit4]   2> 1477647 T2987 oass.FileExchangeRateProvider.reload Reloading exchange rates from file currency.xml
   [junit4]   2> 1477647 T3001 oass.FileExchangeRateProvider.reload Reloading exchange rates from file currency.xml
   [junit4]   2> 1477648 T2973 oass.FileExchangeRateProvider.reload Reloading exchange rates from file currency.xml
   [junit4]   2> 1477651 T2941 oass.FileExchangeRateProvider.reload Reloading exchange rates from file currency.xml
   [junit4]   2> 1477652 T2987 oass.OpenExchangeRatesOrgProvider.reload Reloading exchange rates from open-exchange-rates.json
   [junit4]   2> 1477653 T3001 oass.OpenExchangeRatesOrgProvider.reload Reloading exchange rates from open-exchange-rates.json
   [junit4]   2> 1477653 T2973 oass.OpenExchangeRatesOrgProvider.reload Reloading exchange rates from open-exchange-rates.json
   [junit4]   2> 1477654 T2987 oass.OpenExchangeRatesOrgProvider$OpenExchangeRates.<init> WARN Unknown key IMPORTANT NOTE
   [junit4]   2> 1477654 T3001 oass.OpenExchangeRatesOrgProvider$OpenExchangeRates.<init> WARN Unknown key IMPORTANT NOTE
   [junit4]   2> 1477655 T2973 oass.OpenExchangeRatesOrgProvider$OpenExchangeRates.<init> WARN Unknown key IMPORTANT NOTE
   [junit4]   2> 1477654 T2987 oass.OpenExchangeRatesOrgProvider$OpenExchangeRates.<init> WARN Expected key, got STRING
   [junit4]   2> 1477655 T2973 oass.OpenExchangeRatesOrgProvider$OpenExchangeRates.<init> WARN Expected key, got STRING
   [junit4]   2> 1477655 T3001 oass.OpenExchangeRatesOrgProvider$OpenExchangeRates.<init> WARN Expected key, got STRING
   [junit4]   2> 1477656 T2973 oass.OpenExchangeRatesOrgProvider.reload Reloading exchange rates from open-exchange-rates.json
   [junit4]   2> 1477656 T2941 oass.OpenExchangeRatesOrgProvider.reload Reloading exchange rates from open-exchange-rates.json
   [junit4]   2> 1477656 T2987 oass.OpenExchangeRatesOrgProvider.reload Reloading exchange rates from open-exchange-rates.json
   [junit4]   2> 1477658 T2973 oass.OpenExchangeRatesOrgProvider$OpenExchangeRates.<init> WARN Unknown key IMPORTANT NOTE
   [junit4]   2> 1477658 T2941 oass.OpenExchangeRatesOrgProvider$OpenExchangeRates.<init> WARN Unknown key IMPORTANT NOTE
   [junit4]   2> 1477659 T2941 oass.OpenExchangeRatesOrgProvider$OpenExchangeRates.<init> WARN Expected key, got STRING
   [junit4]   2> 1477658 T2987 oass.OpenExchangeRatesOrgProvider$OpenExchangeRates.<init> WARN Unknown key IMPORTANT NOTE
   [junit4]   2> 1477659 T2987 oass.OpenExchangeRatesOrgProvider$OpenExchangeRates.<init> WARN Expected key, got STRING
   [junit4]   2> 1477658 T2973 oass.OpenExchangeRatesOrgProvider$OpenExchangeRates.<init> WARN Expected key, got STRING
   [junit4]   2> 1477657 T3001 oass.OpenExchangeRatesOrgProvider.reload Reloading exchange rates from open-exchange-rates.json
   [junit4]   2> 1477660 T2973 oasc.SolrCore.initDirectoryFactory org.apache.solr.core.MockDirectoryFactory
   [junit4]   2> 1477660 T2987 oasc.SolrCore.initDirectoryFactory org.apache.solr.core.MockDirectoryFactory
   [junit4]   2> 1477659 T2941 oass.OpenExchangeRatesOrgProvider.reload Reloading exchange rates from open-exchange-rates.json
   [junit4]   2> 1477662 T2987 oasc.SolrCore.<init> [nodes_used_collection_shard2_replica2] Opening new SolrCore at /usr/home/hudson/hudson-slave/workspace/Lucene-Solr-Tests-4.x-Java6/solr/build/solr-core/test/J0/./org.apache.solr.cloud.CollectionsAPIDistributedZkTest-jetty3-1375491765709/nodes_used_collection_shard2_replica2/, dataDir=/usr/home/hudson/hudson-slave/workspace/Lucene-Solr-Tests-4.x-Java6/solr/build/solr-core/test/J0/./org.apache.solr.cloud.CollectionsAPIDistributedZkTest-jetty3-1375491765709//nodes_used_collection_shard2_replica2/data/
   [junit4]   2> 1477661 T3001 oass.OpenExchangeRatesOrgProvider$OpenExchangeRates.<init> WARN Unknown key IMPORTANT NOTE
   [junit4]   2> 1477661 T2973 oasc.SolrCore.<init> [nodes_used_collection_shard2_replica1] Opening new SolrCore at /usr/home/hudson/hudson-slave/workspace/Lucene-Solr-Tests-4.x-Java6/solr/build/solr-core/test/J0/./org.apache.solr.cloud.CollectionsAPIDistributedZkTest-jetty2-1375491764064/nodes_used_collection_shard2_replica1/, dataDir=/usr/home/hudson/hudson-slave/workspace/Lucene-Solr-Tests-4.x-Java6/solr/build/solr-core/test/J0/./org.apache.solr.cloud.CollectionsAPIDistributedZkTest-jetty2-1375491764064//nodes_used_collection_shard2_replica1/data/
   [junit4]   2> 1477663 T3001 oass.OpenExchangeRatesOrgProvider$OpenExchangeRates.<init> WARN Expected key, got STRING
   [junit4]   2> 1477663 T2941 oass.OpenExchangeRatesOrgProvider$OpenExchangeRates.<init> WARN Unknown key IMPORTANT NOTE
   [junit4]   2> 1477662 T2987 oasc.JmxMonitoredMap.<init> JMX monitoring is enabled. Adding Solr mbeans to JMX Server: com.sun.jmx.mbeanserver.JmxMBeanServer@13f4cf6f
   [junit4]   2> 1477664 T2941 oass.OpenExchangeRatesOrgProvider$OpenExchangeRates.<init> WARN Expected key, got STRING
   [junit4]   2> 1477664 T3001 oasc.SolrCore.initDirectoryFactory org.apache.solr.core.MockDirectoryFactory
   [junit4]   2> 1477663 T2973 oasc.JmxMonitoredMap.<init> JMX monitoring is enabled. Adding Solr mbeans to JMX Server: com.sun.jmx.mbeanserver.JmxMBeanServer@13f4cf6f
   [junit4]   2> 1477665 T3001 oasc.SolrCore.<init> [nodes_used_collection_shard1_replica2] Opening new SolrCore at /usr/home/hudson/hudson-slave/workspace/Lucene-Solr-Tests-4.x-Java6/solr/build/solr-core/test/J0/./org.apache.solr.cloud.CollectionsAPIDistributedZkTest-jetty4-1375491767384/nodes_used_collection_shard1_replica2/, dataDir=/usr/home/hudson/hudson-slave/workspace/Lucene-Solr-Tests-4.x-Java6/solr/build/solr-core/test/J0/./org.apache.solr.cloud.CollectionsAPIDistributedZkTest-jetty4-1375491767384//nodes_used_collection_shard1_replica2/data/
   [junit4]   2> 1477665 T2987 oasc.CachingDirectoryFactory.get return new directory for /usr/home/hudson/hudson-slave/workspace/Lucene-Solr-Tests-4.x-Java6/solr/build/solr-core/test/J0/./org.apache.solr.cloud.CollectionsAPIDistributedZkTest-jetty3-1375491765709//nodes_used_collection_shard2_replica2/data
   [junit4]   2> 1477667 T2973 oasc.CachingDirectoryFactory.get return new directory for /usr/home/hudson/hudson-slave/workspace/Lucene-Solr-Tests-4.x-Java6/solr/build/solr-core/test/J0/./org.apache.solr.cloud.CollectionsAPIDistributedZkTest-jetty2-1375491764064//nodes_used_collection_shard2_replica1/data
   [junit4]   2> 1477665 T2941 oasc.SolrCore.initDirectoryFactory org.apache.solr.core.MockDirectoryFactory
   [junit4]   2> 1477667 T2973 oasc.SolrCore.getNewIndexDir New index directory detected: old=null new=/usr/home/hudson/hudson-slave/workspace/Lucene-Solr-Tests-4.x-Java6/solr/build/solr-core/test/J0/./org.apache.solr.cloud.CollectionsAPIDistributedZkTest-jetty2-1375491764064//nodes_used_collection_shard2_replica1/data/index/
   [junit4]   2> 1477667 T2987 oasc.SolrCore.getNewIndexDir New index directory detected: old=null new=/usr/home/hudson/hudson-slave/workspace/Lucene-Solr-Tests-4.x-Java6/solr/build/solr-core/test/J0/./org.apache.solr.cloud.CollectionsAPIDistributedZkTest-jetty3-1375491765709//nodes_used_collection_shard2_replica2/data/index/
   [junit4]   2> 1477666 T3001 oasc.JmxMonitoredMap.<init> JMX monitoring is enabled. Adding Solr mbeans to JMX Server: com.sun.jmx.mbeanserver.JmxMBeanServer@13f4cf6f
   [junit4]   2> 1477668 T2987 oasc.SolrCore.initIndex WARN [nodes_used_collection_shard2_replica2] Solr index directory '/usr/home/hudson/hudson-slave/workspace/Lucene-Solr-Tests-4.x-Java6/solr/build/solr-core/test/J0/./org.apache.solr.cloud.CollectionsAPIDistributedZkTest-jetty3-1375491765709/nodes_used_collection_shard2_replica2/data/index' doesn't exist. Creating new index...
   [junit4]   2> 1477668 T2973 oasc.SolrCore.initIndex WARN [nodes_used_collection_shard2_replica1] Solr index directory '/usr/home/hudson/hudson-slave/workspace/Lucene-Solr-Tests-4.x-Java6/solr/build/solr-core/test/J0/./org.apache.solr.cloud.CollectionsAPIDistributedZkTest-jetty2-1375491764064/nodes_used_collection_shard2_replica1/data/index' doesn't exist. Creating new index...
   [junit4]   2> 1477667 T2941 oasc.SolrCore.<init> [nodes_used_collection_shard1_replica1] Opening new SolrCore at /usr/home/hudson/hudson-slave/workspace/Lucene-Solr-Tests-4.x-Java6/solr/build/solr-core/test/J0/./org.apache.solr.cloud.CollectionsAPIDistributedZkTest-controljetty-1375491761608/nodes_used_collection_shard1_replica1/, dataDir=/usr/home/hudson/hudson-slave/workspace/Lucene-Solr-Tests-4.x-Java6/solr/build/solr-core/test/J0/./org.apache.solr.cloud.CollectionsAPIDistributedZkTest-controljetty-1375491761608//nodes_used_collection_shard1_replica1/data/
   [junit4]   2> 1477670 T2973 oasc.CachingDirectoryFactory.get return new directory for /usr/home/hudson/hudson-slave/workspace/Lucene-Solr-Tests-4.x-Java6/solr/build/solr-core/test/J0/./org.apache.solr.cloud.CollectionsAPIDistributedZkTest-jetty2-1375491764064//nodes_used_collection_shard2_replica1/data/index
   [junit4]   2> 1477669 T2987 oasc.CachingDirectoryFactory.get return new directory for /usr/home/hudson/hudson-slave/workspace/Lucene-Solr-Tests-4.x-Java6/solr/build/solr-core/test/J0/./org.apache.solr.cloud.CollectionsAPIDistributedZkTest-jetty3-1375491765709//nodes_used_collection_shard2_replica2/data/index
   [junit4]   2> 1477669 T3001 oasc.CachingDirectoryFactory.get return new directory for /usr/home/hudson/hudson-slave/workspace/Lucene-Solr-Tests-4.x-Java6/solr/build/solr-core/test/J0/./org.apache.solr.cloud.CollectionsAPIDistributedZkTest-jetty4-1375491767384//nodes_used_collection_shard1_replica2/data
   [junit4]   2> 1477670 T2941 oasc.JmxMonitoredMap.<init> JMX monitoring is enabled. Adding Solr mbeans to JMX Server: com.sun.jmx.mbeanserver.JmxMBeanServer@13f4cf6f
   [junit4]   2> 1477672 T3001 oasc.SolrCore.getNewIndexDir New index directory detected: old=null new=/usr/home/hudson/hudson-slave/workspace/Lucene-Solr-Tests-4.x-Java6/solr/build/solr-core/test/J0/./org.apache.solr.cloud.CollectionsAPIDistributedZkTest-jetty4-1375491767384//nodes_used_collection_shard1_replica2/data/index/
   [junit4]   2> 1477673 T3001 oasc.SolrCore.initIndex WARN [nodes_used_collection_shard1_replica2] Solr index directory '/usr/home/hudson/hudson-slave/workspace/Lucene-Solr-Tests-4.x-Java6/solr/build/solr-core/test/J0/./org.apache.solr.cloud.CollectionsAPIDistributedZkTest-jetty4-1375491767384/nodes_used_collection_shard1_replica2/data/index' doesn't exist. Creating new index...
   [junit4]   2> 1477673 T2941 oasc.CachingDirectoryFactory.get return new directory for /usr/home/hudson/hudson-slave/workspace/Lucene-Solr-Tests-4.x-Java6/solr/build/solr-core/test/J0/./org.apache.solr.cloud.CollectionsAPIDistributedZkTest-controljetty-1375491761608//nodes_used_collection_shard1_replica1/data
   [junit4]   2> 1477674 T3001 oasc.CachingDirectoryFactory.get return new directory for /usr/home/hudson/hudson-slave/workspace/Lucene-Solr-Tests-4.x-Java6/solr/build/solr-core/test/J0/./org.apache.solr.cloud.CollectionsAPIDistributedZkTest-jetty4-1375491767384//nodes_used_collection_shard1_replica2/data/index
   [junit4]   2> 1477674 T2941 oasc.SolrCore.getNewIndexDir New index directory detected: old=null new=/usr/home/hudson/hudson-slave/workspace/Lucene-Solr-Tests-4.x-Java6/solr/build/solr-core/test/J0/./org.apache.solr.cloud.CollectionsAPIDistributedZkTest-controljetty-1375491761608//nodes_used_collection_shard1_replica1/data/index/
   [junit4]   2> 1477675 T2941 oasc.SolrCore.initIndex WARN [nodes_used_collection_shard1_replica1] Solr index directory '/usr/home/hudson/hudson-slave/workspace/Lucene-Solr-Tests-4.x-Java6/solr/build/solr-core/test/J0/./org.apache.solr.cloud.CollectionsAPIDistributedZkTest-controljetty-1375491761608/nodes_used_collection_shard1_replica1/data/index' doesn't exist. Creating new index...
   [junit4]   2> 1477676 T2941 oasc.CachingDirectoryFactory.get return new directory for /usr/home/hudson/hudson-slave/workspace/Lucene-Solr-Tests-4.x-Java6/solr/build/solr-core/test/J0/./org.apache.solr.cloud.CollectionsAPIDistributedZkTest-controljetty-1375491761608//nodes_used_collection_shard1_replica1/data/index
   [junit4]   2> 1477677 T2973 oasc.SolrDeletionPolicy.onCommit SolrDeletionPolicy.onCommit: commits: num=1
   [junit4]   2> 		commit{dir=MockDirWrapper(org.apache.lucene.store.RAMDirectory@7b513edc lockFactory=org.apache.lucene.store.NativeFSLockFactory@6a8bfc4f),segFN=segments_1,generation=1}
   [junit4]   2> 1477677 T2973 oasc.SolrDeletionPolicy.updateCommits newest commit generation = 1
   [junit4]   2> 1477678 T2987 oasc.SolrDeletionPolicy.onCommit SolrDeletionPolicy.onCommit: commits: num=1
   [junit4]   2> 		commit{dir=MockDirWrapper(org.apache.lucene.store.RAMDirectory@7285091a lockFactory=org.apache.lucene.store.NativeFSLockFactory@695e7c47),segFN=segments_1,generation=1}
   [junit4]   2> 1477678 T2987 oasc.SolrDeletionPolicy.updateCommits newest commit generation = 1
   [junit4]   2> 1477681 T3001 oasc.SolrDeletionPolicy.onCommit SolrDeletionPolicy.onCommit: commits: num=1
   [junit4]   2> 		commit{dir=MockDirWrapper(org.apache.lucene.store.RAMDirectory@27c2d1aa lockFactory=org.apache.lucene.store.NativeFSLockFactory@57931c92),segFN=segments_1,generation=1}
   [junit4]   2> 1477681 T3001 oasc.SolrDeletionPolicy.updateCommits newest commit generation = 1
   [junit4]   2> 1477683 T2973 oasup.UpdateRequestProcessorChain.init inserting DistributedUpdateProcessorFactory into updateRequestProcessorChain "dedupe"
   [junit4]   2> 1477684 T2941 oasc.SolrDeletionPolicy.onCommit SolrDeletionPolicy.onCommit: commits: num=1
   [junit4]   2> 		commit{dir=MockDirWrapper(org.apache.lucene.store.RAMDirectory@5387ef4b lockFactory=org.apache.lucene.store.NativeFSLockFactory@10bb0b30),segFN=segments_1,generation=1}
   [junit4]   2> 1477684 T2973 oasup.UpdateRequestProcessorChain.init inserting DistributedUpdateProcessorFactory into updateRequestProcessorChain "stored_sig"
   [junit4]   2> 1477684 T2941 oasc.SolrDeletionPolicy.updateCommits newest commit generation = 1
   [junit4]   2> 1477685 T2973 oasup.UpdateRequestProcessorChain.init inserting DistributedUpdateProcessorFactory into updateRequestProcessorChain "distrib-dup-test-chain-implicit"
   [junit4]   2> 1477685 T2987 oasup.UpdateRequestProcessorChain.init inserting DistributedUpdateProcessorFactory into updateRequestProcessorChain "dedupe"
   [junit4]   2> 1477686 T2973 oasc.RequestHandlers.initHandlersFromConfig created standard: solr.StandardRequestHandler
   [junit4]   2> 1477686 T2987 oasup.UpdateRequestProcessorChain.init inserting DistributedUpdateProcessorFactory into updateRequestProcessorChain "stored_sig"
   [junit4]   2> 1477687 T2973 oasc.RequestHandlers.initHandlersFromConfig created /get: solr.RealTimeGetHandler
   [junit4]   2> 1477688 T2973 oasc.RequestHandlers.initHandlersFromConfig adding lazy requestHandler: solr.ReplicationHandler
   [junit4]   2> 1477687 T3001 oasup.UpdateRequestProcessorChain.init inserting DistributedUpdateProcessorFactory into updateRequestProcessorChain "dedupe"
   [junit4]   2> 1477688 T2973 oasc.RequestHandlers.initHandlersFromConfig created /replication: solr.ReplicationHandler
   [junit4]   2> 1477688 T2987 oasup.UpdateRequestProcessorChain.init inserting DistributedUpdateProcessorFactory into updateRequestProcessorChain "distrib-dup-test-chain-implicit"
   [junit4]   2> 1477689 T2973 oasc.RequestHandlers.initHandlersFromConfig created /update: solr.UpdateRequestHandler
   [junit4]   2> 1477690 T2987 oasc.RequestHandlers.initHandlersFromConfig created standard: solr.StandardRequestHandler
   [junit4]   2> 1477688 T3001 oasup.UpdateRequestProcessorChain.init inserting DistributedUpdateProcessorFactory into updateRequestProcessorChain "stored_sig"
   [junit4]   2> 1477690 T2973 oasc.RequestHandlers.initHandlersFromConfig created /admin/: org.apache.solr.handler.admin.AdminHandlers
   [junit4]   2> 1477690 T2941 oasup.UpdateRequestProcessorChain.init inserting DistributedUpdateProcessorFactory into updateRequestProcessorChain "dedupe"
   [junit4]   2> 1477691 T3001 oasup.UpdateRequestProcessorChain.init inserting DistributedUpdateProcessorFactory into updateRequestProcessorChain "distrib-dup-test-chain-implicit"
   [junit4]   2> 1477691 T2987 oasc.RequestHandlers.initHandlersFromConfig created /get: solr.RealTimeGetHandler
   [junit4]   2> 1477692 T2941 oasup.UpdateRequestProcessorChain.init inserting DistributedUpdateProcessorFactory into updateRequestProcessorChain "stored_sig"
   [junit4]   2> 1477693 T3001 oasc.RequestHandlers.initHandlersFromConfig created standard: solr.StandardRequestHandler
   [junit4]   2> 1477693 T2987 oasc.RequestHandlers.initHandlersFromConfig adding lazy requestHandler: solr.ReplicationHandler
   [junit4]   2> 1477694 T3001 oasc.RequestHandlers.initHandlersFromConfig created /get: solr.RealTimeGetHandler
   [junit4]   2> 1477694 T2987 oasc.RequestHandlers.initHandlersFromConfig created /replication: solr.ReplicationHandler
   [junit4]   2> 1477694 T2941 oasup.UpdateRequestProcessorChain.init inserting DistributedUpdateProcessorFactory into updateRequestProcessorChain "distrib-dup-test-chain-implicit"
   [junit4]   2> 1477695 T2987 oasc.RequestHandlers.initHandlersFromConfig created /update: solr.UpdateRequestHandler
   [junit4]   2> 1477696 T2941 oasc.RequestHandlers.initHandlersFromConfig created standard: solr.StandardRequestHandler
   [junit4]   2> 1477694 T3001 oasc.RequestHandlers.initHandlersFromConfig adding lazy requestHandler: solr.ReplicationHandler
   [junit4]   2> 1477696 T2941 oasc.RequestHandlers.initHandlersFromConfig created /get: solr.RealTimeGetHandler
   [junit4]   2> 1477697 T2941 oasc.RequestHandlers.initHandlersFromConfig adding lazy requestHandler: solr.ReplicationHandler
   [junit4]   2> 1477696 T2987 oasc.RequestHandlers.initHandlersFromConfig created /admin/: org.apache.solr.handler.admin.AdminHandlers
   [junit4]   2> 1477697 T2941 oasc.RequestHandlers.initHandlersFromConfig created /replication: solr.ReplicationHandler
   [junit4]   2> 1477697 T3001 oasc.RequestHandlers.initHandlersFromConfig created /replication: solr.ReplicationHandler
   [junit4]   2> 1477698 T2941 oasc.RequestHandlers.initHandlersFromConfig created /update: solr.UpdateRequestHandler
   [junit4]   2> 1477699 T3001 oasc.RequestHandlers.initHandlersFromConfig created /update: solr.UpdateRequestHandler
   [junit4]   2> 1477699 T2941 oasc.RequestHandlers.initHandlersFromConfig created /admin/: org.apache.solr.handler.admin.AdminHandlers
   [junit4]   2> 1477700 T3001 oasc.RequestHandlers.initHandlersFromConfig created /admin/: org.apache.solr.handler.admin.AdminHandlers
   [junit4]   2> 1477705 T2973 oashl.XMLLoader.init xsltCacheLifetimeSeconds=60
   [junit4]   2> 1477705 T2941 oashl.XMLLoader.init xsltCacheLifetimeSeconds=60
   [junit4]   2> 1477705 T3001 oashl.XMLLoader.init xsltCacheLifetimeSeconds=60
   [junit4]   2> 1477705 T2987 oashl.XMLLoader.init xsltCacheLifetimeSeconds=60
   [junit4]   2> 1477716 T3001 oass.SolrIndexSearcher.<init> Opening Searcher@4b9157f0 main
   [junit4]   2> 1477717 T2987 oass.SolrIndexSearcher.<init> Opening Searcher@461db13b main
   [junit4]   2> 1477717 T2941 oass.SolrIndexSearcher.<init> Opening Searcher@3ca76aa1 main
   [junit4]   2> 1477717 T2973 oass.SolrIndexSearcher.<init> Opening Searcher@1e50cdb9 main
   [junit4]   2> 1477718 T3001 oasu.CommitTracker.<init> Hard AutoCommit: disabled
   [junit4]   2> 1477719 T3001 oasu.CommitTracker.<init> Soft AutoCommit: disabled
   [junit4]   2> 1477719 T2987 oasu.CommitTracker.<init> Hard AutoCommit: disabled
   [junit4]   2> 1477720 T2973 oasu.CommitTracker.<init> Hard AutoCommit: disabled
   [junit4]   2> 1477720 T2987 oasu.CommitTracker.<init> Soft AutoCommit: disabled
   [junit4]   2> 1477720 T2941 oasu.CommitTracker.<init> Hard AutoCommit: disabled
   [junit4]   2> 1477720 T2973 oasu.CommitTracker.<init> Soft AutoCommit: disabled
   [junit4]   2> 1477721 T2941 oasu.CommitTracker.<init> Soft AutoCommit: disabled
   [junit4]   2> 1477724 T3017 oasc.SolrCore.registerSearcher [nodes_used_collection_shard1_replica2] Registered new searcher Searcher@4b9157f0 main{StandardDirectoryReader(segments_1:1)}
   [junit4]   2> 1477725 T3020 oasc.SolrCore.registerSearcher [nodes_used_collection_shard2_replica2] Registered new searcher Searcher@461db13b main{StandardDirectoryReader(segments_1:1)}
   [junit4]   2> 1477725 T3019 oasc.SolrCore.registerSearcher [nodes_used_collection_shard2_replica1] Registered new searcher Searcher@1e50cdb9 main{StandardDirectoryReader(segments_1:1)}
   [junit4]   2> 1477725 T3018 oasc.SolrCore.registerSearcher [nodes_used_collection_shard1_replica1] Registered new searcher Searcher@3ca76aa1 main{StandardDirectoryReader(segments_1:1)}
   [junit4]   2> 1477726 T3001 oasc.CoreContainer.registerCore registering core: nodes_used_collection_shard1_replica2
   [junit4]   2> 1477726 T3001 oasc.ZkController.register Register replica - core:nodes_used_collection_shard1_replica2 address:http://127.0.0.1:16830/_ collection:nodes_used_collection shard:shard1
   [junit4]   2> 1477727 T3001 oascsi.HttpClientUtil.createClient Creating new http client, config:maxConnections=10000&maxConnectionsPerHost=20&connTimeout=15000&socketTimeout=30000&retry=false
   [junit4]   2> 1477727 T2987 oasc.CoreContainer.registerCore registering core: nodes_used_collection_shard2_replica2
   [junit4]   2> 1477728 T2941 oasc.CoreContainer.registerCore registering core: nodes_used_collection_shard1_replica1
   [junit4]   2> 1477727 T2973 oasc.CoreContainer.registerCore registering core: nodes_used_collection_shard2_replica1
   [junit4]   2> 1477728 T2941 oasc.ZkController.register Register replica - core:nodes_used_collection_shard1_replica1 address:http://127.0.0.1:21724/_ collection:nodes_used_collection shard:shard1
   [junit4]   2> 1477728 T2987 oasc.ZkController.register Register replica - core:nodes_used_collection_shard2_replica2 address:http://127.0.0.1:58137/_ collection:nodes_used_collection shard:shard2
   [junit4]   2> 1477729 T2941 oascsi.HttpClientUtil.createClient Creating new http client, config:maxConnections=10000&maxConnectionsPerHost=20&connTimeout=15000&socketTimeout=30000&retry=false
   [junit4]   2> 1477729 T2973 oasc.ZkController.register Register replica - core:nodes_used_collection_shard2_replica1 address:http://127.0.0.1:31876/_ collection:nodes_used_collection shard:shard2
   [junit4]   2> 1477729 T2987 oascsi.HttpClientUtil.createClient Creating new http client, config:maxConnections=10000&maxConnectionsPerHost=20&connTimeout=15000&socketTimeout=30000&retry=false
   [junit4]   2> 1477730 T2973 oascsi.HttpClientUtil.createClient Creating new http client, config:maxConnections=10000&maxConnectionsPerHost=20&connTimeout=15000&socketTimeout=30000&retry=false
   [junit4]   2> 1477755 T3001 oascc.SolrZkClient.makePath makePath: /collections/nodes_used_collection/leader_elect/shard1/election
   [junit4]   2> 1477756 T2973 oascc.SolrZkClient.makePath makePath: /collections/nodes_used_collection/leader_elect/shard2/election
   [junit4]   2> 1477755 T2987 oascc.SolrZkClient.makePath makePath: /collections/nodes_used_collection/leader_elect/shard2/election
   [junit4]   2> 1477755 T2941 oascc.SolrZkClient.makePath makePath: /collections/nodes_used_collection/leader_elect/shard1/election
   [junit4]   2> 1477787 T2987 oasc.ShardLeaderElectionContext.runLeaderProcess Running the leader process for shard shard2
   [junit4]   2> 1477787 T3001 oasc.ShardLeaderElectionContext.runLeaderProcess Running the leader process for shard shard1
   [junit4]   2> 1477798 T2987 oasc.ShardLeaderElectionContext.waitForReplicasToComeUp Enough replicas found to continue.
   [junit4]   2> 1477798 T3001 oasc.ShardLeaderElectionContext.waitForReplicasToComeUp Enough replicas found to continue.
   [junit4]   2> 1477799 T2987 oasc.ShardLeaderElectionContext.runLeaderProcess I may be the new leader - try and sync
   [junit4]   2> 1477799 T3001 oasc.ShardLeaderElectionContext.runLeaderProcess I may be the new leader - try and sync
   [junit4]   2> 1477799 T2987 oasc.SyncStrategy.sync Sync replicas to http://127.0.0.1:58137/_/nodes_used_collection_shard2_replica2/
   [junit4]   2> 1477800 T3001 oasc.SyncStrategy.sync Sync replicas to http://127.0.0.1:16830/_/nodes_used_collection_shard1_replica2/
   [junit4]   2> 1477800 T2987 oasu.PeerSync.sync PeerSync: core=nodes_used_collection_shard2_replica2 url=http://127.0.0.1:58137/_ START replicas=[http://127.0.0.1:31876/_/nodes_used_collection_shard2_replica1/] nUpdates=100
   [junit4]   2> 1477801 T3001 oasu.PeerSync.sync PeerSync: core=nodes_used_collection_shard1_replica2 url=http://127.0.0.1:16830/_ START replicas=[http://127.0.0.1:21724/_/nodes_used_collection_shard1_replica1/] nUpdates=100
   [junit4]   2> 1477801 T2987 oasu.PeerSync.sync PeerSync: core=nodes_used_collection_shard2_replica2 url=http://127.0.0.1:58137/_ DONE.  We have no versions.  sync failed.
   [junit4]   2> 1477802 T2987 oasc.SyncStrategy.syncReplicas Leader's attempt to sync with shard failed, moving to the next candidate
   [junit4]   2> 1477802 T3001 oasu.PeerSync.sync PeerSync: core=nodes_used_collection_shard1_replica2 url=http://127.0.0.1:16830/_ DONE.  We hav

[...truncated too long message...]

ctionsAPIDistributedZkTest-jetty4-1375491767384//new_implicit_coll_1_d_replica4/data/index
   [junit4]   2> 1592133 T3260 oasc.Overseer$ClusterStateUpdater.amILeader According to ZK I (id=90144228069867532-127.0.0.1:16830__-n_0000000004) am no longer a leader.
   [junit4]   2> 1592135 T2929 oejsh.ContextHandler.doStop stopped o.e.j.s.ServletContextHandler{/_,null}
   [junit4]   2> 1592191 T2929 oas.SolrTestCaseJ4.tearDown ###Ending testDistribSearch
   [junit4]   2> 1592194 T2929 oasc.ZkTestServer.send4LetterWord connecting to 127.0.0.1:17827 17827
   [junit4]   1> client port:0.0.0.0/0.0.0.0:0
   [junit4]   2> NOTE: reproduce with: ant test  -Dtestcase=CollectionsAPIDistributedZkTest -Dtests.method=testDistribSearch -Dtests.seed=4B790670815C0CCF -Dtests.multiplier=3 -Dtests.slow=true -Dtests.locale=sl_SI -Dtests.timezone=America/Sitka -Dtests.file.encoding=UTF-8
   [junit4] ERROR    126s J0 | CollectionsAPIDistributedZkTest.testDistribSearch <<<
   [junit4]    > Throwable #1: org.apache.solr.client.solrj.SolrServerException: IOException occured when talking to server at: http://127.0.0.1:31876/_
   [junit4]    > 	at __randomizedtesting.SeedInfo.seed([4B790670815C0CCF:CA9F8868F6036CF3]:0)
   [junit4]    > 	at org.apache.solr.client.solrj.impl.HttpSolrServer.request(HttpSolrServer.java:435)
   [junit4]    > 	at org.apache.solr.client.solrj.impl.HttpSolrServer.request(HttpSolrServer.java:180)
   [junit4]    > 	at org.apache.solr.cloud.AbstractFullDistribZkTestBase.createCollection(AbstractFullDistribZkTestBase.java:1535)
   [junit4]    > 	at org.apache.solr.cloud.CollectionsAPIDistributedZkTest.testCustomCollectionsAPI(CollectionsAPIDistributedZkTest.java:677)
   [junit4]    > 	at org.apache.solr.cloud.CollectionsAPIDistributedZkTest.doTest(CollectionsAPIDistributedZkTest.java:159)
   [junit4]    > 	at org.apache.solr.BaseDistributedSearchTestCase.testDistribSearch(BaseDistributedSearchTestCase.java:835)
   [junit4]    > 	at java.lang.Thread.run(Thread.java:679)
   [junit4]    > Caused by: org.apache.http.conn.ConnectTimeoutException: Connect to 127.0.0.1:31876 timed out
   [junit4]    > 	at org.apache.http.conn.scheme.PlainSocketFactory.connectSocket(PlainSocketFactory.java:129)
   [junit4]    > 	at org.apache.http.impl.conn.DefaultClientConnectionOperator.openConnection(DefaultClientConnectionOperator.java:180)
   [junit4]    > 	at org.apache.http.impl.conn.ManagedClientConnectionImpl.open(ManagedClientConnectionImpl.java:294)
   [junit4]    > 	at org.apache.http.impl.client.DefaultRequestDirector.tryConnect(DefaultRequestDirector.java:645)
   [junit4]    > 	at org.apache.http.impl.client.DefaultRequestDirector.execute(DefaultRequestDirector.java:480)
   [junit4]    > 	at org.apache.http.impl.client.AbstractHttpClient.execute(AbstractHttpClient.java:906)
   [junit4]    > 	at org.apache.http.impl.client.AbstractHttpClient.execute(AbstractHttpClient.java:805)
   [junit4]    > 	at org.apache.http.impl.client.AbstractHttpClient.execute(AbstractHttpClient.java:784)
   [junit4]    > 	at org.apache.solr.client.solrj.impl.HttpSolrServer.request(HttpSolrServer.java:365)
   [junit4]    > 	... 45 more
   [junit4]   2> 1592397 T2929 oas.SolrTestCaseJ4.deleteCore ###deleteCore
   [junit4]   2> 126320 T2928 ccr.ThreadLeakControl.checkThreadLeaks WARNING Will linger awaiting termination of 2 leaked thread(s).
   [junit4]   2> 1593435 T3011 oasc.LeaderElector$1.process WARN  org.apache.zookeeper.KeeperException$SessionExpiredException: KeeperErrorCode = Session expired for /collections/new_implicit_coll_1/leader_elect/a/election
   [junit4]   2> 	at org.apache.zookeeper.KeeperException.create(KeeperException.java:127)
   [junit4]   2> 	at org.apache.zookeeper.KeeperException.create(KeeperException.java:51)
   [junit4]   2> 	at org.apache.zookeeper.ZooKeeper.getChildren(ZooKeeper.java:1468)
   [junit4]   2> 	at org.apache.solr.common.cloud.SolrZkClient$6.execute(SolrZkClient.java:235)
   [junit4]   2> 	at org.apache.solr.common.cloud.SolrZkClient$6.execute(SolrZkClient.java:232)
   [junit4]   2> 	at org.apache.solr.common.cloud.ZkCmdExecutor.retryOperation(ZkCmdExecutor.java:65)
   [junit4]   2> 	at org.apache.solr.common.cloud.SolrZkClient.getChildren(SolrZkClient.java:232)
   [junit4]   2> 	at org.apache.solr.cloud.LeaderElector.checkIfIamLeader(LeaderElector.java:84)
   [junit4]   2> 	at org.apache.solr.cloud.LeaderElector.access$000(LeaderElector.java:55)
   [junit4]   2> 	at org.apache.solr.cloud.LeaderElector$1.process(LeaderElector.java:129)
   [junit4]   2> 	at org.apache.zookeeper.ClientCnxn$EventThread.processEvent(ClientCnxn.java:519)
   [junit4]   2> 	at org.apache.zookeeper.ClientCnxn$EventThread.run(ClientCnxn.java:495)
   [junit4]   2> 
   [junit4]   2> 1593435 T3011 oasc.LeaderElector$1.process WARN  org.apache.zookeeper.KeeperException$SessionExpiredException: KeeperErrorCode = Session expired for /collections/new_implicit_coll_1/leader_elect/d/election
   [junit4]   2> 	at org.apache.zookeeper.KeeperException.create(KeeperException.java:127)
   [junit4]   2> 	at org.apache.zookeeper.KeeperException.create(KeeperException.java:51)
   [junit4]   2> 	at org.apache.zookeeper.ZooKeeper.getChildren(ZooKeeper.java:1468)
   [junit4]   2> 	at org.apache.solr.common.cloud.SolrZkClient$6.execute(SolrZkClient.java:235)
   [junit4]   2> 	at org.apache.solr.common.cloud.SolrZkClient$6.execute(SolrZkClient.java:232)
   [junit4]   2> 	at org.apache.solr.common.cloud.ZkCmdExecutor.retryOperation(ZkCmdExecutor.java:65)
   [junit4]   2> 	at org.apache.solr.common.cloud.SolrZkClient.getChildren(SolrZkClient.java:232)
   [junit4]   2> 	at org.apache.solr.cloud.LeaderElector.checkIfIamLeader(LeaderElector.java:84)
   [junit4]   2> 	at org.apache.solr.cloud.LeaderElector.access$000(LeaderElector.java:55)
   [junit4]   2> 	at org.apache.solr.cloud.LeaderElector$1.process(LeaderElector.java:129)
   [junit4]   2> 	at org.apache.zookeeper.ClientCnxn$EventThread.processEvent(ClientCnxn.java:519)
   [junit4]   2> 	at org.apache.zookeeper.ClientCnxn$EventThread.run(ClientCnxn.java:495)
   [junit4]   2> 
   [junit4]   2> 1593436 T3011 oascc.ZkStateReader$3.process WARN ZooKeeper watch triggered, but Solr cannot talk to ZK
   [junit4]   2> 1593436 T3011 oascc.ZkStateReader$2.process A cluster state change: WatchedEvent state:SyncConnected type:NodeChildrenChanged path:/live_nodes, has occurred - updating... (live nodes size: 1)
   [junit4]   2> 1593436 T3011 oascc.ZkStateReader$2.process WARN ZooKeeper watch triggered, but Solr cannot talk to ZK
   [junit4]   2> NOTE: test params are: codec=Asserting, sim=RandomSimilarityProvider(queryNorm=false,coord=yes): {}, locale=sl_SI, timezone=America/Sitka
   [junit4]   2> NOTE: FreeBSD 9.1-RELEASE-p3 amd64/Sun Microsystems Inc. 1.6.0_32 (64-bit)/cpus=16,threads=5,free=175474816,total=462422016
   [junit4]   2> NOTE: All tests run in this JVM: [BinaryUpdateRequestHandlerTest, TestRealTimeGet, TestWriterPerf, TestLRUCache, HdfsBasicDistributedZkTest, StressHdfsTest, CSVRequestHandlerTest, OverseerTest, SpellingQueryConverterTest, SolrInfoMBeanTest, SolrTestCaseJ4Test, TestFaceting, TestStressRecovery, TestShardHandlerFactory, TestPluginEnable, TestSolrXmlPersistence, DocValuesTest, FieldMutatingUpdateProcessorTest, TestFieldResource, TestSweetSpotSimilarityFactory, DistributedQueryElevationComponentTest, TestFuzzyAnalyzedSuggestions, LeaderElectionTest, TestPHPSerializedResponseWriter, AutoCommitTest, TestBadConfig, TestDefaultSearchFieldResource, DateFieldTest, TestSolrQueryParserDefaultOperatorResource, BlockDirectoryTest, QueryElevationComponentTest, TestTrie, SyncSliceTest, TestRandomDVFaceting, TestGroupingSearch, TestLFUCache, DistributedTermsComponentTest, LegacyHTMLStripCharFilterTest, ResponseLogComponentTest, TestLMDirichletSimilarityFactory, TestFieldTypeResource, ParsingFieldUpdateProcessorsTest, TestSolrDeletionPolicy1, AliasIntegrationTest, QueryParsingTest, ZkControllerTest, MinimalSchemaTest, TestCoreContainer, TestFieldTypeCollectionResource, SuggesterTest, TestXIncludeConfig, SuggesterFSTTest, AddSchemaFieldsUpdateProcessorFactoryTest, MoreLikeThisHandlerTest, TestSolrXml, BadComponentTest, PreAnalyzedFieldTest, IndexSchemaTest, WordBreakSolrSpellCheckerTest, CacheHeaderTest, TestSolrIndexConfig, TestIBSimilarityFactory, TestSolrCoreProperties, SliceStateUpdateTest, SOLR749Test, TestCloudManagedSchemaAddField, ResourceLoaderTest, ShardRoutingTest, ReturnFieldsTest, PrimitiveFieldTypeTest, TestPseudoReturnFields, RecoveryZkTest, PolyFieldTest, UUIDFieldTest, BasicFunctionalityTest, JsonLoaderTest, UnloadDistributedZkTest, CollectionsAPIDistributedZkTest]
   [junit4] Completed on J0 in 127.61s, 1 test, 1 error <<< FAILURES!

[...truncated 483 lines...]
BUILD FAILED
/usr/home/hudson/hudson-slave/workspace/Lucene-Solr-Tests-4.x-Java6/build.xml:395: The following error occurred while executing this line:
/usr/home/hudson/hudson-slave/workspace/Lucene-Solr-Tests-4.x-Java6/build.xml:375: The following error occurred while executing this line:
/usr/home/hudson/hudson-slave/workspace/Lucene-Solr-Tests-4.x-Java6/build.xml:39: The following error occurred while executing this line:
/usr/home/hudson/hudson-slave/workspace/Lucene-Solr-Tests-4.x-Java6/solr/build.xml:181: The following error occurred while executing this line:
/usr/home/hudson/hudson-slave/workspace/Lucene-Solr-Tests-4.x-Java6/solr/common-build.xml:449: The following error occurred while executing this line:
/usr/home/hudson/hudson-slave/workspace/Lucene-Solr-Tests-4.x-Java6/lucene/common-build.xml:1233: The following error occurred while executing this line:
/usr/home/hudson/hudson-slave/workspace/Lucene-Solr-Tests-4.x-Java6/lucene/common-build.xml:876: There were test failures: 321 suites, 1352 tests, 1 error, 34 ignored (6 assumptions)

Total time: 60 minutes 7 seconds
Build step 'Invoke Ant' marked build as failure
Archiving artifacts
Recording test results
Email was triggered for: Failure
Sending email for trigger: Failure



Mime
View raw message