lucene-dev mailing list archives

Site index · List index
Message view « Date » · « Thread »
Top « Date » · « Thread »
From Policeman Jenkins Server <jenk...@thetaphi.de>
Subject [JENKINS] Lucene-Solr-trunk-Linux (32bit/jdk1.7.0_25) - Build # 6837 - Still Failing!
Date Fri, 02 Aug 2013 01:57:30 GMT
Build: http://jenkins.thetaphi.de/job/Lucene-Solr-trunk-Linux/6837/
Java: 32bit/jdk1.7.0_25 -server -XX:+UseG1GC

1 tests failed.
FAILED:  org.apache.solr.cloud.CollectionsAPIDistributedZkTest.testDistribSearch

Error Message:
Server refused connection at: http://127.0.0.1:51253/z_

Stack Trace:
org.apache.solr.client.solrj.SolrServerException: Server refused connection at: http://127.0.0.1:51253/z_
	at __randomizedtesting.SeedInfo.seed([F0BFB9BAAA1AA4C6:715937A2DD45C4FA]:0)
	at org.apache.solr.client.solrj.impl.HttpSolrServer.request(HttpSolrServer.java:428)
	at org.apache.solr.client.solrj.impl.HttpSolrServer.request(HttpSolrServer.java:180)
	at org.apache.solr.cloud.AbstractFullDistribZkTestBase.createCollection(AbstractFullDistribZkTestBase.java:1535)
	at org.apache.solr.cloud.CollectionsAPIDistributedZkTest.testCustomCollectionsAPI(CollectionsAPIDistributedZkTest.java:677)
	at org.apache.solr.cloud.CollectionsAPIDistributedZkTest.doTest(CollectionsAPIDistributedZkTest.java:159)
	at org.apache.solr.BaseDistributedSearchTestCase.testDistribSearch(BaseDistributedSearchTestCase.java:835)
	at sun.reflect.NativeMethodAccessorImpl.invoke0(Native Method)
	at sun.reflect.NativeMethodAccessorImpl.invoke(NativeMethodAccessorImpl.java:57)
	at sun.reflect.DelegatingMethodAccessorImpl.invoke(DelegatingMethodAccessorImpl.java:43)
	at java.lang.reflect.Method.invoke(Method.java:606)
	at com.carrotsearch.randomizedtesting.RandomizedRunner.invoke(RandomizedRunner.java:1559)
	at com.carrotsearch.randomizedtesting.RandomizedRunner.access$600(RandomizedRunner.java:79)
	at com.carrotsearch.randomizedtesting.RandomizedRunner$6.evaluate(RandomizedRunner.java:737)
	at com.carrotsearch.randomizedtesting.RandomizedRunner$7.evaluate(RandomizedRunner.java:773)
	at com.carrotsearch.randomizedtesting.RandomizedRunner$8.evaluate(RandomizedRunner.java:787)
	at com.carrotsearch.randomizedtesting.rules.SystemPropertiesRestoreRule$1.evaluate(SystemPropertiesRestoreRule.java:53)
	at org.apache.lucene.util.TestRuleSetupTeardownChained$1.evaluate(TestRuleSetupTeardownChained.java:50)
	at org.apache.lucene.util.TestRuleFieldCacheSanity$1.evaluate(TestRuleFieldCacheSanity.java:51)
	at org.apache.lucene.util.AbstractBeforeAfterRule$1.evaluate(AbstractBeforeAfterRule.java:46)
	at com.carrotsearch.randomizedtesting.rules.SystemPropertiesInvariantRule$1.evaluate(SystemPropertiesInvariantRule.java:55)
	at org.apache.lucene.util.TestRuleThreadAndTestName$1.evaluate(TestRuleThreadAndTestName.java:49)
	at org.apache.lucene.util.TestRuleIgnoreAfterMaxFailures$1.evaluate(TestRuleIgnoreAfterMaxFailures.java:70)
	at org.apache.lucene.util.TestRuleMarkFailure$1.evaluate(TestRuleMarkFailure.java:48)
	at com.carrotsearch.randomizedtesting.rules.StatementAdapter.evaluate(StatementAdapter.java:36)
	at com.carrotsearch.randomizedtesting.ThreadLeakControl$StatementRunner.run(ThreadLeakControl.java:358)
	at com.carrotsearch.randomizedtesting.ThreadLeakControl.forkTimeoutingTask(ThreadLeakControl.java:782)
	at com.carrotsearch.randomizedtesting.ThreadLeakControl$3.evaluate(ThreadLeakControl.java:442)
	at com.carrotsearch.randomizedtesting.RandomizedRunner.runSingleTest(RandomizedRunner.java:746)
	at com.carrotsearch.randomizedtesting.RandomizedRunner$3.evaluate(RandomizedRunner.java:648)
	at com.carrotsearch.randomizedtesting.RandomizedRunner$4.evaluate(RandomizedRunner.java:682)
	at com.carrotsearch.randomizedtesting.RandomizedRunner$5.evaluate(RandomizedRunner.java:693)
	at com.carrotsearch.randomizedtesting.rules.StatementAdapter.evaluate(StatementAdapter.java:36)
	at com.carrotsearch.randomizedtesting.rules.SystemPropertiesRestoreRule$1.evaluate(SystemPropertiesRestoreRule.java:53)
	at org.apache.lucene.util.AbstractBeforeAfterRule$1.evaluate(AbstractBeforeAfterRule.java:46)
	at org.apache.lucene.util.TestRuleStoreClassName$1.evaluate(TestRuleStoreClassName.java:42)
	at com.carrotsearch.randomizedtesting.rules.SystemPropertiesInvariantRule$1.evaluate(SystemPropertiesInvariantRule.java:55)
	at com.carrotsearch.randomizedtesting.rules.NoShadowingOrOverridesOnMethodsRule$1.evaluate(NoShadowingOrOverridesOnMethodsRule.java:39)
	at com.carrotsearch.randomizedtesting.rules.NoShadowingOrOverridesOnMethodsRule$1.evaluate(NoShadowingOrOverridesOnMethodsRule.java:39)
	at com.carrotsearch.randomizedtesting.rules.StatementAdapter.evaluate(StatementAdapter.java:36)
	at org.apache.lucene.util.TestRuleAssertionsRequired$1.evaluate(TestRuleAssertionsRequired.java:43)
	at org.apache.lucene.util.TestRuleMarkFailure$1.evaluate(TestRuleMarkFailure.java:48)
	at org.apache.lucene.util.TestRuleIgnoreAfterMaxFailures$1.evaluate(TestRuleIgnoreAfterMaxFailures.java:70)
	at org.apache.lucene.util.TestRuleIgnoreTestSuites$1.evaluate(TestRuleIgnoreTestSuites.java:55)
	at com.carrotsearch.randomizedtesting.rules.StatementAdapter.evaluate(StatementAdapter.java:36)
	at com.carrotsearch.randomizedtesting.ThreadLeakControl$StatementRunner.run(ThreadLeakControl.java:358)
	at java.lang.Thread.run(Thread.java:724)
Caused by: org.apache.http.conn.HttpHostConnectException: Connection to http://127.0.0.1:51253 refused
	at org.apache.http.impl.conn.DefaultClientConnectionOperator.openConnection(DefaultClientConnectionOperator.java:190)
	at org.apache.http.impl.conn.ManagedClientConnectionImpl.open(ManagedClientConnectionImpl.java:294)
	at org.apache.http.impl.client.DefaultRequestDirector.tryConnect(DefaultRequestDirector.java:645)
	at org.apache.http.impl.client.DefaultRequestDirector.execute(DefaultRequestDirector.java:480)
	at org.apache.http.impl.client.AbstractHttpClient.execute(AbstractHttpClient.java:906)
	at org.apache.http.impl.client.AbstractHttpClient.execute(AbstractHttpClient.java:805)
	at org.apache.http.impl.client.AbstractHttpClient.execute(AbstractHttpClient.java:784)
	at org.apache.solr.client.solrj.impl.HttpSolrServer.request(HttpSolrServer.java:365)
	... 45 more
Caused by: java.net.ConnectException: Connection refused
	at java.net.PlainSocketImpl.socketConnect(Native Method)
	at java.net.AbstractPlainSocketImpl.doConnect(AbstractPlainSocketImpl.java:339)
	at java.net.AbstractPlainSocketImpl.connectToAddress(AbstractPlainSocketImpl.java:200)
	at java.net.AbstractPlainSocketImpl.connect(AbstractPlainSocketImpl.java:182)
	at java.net.SocksSocketImpl.connect(SocksSocketImpl.java:392)
	at java.net.Socket.connect(Socket.java:579)
	at org.apache.http.conn.scheme.PlainSocketFactory.connectSocket(PlainSocketFactory.java:127)
	at org.apache.http.impl.conn.DefaultClientConnectionOperator.openConnection(DefaultClientConnectionOperator.java:180)
	... 52 more




Build Log:
[...truncated 9754 lines...]
   [junit4] Suite: org.apache.solr.cloud.CollectionsAPIDistributedZkTest
   [junit4]   2> 615594 T2177 oas.BaseDistributedSearchTestCase.initHostContext Setting hostContext system property: /z_/
   [junit4]   2> 615601 T2177 oas.SolrTestCaseJ4.setUp ###Starting testDistribSearch
   [junit4]   2> Creating dataDir: /mnt/ssd/jenkins/workspace/Lucene-Solr-trunk-Linux/solr/build/solr-core/test/J1/./solrtest-CollectionsAPIDistributedZkTest-1375407925205
   [junit4]   2> 615601 T2177 oasc.ZkTestServer.run STARTING ZK TEST SERVER
   [junit4]   2> 615602 T2178 oasc.ZkTestServer$ZKServerMain.runFromConfig Starting server
   [junit4]   2> 615702 T2177 oasc.ZkTestServer.run start zk server on port:39909
   [junit4]   2> 615703 T2177 oascc.ConnectionManager.waitForConnected Waiting for client to connect to ZooKeeper
   [junit4]   2> 615823 T2184 oascc.ConnectionManager.process Watcher org.apache.solr.common.cloud.ConnectionManager@f3a86 name:ZooKeeperConnection Watcher:127.0.0.1:39909 got event WatchedEvent state:SyncConnected type:None path:null path:null type:None
   [junit4]   2> 615824 T2177 oascc.ConnectionManager.waitForConnected Client is connected to ZooKeeper
   [junit4]   2> 615824 T2177 oascc.SolrZkClient.makePath makePath: /solr
   [junit4]   2> 615828 T2177 oascc.ConnectionManager.waitForConnected Waiting for client to connect to ZooKeeper
   [junit4]   2> 615829 T2186 oascc.ConnectionManager.process Watcher org.apache.solr.common.cloud.ConnectionManager@1811bc2 name:ZooKeeperConnection Watcher:127.0.0.1:39909/solr got event WatchedEvent state:SyncConnected type:None path:null path:null type:None
   [junit4]   2> 615830 T2177 oascc.ConnectionManager.waitForConnected Client is connected to ZooKeeper
   [junit4]   2> 615830 T2177 oascc.SolrZkClient.makePath makePath: /collections/collection1
   [junit4]   2> 615833 T2177 oascc.SolrZkClient.makePath makePath: /collections/collection1/shards
   [junit4]   2> 615835 T2177 oascc.SolrZkClient.makePath makePath: /collections/control_collection
   [junit4]   2> 615836 T2177 oascc.SolrZkClient.makePath makePath: /collections/control_collection/shards
   [junit4]   2> 615838 T2177 oasc.AbstractZkTestCase.putConfig put /mnt/ssd/jenkins/workspace/Lucene-Solr-trunk-Linux/solr/build/solr-core/test-files/solr/collection1/conf/solrconfig-tlog.xml to /configs/conf1/solrconfig.xml
   [junit4]   2> 615839 T2177 oascc.SolrZkClient.makePath makePath: /configs/conf1/solrconfig.xml
   [junit4]   2> 615842 T2177 oasc.AbstractZkTestCase.putConfig put /mnt/ssd/jenkins/workspace/Lucene-Solr-trunk-Linux/solr/build/solr-core/test-files/solr/collection1/conf/schema.xml to /configs/conf1/schema.xml
   [junit4]   2> 615843 T2177 oascc.SolrZkClient.makePath makePath: /configs/conf1/schema.xml
   [junit4]   2> 615845 T2177 oasc.AbstractZkTestCase.putConfig put /mnt/ssd/jenkins/workspace/Lucene-Solr-trunk-Linux/solr/build/solr-core/test-files/solr/collection1/conf/stopwords.txt to /configs/conf1/stopwords.txt
   [junit4]   2> 615846 T2177 oascc.SolrZkClient.makePath makePath: /configs/conf1/stopwords.txt
   [junit4]   2> 615848 T2177 oasc.AbstractZkTestCase.putConfig put /mnt/ssd/jenkins/workspace/Lucene-Solr-trunk-Linux/solr/build/solr-core/test-files/solr/collection1/conf/protwords.txt to /configs/conf1/protwords.txt
   [junit4]   2> 615849 T2177 oascc.SolrZkClient.makePath makePath: /configs/conf1/protwords.txt
   [junit4]   2> 615851 T2177 oasc.AbstractZkTestCase.putConfig put /mnt/ssd/jenkins/workspace/Lucene-Solr-trunk-Linux/solr/build/solr-core/test-files/solr/collection1/conf/currency.xml to /configs/conf1/currency.xml
   [junit4]   2> 615851 T2177 oascc.SolrZkClient.makePath makePath: /configs/conf1/currency.xml
   [junit4]   2> 615854 T2177 oasc.AbstractZkTestCase.putConfig put /mnt/ssd/jenkins/workspace/Lucene-Solr-trunk-Linux/solr/build/solr-core/test-files/solr/collection1/conf/open-exchange-rates.json to /configs/conf1/open-exchange-rates.json
   [junit4]   2> 615854 T2177 oascc.SolrZkClient.makePath makePath: /configs/conf1/open-exchange-rates.json
   [junit4]   2> 615859 T2177 oasc.AbstractZkTestCase.putConfig put /mnt/ssd/jenkins/workspace/Lucene-Solr-trunk-Linux/solr/build/solr-core/test-files/solr/collection1/conf/mapping-ISOLatin1Accent.txt to /configs/conf1/mapping-ISOLatin1Accent.txt
   [junit4]   2> 615860 T2177 oascc.SolrZkClient.makePath makePath: /configs/conf1/mapping-ISOLatin1Accent.txt
   [junit4]   2> 615863 T2177 oasc.AbstractZkTestCase.putConfig put /mnt/ssd/jenkins/workspace/Lucene-Solr-trunk-Linux/solr/build/solr-core/test-files/solr/collection1/conf/old_synonyms.txt to /configs/conf1/old_synonyms.txt
   [junit4]   2> 615863 T2177 oascc.SolrZkClient.makePath makePath: /configs/conf1/old_synonyms.txt
   [junit4]   2> 615866 T2177 oasc.AbstractZkTestCase.putConfig put /mnt/ssd/jenkins/workspace/Lucene-Solr-trunk-Linux/solr/build/solr-core/test-files/solr/collection1/conf/synonyms.txt to /configs/conf1/synonyms.txt
   [junit4]   2> 615866 T2177 oascc.SolrZkClient.makePath makePath: /configs/conf1/synonyms.txt
   [junit4]   2> 615970 T2177 oejs.Server.doStart jetty-8.1.10.v20130312
   [junit4]   2> 615973 T2177 oejs.AbstractConnector.doStart Started SelectChannelConnector@127.0.0.1:42434
   [junit4]   2> 615974 T2177 oass.SolrDispatchFilter.init SolrDispatchFilter.init()
   [junit4]   2> 615975 T2177 oasc.SolrResourceLoader.locateSolrHome JNDI not configured for solr (NoInitialContextEx)
   [junit4]   2> 615975 T2177 oasc.SolrResourceLoader.locateSolrHome using system property solr.solr.home: /mnt/ssd/jenkins/workspace/Lucene-Solr-trunk-Linux/solr/build/solr-core/test/J1/./org.apache.solr.cloud.CollectionsAPIDistributedZkTest-controljetty-1375407925474
   [junit4]   2> 615975 T2177 oasc.SolrResourceLoader.<init> new SolrResourceLoader for directory: '/mnt/ssd/jenkins/workspace/Lucene-Solr-trunk-Linux/solr/build/solr-core/test/J1/./org.apache.solr.cloud.CollectionsAPIDistributedZkTest-controljetty-1375407925474/'
   [junit4]   2> 615992 T2177 oasc.ConfigSolr.fromFile Loading container configuration from /mnt/ssd/jenkins/workspace/Lucene-Solr-trunk-Linux/solr/build/solr-core/test/J1/./org.apache.solr.cloud.CollectionsAPIDistributedZkTest-controljetty-1375407925474/solr.xml
   [junit4]   2> 616042 T2177 oasc.ConfigSolrXml.<init> Config-defined core root directory: 
   [junit4]   2> 616043 T2177 oasc.CoreContainer.<init> New CoreContainer 17749651
   [junit4]   2> 616044 T2177 oasc.CoreContainer.load Loading cores into CoreContainer [instanceDir=/mnt/ssd/jenkins/workspace/Lucene-Solr-trunk-Linux/solr/build/solr-core/test/J1/./org.apache.solr.cloud.CollectionsAPIDistributedZkTest-controljetty-1375407925474/]
   [junit4]   2> 616045 T2177 oashc.HttpShardHandlerFactory.getParameter Setting socketTimeout to: 120000
   [junit4]   2> 616046 T2177 oashc.HttpShardHandlerFactory.getParameter Setting urlScheme to: http://
   [junit4]   2> 616046 T2177 oashc.HttpShardHandlerFactory.getParameter Setting connTimeout to: 15000
   [junit4]   2> 616047 T2177 oashc.HttpShardHandlerFactory.getParameter Setting maxConnectionsPerHost to: 20
   [junit4]   2> 616047 T2177 oashc.HttpShardHandlerFactory.getParameter Setting corePoolSize to: 0
   [junit4]   2> 616048 T2177 oashc.HttpShardHandlerFactory.getParameter Setting maximumPoolSize to: 2147483647
   [junit4]   2> 616048 T2177 oashc.HttpShardHandlerFactory.getParameter Setting maxThreadIdleTime to: 5
   [junit4]   2> 616048 T2177 oashc.HttpShardHandlerFactory.getParameter Setting sizeOfQueue to: -1
   [junit4]   2> 616049 T2177 oashc.HttpShardHandlerFactory.getParameter Setting fairnessPolicy to: false
   [junit4]   2> 616049 T2177 oascsi.HttpClientUtil.createClient Creating new http client, config:maxConnectionsPerHost=20&maxConnections=10000&socketTimeout=120000&connTimeout=15000&retry=false
   [junit4]   2> 616054 T2177 oasc.ZkContainer.initZooKeeper Zookeeper client=127.0.0.1:39909/solr
   [junit4]   2> 616055 T2177 oasc.ZkController.checkChrootPath zkHost includes chroot
   [junit4]   2> 616056 T2177 oascc.ConnectionManager.waitForConnected Waiting for client to connect to ZooKeeper
   [junit4]   2> 616057 T2197 oascc.ConnectionManager.process Watcher org.apache.solr.common.cloud.ConnectionManager@1f0a7cd name:ZooKeeperConnection Watcher:127.0.0.1:39909 got event WatchedEvent state:SyncConnected type:None path:null path:null type:None
   [junit4]   2> 616058 T2177 oascc.ConnectionManager.waitForConnected Client is connected to ZooKeeper
   [junit4]   2> 616069 T2177 oascsi.HttpClientUtil.createClient Creating new http client, config:maxConnections=500&maxConnectionsPerHost=16&socketTimeout=120000&connTimeout=15000
   [junit4]   2> 616073 T2177 oascc.ConnectionManager.waitForConnected Waiting for client to connect to ZooKeeper
   [junit4]   2> 616075 T2199 oascc.ConnectionManager.process Watcher org.apache.solr.common.cloud.ConnectionManager@9f610a name:ZooKeeperConnection Watcher:127.0.0.1:39909/solr got event WatchedEvent state:SyncConnected type:None path:null path:null type:None
   [junit4]   2> 616075 T2177 oascc.ConnectionManager.waitForConnected Client is connected to ZooKeeper
   [junit4]   2> 616077 T2177 oascc.SolrZkClient.makePath makePath: /overseer/queue
   [junit4]   2> 616080 T2177 oascc.SolrZkClient.makePath makePath: /overseer/collection-queue-work
   [junit4]   2> 616082 T2177 oascc.SolrZkClient.makePath makePath: /live_nodes
   [junit4]   2> 616084 T2177 oasc.ZkController.createEphemeralLiveNode Register node as live in ZooKeeper:/live_nodes/127.0.0.1:42434_z_
   [junit4]   2> 616085 T2177 oascc.SolrZkClient.makePath makePath: /live_nodes/127.0.0.1:42434_z_
   [junit4]   2> 616088 T2177 oascc.SolrZkClient.makePath makePath: /overseer_elect/election
   [junit4]   2> 616092 T2177 oascc.SolrZkClient.makePath makePath: /overseer_elect/leader
   [junit4]   2> 616095 T2177 oasc.Overseer.start Overseer (id=90138733786431491-127.0.0.1:42434_z_-n_0000000000) starting
   [junit4]   2> 616097 T2177 oascc.SolrZkClient.makePath makePath: /overseer/queue-work
   [junit4]   2> 616101 T2201 oasc.OverseerCollectionProcessor.run Process current queue of collection creations
   [junit4]   2> 616101 T2177 oascc.SolrZkClient.makePath makePath: /clusterstate.json
   [junit4]   2> 616104 T2177 oascc.SolrZkClient.makePath makePath: /aliases.json
   [junit4]   2> 616106 T2177 oascc.ZkStateReader.createClusterStateWatchersAndUpdate Updating cluster state from ZooKeeper... 
   [junit4]   2> 616110 T2200 oasc.Overseer$ClusterStateUpdater.run Starting to work on the main queue
   [junit4]   2> 616112 T2177 oasc.CorePropertiesLocator.discover Looking for core definitions underneath /mnt/ssd/jenkins/workspace/Lucene-Solr-trunk-Linux/solr/build/solr-core/test/J1/./org.apache.solr.cloud.CollectionsAPIDistributedZkTest-controljetty-1375407925474
   [junit4]   2> 616160 T2177 oasc.CorePropertiesLocator.discoverUnder Found core conf in /mnt/ssd/jenkins/workspace/Lucene-Solr-trunk-Linux/solr/build/solr-core/test/J1/./org.apache.solr.cloud.CollectionsAPIDistributedZkTest-controljetty-1375407925474/conf/
   [junit4]   2> 616161 T2177 oasc.CorePropertiesLocator.discover Found 1 core definitions
   [junit4]   2> 616163 T2177 oass.SolrDispatchFilter.init user.dir=/mnt/ssd/jenkins/workspace/Lucene-Solr-trunk-Linux/solr/build/solr-core/test/J1
   [junit4]   2> 616164 T2177 oass.SolrDispatchFilter.init SolrDispatchFilter.init() done
   [junit4]   2> 616164 T2177 oascsi.HttpClientUtil.createClient Creating new http client, config:maxConnections=128&maxConnectionsPerHost=32&followRedirects=false
   [junit4]   2> 616169 T2177 oascsi.HttpClientUtil.createClient Creating new http client, config:
   [junit4]   2> 616172 T2177 oascc.ConnectionManager.waitForConnected Waiting for client to connect to ZooKeeper
   [junit4]   2> 616173 T2204 oascc.ConnectionManager.process Watcher org.apache.solr.common.cloud.ConnectionManager@327d8c name:ZooKeeperConnection Watcher:127.0.0.1:39909/solr got event WatchedEvent state:SyncConnected type:None path:null path:null type:None
   [junit4]   2> 616173 T2177 oascc.ConnectionManager.waitForConnected Client is connected to ZooKeeper
   [junit4]   2> 616175 T2177 oascc.ZkStateReader.createClusterStateWatchersAndUpdate Updating cluster state from ZooKeeper... 
   [junit4]   2> 616179 T2177 oasc.ChaosMonkey.monkeyLog monkey: init - expire sessions:true cause connection loss:true
   [junit4]   2> 616280 T2177 oejs.Server.doStart jetty-8.1.10.v20130312
   [junit4]   2> 616282 T2177 oejs.AbstractConnector.doStart Started SelectChannelConnector@127.0.0.1:47660
   [junit4]   2> 616283 T2177 oass.SolrDispatchFilter.init SolrDispatchFilter.init()
   [junit4]   2> 616284 T2177 oasc.SolrResourceLoader.locateSolrHome JNDI not configured for solr (NoInitialContextEx)
   [junit4]   2> 616284 T2177 oasc.SolrResourceLoader.locateSolrHome using system property solr.solr.home: /mnt/ssd/jenkins/workspace/Lucene-Solr-trunk-Linux/solr/build/solr-core/test/J1/./org.apache.solr.cloud.CollectionsAPIDistributedZkTest-jetty1-1375407925784
   [junit4]   2> 616285 T2177 oasc.SolrResourceLoader.<init> new SolrResourceLoader for directory: '/mnt/ssd/jenkins/workspace/Lucene-Solr-trunk-Linux/solr/build/solr-core/test/J1/./org.apache.solr.cloud.CollectionsAPIDistributedZkTest-jetty1-1375407925784/'
   [junit4]   2> 616302 T2177 oasc.ConfigSolr.fromFile Loading container configuration from /mnt/ssd/jenkins/workspace/Lucene-Solr-trunk-Linux/solr/build/solr-core/test/J1/./org.apache.solr.cloud.CollectionsAPIDistributedZkTest-jetty1-1375407925784/solr.xml
   [junit4]   2> 616352 T2177 oasc.ConfigSolrXml.<init> Config-defined core root directory: 
   [junit4]   2> 616353 T2177 oasc.CoreContainer.<init> New CoreContainer 14821266
   [junit4]   2> 616353 T2177 oasc.CoreContainer.load Loading cores into CoreContainer [instanceDir=/mnt/ssd/jenkins/workspace/Lucene-Solr-trunk-Linux/solr/build/solr-core/test/J1/./org.apache.solr.cloud.CollectionsAPIDistributedZkTest-jetty1-1375407925784/]
   [junit4]   2> 616355 T2177 oashc.HttpShardHandlerFactory.getParameter Setting socketTimeout to: 120000
   [junit4]   2> 616355 T2177 oashc.HttpShardHandlerFactory.getParameter Setting urlScheme to: http://
   [junit4]   2> 616356 T2177 oashc.HttpShardHandlerFactory.getParameter Setting connTimeout to: 15000
   [junit4]   2> 616356 T2177 oashc.HttpShardHandlerFactory.getParameter Setting maxConnectionsPerHost to: 20
   [junit4]   2> 616356 T2177 oashc.HttpShardHandlerFactory.getParameter Setting corePoolSize to: 0
   [junit4]   2> 616357 T2177 oashc.HttpShardHandlerFactory.getParameter Setting maximumPoolSize to: 2147483647
   [junit4]   2> 616357 T2177 oashc.HttpShardHandlerFactory.getParameter Setting maxThreadIdleTime to: 5
   [junit4]   2> 616358 T2177 oashc.HttpShardHandlerFactory.getParameter Setting sizeOfQueue to: -1
   [junit4]   2> 616358 T2177 oashc.HttpShardHandlerFactory.getParameter Setting fairnessPolicy to: false
   [junit4]   2> 616359 T2177 oascsi.HttpClientUtil.createClient Creating new http client, config:maxConnectionsPerHost=20&maxConnections=10000&socketTimeout=120000&connTimeout=15000&retry=false
   [junit4]   2> 616363 T2177 oasc.ZkContainer.initZooKeeper Zookeeper client=127.0.0.1:39909/solr
   [junit4]   2> 616364 T2177 oasc.ZkController.checkChrootPath zkHost includes chroot
   [junit4]   2> 616365 T2177 oascc.ConnectionManager.waitForConnected Waiting for client to connect to ZooKeeper
   [junit4]   2> 616366 T2215 oascc.ConnectionManager.process Watcher org.apache.solr.common.cloud.ConnectionManager@1464516 name:ZooKeeperConnection Watcher:127.0.0.1:39909 got event WatchedEvent state:SyncConnected type:None path:null path:null type:None
   [junit4]   2> 616367 T2177 oascc.ConnectionManager.waitForConnected Client is connected to ZooKeeper
   [junit4]   2> 616368 T2177 oascsi.HttpClientUtil.createClient Creating new http client, config:maxConnections=500&maxConnectionsPerHost=16&socketTimeout=120000&connTimeout=15000
   [junit4]   2> 616374 T2177 oascc.ConnectionManager.waitForConnected Waiting for client to connect to ZooKeeper
   [junit4]   2> 616375 T2217 oascc.ConnectionManager.process Watcher org.apache.solr.common.cloud.ConnectionManager@138ccda name:ZooKeeperConnection Watcher:127.0.0.1:39909/solr got event WatchedEvent state:SyncConnected type:None path:null path:null type:None
   [junit4]   2> 616376 T2177 oascc.ConnectionManager.waitForConnected Client is connected to ZooKeeper
   [junit4]   2> 616379 T2177 oascc.ZkStateReader.createClusterStateWatchersAndUpdate Updating cluster state from ZooKeeper... 
   [junit4]   2> 617382 T2177 oasc.ZkController.createEphemeralLiveNode Register node as live in ZooKeeper:/live_nodes/127.0.0.1:47660_z_
   [junit4]   2> 617383 T2177 oascc.SolrZkClient.makePath makePath: /live_nodes/127.0.0.1:47660_z_
   [junit4]   2> 617387 T2199 oascc.ZkStateReader$3.process Updating live nodes... (2)
   [junit4]   2> 617387 T2204 oascc.ZkStateReader$3.process Updating live nodes... (2)
   [junit4]   2> 617387 T2217 oascc.ZkStateReader$3.process Updating live nodes... (2)
   [junit4]   2> 617392 T2177 oasc.CorePropertiesLocator.discover Looking for core definitions underneath /mnt/ssd/jenkins/workspace/Lucene-Solr-trunk-Linux/solr/build/solr-core/test/J1/./org.apache.solr.cloud.CollectionsAPIDistributedZkTest-jetty1-1375407925784
   [junit4]   2> 617414 T2177 oasc.CorePropertiesLocator.discoverUnder Found core conf in /mnt/ssd/jenkins/workspace/Lucene-Solr-trunk-Linux/solr/build/solr-core/test/J1/./org.apache.solr.cloud.CollectionsAPIDistributedZkTest-jetty1-1375407925784/conf/
   [junit4]   2> 617414 T2177 oasc.CorePropertiesLocator.discover Found 1 core definitions
   [junit4]   2> 617415 T2177 oass.SolrDispatchFilter.init user.dir=/mnt/ssd/jenkins/workspace/Lucene-Solr-trunk-Linux/solr/build/solr-core/test/J1
   [junit4]   2> 617415 T2177 oass.SolrDispatchFilter.init SolrDispatchFilter.init() done
   [junit4]   2> 617416 T2177 oascsi.HttpClientUtil.createClient Creating new http client, config:maxConnections=128&maxConnectionsPerHost=32&followRedirects=false
   [junit4]   2> 617489 T2177 oejs.Server.doStart jetty-8.1.10.v20130312
   [junit4]   2> 617492 T2177 oejs.AbstractConnector.doStart Started SelectChannelConnector@127.0.0.1:51253
   [junit4]   2> 617493 T2177 oass.SolrDispatchFilter.init SolrDispatchFilter.init()
   [junit4]   2> 617493 T2177 oasc.SolrResourceLoader.locateSolrHome JNDI not configured for solr (NoInitialContextEx)
   [junit4]   2> 617494 T2177 oasc.SolrResourceLoader.locateSolrHome using system property solr.solr.home: /mnt/ssd/jenkins/workspace/Lucene-Solr-trunk-Linux/solr/build/solr-core/test/J1/./org.apache.solr.cloud.CollectionsAPIDistributedZkTest-jetty2-1375407927022
   [junit4]   2> 617494 T2177 oasc.SolrResourceLoader.<init> new SolrResourceLoader for directory: '/mnt/ssd/jenkins/workspace/Lucene-Solr-trunk-Linux/solr/build/solr-core/test/J1/./org.apache.solr.cloud.CollectionsAPIDistributedZkTest-jetty2-1375407927022/'
   [junit4]   2> 617510 T2177 oasc.ConfigSolr.fromFile Loading container configuration from /mnt/ssd/jenkins/workspace/Lucene-Solr-trunk-Linux/solr/build/solr-core/test/J1/./org.apache.solr.cloud.CollectionsAPIDistributedZkTest-jetty2-1375407927022/solr.xml
   [junit4]   2> 617551 T2177 oasc.ConfigSolrXml.<init> Config-defined core root directory: 
   [junit4]   2> 617552 T2177 oasc.CoreContainer.<init> New CoreContainer 1919218
   [junit4]   2> 617552 T2177 oasc.CoreContainer.load Loading cores into CoreContainer [instanceDir=/mnt/ssd/jenkins/workspace/Lucene-Solr-trunk-Linux/solr/build/solr-core/test/J1/./org.apache.solr.cloud.CollectionsAPIDistributedZkTest-jetty2-1375407927022/]
   [junit4]   2> 617553 T2177 oashc.HttpShardHandlerFactory.getParameter Setting socketTimeout to: 120000
   [junit4]   2> 617554 T2177 oashc.HttpShardHandlerFactory.getParameter Setting urlScheme to: http://
   [junit4]   2> 617554 T2177 oashc.HttpShardHandlerFactory.getParameter Setting connTimeout to: 15000
   [junit4]   2> 617554 T2177 oashc.HttpShardHandlerFactory.getParameter Setting maxConnectionsPerHost to: 20
   [junit4]   2> 617555 T2177 oashc.HttpShardHandlerFactory.getParameter Setting corePoolSize to: 0
   [junit4]   2> 617555 T2177 oashc.HttpShardHandlerFactory.getParameter Setting maximumPoolSize to: 2147483647
   [junit4]   2> 617555 T2177 oashc.HttpShardHandlerFactory.getParameter Setting maxThreadIdleTime to: 5
   [junit4]   2> 617556 T2177 oashc.HttpShardHandlerFactory.getParameter Setting sizeOfQueue to: -1
   [junit4]   2> 617556 T2177 oashc.HttpShardHandlerFactory.getParameter Setting fairnessPolicy to: false
   [junit4]   2> 617556 T2177 oascsi.HttpClientUtil.createClient Creating new http client, config:maxConnectionsPerHost=20&maxConnections=10000&socketTimeout=120000&connTimeout=15000&retry=false
   [junit4]   2> 617560 T2177 oasc.ZkContainer.initZooKeeper Zookeeper client=127.0.0.1:39909/solr
   [junit4]   2> 617561 T2177 oasc.ZkController.checkChrootPath zkHost includes chroot
   [junit4]   2> 617561 T2177 oascc.ConnectionManager.waitForConnected Waiting for client to connect to ZooKeeper
   [junit4]   2> 617563 T2229 oascc.ConnectionManager.process Watcher org.apache.solr.common.cloud.ConnectionManager@8edcf9 name:ZooKeeperConnection Watcher:127.0.0.1:39909 got event WatchedEvent state:SyncConnected type:None path:null path:null type:None
   [junit4]   2> 617563 T2177 oascc.ConnectionManager.waitForConnected Client is connected to ZooKeeper
   [junit4]   2> 617565 T2177 oascsi.HttpClientUtil.createClient Creating new http client, config:maxConnections=500&maxConnectionsPerHost=16&socketTimeout=120000&connTimeout=15000
   [junit4]   2> 617568 T2177 oascc.ConnectionManager.waitForConnected Waiting for client to connect to ZooKeeper
   [junit4]   2> 617569 T2231 oascc.ConnectionManager.process Watcher org.apache.solr.common.cloud.ConnectionManager@b642e8 name:ZooKeeperConnection Watcher:127.0.0.1:39909/solr got event WatchedEvent state:SyncConnected type:None path:null path:null type:None
   [junit4]   2> 617570 T2177 oascc.ConnectionManager.waitForConnected Client is connected to ZooKeeper
   [junit4]   2> 617574 T2177 oascc.ZkStateReader.createClusterStateWatchersAndUpdate Updating cluster state from ZooKeeper... 
   [junit4]   2> 618576 T2177 oasc.ZkController.createEphemeralLiveNode Register node as live in ZooKeeper:/live_nodes/127.0.0.1:51253_z_
   [junit4]   2> 618577 T2177 oascc.SolrZkClient.makePath makePath: /live_nodes/127.0.0.1:51253_z_
   [junit4]   2> 618580 T2217 oascc.ZkStateReader$3.process Updating live nodes... (3)
   [junit4]   2> 618580 T2199 oascc.ZkStateReader$3.process Updating live nodes... (3)
   [junit4]   2> 618580 T2231 oascc.ZkStateReader$3.process Updating live nodes... (3)
   [junit4]   2> 618580 T2204 oascc.ZkStateReader$3.process Updating live nodes... (3)
   [junit4]   2> 618585 T2177 oasc.CorePropertiesLocator.discover Looking for core definitions underneath /mnt/ssd/jenkins/workspace/Lucene-Solr-trunk-Linux/solr/build/solr-core/test/J1/./org.apache.solr.cloud.CollectionsAPIDistributedZkTest-jetty2-1375407927022
   [junit4]   2> 618606 T2177 oasc.CorePropertiesLocator.discoverUnder Found core conf in /mnt/ssd/jenkins/workspace/Lucene-Solr-trunk-Linux/solr/build/solr-core/test/J1/./org.apache.solr.cloud.CollectionsAPIDistributedZkTest-jetty2-1375407927022/conf/
   [junit4]   2> 618607 T2177 oasc.CorePropertiesLocator.discover Found 1 core definitions
   [junit4]   2> 618608 T2177 oass.SolrDispatchFilter.init user.dir=/mnt/ssd/jenkins/workspace/Lucene-Solr-trunk-Linux/solr/build/solr-core/test/J1
   [junit4]   2> 618608 T2177 oass.SolrDispatchFilter.init SolrDispatchFilter.init() done
   [junit4]   2> 618608 T2177 oascsi.HttpClientUtil.createClient Creating new http client, config:maxConnections=128&maxConnectionsPerHost=32&followRedirects=false
   [junit4]   2> 618671 T2177 oejs.Server.doStart jetty-8.1.10.v20130312
   [junit4]   2> 618673 T2177 oejs.AbstractConnector.doStart Started SelectChannelConnector@127.0.0.1:40305
   [junit4]   2> 618673 T2177 oass.SolrDispatchFilter.init SolrDispatchFilter.init()
   [junit4]   2> 618674 T2177 oasc.SolrResourceLoader.locateSolrHome JNDI not configured for solr (NoInitialContextEx)
   [junit4]   2> 618674 T2177 oasc.SolrResourceLoader.locateSolrHome using system property solr.solr.home: /mnt/ssd/jenkins/workspace/Lucene-Solr-trunk-Linux/solr/build/solr-core/test/J1/./org.apache.solr.cloud.CollectionsAPIDistributedZkTest-jetty3-1375407928215
   [junit4]   2> 618674 T2177 oasc.SolrResourceLoader.<init> new SolrResourceLoader for directory: '/mnt/ssd/jenkins/workspace/Lucene-Solr-trunk-Linux/solr/build/solr-core/test/J1/./org.apache.solr.cloud.CollectionsAPIDistributedZkTest-jetty3-1375407928215/'
   [junit4]   2> 618686 T2177 oasc.ConfigSolr.fromFile Loading container configuration from /mnt/ssd/jenkins/workspace/Lucene-Solr-trunk-Linux/solr/build/solr-core/test/J1/./org.apache.solr.cloud.CollectionsAPIDistributedZkTest-jetty3-1375407928215/solr.xml
   [junit4]   2> 618718 T2177 oasc.ConfigSolrXml.<init> Config-defined core root directory: 
   [junit4]   2> 618719 T2177 oasc.CoreContainer.<init> New CoreContainer 20016129
   [junit4]   2> 618719 T2177 oasc.CoreContainer.load Loading cores into CoreContainer [instanceDir=/mnt/ssd/jenkins/workspace/Lucene-Solr-trunk-Linux/solr/build/solr-core/test/J1/./org.apache.solr.cloud.CollectionsAPIDistributedZkTest-jetty3-1375407928215/]
   [junit4]   2> 618720 T2177 oashc.HttpShardHandlerFactory.getParameter Setting socketTimeout to: 120000
   [junit4]   2> 618720 T2177 oashc.HttpShardHandlerFactory.getParameter Setting urlScheme to: http://
   [junit4]   2> 618721 T2177 oashc.HttpShardHandlerFactory.getParameter Setting connTimeout to: 15000
   [junit4]   2> 618721 T2177 oashc.HttpShardHandlerFactory.getParameter Setting maxConnectionsPerHost to: 20
   [junit4]   2> 618721 T2177 oashc.HttpShardHandlerFactory.getParameter Setting corePoolSize to: 0
   [junit4]   2> 618722 T2177 oashc.HttpShardHandlerFactory.getParameter Setting maximumPoolSize to: 2147483647
   [junit4]   2> 618722 T2177 oashc.HttpShardHandlerFactory.getParameter Setting maxThreadIdleTime to: 5
   [junit4]   2> 618722 T2177 oashc.HttpShardHandlerFactory.getParameter Setting sizeOfQueue to: -1
   [junit4]   2> 618722 T2177 oashc.HttpShardHandlerFactory.getParameter Setting fairnessPolicy to: false
   [junit4]   2> 618723 T2177 oascsi.HttpClientUtil.createClient Creating new http client, config:maxConnectionsPerHost=20&maxConnections=10000&socketTimeout=120000&connTimeout=15000&retry=false
   [junit4]   2> 618726 T2177 oasc.ZkContainer.initZooKeeper Zookeeper client=127.0.0.1:39909/solr
   [junit4]   2> 618726 T2177 oasc.ZkController.checkChrootPath zkHost includes chroot
   [junit4]   2> 618727 T2177 oascc.ConnectionManager.waitForConnected Waiting for client to connect to ZooKeeper
   [junit4]   2> 618728 T2243 oascc.ConnectionManager.process Watcher org.apache.solr.common.cloud.ConnectionManager@1a71706 name:ZooKeeperConnection Watcher:127.0.0.1:39909 got event WatchedEvent state:SyncConnected type:None path:null path:null type:None
   [junit4]   2> 618729 T2177 oascc.ConnectionManager.waitForConnected Client is connected to ZooKeeper
   [junit4]   2> 618730 T2177 oascsi.HttpClientUtil.createClient Creating new http client, config:maxConnections=500&maxConnectionsPerHost=16&socketTimeout=120000&connTimeout=15000
   [junit4]   2> 618733 T2177 oascc.ConnectionManager.waitForConnected Waiting for client to connect to ZooKeeper
   [junit4]   2> 618734 T2245 oascc.ConnectionManager.process Watcher org.apache.solr.common.cloud.ConnectionManager@974f2a name:ZooKeeperConnection Watcher:127.0.0.1:39909/solr got event WatchedEvent state:SyncConnected type:None path:null path:null type:None
   [junit4]   2> 618735 T2177 oascc.ConnectionManager.waitForConnected Client is connected to ZooKeeper
   [junit4]   2> 618737 T2177 oascc.ZkStateReader.createClusterStateWatchersAndUpdate Updating cluster state from ZooKeeper... 
   [junit4]   2> 619740 T2177 oasc.ZkController.createEphemeralLiveNode Register node as live in ZooKeeper:/live_nodes/127.0.0.1:40305_z_
   [junit4]   2> 619741 T2177 oascc.SolrZkClient.makePath makePath: /live_nodes/127.0.0.1:40305_z_
   [junit4]   2> 619744 T2231 oascc.ZkStateReader$3.process Updating live nodes... (4)
   [junit4]   2> 619744 T2199 oascc.ZkStateReader$3.process Updating live nodes... (4)
   [junit4]   2> 619744 T2245 oascc.ZkStateReader$3.process Updating live nodes... (4)
   [junit4]   2> 619744 T2217 oascc.ZkStateReader$3.process Updating live nodes... (4)
   [junit4]   2> 619744 T2204 oascc.ZkStateReader$3.process Updating live nodes... (4)
   [junit4]   2> 619748 T2177 oasc.CorePropertiesLocator.discover Looking for core definitions underneath /mnt/ssd/jenkins/workspace/Lucene-Solr-trunk-Linux/solr/build/solr-core/test/J1/./org.apache.solr.cloud.CollectionsAPIDistributedZkTest-jetty3-1375407928215
   [junit4]   2> 619771 T2177 oasc.CorePropertiesLocator.discoverUnder Found core conf in /mnt/ssd/jenkins/workspace/Lucene-Solr-trunk-Linux/solr/build/solr-core/test/J1/./org.apache.solr.cloud.CollectionsAPIDistributedZkTest-jetty3-1375407928215/conf/
   [junit4]   2> 619772 T2177 oasc.CorePropertiesLocator.discover Found 1 core definitions
   [junit4]   2> 619772 T2177 oass.SolrDispatchFilter.init user.dir=/mnt/ssd/jenkins/workspace/Lucene-Solr-trunk-Linux/solr/build/solr-core/test/J1
   [junit4]   2> 619773 T2177 oass.SolrDispatchFilter.init SolrDispatchFilter.init() done
   [junit4]   2> 619773 T2177 oascsi.HttpClientUtil.createClient Creating new http client, config:maxConnections=128&maxConnectionsPerHost=32&followRedirects=false
   [junit4]   2> 619846 T2177 oejs.Server.doStart jetty-8.1.10.v20130312
   [junit4]   2> 619851 T2177 oejs.AbstractConnector.doStart Started SelectChannelConnector@127.0.0.1:42343
   [junit4]   2> 619852 T2177 oass.SolrDispatchFilter.init SolrDispatchFilter.init()
   [junit4]   2> 619852 T2177 oasc.SolrResourceLoader.locateSolrHome JNDI not configured for solr (NoInitialContextEx)
   [junit4]   2> 619855 T2177 oasc.SolrResourceLoader.locateSolrHome using system property solr.solr.home: /mnt/ssd/jenkins/workspace/Lucene-Solr-trunk-Linux/solr/build/solr-core/test/J1/./org.apache.solr.cloud.CollectionsAPIDistributedZkTest-jetty4-1375407929380
   [junit4]   2> 619855 T2177 oasc.SolrResourceLoader.<init> new SolrResourceLoader for directory: '/mnt/ssd/jenkins/workspace/Lucene-Solr-trunk-Linux/solr/build/solr-core/test/J1/./org.apache.solr.cloud.CollectionsAPIDistributedZkTest-jetty4-1375407929380/'
   [junit4]   2> 619872 T2177 oasc.ConfigSolr.fromFile Loading container configuration from /mnt/ssd/jenkins/workspace/Lucene-Solr-trunk-Linux/solr/build/solr-core/test/J1/./org.apache.solr.cloud.CollectionsAPIDistributedZkTest-jetty4-1375407929380/solr.xml
   [junit4]   2> 619910 T2177 oasc.ConfigSolrXml.<init> Config-defined core root directory: 
   [junit4]   2> 619911 T2177 oasc.CoreContainer.<init> New CoreContainer 23140910
   [junit4]   2> 619911 T2177 oasc.CoreContainer.load Loading cores into CoreContainer [instanceDir=/mnt/ssd/jenkins/workspace/Lucene-Solr-trunk-Linux/solr/build/solr-core/test/J1/./org.apache.solr.cloud.CollectionsAPIDistributedZkTest-jetty4-1375407929380/]
   [junit4]   2> 619912 T2177 oashc.HttpShardHandlerFactory.getParameter Setting socketTimeout to: 120000
   [junit4]   2> 619912 T2177 oashc.HttpShardHandlerFactory.getParameter Setting urlScheme to: http://
   [junit4]   2> 619913 T2177 oashc.HttpShardHandlerFactory.getParameter Setting connTimeout to: 15000
   [junit4]   2> 619913 T2177 oashc.HttpShardHandlerFactory.getParameter Setting maxConnectionsPerHost to: 20
   [junit4]   2> 619913 T2177 oashc.HttpShardHandlerFactory.getParameter Setting corePoolSize to: 0
   [junit4]   2> 619914 T2177 oashc.HttpShardHandlerFactory.getParameter Setting maximumPoolSize to: 2147483647
   [junit4]   2> 619914 T2177 oashc.HttpShardHandlerFactory.getParameter Setting maxThreadIdleTime to: 5
   [junit4]   2> 619914 T2177 oashc.HttpShardHandlerFactory.getParameter Setting sizeOfQueue to: -1
   [junit4]   2> 619915 T2177 oashc.HttpShardHandlerFactory.getParameter Setting fairnessPolicy to: false
   [junit4]   2> 619915 T2177 oascsi.HttpClientUtil.createClient Creating new http client, config:maxConnectionsPerHost=20&maxConnections=10000&socketTimeout=120000&connTimeout=15000&retry=false
   [junit4]   2> 619918 T2177 oasc.ZkContainer.initZooKeeper Zookeeper client=127.0.0.1:39909/solr
   [junit4]   2> 619918 T2177 oasc.ZkController.checkChrootPath zkHost includes chroot
   [junit4]   2> 619919 T2177 oascc.ConnectionManager.waitForConnected Waiting for client to connect to ZooKeeper
   [junit4]   2> 619920 T2257 oascc.ConnectionManager.process Watcher org.apache.solr.common.cloud.ConnectionManager@100d287 name:ZooKeeperConnection Watcher:127.0.0.1:39909 got event WatchedEvent state:SyncConnected type:None path:null path:null type:None
   [junit4]   2> 619921 T2177 oascc.ConnectionManager.waitForConnected Client is connected to ZooKeeper
   [junit4]   2> 619922 T2177 oascsi.HttpClientUtil.createClient Creating new http client, config:maxConnections=500&maxConnectionsPerHost=16&socketTimeout=120000&connTimeout=15000
   [junit4]   2> 619926 T2177 oascc.ConnectionManager.waitForConnected Waiting for client to connect to ZooKeeper
   [junit4]   2> 619927 T2259 oascc.ConnectionManager.process Watcher org.apache.solr.common.cloud.ConnectionManager@a4a267 name:ZooKeeperConnection Watcher:127.0.0.1:39909/solr got event WatchedEvent state:SyncConnected type:None path:null path:null type:None
   [junit4]   2> 619927 T2177 oascc.ConnectionManager.waitForConnected Client is connected to ZooKeeper
   [junit4]   2> 619930 T2177 oascc.ZkStateReader.createClusterStateWatchersAndUpdate Updating cluster state from ZooKeeper... 
   [junit4]   2> 620932 T2177 oasc.ZkController.createEphemeralLiveNode Register node as live in ZooKeeper:/live_nodes/127.0.0.1:42343_z_
   [junit4]   2> 620933 T2177 oascc.SolrZkClient.makePath makePath: /live_nodes/127.0.0.1:42343_z_
   [junit4]   2> 620937 T2199 oascc.ZkStateReader$3.process Updating live nodes... (5)
   [junit4]   2> 620937 T2204 oascc.ZkStateReader$3.process Updating live nodes... (5)
   [junit4]   2> 620937 T2231 oascc.ZkStateReader$3.process Updating live nodes... (5)
   [junit4]   2> 620938 T2245 oascc.ZkStateReader$3.process Updating live nodes... (5)
   [junit4]   2> 620938 T2217 oascc.ZkStateReader$3.process Updating live nodes... (5)
   [junit4]   2> 620938 T2259 oascc.ZkStateReader$3.process Updating live nodes... (5)
   [junit4]   2> 620952 T2177 oasc.CorePropertiesLocator.discover Looking for core definitions underneath /mnt/ssd/jenkins/workspace/Lucene-Solr-trunk-Linux/solr/build/solr-core/test/J1/./org.apache.solr.cloud.CollectionsAPIDistributedZkTest-jetty4-1375407929380
   [junit4]   2> 620979 T2177 oasc.CorePropertiesLocator.discoverUnder Found core conf in /mnt/ssd/jenkins/workspace/Lucene-Solr-trunk-Linux/solr/build/solr-core/test/J1/./org.apache.solr.cloud.CollectionsAPIDistributedZkTest-jetty4-1375407929380/conf/
   [junit4]   2> 620980 T2177 oasc.CorePropertiesLocator.discover Found 1 core definitions
   [junit4]   2> 620980 T2177 oass.SolrDispatchFilter.init user.dir=/mnt/ssd/jenkins/workspace/Lucene-Solr-trunk-Linux/solr/build/solr-core/test/J1
   [junit4]   2> 620980 T2177 oass.SolrDispatchFilter.init SolrDispatchFilter.init() done
   [junit4]   2> 620981 T2177 oascsi.HttpClientUtil.createClient Creating new http client, config:maxConnections=128&maxConnectionsPerHost=32&followRedirects=false
   [junit4]   2> 620984 T2177 oascsi.HttpClientUtil.createClient Creating new http client, config:maxConnections=128&maxConnectionsPerHost=32&followRedirects=false
   [junit4]   2> 620988 T2211 oasha.CollectionsHandler.handleCreateAction Creating Collection : numShards=2&name=nodes_used_collection&replicationFactor=2&action=CREATE&wt=javabin&version=2
   [junit4]   2> 620990 T2199 oasc.DistributedQueue$LatchChildWatcher.process Watcher fired on path: /overseer/collection-queue-work state: SyncConnected type NodeChildrenChanged
   [junit4]   2> 620991 T2201 oasc.OverseerCollectionProcessor.run Overseer Collection Processor: Get the message id:/overseer/collection-queue-work/qn-0000000000 message:{
   [junit4]   2> 	  "operation":"createcollection",
   [junit4]   2> 	  "numShards":"2",
   [junit4]   2> 	  "name":"nodes_used_collection",
   [junit4]   2> 	  "replicationFactor":"2"}
   [junit4]   2> 620991 T2201 oasc.OverseerCollectionProcessor.processMessage WARN OverseerCollectionProcessor.processMessage : createcollection , {
   [junit4]   2> 	  "operation":"createcollection",
   [junit4]   2> 	  "numShards":"2",
   [junit4]   2> 	  "name":"nodes_used_collection",
   [junit4]   2> 	  "replicationFactor":"2"}
   [junit4]   2> 622151 T2200 oascc.ZkStateReader.updateClusterState Updating cloud state from ZooKeeper... 
   [junit4]   2> 622152 T2200 oasc.Overseer$ClusterStateUpdater.buildCollection building a new collection: nodes_used_collection
   [junit4]   2> 622152 T2200 oasc.Overseer$ClusterStateUpdater.createCollection Create collection nodes_used_collection with shards [shard1, shard2]
   [junit4]   2> 622155 T2199 oascc.ZkStateReader$2.process A cluster state change: WatchedEvent state:SyncConnected type:NodeDataChanged path:/clusterstate.json, has occurred - updating... (live nodes size: 5)
   [junit4]   2> 622155 T2245 oascc.ZkStateReader$2.process A cluster state change: WatchedEvent state:SyncConnected type:NodeDataChanged path:/clusterstate.json, has occurred - updating... (live nodes size: 5)
   [junit4]   2> 622156 T2217 oascc.ZkStateReader$2.process A cluster state change: WatchedEvent state:SyncConnected type:NodeDataChanged path:/clusterstate.json, has occurred - updating... (live nodes size: 5)
   [junit4]   2> 622155 T2259 oascc.ZkStateReader$2.process A cluster state change: WatchedEvent state:SyncConnected type:NodeDataChanged path:/clusterstate.json, has occurred - updating... (live nodes size: 5)
   [junit4]   2> 622155 T2204 oascc.ZkStateReader$2.process A cluster state change: WatchedEvent state:SyncConnected type:NodeDataChanged path:/clusterstate.json, has occurred - updating... (live nodes size: 5)
   [junit4]   2> 622155 T2231 oascc.ZkStateReader$2.process A cluster state change: WatchedEvent state:SyncConnected type:NodeDataChanged path:/clusterstate.json, has occurred - updating... (live nodes size: 5)
   [junit4]   2> 622194 T2201 oasc.OverseerCollectionProcessor.createCollection going to create cores replicas shardNames [shard1, shard2] , repFactor : 2
   [junit4]   2> 622194 T2201 oasc.OverseerCollectionProcessor.createCollection Creating shard nodes_used_collection_shard1_replica1 as part of slice shard1 of collection nodes_used_collection on 127.0.0.1:47660_z_
   [junit4]   2> 622194 T2201 oasc.OverseerCollectionProcessor.createCollection Creating shard nodes_used_collection_shard1_replica2 as part of slice shard1 of collection nodes_used_collection on 127.0.0.1:51253_z_
   [junit4]   2> 622195 T2201 oasc.OverseerCollectionProcessor.createCollection Creating shard nodes_used_collection_shard2_replica1 as part of slice shard2 of collection nodes_used_collection on 127.0.0.1:42343_z_
   [junit4]   2> 622196 T2201 oasc.OverseerCollectionProcessor.createCollection Creating shard nodes_used_collection_shard2_replica2 as part of slice shard2 of collection nodes_used_collection on 127.0.0.1:40305_z_
   [junit4]   2> 622197 T2212 oasc.ZkController.publish publishing core=nodes_used_collection_shard1_replica1 state=down
   [junit4]   2> 622199 T2225 oasc.ZkController.publish publishing core=nodes_used_collection_shard1_replica2 state=down
   [junit4]   2> 622199 T2212 oasc.ZkController.waitForCoreNodeName look for our core node name
   [junit4]   2> 622199 T2252 oasc.ZkController.publish publishing core=nodes_used_collection_shard2_replica1 state=down
   [junit4]   2> 622199 T2240 oasc.ZkController.publish publishing core=nodes_used_collection_shard2_replica2 state=down
   [junit4]   2> 622199 T2225 oasc.ZkController.waitForCoreNodeName look for our core node name
   [junit4]   2> 622200 T2252 oasc.ZkController.waitForCoreNodeName look for our core node name
   [junit4]   2> 622200 T2240 oasc.ZkController.waitForCoreNodeName look for our core node name
   [junit4]   2> 623660 T2200 oascc.ZkStateReader.updateClusterState Updating cloud state from ZooKeeper... 
   [junit4]   2> 623661 T2200 oasc.Overseer$ClusterStateUpdater.updateState WARN Could not find collection node for nodes_used_collection, skipping publish state
   [junit4]   2> 623661 T2200 oasc.Overseer$ClusterStateUpdater.updateState Update state numShards=2 message={
   [junit4]   2> 	  "operation":"state",
   [junit4]   2> 	  "core_node_name":"core_node1",
   [junit4]   2> 	  "numShards":"2",
   [junit4]   2> 	  "shard":"shard1",
   [junit4]   2> 	  "roles":null,
   [junit4]   2> 	  "state":"down",
   [junit4]   2> 	  "shard_state":"active",
   [junit4]   2> 	  "core":"nodes_used_collection_shard1_replica1",
   [junit4]   2> 	  "collection":"nodes_used_collection",
   [junit4]   2> 	  "shard_range":null,
   [junit4]   2> 	  "node_name":"127.0.0.1:47660_z_",
   [junit4]   2> 	  "base_url":"http://127.0.0.1:47660/z_"}
   [junit4]   2> 623665 T2200 oasc.Overseer$ClusterStateUpdater.updateState WARN Could not find collection node for nodes_used_collection, skipping publish state
   [junit4]   2> 623665 T2200 oasc.Overseer$ClusterStateUpdater.updateState Update state numShards=2 message={
   [junit4]   2> 	  "operation":"state",
   [junit4]   2> 	  "core_node_name":"core_node2",
   [junit4]   2> 	  "numShards":"2",
   [junit4]   2> 	  "shard":"shard1",
   [junit4]   2> 	  "roles":null,
   [junit4]   2> 	  "state":"down",
   [junit4]   2> 	  "shard_state":"active",
   [junit4]   2> 	  "core":"nodes_used_collection_shard1_replica2",
   [junit4]   2> 	  "collection":"nodes_used_collection",
   [junit4]   2> 	  "shard_range":null,
   [junit4]   2> 	  "node_name":"127.0.0.1:51253_z_",
   [junit4]   2> 	  "base_url":"http://127.0.0.1:51253/z_"}
   [junit4]   2> 623668 T2200 oasc.Overseer$ClusterStateUpdater.updateState WARN Could not find collection node for nodes_used_collection, skipping publish state
   [junit4]   2> 623668 T2200 oasc.Overseer$ClusterStateUpdater.updateState Update state numShards=2 message={
   [junit4]   2> 	  "operation":"state",
   [junit4]   2> 	  "core_node_name":"core_node3",
   [junit4]   2> 	  "numShards":"2",
   [junit4]   2> 	  "shard":"shard2",
   [junit4]   2> 	  "roles":null,
   [junit4]   2> 	  "state":"down",
   [junit4]   2> 	  "shard_state":"active",
   [junit4]   2> 	  "core":"nodes_used_collection_shard2_replica1",
   [junit4]   2> 	  "collection":"nodes_used_collection",
   [junit4]   2> 	  "shard_range":null,
   [junit4]   2> 	  "node_name":"127.0.0.1:42343_z_",
   [junit4]   2> 	  "base_url":"http://127.0.0.1:42343/z_"}
   [junit4]   2> 623671 T2200 oasc.Overseer$ClusterStateUpdater.updateState WARN Could not find collection node for nodes_used_collection, skipping publish state
   [junit4]   2> 623671 T2200 oasc.Overseer$ClusterStateUpdater.updateState Update state numShards=2 message={
   [junit4]   2> 	  "operation":"state",
   [junit4]   2> 	  "core_node_name":"core_node4",
   [junit4]   2> 	  "numShards":"2",
   [junit4]   2> 	  "shard":"shard2",
   [junit4]   2> 	  "roles":null,
   [junit4]   2> 	  "state":"down",
   [junit4]   2> 	  "shard_state":"active",
   [junit4]   2> 	  "core":"nodes_used_collection_shard2_replica2",
   [junit4]   2> 	  "collection":"nodes_used_collection",
   [junit4]   2> 	  "shard_range":null,
   [junit4]   2> 	  "node_name":"127.0.0.1:40305_z_",
   [junit4]   2> 	  "base_url":"http://127.0.0.1:40305/z_"}
   [junit4]   2> 623674 T2245 oascc.ZkStateReader$2.process A cluster state change: WatchedEvent state:SyncConnected type:NodeDataChanged path:/clusterstate.json, has occurred - updating... (live nodes size: 5)
   [junit4]   2> 623674 T2199 oascc.ZkStateReader$2.process A cluster state change: WatchedEvent state:SyncConnected type:NodeDataChanged path:/clusterstate.json, has occurred - updating... (live nodes size: 5)
   [junit4]   2> 623674 T2231 oascc.ZkStateReader$2.process A cluster state change: WatchedEvent state:SyncConnected type:NodeDataChanged path:/clusterstate.json, has occurred - updating... (live nodes size: 5)
   [junit4]   2> 623674 T2204 oascc.ZkStateReader$2.process A cluster state change: WatchedEvent state:SyncConnected type:NodeDataChanged path:/clusterstate.json, has occurred - updating... (live nodes size: 5)
   [junit4]   2> 623674 T2259 oascc.ZkStateReader$2.process A cluster state change: WatchedEvent state:SyncConnected type:NodeDataChanged path:/clusterstate.json, has occurred - updating... (live nodes size: 5)
   [junit4]   2> 623674 T2217 oascc.ZkStateReader$2.process A cluster state change: WatchedEvent state:SyncConnected type:NodeDataChanged path:/clusterstate.json, has occurred - updating... (live nodes size: 5)
   [junit4]   2> 624199 T2212 oasc.ZkController.waitForShardId waiting to find shard id in clusterstate for nodes_used_collection_shard1_replica1
   [junit4]   2> 624200 T2212 oasc.CorePropertiesLocator.writePropertiesFile ERROR Couldn't persist core properties to /mnt/ssd/jenkins/workspace/Lucene-Solr-trunk-Linux/solr/build/solr-core/test/J1/./org.apache.solr.cloud.CollectionsAPIDistributedZkTest-jetty1-1375407925784/nodes_used_collection_shard1_replica1/core.properties: java.io.FileNotFoundException: /mnt/ssd/jenkins/workspace/Lucene-Solr-trunk-Linux/solr/build/solr-core/test/J1/./org.apache.solr.cloud.CollectionsAPIDistributedZkTest-jetty1-1375407925784/nodes_used_collection_shard1_replica1/core.properties (No such file or directory)
   [junit4]   2> 624200 T2225 oasc.ZkController.waitForShardId waiting to find shard id in clusterstate for nodes_used_collection_shard1_replica2
   [junit4]   2> 624201 T2252 oasc.ZkController.waitForShardId waiting to find shard id in clusterstate for nodes_used_collection_shard2_replica1
   [junit4]   2> 624201 T2225 oasc.CorePropertiesLocator.writePropertiesFile ERROR Couldn't persist core properties to /mnt/ssd/jenkins/workspace/Lucene-Solr-trunk-Linux/solr/build/solr-core/test/J1/./org.apache.solr.cloud.CollectionsAPIDistributedZkTest-jetty2-1375407927022/nodes_used_collection_shard1_replica2/core.properties: java.io.FileNotFoundException: /mnt/ssd/jenkins/workspace/Lucene-Solr-trunk-Linux/solr/build/solr-core/test/J1/./org.apache.solr.cloud.CollectionsAPIDistributedZkTest-jetty2-1375407927022/nodes_used_collection_shard1_replica2/core.properties (No such file or directory)
   [junit4]   2> 624200 T2212 oasc.CoreContainer.create Creating SolrCore 'nodes_used_collection_shard1_replica1' using instanceDir: /mnt/ssd/jenkins/workspace/Lucene-Solr-trunk-Linux/solr/build/solr-core/test/J1/./org.apache.solr.cloud.CollectionsAPIDistributedZkTest-jetty1-1375407925784/nodes_used_collection_shard1_replica1
   [junit4]   2> 624202 T2212 oasc.ZkController.createCollectionZkNode Check for collection zkNode:nodes_used_collection
   [junit4]   2> 624202 T2225 oasc.CoreContainer.create Creating SolrCore 'nodes_used_collection_shard1_replica2' using instanceDir: /mnt/ssd/jenkins/workspace/Lucene-Solr-trunk-Linux/solr/build/solr-core/test/J1/./org.apache.solr.cloud.CollectionsAPIDistributedZkTest-jetty2-1375407927022/nodes_used_collection_shard1_replica2
   [junit4]   2> 624202 T2225 oasc.ZkController.createCollectionZkNode Check for collection zkNode:nodes_used_collection
   [junit4]   2> 624203 T2212 oasc.ZkController.createCollectionZkNode Creating collection in ZooKeeper:nodes_used_collection
   [junit4]   2> 624201 T2252 oasc.CorePropertiesLocator.writePropertiesFile ERROR Couldn't persist core properties to /mnt/ssd/jenkins/workspace/Lucene-Solr-trunk-Linux/solr/build/solr-core/test/J1/./org.apache.solr.cloud.CollectionsAPIDistributedZkTest-jetty4-1375407929380/nodes_used_collection_shard2_replica1/core.properties: java.io.FileNotFoundException: /mnt/ssd/jenkins/workspace/Lucene-Solr-trunk-Linux/solr/build/solr-core/test/J1/./org.apache.solr.cloud.CollectionsAPIDistributedZkTest-jetty4-1375407929380/nodes_used_collection_shard2_replica1/core.properties (No such file or directory)
   [junit4]   2> 624201 T2240 oasc.ZkController.waitForShardId waiting to find shard id in clusterstate for nodes_used_collection_shard2_replica2
   [junit4]   2> 624203 T2252 oasc.CoreContainer.create Creating SolrCore 'nodes_used_collection_shard2_replica1' using instanceDir: /mnt/ssd/jenkins/workspace/Lucene-Solr-trunk-Linux/solr/build/solr-core/test/J1/./org.apache.solr.cloud.CollectionsAPIDistributedZkTest-jetty4-1375407929380/nodes_used_collection_shard2_replica1
   [junit4]   2> 624204 T2252 oasc.ZkController.createCollectionZkNode Check for collection zkNode:nodes_used_collection
   [junit4]   2> 624203 T2225 oasc.ZkController.createCollectionZkNode Creating collection in ZooKeeper:nodes_used_collection
   [junit4]   2> 624203 T2212 oasc.ZkController.getConfName Looking for collection configName
   [junit4]   2> 624205 T2252 oasc.ZkController.createCollectionZkNode Creating collection in ZooKeeper:nodes_used_collection
   [junit4]   2> 624205 T2225 oasc.ZkController.getConfName Looking for collection configName
   [junit4]   2> 624205 T2212 oasc.ZkController.getConfName Only one config set found in zk - using it:conf1
   [junit4]   2> 624204 T2240 oasc.CorePropertiesLocator.writePropertiesFile ERROR Couldn't persist core properties to /mnt/ssd/jenkins/workspace/Lucene-Solr-trunk-Linux/solr/build/solr-core/test/J1/./org.apache.solr.cloud.CollectionsAPIDistributedZkTest-jetty3-1375407928215/nodes_used_collection_shard2_replica2/core.properties: java.io.FileNotFoundException: /mnt/ssd/jenkins/workspace/Lucene-Solr-trunk-Linux/solr/build/solr-core/test/J1/./org.apache.solr.cloud.CollectionsAPIDistributedZkTest-jetty3-1375407928215/nodes_used_collection_shard2_replica2/core.properties (No such file or directory)
   [junit4]   2> 624206 T2225 oasc.ZkController.getConfName Only one config set found in zk - using it:conf1
   [junit4]   2> 624206 T2212 oascc.SolrZkClient.makePath makePath: /collections/nodes_used_collection
   [junit4]   2> 624205 T2252 oasc.ZkController.getConfName Looking for collection configName
   [junit4]   2> 624206 T2225 oascc.SolrZkClient.makePath makePath: /collections/nodes_used_collection
   [junit4]   2> 624206 T2240 oasc.CoreContainer.create Creating SolrCore 'nodes_used_collection_shard2_replica2' using instanceDir: /mnt/ssd/jenkins/workspace/Lucene-Solr-trunk-Linux/solr/build/solr-core/test/J1/./org.apache.solr.cloud.CollectionsAPIDistributedZkTest-jetty3-1375407928215/nodes_used_collection_shard2_replica2
   [junit4]   2> 624208 T2240 oasc.ZkController.createCollectionZkNode Check for collection zkNode:nodes_used_collection
   [junit4]   2> 624208 T2252 oasc.ZkController.getConfName Only one config set found in zk - using it:conf1
   [junit4]   2> 624208 T2240 oasc.ZkController.createCollectionZkNode Collection zkNode exists
   [junit4]   2> 624209 T2240 oasc.ZkController.readConfigName Load collection config from:/collections/nodes_used_collection
   [junit4]   2> 624208 T2212 oasc.ZkController.readConfigName Load collection config from:/collections/nodes_used_collection
   [junit4]   2> 624208 T2252 oascc.SolrZkClient.makePath makePath: /collections/nodes_used_collection
   [junit4]   2> 624209 T2225 oasc.ZkController.readConfigName Load collection config from:/collections/nodes_used_collection
   [junit4]   2> 624210 T2240 oasc.SolrResourceLoader.<init> new SolrResourceLoader for directory: '/mnt/ssd/jenkins/workspace/Lucene-Solr-trunk-Linux/solr/build/solr-core/test/J1/./org.apache.solr.cloud.CollectionsAPIDistributedZkTest-jetty3-1375407928215/nodes_used_collection_shard2_replica2/'
   [junit4]   2> 624210 T2212 oasc.SolrResourceLoader.<init> new SolrResourceLoader for directory: '/mnt/ssd/jenkins/workspace/Lucene-Solr-trunk-Linux/solr/build/solr-core/test/J1/./org.apache.solr.cloud.CollectionsAPIDistributedZkTest-jetty1-1375407925784/nodes_used_collection_shard1_replica1/'
   [junit4]   2> 624211 T2225 oasc.SolrResourceLoader.<init> new SolrResourceLoader for directory: '/mnt/ssd/jenkins/workspace/Lucene-Solr-trunk-Linux/solr/build/solr-core/test/J1/./org.apache.solr.cloud.CollectionsAPIDistributedZkTest-jetty2-1375407927022/nodes_used_collection_shard1_replica2/'
   [junit4]   2> 624211 T2252 oasc.ZkController.readConfigName Load collection config from:/collections/nodes_used_collection
   [junit4]   2> 624212 T2252 oasc.SolrResourceLoader.<init> new SolrResourceLoader for directory: '/mnt/ssd/jenkins/workspace/Lucene-Solr-trunk-Linux/solr/build/solr-core/test/J1/./org.apache.solr.cloud.CollectionsAPIDistributedZkTest-jetty4-1375407929380/nodes_used_collection_shard2_replica1/'
   [junit4]   2> 624249 T2252 oasc.SolrConfig.<init> Using Lucene MatchVersion: LUCENE_50
   [junit4]   2> 624254 T2240 oasc.SolrConfig.<init> Using Lucene MatchVersion: LUCENE_50
   [junit4]   2> 624258 T2225 oasc.SolrConfig.<init> Using Lucene MatchVersion: LUCENE_50
   [junit4]   2> 624264 T2212 oasc.SolrConfig.<init> Using Lucene MatchVersion: LUCENE_50
   [junit4]   2> 624283 T2252 oasc.SolrConfig.<init> Loaded SolrConfig: solrconfig.xml
   [junit4]   2> 624285 T2252 oass.IndexSchema.readSchema Reading Solr Schema from schema.xml
   [junit4]   2> 624291 T2252 oass.IndexSchema.readSchema [nodes_used_collection_shard2_replica1] Schema name=test
   [junit4]   2> 624305 T2240 oasc.SolrConfig.<init> Loaded SolrConfig: solrconfig.xml
   [junit4]   2> 624306 T2240 oass.IndexSchema.readSchema Reading Solr Schema from schema.xml
   [junit4]   2> 624307 T2225 oasc.SolrConfig.<init> Loaded SolrConfig: solrconfig.xml
   [junit4]   2> 624308 T2225 oass.IndexSchema.readSchema Reading Solr Schema from schema.xml
   [junit4]   2> 624314 T2212 oasc.SolrConfig.<init> Loaded SolrConfig: solrconfig.xml
   [junit4]   2> 624316 T2212 oass.IndexSchema.readSchema Reading Solr Schema from schema.xml
   [junit4]   2> 624316 T2240 oass.IndexSchema.readSchema [nodes_used_collection_shard2_replica2] Schema name=test
   [junit4]   2> 624317 T2225 oass.IndexSchema.readSchema [nodes_used_collection_shard1_replica2] Schema name=test
   [junit4]   2> 624328 T2212 oass.IndexSchema.readSchema [nodes_used_collection_shard1_replica1] Schema name=test
   [junit4]   2> 624895 T2252 oass.OpenExchangeRatesOrgProvider.init Initialized with rates=open-exchange-rates.json, refreshInterval=1440.
   [junit4]   2> 624902 T2252 oass.IndexSchema.readSchema default search field in schema is text
   [junit4]   2> 624905 T2252 oass.IndexSchema.readSchema unique key field: id
   [junit4]   2> 624921 T2252 oass.FileExchangeRateProvider.reload Reloading exchange rates from file currency.xml
   [junit4]   2> 624925 T2252 oass.FileExchangeRateProvider.reload Reloading exchange rates from file currency.xml
   [junit4]   2> 624930 T2252 oass.OpenExchangeRatesOrgProvider.reload Reloading exchange rates from open-exchange-rates.json
   [junit4]   2> 624932 T2252 oass.OpenExchangeRatesOrgProvider$OpenExchangeRates.<init> WARN Unknown key IMPORTANT NOTE
   [junit4]   2> 624932 T2252 oass.OpenExchangeRatesOrgProvider$OpenExchangeRates.<init> WARN Expected key, got STRING
   [junit4]   2> 624933 T2252 oass.OpenExchangeRatesOrgProvider.reload Reloading exchange rates from open-exchange-rates.json
   [junit4]   2> 624934 T2252 oass.OpenExchangeRatesOrgProvider$OpenExchangeRates.<init> WARN Unknown key IMPORTANT NOTE
   [junit4]   2> 624934 T2252 oass.OpenExchangeRatesOrgProvider$OpenExchangeRates.<init> WARN Expected key, got STRING
   [junit4]   2> 624935 T2252 oasc.SolrCore.initDirectoryFactory org.apache.solr.core.MockDirectoryFactory
   [junit4]   2> 624935 T2252 oasc.SolrCore.<init> [nodes_used_collection_shard2_replica1] Opening new SolrCore at /mnt/ssd/jenkins/workspace/Lucene-Solr-trunk-Linux/solr/build/solr-core/test/J1/./org.apache.solr.cloud.CollectionsAPIDistributedZkTest-jetty4-1375407929380/nodes_used_collection_shard2_replica1/, dataDir=/mnt/ssd/jenkins/workspace/Lucene-Solr-trunk-Linux/solr/build/solr-core/test/J1/./org.apache.solr.cloud.CollectionsAPIDistributedZkTest-jetty4-1375407929380//nodes_used_collection_shard2_replica1/data/
   [junit4]   2> 624935 T2252 oasc.JmxMonitoredMap.<init> JMX monitoring is enabled. Adding Solr mbeans to JMX Server: com.sun.jmx.mbeanserver.JmxMBeanServer@3396b1
   [junit4]   2> 624937 T2252 oasc.CachingDirectoryFactory.get return new directory for /mnt/ssd/jenkins/workspace/Lucene-Solr-trunk-Linux/solr/build/solr-core/test/J1/./org.apache.solr.cloud.CollectionsAPIDistributedZkTest-jetty4-1375407929380//nodes_used_collection_shard2_replica1/data
   [junit4]   2> 624937 T2252 oasc.SolrCore.getNewIndexDir New index directory detected: old=null new=/mnt/ssd/jenkins/workspace/Lucene-Solr-trunk-Linux/solr/build/solr-core/test/J1/./org.apache.solr.cloud.CollectionsAPIDistributedZkTest-jetty4-1375407929380//nodes_used_collection_shard2_replica1/data/index/
   [junit4]   2> 624937 T2252 oasc.SolrCore.initIndex WARN [nodes_used_collection_shard2_replica1] Solr index directory '/mnt/ssd/jenkins/workspace/Lucene-Solr-trunk-Linux/solr/build/solr-core/test/J1/./org.apache.solr.cloud.CollectionsAPIDistributedZkTest-jetty4-1375407929380/nodes_used_collection_shard2_replica1/data/index' doesn't exist. Creating new index...
   [junit4]   2> 624938 T2252 oasc.CachingDirectoryFactory.get return new directory for /mnt/ssd/jenkins/workspace/Lucene-Solr-trunk-Linux/solr/build/solr-core/test/J1/./org.apache.solr.cloud.CollectionsAPIDistributedZkTest-jetty4-1375407929380//nodes_used_collection_shard2_replica1/data/index
   [junit4]   2> 624939 T2240 oass.OpenExchangeRatesOrgProvider.init Initialized with rates=open-exchange-rates.json, refreshInterval=1440.
   [junit4]   2> 624940 T2252 oasc.SolrDeletionPolicy.onCommit SolrDeletionPolicy.onCommit: commits: num=1
   [junit4]   2> 		commit{dir=MockDirWrapper(org.apache.lucene.store.RAMDirectory@111b049 lockFactory=org.apache.lucene.store.NativeFSLockFactory@18561f7),segFN=segments_1,generation=1}
   [junit4]   2> 624941 T2252 oasc.SolrDeletionPolicy.updateCommits newest commit generation = 1
   [junit4]   2> 624942 T2225 oass.OpenExchangeRatesOrgProvider.init Initialized with rates=open-exchange-rates.json, refreshInterval=1440.
   [junit4]   2> 624945 T2252 oasup.UpdateRequestProcessorChain.init inserting DistributedUpdateProcessorFactory into updateRequestProcessorChain "dedupe"
   [junit4]   2> 624946 T2252 oasup.UpdateRequestProcessorChain.init inserting DistributedUpdateProcessorFactory into updateRequestProcessorChain "stored_sig"
   [junit4]   2> 624947 T2252 oasup.UpdateRequestProcessorChain.init inserting DistributedUpdateProcessorFactory into updateRequestProcessorChain "distrib-dup-test-chain-implicit"
   [junit4]   2> 624947 T2240 oass.IndexSchema.readSchema default search field in schema is text
   [junit4]   2> 624947 T2252 oasc.RequestHandlers.initHandlersFromConfig created standard: solr.StandardRequestHandler
   [junit4]   2> 624949 T2252 oasc.RequestHandlers.initHandlersFromConfig created /get: solr.RealTimeGetHandler
   [junit4]   2> 624949 T2252 oasc.RequestHandlers.initHandlersFromConfig adding lazy requestHandler: solr.ReplicationHandler
   [junit4]   2> 624949 T2225 oass.IndexSchema.readSchema default search field in schema is text
   [junit4]   2> 624949 T2252 oasc.RequestHandlers.initHandlersFromConfig created /replication: solr.ReplicationHandler
   [junit4]   2> 624950 T2252 oasc.RequestHandlers.initHandlersFromConfig created /update: solr.UpdateRequestHandler
   [junit4]   2> 624951 T2252 oasc.RequestHandlers.initHandlersFromConfig created /admin/: org.apache.solr.handler.admin.AdminHandlers
   [junit4]   2> 624951 T2240 oass.IndexSchema.readSchema unique key field: id
   [junit4]   2> 624953 T2225 oass.IndexSchema.readSchema unique key field: id
   [junit4]   2> 624954 T2252 oashl.XMLLoader.init xsltCacheLifetimeSeconds=60
   [junit4]   2> 624962 T2252 oass.SolrIndexSearcher.<init> Opening Searcher@17931c0 main
   [junit4]   2> 624963 T2252 oasu.CommitTracker.<init> Hard AutoCommit: disabled
   [junit4]   2> 624963 T2252 oasu.CommitTracker.<init> Soft AutoCommit: disabled
   [junit4]   2> 624966 T2212 oass.OpenExchangeRatesOrgProvider.init Initialized with rates=open-exchange-rates.json, refreshInterval=1440.
   [junit4]   2> 624969 T2265 oasc.SolrCore.registerSearcher [nodes_used_collection_shard2_replica1] Registered new searcher Searcher@17931c0 main{StandardDirectoryReader(segments_1:1)}
   [junit4]   2> 624972 T2252 oasc.CoreContainer.registerCore registering core: nodes_used_collection_shard2_replica1
   [junit4]   2> 624973 T2240 oass.FileExchangeRateProvider.reload Reloading exchange rates from file currency.xml
   [junit4]   2> 624973 T2252 oasc.ZkController.register Register replica - core:nodes_used_collection_shard2_replica1 address:http://127.0.0.1:42343/z_ collection:nodes_used_collection shard:shard2
   [junit4]   2> 624976 T2252 oascsi.HttpClientUtil.createClient Creating new http client, config:maxConnections=10000&maxConnectionsPerHost=20&connTimeout=15000&socketTimeout=30000&retry=false
   [junit4]   2> 624976 T2225 oass.FileExchangeRateProvider.reload Reloading exchange rates from file currency.xml
   [junit4]   2> 624978 T2212 oass.IndexSchema.readSchema default search field in schema is text
   [junit4]   2> 624979 T2240 oass.FileExchangeRateProvider.reload Reloading exchange rates from file currency.xml
   [junit4]   2> 624982 T2225 oass.FileExchangeRateProvider.reload Reloading exchange rates from file currency.xml
   [junit4]   2> 624983 T2212 oass.IndexSchema.readSchema unique key field: id
   [junit4]   2> 624983 T2240 oass.OpenExchangeRatesOrgProvider.reload Reloading exchange rates from open-exchange-rates.json
   [junit4]   2> 624984 T2240 oass.OpenExchangeRatesOrgProvider$OpenExchangeRates.<init> WARN Unknown key IMPORTANT NOTE
   [junit4]   2> 624985 T2240 oass.OpenExchangeRatesOrgProvider$OpenExchangeRates.<init> WARN Expected key, got STRING
   [junit4]   2> 624985 T2240 oass.OpenExchangeRatesOrgProvider.reload Reloading exchange rates from open-exchange-rates.json
   [junit4]   2> 624986 T2240 oass.OpenExchangeRatesOrgProvider$OpenExchangeRates.<init> WARN Unknown key IMPORTANT NOTE
   [junit4]   2> 624987 T2240 oass.OpenExchangeRatesOrgProvider$OpenExchangeRates.<init> WARN Expected key, got STRING
   [junit4]   2> 624987 T2240 oasc.SolrCore.initDirectoryFactory org.apache.solr.core.MockDirectoryFactory
   [junit4]   2> 624988 T2240 oasc.SolrCore.<init> [nodes_used_collection_shard2_replica2] Opening new SolrCore at /mnt/ssd/jenkins/workspace/Lucene-Solr-trunk-Linux/solr/build/solr-core/test/J1/./org.apache.solr.cloud.CollectionsAPIDistributedZkTest-jetty3-1375407928215/nodes_used_collection_shard2_replica2/, dataDir=/mnt/ssd/jenkins/workspace/Lucene-Solr-trunk-Linux/solr/build/solr-core/test/J1/./org.apache.solr.cloud.CollectionsAPIDistributedZkTest-jetty3-1375407928215//nodes_used_collection_shard2_replica2/data/
   [junit4]   2> 624988 T2240 oasc.JmxMonitoredMap.<init> JMX monitoring is enabled. Adding Solr mbeans to JMX Server: com.sun.jmx.mbeanserver.JmxMBeanServer@3396b1
   [junit4]   2> 624989 T2240 oasc.CachingDirectoryFactory.get return new directory for /mnt/ssd/jenkins/workspace/Lucene-Solr-trunk-Linux/solr/build/solr-core/test/J1/./org.apache.solr.cloud.CollectionsAPIDistributedZkTest-jetty3-1375407928215//nodes_used_collection_shard2_replica2/data
   [junit4]   2> 624990 T2240 oasc.SolrCore.getNewIndexDir New index directory detected: old=null new=/mnt/ssd/jenkins/workspace/Lucene-Solr-trunk-Linux/solr/build/solr-core/test/J1/./org.apache.solr.cloud.CollectionsAPIDistributedZkTest-jetty3-1375407928215//nodes_used_collection_shard2_replica2/data/index/
   [junit4]   2> 624990 T2240 oasc.SolrCore.initIndex WARN [nodes_used_collection_shard2_replica2] Solr index directory '/mnt/ssd/jenkins/workspace/Lucene-Solr-trunk-Linux/solr/build/solr-core/test/J1/./org.apache.solr.cloud.CollectionsAPIDistributedZkTest-jetty3-1375407928215/nodes_used_collection_shard2_replica2/data/index' doesn't exist. Creating new index...
   [junit4]   2> 624987 T2225 oass.OpenExchangeRatesOrgProvider.reload Reloading exchange rates from open-exchange-rates.json
   [junit4]   2> 624991 T2240 oasc.CachingDirectoryFactory.get return new directory for /mnt/ssd/jenkins/workspace/Lucene-Solr-trunk-Linux/solr/build/solr-core/test/J1/./org.apache.solr.cloud.CollectionsAPIDistributedZkTest-jetty3-1375407928215//nodes_used_collection_shard2_replica2/data/index
   [junit4]   2> 624991 T2252 oascc.SolrZkClient.makePath makePath: /collections/nodes_used_collection/leader_elect/shard2/election
   [junit4]   2> 624992 T2225 oass.OpenExchangeRatesOrgProvider$OpenExchangeRates.<init> WARN Unknown key IMPORTANT NOTE
   [junit4]   2> 624993 T2225 oass.OpenExchangeRatesOrgProvider$OpenExchangeRates.<init> WARN Expected key, got STRING
   [junit4]   2> 624993 T2240 oasc.SolrDeletionPolicy.onCommit SolrDeletionPolicy.onCommit: commits: num=1
   [junit4]   2> 		commit{dir=MockDirWrapper(org.apache.lucene.store.RAMDirectory@c7f0ac lockFactory=org.apache.lucene.store.NativeFSLockFactory@e7906b),segFN=segments_1,generation=1}
   [junit4]   2> 624994 T2240 oasc.SolrDeletionPolicy.updateCommits newest commit generation = 1
   [junit4]   2> 624993 T2225 oass.OpenExchangeRatesOrgProvider.reload Reloading exchange rates from open-exchange-rates.json
   [junit4]   2> 624996 T2225 oass.OpenExchangeRatesOrgProvider$OpenExchangeRates.<init> WARN Unknown key IMPORTANT NOTE
   [junit4]   2> 624996 T2225 oass.OpenExchangeRatesOrgProvider$OpenExchangeRates.<init> WARN Expected key, got STRING
   [junit4]   2> 624997 T2225 oasc.SolrCore.initDirectoryFactory org.apache.solr.core.MockDirectoryFactory
   [junit4]   2> 624997 T2225 oasc.SolrCore.<init> [nodes_used_collection_shard1_replica2] Opening new SolrCore at /mnt/ssd/jenkins/workspace/Lucene-Solr-trunk-Linux/solr/build/solr-core/test/J1/./org.apache.solr.cloud.CollectionsAPIDistributedZkTest-jetty2-1375407927022/nodes_used_collection_shard1_replica2/, dataDir=/mnt/ssd/jenkins/workspace/Lucene-Solr-trunk-Linux/solr/build/solr-core/test/J1/./org.apache.solr.cloud.CollectionsAPIDistributedZkTest-jetty2-1375407927022//nodes_used_collection_shard1_replica2/data/
   [junit4]   2> 624998 T2225 oasc.JmxMonitoredMap.<init> JMX monitoring is enabled. Adding Solr mbeans to JMX Server: com.sun.jmx.mbeanserver.JmxMBeanServer@3396b1
   [junit4]   2> 624999 T2240 oasup.UpdateRequestProcessorChain.init inserting DistributedUpdateProcessorFactory into updateRequestProcessorChain "dedupe"
   [junit4]   2> 624999 T2225 oasc.CachingDirectoryFactory.get return new directory for /mnt/ssd/jenkins/workspace/Lucene-Solr-trunk-Linux/solr/build/solr-core/test/J1/./org.apache.solr.cloud.CollectionsAPIDistributedZkTest-jetty2-1375407927022//nodes_used_collection_shard1_replica2/data
   [junit4]   2> 625000 T2252 oasc.ShardLeaderElectionContext.runLeaderProcess Running the leader process for shard shard2
   [junit4]   2> 625000 T2240 oasup.UpdateRequestProcessorChain.init inserting DistributedUpdateProcessorFactory into updateRequestProcessorChain "stored_sig"
   [junit4]   2> 625000 T2225 oasc.SolrCore.getNewIndexDir New index directory detected: old=null new=/mnt/ssd/jenkins/workspace/Lucene-Solr-trunk-Linux/solr/build/solr-core/test/J1/./org.apache.solr.cloud.CollectionsAPIDistributedZkTest-jetty2-1375407927022//nodes_used_collection_shard1_replica2/data/index/
   [junit4]   2> 625002 T2225 oasc.SolrCore.initIndex WARN [nodes_used_collection_shard1_replica2] Solr index directory '/mnt/ssd/jenkins/workspace/Lucene-Solr-trunk-Linux/solr/build/solr-core/test/J1/./org.apache.solr.cloud.CollectionsAPIDistributedZkTest-jetty2-1375407927022/nodes_used_collection_shard1_replica2/data/index' doesn't exist. Creating new index...
   [junit4]   2> 625002 T2240 oasup.UpdateRequestProcessorChain.init inserting DistributedUpdateProcessorFactory into updateRequestProcessorChain "distrib-dup-test-chain-implicit"
   [junit4]   2> 625003 T2225 oasc.CachingDirectoryFactory.get return new directory for /mnt/ssd/jenkins/workspace/Lucene-Solr-trunk-Linux/solr/build/solr-core/test/J1/./org.apache.solr.cloud.CollectionsAPIDistributedZkTest-jetty2-1375407927022//nodes_used_collection_shard1_replica2/data/index
   [junit4]   2> 625003 T2252 oasc.ShardLeaderElectionContext.waitForReplicasToComeUp Waiting until we see more replicas up for shard shard2: total=2 found=1 timeoutin=180000
   [junit4]   2> 625003 T2212 oass.FileExchangeRateProvider.reload Reloading exchange rates from file currency.xml
   [junit4]   2> 625003 T2240 oasc.RequestHandlers.initHandlersFromConfig created standard: solr.StandardRequestHandler
   [junit4]   2> 625005 T2240 oasc.RequestHandlers.initHandlersFromConfig created /get: solr.RealTimeGetHandler
   [junit4]   2> 625005 T2240 oasc.RequestHandlers.initHandlersFromConfig adding lazy requestHandler: solr.ReplicationHandler
   [junit4]   2> 625005 T2240 oasc.RequestHandlers.initHandlersFromConfig created /replication: solr.ReplicationHandler
   [junit4]   2> 625006 T2225 oasc.SolrDeletionPolicy.onCommit SolrDeletionPolicy.onCommit: commits: num=1
   [junit4]   2> 		commit{dir=MockDirWrapper(org.apache.lucene.store.RAMDirectory@1fd1f63 lockFactory=org.apache.lucene.store.NativeFSLockFactory@141ea0d),segFN=segments_1,generation=1}
   [junit4]   2> 625006 T2240 oasc.RequestHandlers.initHandlersFromConfig created /update: solr.UpdateRequestHandler
   [junit4]   2> 625007 T2240 oasc.RequestHandlers.initHandlersFromConfig created /admin/: org.apache.solr.handler.admin.AdminHandlers
   [junit4]   2> 625010 T2212 oass.FileExchangeRateProvider.reload Reloading exchange rates from file currency.xml
   [junit4]   2> 625006 T2225 oasc.SolrDeletionPolicy.updateCommits newest commit generation = 1
   [junit4]   2> 625010 T2240 oashl.XMLLoader.init xsltCacheLifetimeSeconds=60
   [junit4]   2> 625015 T2240 oass.SolrIndexSearcher.<init> Opening Searcher@1041c4 main
   [junit4]   2> 625016 T2240 oasu.CommitTracker.<init> Hard AutoCommit: disabled
   [junit4]   2> 625016 T2240 oasu.CommitTracker.<init> Soft AutoCommit: disabled
   [junit4]   2> 625017 T2212 oass.OpenExchangeRatesOrgProvider.reload Reloading exchange rates from open-exchange-rates.json
   [junit4]   2> 625018 T2225 oasup.UpdateRequestProcessorChain.init inserting DistributedUpdateProcessorFactory into updateRequestProcessorChain "dedupe"
   [junit4]   2> 625018 T2212 oass.OpenExchangeRatesOrgProvider$OpenExchangeRates.<init> WARN Unknown key IMPORTANT NOTE
   [junit4]   2> 625019 T2212 oass.OpenExchangeRatesOrgProvider$OpenExchangeRates.<init> WARN Expected key, got STRING
   [junit4]   2> 625019 T2212 oass.OpenExchangeRatesOrgProvider.reload Reloading exchange rates from open-exchange-rates.json
   [junit4]   2> 625018 T2225 oasup.UpdateRequestProcessorChain.init inserting DistributedUpdateProcessorFactory into updateRequestProcessorChain "stored_sig"
   [junit4]   2> 625020 T2266 oasc.SolrCore.registerSearcher [nodes_used_collection_shard2_replica2] Registered new searcher Searcher@1041c4 main{StandardDirectoryReader(segments_1:1)}
   [junit4]   2> 625021 T2225 oasup.UpdateRequestProcessorChain.init inserting DistributedUpdateProcessorFactory into updateRequestProcessorChain "distrib-dup-test-chain-implicit"
   [junit4]   2> 625021 T2212 oass.OpenExchangeRatesOrgProvider$OpenExchangeRates.<init> WARN Unknown key IMPORTANT NOTE
   [junit4]   2> 625021 T2212 oass.OpenExchangeRatesOrgProvider$OpenExchangeRates.<init> WARN Expected key, got STRING
   [junit4]   2> 625021 T2225 oasc.RequestHandlers.initHandlersFromConfig created standard: solr.StandardRequestHandler
   [junit4]   2> 625022 T2212 oasc.SolrCore.initDirectoryFactory org.apache.solr.core.MockDirectoryFactory
   [junit4]   2> 625022 T2225 oasc.RequestHandlers.initHandlersFromConfig created /get: solr.RealTimeGetHandler
   [junit4]   2> 625022 T2225 oasc.RequestHandlers.initHandlersFromConfig adding lazy requestHandler: solr.ReplicationHandler
   [junit4]   2> 625022 T2212 oasc.SolrCore.<init> [nodes_used_collection_shard1_replica1] Opening new SolrCore at /mnt/ssd/jenkins/workspace/Lucene-Solr-trunk-Linux/solr/build/solr-core/test/J1/./org.apache.solr.cloud.CollectionsAPIDistributedZkTest-jetty1-1375407925784/nodes_used_collection_shard1_replica1/, dataDir=/mnt/ssd/jenkins/workspace/Lucene-Solr-trunk-Linux/solr/build/solr-core/test/J1/./org.apache.solr.cloud.CollectionsAPIDistributedZkTest-jetty1-1375407925784//nodes_used_collection_shard1_replica1/data/
   [junit4]   2> 625023 T2225 oasc.RequestHandlers.initHandlersFromConfig created /replication: solr.ReplicationHandler
   [junit4]   2> 625023 T2240 oasc.CoreContainer.registerCore registering core: nodes_used_collection_shard2_replica2
   [junit4]   2> 625023 T2225 oasc.RequestHandlers.initHandlersFromConfig created /update: solr.UpdateRequestHandler
   [junit4]   2> 625023 T2212 oasc.JmxMonitoredMap.<init> JMX monitoring is enabled. Adding Solr mbeans to JMX Server: com.sun.jmx.mbeanserver.JmxMBeanServer@3396b1
   [junit4]   2> 625024 T2225 oasc.RequestHandlers.initHandlersFromConfig created /admin/: org.apache.solr.handler.admin.AdminHandlers
   [junit4]   2> 625024 T2240 oasc.ZkController.register Register replica - core:nodes_used_collection_shard2_replica2 address:http://127.0.0.1:40305/z_ collection:nodes_used_collection shard:shard2
   [junit4]   2> 625025 T2212 oasc.CachingDirectoryFactory.get return new directory for /mnt/ssd/jenkins/workspace/Lucene-Solr-trunk-Linux/solr/build/solr-core/test/J1/./org.apache.solr.cloud.CollectionsAPIDistributedZkTest-jetty1-1375407925784//nodes_used_collection_shard1_replica1/data
   [junit4]   2> 625025 T2240 oascsi.HttpClientUtil.createClient Creating new http client, config:maxConnections=10000&maxConnectionsPerHost=20&connTimeout=15000&socketTimeout=30000&retry=false
   [junit4]   2> 625025 T2212 oasc.SolrCore.getNewIndexDir New index directory detected: old=null new=/mnt/ssd/jenkins/workspace/Lucene-Solr-trunk-Linux/solr/build/solr-core/test/J1/./org.apache.solr.cloud.CollectionsAPIDistributedZkTest-jetty1-1375407925784//nodes_used_collection_shard1_replica1/data/index/
   [junit4]   2> 625026 T2212 oasc.SolrCore.initIndex WARN [nodes_used_collection_shard1_replica1] Solr index directory '/mnt/ssd/jenkins/workspace/Lucene-Solr-trunk-Linux/solr/build/solr-core/test/J1/./org.apache.solr.cloud.CollectionsAPIDistributedZkTest-jetty1-1375407925784/nodes_used_collection_shard1_replica1/data/index' doesn't exist. Creating new index...
   [junit4]   2> 625027 T2212 oasc.CachingDirectoryFactory.get return new directory for /mnt/ssd/jenkins/workspace/Lucene-Solr-trunk-Linux/solr/build/solr-core/test/J1/./org.apache.solr.cloud.CollectionsAPIDistributedZkTest-jetty1-1375407925784//nodes_used_collection_shard1_replica1/data/index
   [junit4]   2> 625028 T2225 oashl.XMLLoader.init xsltCacheLifetimeSeconds=60
   [junit4]   2> 625029 T2212 oasc.SolrDeletionPolicy.onCommit SolrDeletionPolicy.onCommit: commits: num=1
   [junit4]   2> 		commit{dir=MockDirWrapper(org.apache.lucene.store.RAMDirectory@a99791 lockFactory=org.apache.lucene.store.NativeFSLockFactory@6ed4db),segFN=segments_1,generation=1}
   [junit4]   2> 625030 T2212 oasc.SolrDeletionPolicy.updateCommits newest commit generation = 1
   [junit4]   2> 625032 T2225 oass.SolrIndexSearcher.<init> Opening Searcher@ba73f3 main
   [junit4]   2> 625034 T2225 oasu.CommitTracker.<init> Hard AutoCommit: disabled
   [junit4]   2> 625034 T2225 oasu.CommitTracker.<init> Soft AutoCommit: disabled
   [junit4]   2> 625034 T2212 oasup.UpdateRequestProcessorChain.init inserting DistributedUpdateProcessorFactory into updateRequestProcessorChain "dedupe"
   [junit4]   2> 625036 T2212 oasup.UpdateRequestProcessorChain.init inserting DistributedUpdateProcessorFactory into updateRequestProcessorChain "stored_sig"
   [junit4]   2> 625037 T2212 oasup.UpdateRequestProcessorChain.init inserting DistributedUpdateProcessorFactory into updateRequestProcessorChain "distrib-dup-test-chain-implicit"
   [junit4]   2> 625037 T2212 oasc.RequestHandlers.initHandlersFromConfig created standard: solr.StandardRequestHandler
   [junit4]   2> 625037 T2212 oasc.RequestHandlers.initHandlersFromConfig created /get: solr.RealTimeGetHandler
   [junit4]   2> 625038 T2212 oasc.RequestHandlers.initHandlersFromConfig adding lazy requestHandler: solr.ReplicationHandler
   [junit4]   2> 625038 T2212 oasc.RequestHandlers.initHandlersFromConfig created /replication: solr.ReplicationHandler
   [junit4]   2> 625039 T2212 oasc.RequestHandlers.initHandlersFromConfig created /update: solr.UpdateRequestHandler
   [junit4]   2> 625039 T2212 oasc.RequestHandlers.initHandlersFromConfig created /admin/: org.apache.solr.handler.admin.AdminHandlers
   [junit4]   2> 625039 T2267 oasc.SolrCore.registerSearcher [nodes_used_collection_shard1_replica2] Registered new searcher Searcher@ba73f3 main{StandardDirectoryReader(segments_1:1)}
   [junit4]   2> 625041 T2225 oasc.CoreContainer.registerCore registering core: nodes_used_collection_shard1_replica2
   [junit4]   2> 625041 T2225 oasc.ZkController.register Register replica - core:nodes_used_collection_shard1_replica2 address:http://127.0.0.1:51253/z_ collection:nodes_used_collection shard:shard1
   [junit4]   2> 625042 T2225 oascsi.HttpClientUtil.createClient Creating new http client, config:maxConnections=10000&maxConnectionsPerHost=20&connTimeout=15000&socketTimeout=30000&retry=false
   [junit4]   2> 625043 T2212 oashl.XMLLoader.init xsltCacheLifetimeSeconds=60
   [junit4]   2> 625046 T2212 oass.SolrIndexSearcher.<init> Opening Searcher@181b170 main
   [junit4]   2> 625046 T2212 oasu.CommitTracker.<init> Hard AutoCommit: disabled
   [junit4]   2> 625047 T2225 oascc.SolrZkClient.makePath makePath: /collections/nodes_used_collection/leader_elect/shard1/election
   [junit4]   2> 625047 T2212 oasu.CommitTracker.<init> Soft AutoCommit: disabled
   [junit4]   2> 625052 T2225 oasc.ShardLeaderElectionContext.runLeaderProcess Running the leader process for shard shard1
   [junit4]   2> 625055 T2225 oasc.ShardLeaderElectionContext.waitForReplicasToComeUp Waiting until we see more replicas up for shard shard1: total=2 found=1 timeoutin=180000
   [junit4]   2> 625056 T2268 oasc.SolrCore.registerSearcher [nodes_used_collection_shard1_replica1] Registered new searcher Searcher@181b170 main{StandardDirectoryReader(segments_1:1)}
   [junit4]   2> 625057 T2212 oasc.CoreContainer.registerCore registering core: nodes_used_collection_shard1_replica1
   [junit4]   2> 625058 T2212 oasc.ZkController.register Register replica - core:nodes_used_collection_shard1_replica1 address:http://127.0.0.1:47660/z_ collection:nodes_used_collection shard:shard1
   [junit4]   2> 625058 T2212 oascsi.HttpClientUtil.createClient Creating new http client, config:maxConnections=10000&maxConnectionsPerHost=20&connTimeout=15000&socketTimeout=30000&retry=false
   [junit4]   2> 625182 T2200 oascc.ZkStateReader.updateClusterState Updating cloud state from ZooKeeper... 
   [junit4]   2> 625187 T2217 oascc.ZkStateReader$2.process A cluster state change: WatchedEvent state:SyncConnected type:NodeDataChanged path:/clusterstate.json, has occurred - updating... (live nodes size: 5)
   [junit4]   2> 625187 T2245 oascc.ZkStateReader$2.process A cluster state change: WatchedEvent state:SyncConnected type:NodeDataChanged path:/clusterstate.json, has occurred - updating... (live nodes size: 5)
   [junit4]   2> 625187 T2199 oascc.ZkStateReader$2.process A cluster state change: WatchedEvent state:SyncConnected type:NodeDataChanged path:/clusterstate.json, has occurred - updating... (live nodes size: 5)
   [junit4]   2> 625188 T2231 oascc.ZkStateReader$2.process A cluster state change: WatchedEvent state:SyncConnected type:NodeDataChanged path:/clusterstate.json, has occurred - updating... (live nodes size: 5)
   [junit4]   2> 625187 T2259 oascc.ZkStateReader$2.process A cluster state change: WatchedEvent state:SyncConnected type:NodeDataChanged path:/clusterstate.json, has occurred - updating... (live nodes size: 5)
   [junit4]   2> 625187 T2204 oascc.ZkStateReader$2.process A cluster state change: WatchedEvent state:SyncConnected type:NodeDataChanged path:/clusterstate.json, has occurred - updating... (live nodes size: 5)
   [junit4]   2> 625504 T2252 oasc.ShardLeaderElectionContext.waitForReplicasToComeUp Enough replicas found to continue.
   [junit4]   2> 625505 T2252 oasc.ShardLeaderElectionContext.runLeaderProcess I may be the new leader - try and sync
   [junit4]   2> 625505 T2252 oasc.SyncStrategy.sync Sync replicas to http://127.0.0.1:42343/z_/nodes_used_collection_shard2_replica1/
   [junit4]   2> 625505 T2252 oasu.PeerSync.sync PeerSync: core=nodes_used_collection_shard2_replica1 url=http://127.0.0.1:42343/z_ START replicas=[http://127.0.0.1:40305/z_/nodes_used_collection_shard2_replica2/] nUpdates=100
   [junit4]   2> 625506 T2252 oasu.PeerSync.sync PeerSync: core=nodes_used_collection_shard2_replica1 url=http://127.0.0.1:42343/z_ DONE.  We have no versions.  sync failed.
   [junit4]   2> 625506 T2252 oasc.SyncStrategy.syncReplicas Leader's attempt to sync with shard failed, moving to the next candidate
   [junit4]   2> 625507 T2252 oasc.ShardLeaderElectionContext.runLeaderProcess We failed sync, but we have no versions - we can't sync in that case - we were active before, so become leader anyway
   [junit4]   2> 625507 T2252 oasc.ShardLeaderElectionContext.runLeaderProcess I am the new leader: http://127.0.0.1:42343/z_/nodes_used_collection_shard2_replica1/ shard2
   [junit4]   2> 625508 T2252 oascc.SolrZkClient.makePath makePath: /collections/nodes_used_collection/leaders/shard2
   [junit4]   2> ASYNC  NEW_CORE C416 name=nodes_used_collection_shard2_replica2 org.apache.solr.core.SolrCore@16c0174 url=http://127.0.0.1:40305/z_/nodes_used_collection_shard2_replica2 node=127.0.0.1:40305_z_ C416_STATE=coll:nodes_used_collection core:nodes_used_collection_shard2_replica2 props:{state=down, core=nodes_used_collection_shard2_replica2, node_name=127.0.0.1:40305_z_, base_url=http://127.0.0.1:40305/z_}
   [junit4]   2> 625515 T2239 C416 P40305 oasc.SolrCore.execute [nodes_used_collection_shard2_replica2] webapp=/z_ path=/get params={getVersions=100&distrib=false&wt=javabin&qt=/get&version=2} status=0 QTime=2 
   [junit4]   2> 625556 T2225 oasc.ShardLeaderElectionContext.waitForReplicasToComeUp Enough replicas found to continue.
   [junit4]   2> 625557 T2225 oasc.ShardLeaderElectionContext.runLeaderProcess I may be the new leader - try and sync
   [junit4]   2> 625557 T2225 oasc.SyncStrategy.sync Sync replicas to http://127.0.0.1:51253/z_/nodes_used_collection_shard1_replica2/
   [junit4]   2> 625557 T2225 oasu.PeerSync.sync PeerSync: core=nodes_used_collection_shard1_replica2 url=http://127.0.0.1:51253/z_ START replicas=[http://127.0.0.1:47660/z_/nodes_used_collection_shard1_replica1/] nUpdates=100
   [juni

[...truncated too long message...]

tConnectException: Connection to http://127.0.0.1:51253 refused
   [junit4]    > 	at org.apache.http.impl.conn.DefaultClientConnectionOperator.openConnection(DefaultClientConnectionOperator.java:190)
   [junit4]    > 	at org.apache.http.impl.conn.ManagedClientConnectionImpl.open(ManagedClientConnectionImpl.java:294)
   [junit4]    > 	at org.apache.http.impl.client.DefaultRequestDirector.tryConnect(DefaultRequestDirector.java:645)
   [junit4]    > 	at org.apache.http.impl.client.DefaultRequestDirector.execute(DefaultRequestDirector.java:480)
   [junit4]    > 	at org.apache.http.impl.client.AbstractHttpClient.execute(AbstractHttpClient.java:906)
   [junit4]    > 	at org.apache.http.impl.client.AbstractHttpClient.execute(AbstractHttpClient.java:805)
   [junit4]    > 	at org.apache.http.impl.client.AbstractHttpClient.execute(AbstractHttpClient.java:784)
   [junit4]    > 	at org.apache.solr.client.solrj.impl.HttpSolrServer.request(HttpSolrServer.java:365)
   [junit4]    > 	... 45 more
   [junit4]    > Caused by: java.net.ConnectException: Connection refused
   [junit4]    > 	at java.net.PlainSocketImpl.socketConnect(Native Method)
   [junit4]    > 	at java.net.AbstractPlainSocketImpl.doConnect(AbstractPlainSocketImpl.java:339)
   [junit4]    > 	at java.net.AbstractPlainSocketImpl.connectToAddress(AbstractPlainSocketImpl.java:200)
   [junit4]    > 	at java.net.AbstractPlainSocketImpl.connect(AbstractPlainSocketImpl.java:182)
   [junit4]    > 	at java.net.SocksSocketImpl.connect(SocksSocketImpl.java:392)
   [junit4]    > 	at java.net.Socket.connect(Socket.java:579)
   [junit4]    > 	at org.apache.http.conn.scheme.PlainSocketFactory.connectSocket(PlainSocketFactory.java:127)
   [junit4]    > 	at org.apache.http.impl.conn.DefaultClientConnectionOperator.openConnection(DefaultClientConnectionOperator.java:180)
   [junit4]    > 	... 52 more
   [junit4]   2> 739720 T2177 oas.SolrTestCaseJ4.deleteCore ###deleteCore
   [junit4]   2> 124132 T2176 ccr.ThreadLeakControl.checkThreadLeaks WARNING Will linger awaiting termination of 2 leaked thread(s).
   [junit4]   2> 740921 T2259 oasc.LeaderElector$1.process WARN  org.apache.zookeeper.KeeperException$SessionExpiredException: KeeperErrorCode = Session expired for /collections/new_implicit_coll_0/leader_elect/a/election
   [junit4]   2> 	at org.apache.zookeeper.KeeperException.create(KeeperException.java:127)
   [junit4]   2> 	at org.apache.zookeeper.KeeperException.create(KeeperException.java:51)
   [junit4]   2> 	at org.apache.zookeeper.ZooKeeper.getChildren(ZooKeeper.java:1468)
   [junit4]   2> 	at org.apache.solr.common.cloud.SolrZkClient$6.execute(SolrZkClient.java:235)
   [junit4]   2> 	at org.apache.solr.common.cloud.SolrZkClient$6.execute(SolrZkClient.java:232)
   [junit4]   2> 	at org.apache.solr.common.cloud.ZkCmdExecutor.retryOperation(ZkCmdExecutor.java:65)
   [junit4]   2> 	at org.apache.solr.common.cloud.SolrZkClient.getChildren(SolrZkClient.java:232)
   [junit4]   2> 	at org.apache.solr.cloud.LeaderElector.checkIfIamLeader(LeaderElector.java:84)
   [junit4]   2> 	at org.apache.solr.cloud.LeaderElector.access$000(LeaderElector.java:55)
   [junit4]   2> 	at org.apache.solr.cloud.LeaderElector$1.process(LeaderElector.java:129)
   [junit4]   2> 	at org.apache.zookeeper.ClientCnxn$EventThread.processEvent(ClientCnxn.java:519)
   [junit4]   2> 	at org.apache.zookeeper.ClientCnxn$EventThread.run(ClientCnxn.java:495)
   [junit4]   2> 
   [junit4]   2> 740922 T2259 oascc.ZkStateReader$3.process WARN ZooKeeper watch triggered, but Solr cannot talk to ZK
   [junit4]   2> 740922 T2259 oascc.ZkStateReader$2.process A cluster state change: WatchedEvent state:SyncConnected type:NodeChildrenChanged path:/live_nodes, has occurred - updating... (live nodes size: 1)
   [junit4]   2> 740923 T2259 oascc.ZkStateReader$2.process WARN ZooKeeper watch triggered, but Solr cannot talk to ZK
   [junit4]   2> 740923 T2259 oasc.LeaderElector$1.process WARN  org.apache.zookeeper.KeeperException$SessionExpiredException: KeeperErrorCode = Session expired for /collections/new_implicit_coll_0/leader_elect/b/election
   [junit4]   2> 	at org.apache.zookeeper.KeeperException.create(KeeperException.java:127)
   [junit4]   2> 	at org.apache.zookeeper.KeeperException.create(KeeperException.java:51)
   [junit4]   2> 	at org.apache.zookeeper.ZooKeeper.getChildren(ZooKeeper.java:1468)
   [junit4]   2> 	at org.apache.solr.common.cloud.SolrZkClient$6.execute(SolrZkClient.java:235)
   [junit4]   2> 	at org.apache.solr.common.cloud.SolrZkClient$6.execute(SolrZkClient.java:232)
   [junit4]   2> 	at org.apache.solr.common.cloud.ZkCmdExecutor.retryOperation(ZkCmdExecutor.java:65)
   [junit4]   2> 	at org.apache.solr.common.cloud.SolrZkClient.getChildren(SolrZkClient.java:232)
   [junit4]   2> 	at org.apache.solr.cloud.LeaderElector.checkIfIamLeader(LeaderElector.java:84)
   [junit4]   2> 	at org.apache.solr.cloud.LeaderElector.access$000(LeaderElector.java:55)
   [junit4]   2> 	at org.apache.solr.cloud.LeaderElector$1.process(LeaderElector.java:129)
   [junit4]   2> 	at org.apache.zookeeper.ClientCnxn$EventThread.processEvent(ClientCnxn.java:519)
   [junit4]   2> 	at org.apache.zookeeper.ClientCnxn$EventThread.run(ClientCnxn.java:495)
   [junit4]   2> 
   [junit4]   2> 740923 T2259 oasc.LeaderElector$1.process WARN  org.apache.zookeeper.KeeperException$SessionExpiredException: KeeperErrorCode = Session expired for /collections/new_implicit_coll_0/leader_elect/d/election
   [junit4]   2> 	at org.apache.zookeeper.KeeperException.create(KeeperException.java:127)
   [junit4]   2> 	at org.apache.zookeeper.KeeperException.create(KeeperException.java:51)
   [junit4]   2> 	at org.apache.zookeeper.ZooKeeper.getChildren(ZooKeeper.java:1468)
   [junit4]   2> 	at org.apache.solr.common.cloud.SolrZkClient$6.execute(SolrZkClient.java:235)
   [junit4]   2> 	at org.apache.solr.common.cloud.SolrZkClient$6.execute(SolrZkClient.java:232)
   [junit4]   2> 	at org.apache.solr.common.cloud.ZkCmdExecutor.retryOperation(ZkCmdExecutor.java:65)
   [junit4]   2> 	at org.apache.solr.common.cloud.SolrZkClient.getChildren(SolrZkClient.java:232)
   [junit4]   2> 	at org.apache.solr.cloud.LeaderElector.checkIfIamLeader(LeaderElector.java:84)
   [junit4]   2> 	at org.apache.solr.cloud.LeaderElector.access$000(LeaderElector.java:55)
   [junit4]   2> 	at org.apache.solr.cloud.LeaderElector$1.process(LeaderElector.java:129)
   [junit4]   2> 	at org.apache.zookeeper.ClientCnxn$EventThread.processEvent(ClientCnxn.java:519)
   [junit4]   2> 	at org.apache.zookeeper.ClientCnxn$EventThread.run(ClientCnxn.java:495)
   [junit4]   2> 
   [junit4]   2> NOTE: test params are: codec=Lucene41, sim=DefaultSimilarity, locale=it_CH, timezone=Africa/Tunis
   [junit4]   2> NOTE: Linux 3.2.0-51-generic i386/Oracle Corporation 1.7.0_25 (32-bit)/cpus=8,threads=6,free=158274752,total=536870912
   [junit4]   2> NOTE: All tests run in this JVM: [ConvertedLegacyTest, FieldAnalysisRequestHandlerTest, NumericFieldsTest, SortByFunctionTest, HdfsRecoveryZkTest, URLClassifyProcessorTest, TestCodecSupport, TestAddFieldRealTimeGet, BasicZkTest, SpellPossibilityIteratorTest, TestCollationField, TestDefaultSimilarityFactory, TestCopyFieldCollectionResource, TestJmxMonitoredMap, DirectSolrSpellCheckerTest, UniqFieldsUpdateProcessorFactoryTest, StatsComponentTest, TestCoreDiscovery, FileUtilsTest, TestUniqueKeyFieldResource, DeleteShardTest, StandardRequestHandlerTest, TestReloadAndDeleteDocs, TestStressLucene, SimplePostToolTest, ClusterStateTest, LeaderElectionIntegrationTest, SuggesterWFSTTest, TimeZoneUtilsTest, DistanceFunctionTest, TestAtomicUpdateErrorCases, HighlighterConfigTest, SolrCoreCheckLockOnStartupTest, SolrCmdDistributorTest, CoreAdminCreateDiscoverTest, HighlighterTest, TestDistributedSearch, BadIndexSchemaTest, TestOmitPositions, TestPartialUpdateDeduplication, IndexReaderFactoryTest, ShardRoutingCustomTest, DocValuesMultiTest, TestPropInject, TestFastOutputStream, TestSchemaResource, TestAnalyzedSuggestions, TestPostingsSolrHighlighter, TestRTGBase, TestIndexSearcher, TestLuceneMatchVersion, OpenExchangeRatesOrgProviderTest, HdfsBasicDistributedZk2Test, HdfsDirectoryTest, CurrencyFieldOpenExchangeTest, HdfsSyncSliceTest, TestCloudManagedSchema, DateMathParserTest, CopyFieldTest, RequiredFieldsTest, MultiTermTest, TestReload, XmlUpdateRequestHandlerTest, TestStressReorder, ZkNodePropsTest, DisMaxRequestHandlerTest, TestQuerySenderNoQuery, XsltUpdateRequestHandlerTest, TestRandomMergePolicy, SolrIndexConfigTest, TermVectorComponentDistributedTest, CurrencyFieldXmlFileTest, TestSolrJ, ChaosMonkeySafeLeaderTest, BasicDistributedZk2Test, UnloadDistributedZkTest, CollectionsAPIDistributedZkTest]
   [junit4] Completed on J1 in 125.42s, 1 test, 1 error <<< FAILURES!

[...truncated 494 lines...]
BUILD FAILED
/mnt/ssd/jenkins/workspace/Lucene-Solr-trunk-Linux/build.xml:389: The following error occurred while executing this line:
/mnt/ssd/jenkins/workspace/Lucene-Solr-trunk-Linux/build.xml:369: The following error occurred while executing this line:
/mnt/ssd/jenkins/workspace/Lucene-Solr-trunk-Linux/build.xml:39: The following error occurred while executing this line:
/mnt/ssd/jenkins/workspace/Lucene-Solr-trunk-Linux/solr/build.xml:181: The following error occurred while executing this line:
/mnt/ssd/jenkins/workspace/Lucene-Solr-trunk-Linux/solr/common-build.xml:449: The following error occurred while executing this line:
/mnt/ssd/jenkins/workspace/Lucene-Solr-trunk-Linux/lucene/common-build.xml:1230: The following error occurred while executing this line:
/mnt/ssd/jenkins/workspace/Lucene-Solr-trunk-Linux/lucene/common-build.xml:873: There were test failures: 320 suites, 1347 tests, 1 error, 34 ignored (6 assumptions)

Total time: 42 minutes 39 seconds
Build step 'Invoke Ant' marked build as failure
Description set: Java: 32bit/jdk1.7.0_25 -server -XX:+UseG1GC
Archiving artifacts
Recording test results
Email was triggered for: Failure
Sending email for trigger: Failure



Mime
View raw message