lucene-dev mailing list archives

Site index · List index
Message view « Date » · « Thread »
Top « Date » · « Thread »
From Policeman Jenkins Server <jenk...@thetaphi.de>
Subject [JENKINS] Lucene-Solr-4.x-MacOSX (64bit/jdk1.6.0) - Build # 683 - Still Failing!
Date Sat, 03 Aug 2013 09:53:18 GMT
Build: http://jenkins.thetaphi.de/job/Lucene-Solr-4.x-MacOSX/683/
Java: 64bit/jdk1.6.0 -XX:-UseCompressedOops -XX:+UseParallelGC

1 tests failed.
FAILED:  org.apache.solr.cloud.CollectionsAPIDistributedZkTest.testDistribSearch

Error Message:
Server refused connection at: http://127.0.0.1:52779

Stack Trace:
org.apache.solr.client.solrj.SolrServerException: Server refused connection at: http://127.0.0.1:52779
	at __randomizedtesting.SeedInfo.seed([A8E7EE000B36490E:290160187C692932]:0)
	at org.apache.solr.client.solrj.impl.HttpSolrServer.request(HttpSolrServer.java:428)
	at org.apache.solr.client.solrj.impl.HttpSolrServer.request(HttpSolrServer.java:180)
	at org.apache.solr.cloud.CollectionsAPIDistributedZkTest.testCustomCollectionsAPI(CollectionsAPIDistributedZkTest.java:764)
	at org.apache.solr.cloud.CollectionsAPIDistributedZkTest.doTest(CollectionsAPIDistributedZkTest.java:159)
	at org.apache.solr.BaseDistributedSearchTestCase.testDistribSearch(BaseDistributedSearchTestCase.java:835)
	at sun.reflect.NativeMethodAccessorImpl.invoke0(Native Method)
	at sun.reflect.NativeMethodAccessorImpl.invoke(NativeMethodAccessorImpl.java:39)
	at sun.reflect.DelegatingMethodAccessorImpl.invoke(DelegatingMethodAccessorImpl.java:25)
	at java.lang.reflect.Method.invoke(Method.java:597)
	at com.carrotsearch.randomizedtesting.RandomizedRunner.invoke(RandomizedRunner.java:1559)
	at com.carrotsearch.randomizedtesting.RandomizedRunner.access$600(RandomizedRunner.java:79)
	at com.carrotsearch.randomizedtesting.RandomizedRunner$6.evaluate(RandomizedRunner.java:737)
	at com.carrotsearch.randomizedtesting.RandomizedRunner$7.evaluate(RandomizedRunner.java:773)
	at com.carrotsearch.randomizedtesting.RandomizedRunner$8.evaluate(RandomizedRunner.java:787)
	at com.carrotsearch.randomizedtesting.rules.SystemPropertiesRestoreRule$1.evaluate(SystemPropertiesRestoreRule.java:53)
	at org.apache.lucene.util.TestRuleSetupTeardownChained$1.evaluate(TestRuleSetupTeardownChained.java:50)
	at org.apache.lucene.util.TestRuleFieldCacheSanity$1.evaluate(TestRuleFieldCacheSanity.java:51)
	at org.apache.lucene.util.AbstractBeforeAfterRule$1.evaluate(AbstractBeforeAfterRule.java:46)
	at com.carrotsearch.randomizedtesting.rules.SystemPropertiesInvariantRule$1.evaluate(SystemPropertiesInvariantRule.java:55)
	at org.apache.lucene.util.TestRuleThreadAndTestName$1.evaluate(TestRuleThreadAndTestName.java:49)
	at org.apache.lucene.util.TestRuleIgnoreAfterMaxFailures$1.evaluate(TestRuleIgnoreAfterMaxFailures.java:70)
	at org.apache.lucene.util.TestRuleMarkFailure$1.evaluate(TestRuleMarkFailure.java:48)
	at com.carrotsearch.randomizedtesting.rules.StatementAdapter.evaluate(StatementAdapter.java:36)
	at com.carrotsearch.randomizedtesting.ThreadLeakControl$StatementRunner.run(ThreadLeakControl.java:358)
	at com.carrotsearch.randomizedtesting.ThreadLeakControl.forkTimeoutingTask(ThreadLeakControl.java:782)
	at com.carrotsearch.randomizedtesting.ThreadLeakControl$3.evaluate(ThreadLeakControl.java:442)
	at com.carrotsearch.randomizedtesting.RandomizedRunner.runSingleTest(RandomizedRunner.java:746)
	at com.carrotsearch.randomizedtesting.RandomizedRunner$3.evaluate(RandomizedRunner.java:648)
	at com.carrotsearch.randomizedtesting.RandomizedRunner$4.evaluate(RandomizedRunner.java:682)
	at com.carrotsearch.randomizedtesting.RandomizedRunner$5.evaluate(RandomizedRunner.java:693)
	at com.carrotsearch.randomizedtesting.rules.StatementAdapter.evaluate(StatementAdapter.java:36)
	at com.carrotsearch.randomizedtesting.rules.SystemPropertiesRestoreRule$1.evaluate(SystemPropertiesRestoreRule.java:53)
	at org.apache.lucene.util.AbstractBeforeAfterRule$1.evaluate(AbstractBeforeAfterRule.java:46)
	at org.apache.lucene.util.TestRuleStoreClassName$1.evaluate(TestRuleStoreClassName.java:42)
	at com.carrotsearch.randomizedtesting.rules.SystemPropertiesInvariantRule$1.evaluate(SystemPropertiesInvariantRule.java:55)
	at com.carrotsearch.randomizedtesting.rules.NoShadowingOrOverridesOnMethodsRule$1.evaluate(NoShadowingOrOverridesOnMethodsRule.java:39)
	at com.carrotsearch.randomizedtesting.rules.NoShadowingOrOverridesOnMethodsRule$1.evaluate(NoShadowingOrOverridesOnMethodsRule.java:39)
	at com.carrotsearch.randomizedtesting.rules.StatementAdapter.evaluate(StatementAdapter.java:36)
	at org.apache.lucene.util.TestRuleAssertionsRequired$1.evaluate(TestRuleAssertionsRequired.java:43)
	at org.apache.lucene.util.TestRuleMarkFailure$1.evaluate(TestRuleMarkFailure.java:48)
	at org.apache.lucene.util.TestRuleIgnoreAfterMaxFailures$1.evaluate(TestRuleIgnoreAfterMaxFailures.java:70)
	at org.apache.lucene.util.TestRuleIgnoreTestSuites$1.evaluate(TestRuleIgnoreTestSuites.java:55)
	at com.carrotsearch.randomizedtesting.rules.StatementAdapter.evaluate(StatementAdapter.java:36)
	at com.carrotsearch.randomizedtesting.ThreadLeakControl$StatementRunner.run(ThreadLeakControl.java:358)
	at java.lang.Thread.run(Thread.java:680)
Caused by: org.apache.http.conn.HttpHostConnectException: Connection to http://127.0.0.1:52779 refused
	at org.apache.http.impl.conn.DefaultClientConnectionOperator.openConnection(DefaultClientConnectionOperator.java:190)
	at org.apache.http.impl.conn.ManagedClientConnectionImpl.open(ManagedClientConnectionImpl.java:294)
	at org.apache.http.impl.client.DefaultRequestDirector.tryConnect(DefaultRequestDirector.java:645)
	at org.apache.http.impl.client.DefaultRequestDirector.execute(DefaultRequestDirector.java:480)
	at org.apache.http.impl.client.AbstractHttpClient.execute(AbstractHttpClient.java:906)
	at org.apache.http.impl.client.AbstractHttpClient.execute(AbstractHttpClient.java:805)
	at org.apache.http.impl.client.AbstractHttpClient.execute(AbstractHttpClient.java:784)
	at org.apache.solr.client.solrj.impl.HttpSolrServer.request(HttpSolrServer.java:365)
	... 44 more
Caused by: java.net.ConnectException: Connection refused
	at java.net.PlainSocketImpl.socketConnect(Native Method)
	at java.net.PlainSocketImpl.doConnect(PlainSocketImpl.java:382)
	at java.net.PlainSocketImpl.connectToAddress(PlainSocketImpl.java:241)
	at java.net.PlainSocketImpl.connect(PlainSocketImpl.java:228)
	at java.net.SocksSocketImpl.connect(SocksSocketImpl.java:431)
	at java.net.Socket.connect(Socket.java:527)
	at org.apache.http.conn.scheme.PlainSocketFactory.connectSocket(PlainSocketFactory.java:127)
	at org.apache.http.impl.conn.DefaultClientConnectionOperator.openConnection(DefaultClientConnectionOperator.java:180)
	... 51 more




Build Log:
[...truncated 9243 lines...]
   [junit4] Suite: org.apache.solr.cloud.CollectionsAPIDistributedZkTest
   [junit4]   2> 1926498 T4452 oas.BaseDistributedSearchTestCase.initHostContext Setting hostContext system property: /
   [junit4]   2> 1926505 T4452 oas.SolrTestCaseJ4.setUp ###Starting testDistribSearch
   [junit4]   2> Creating dataDir: /Users/jenkins/jenkins-slave/workspace/Lucene-Solr-4.x-MacOSX/solr/build/solr-core/test/J0/./solrtest-CollectionsAPIDistributedZkTest-1375521660857
   [junit4]   2> 1926512 T4452 oasc.ZkTestServer.run STARTING ZK TEST SERVER
   [junit4]   2> 1926513 T4453 oasc.ZkTestServer$ZKServerMain.runFromConfig Starting server
   [junit4]   2> 1926614 T4452 oasc.ZkTestServer.run start zk server on port:52772
   [junit4]   2> 1926633 T4452 oascc.ConnectionManager.waitForConnected Waiting for client to connect to ZooKeeper
   [junit4]   2> 1926640 T4459 oascc.ConnectionManager.process Watcher org.apache.solr.common.cloud.ConnectionManager@771b3c18 name:ZooKeeperConnection Watcher:127.0.0.1:52772 got event WatchedEvent state:SyncConnected type:None path:null path:null type:None
   [junit4]   2> 1926641 T4452 oascc.ConnectionManager.waitForConnected Client is connected to ZooKeeper
   [junit4]   2> 1926641 T4452 oascc.SolrZkClient.makePath makePath: /solr
   [junit4]   2> 1926687 T4452 oascc.ConnectionManager.waitForConnected Waiting for client to connect to ZooKeeper
   [junit4]   2> 1926689 T4461 oascc.ConnectionManager.process Watcher org.apache.solr.common.cloud.ConnectionManager@8c6092b name:ZooKeeperConnection Watcher:127.0.0.1:52772/solr got event WatchedEvent state:SyncConnected type:None path:null path:null type:None
   [junit4]   2> 1926689 T4452 oascc.ConnectionManager.waitForConnected Client is connected to ZooKeeper
   [junit4]   2> 1926689 T4452 oascc.SolrZkClient.makePath makePath: /collections/collection1
   [junit4]   2> 1926702 T4452 oascc.SolrZkClient.makePath makePath: /collections/collection1/shards
   [junit4]   2> 1926717 T4452 oascc.SolrZkClient.makePath makePath: /collections/control_collection
   [junit4]   2> 1926729 T4452 oascc.SolrZkClient.makePath makePath: /collections/control_collection/shards
   [junit4]   2> 1926740 T4452 oasc.AbstractZkTestCase.putConfig put /Users/jenkins/jenkins-slave/workspace/Lucene-Solr-4.x-MacOSX/solr/build/solr-core/test-files/solr/collection1/conf/solrconfig-tlog.xml to /configs/conf1/solrconfig.xml
   [junit4]   2> 1926741 T4452 oascc.SolrZkClient.makePath makePath: /configs/conf1/solrconfig.xml
   [junit4]   2> 1926756 T4452 oasc.AbstractZkTestCase.putConfig put /Users/jenkins/jenkins-slave/workspace/Lucene-Solr-4.x-MacOSX/solr/build/solr-core/test-files/solr/collection1/conf/schema.xml to /configs/conf1/schema.xml
   [junit4]   2> 1926757 T4452 oascc.SolrZkClient.makePath makePath: /configs/conf1/schema.xml
   [junit4]   2> 1926769 T4452 oasc.AbstractZkTestCase.putConfig put /Users/jenkins/jenkins-slave/workspace/Lucene-Solr-4.x-MacOSX/solr/build/solr-core/test-files/solr/collection1/conf/stopwords.txt to /configs/conf1/stopwords.txt
   [junit4]   2> 1926770 T4452 oascc.SolrZkClient.makePath makePath: /configs/conf1/stopwords.txt
   [junit4]   2> 1926785 T4452 oasc.AbstractZkTestCase.putConfig put /Users/jenkins/jenkins-slave/workspace/Lucene-Solr-4.x-MacOSX/solr/build/solr-core/test-files/solr/collection1/conf/protwords.txt to /configs/conf1/protwords.txt
   [junit4]   2> 1926788 T4452 oascc.SolrZkClient.makePath makePath: /configs/conf1/protwords.txt
   [junit4]   2> 1926799 T4452 oasc.AbstractZkTestCase.putConfig put /Users/jenkins/jenkins-slave/workspace/Lucene-Solr-4.x-MacOSX/solr/build/solr-core/test-files/solr/collection1/conf/currency.xml to /configs/conf1/currency.xml
   [junit4]   2> 1926800 T4452 oascc.SolrZkClient.makePath makePath: /configs/conf1/currency.xml
   [junit4]   2> 1926812 T4452 oasc.AbstractZkTestCase.putConfig put /Users/jenkins/jenkins-slave/workspace/Lucene-Solr-4.x-MacOSX/solr/build/solr-core/test-files/solr/collection1/conf/open-exchange-rates.json to /configs/conf1/open-exchange-rates.json
   [junit4]   2> 1926813 T4452 oascc.SolrZkClient.makePath makePath: /configs/conf1/open-exchange-rates.json
   [junit4]   2> 1926824 T4452 oasc.AbstractZkTestCase.putConfig put /Users/jenkins/jenkins-slave/workspace/Lucene-Solr-4.x-MacOSX/solr/build/solr-core/test-files/solr/collection1/conf/mapping-ISOLatin1Accent.txt to /configs/conf1/mapping-ISOLatin1Accent.txt
   [junit4]   2> 1926825 T4452 oascc.SolrZkClient.makePath makePath: /configs/conf1/mapping-ISOLatin1Accent.txt
   [junit4]   2> 1926837 T4452 oasc.AbstractZkTestCase.putConfig put /Users/jenkins/jenkins-slave/workspace/Lucene-Solr-4.x-MacOSX/solr/build/solr-core/test-files/solr/collection1/conf/old_synonyms.txt to /configs/conf1/old_synonyms.txt
   [junit4]   2> 1926839 T4452 oascc.SolrZkClient.makePath makePath: /configs/conf1/old_synonyms.txt
   [junit4]   2> 1926860 T4452 oasc.AbstractZkTestCase.putConfig put /Users/jenkins/jenkins-slave/workspace/Lucene-Solr-4.x-MacOSX/solr/build/solr-core/test-files/solr/collection1/conf/synonyms.txt to /configs/conf1/synonyms.txt
   [junit4]   2> 1926861 T4452 oascc.SolrZkClient.makePath makePath: /configs/conf1/synonyms.txt
   [junit4]   2> 1927435 T4452 oejs.Server.doStart jetty-8.1.10.v20130312
   [junit4]   2> 1927441 T4452 oejs.AbstractConnector.doStart Started SelectChannelConnector@127.0.0.1:52775
   [junit4]   2> 1927442 T4452 oass.SolrDispatchFilter.init SolrDispatchFilter.init()
   [junit4]   2> 1927446 T4452 oasc.SolrResourceLoader.locateSolrHome JNDI not configured for solr (NoInitialContextEx)
   [junit4]   2> 1927447 T4452 oasc.SolrResourceLoader.locateSolrHome using system property solr.solr.home: /Users/jenkins/jenkins-slave/workspace/Lucene-Solr-4.x-MacOSX/solr/build/solr-core/test/J0/./org.apache.solr.cloud.CollectionsAPIDistributedZkTest-controljetty-1375521661225
   [junit4]   2> 1927447 T4452 oasc.SolrResourceLoader.<init> new SolrResourceLoader for directory: '/Users/jenkins/jenkins-slave/workspace/Lucene-Solr-4.x-MacOSX/solr/build/solr-core/test/J0/./org.apache.solr.cloud.CollectionsAPIDistributedZkTest-controljetty-1375521661225/'
   [junit4]   2> 1927555 T4452 oasc.ConfigSolr.fromFile Loading container configuration from /Users/jenkins/jenkins-slave/workspace/Lucene-Solr-4.x-MacOSX/solr/build/solr-core/test/J0/./org.apache.solr.cloud.CollectionsAPIDistributedZkTest-controljetty-1375521661225/solr.xml
   [junit4]   2> 1927702 T4452 oasc.ConfigSolrXml.<init> Config-defined core root directory: 
   [junit4]   2> 1927703 T4452 oasc.CoreContainer.<init> New CoreContainer 1091027104
   [junit4]   2> 1927703 T4452 oasc.CoreContainer.load Loading cores into CoreContainer [instanceDir=/Users/jenkins/jenkins-slave/workspace/Lucene-Solr-4.x-MacOSX/solr/build/solr-core/test/J0/./org.apache.solr.cloud.CollectionsAPIDistributedZkTest-controljetty-1375521661225/]
   [junit4]   2> 1927704 T4452 oashc.HttpShardHandlerFactory.getParameter Setting socketTimeout to: 120000
   [junit4]   2> 1927705 T4452 oashc.HttpShardHandlerFactory.getParameter Setting urlScheme to: http://
   [junit4]   2> 1927705 T4452 oashc.HttpShardHandlerFactory.getParameter Setting connTimeout to: 15000
   [junit4]   2> 1927706 T4452 oashc.HttpShardHandlerFactory.getParameter Setting maxConnectionsPerHost to: 20
   [junit4]   2> 1927706 T4452 oashc.HttpShardHandlerFactory.getParameter Setting corePoolSize to: 0
   [junit4]   2> 1927707 T4452 oashc.HttpShardHandlerFactory.getParameter Setting maximumPoolSize to: 2147483647
   [junit4]   2> 1927707 T4452 oashc.HttpShardHandlerFactory.getParameter Setting maxThreadIdleTime to: 5
   [junit4]   2> 1927708 T4452 oashc.HttpShardHandlerFactory.getParameter Setting sizeOfQueue to: -1
   [junit4]   2> 1927708 T4452 oashc.HttpShardHandlerFactory.getParameter Setting fairnessPolicy to: false
   [junit4]   2> 1927709 T4452 oascsi.HttpClientUtil.createClient Creating new http client, config:maxConnectionsPerHost=20&maxConnections=10000&socketTimeout=120000&connTimeout=15000&retry=false
   [junit4]   2> 1927797 T4452 oasc.ZkContainer.initZooKeeper Zookeeper client=127.0.0.1:52772/solr
   [junit4]   2> 1927798 T4452 oasc.ZkController.checkChrootPath zkHost includes chroot
   [junit4]   2> 1927799 T4452 oascc.ConnectionManager.waitForConnected Waiting for client to connect to ZooKeeper
   [junit4]   2> 1927830 T4472 oascc.ConnectionManager.process Watcher org.apache.solr.common.cloud.ConnectionManager@63f769ba name:ZooKeeperConnection Watcher:127.0.0.1:52772 got event WatchedEvent state:SyncConnected type:None path:null path:null type:None
   [junit4]   2> 1927831 T4452 oascc.ConnectionManager.waitForConnected Client is connected to ZooKeeper
   [junit4]   2> 1927848 T4452 oascsi.HttpClientUtil.createClient Creating new http client, config:maxConnections=500&maxConnectionsPerHost=16&socketTimeout=120000&connTimeout=15000
   [junit4]   2> 1927911 T4452 oascc.ConnectionManager.waitForConnected Waiting for client to connect to ZooKeeper
   [junit4]   2> 1927933 T4474 oascc.ConnectionManager.process Watcher org.apache.solr.common.cloud.ConnectionManager@17ff929c name:ZooKeeperConnection Watcher:127.0.0.1:52772/solr got event WatchedEvent state:SyncConnected type:None path:null path:null type:None
   [junit4]   2> 1927933 T4452 oascc.ConnectionManager.waitForConnected Client is connected to ZooKeeper
   [junit4]   2> 1927940 T4452 oascc.SolrZkClient.makePath makePath: /overseer/queue
   [junit4]   2> 1927957 T4452 oascc.SolrZkClient.makePath makePath: /overseer/collection-queue-work
   [junit4]   2> 1927971 T4452 oascc.SolrZkClient.makePath makePath: /live_nodes
   [junit4]   2> 1927988 T4452 oasc.ZkController.createEphemeralLiveNode Register node as live in ZooKeeper:/live_nodes/127.0.0.1:52775_
   [junit4]   2> 1927991 T4452 oascc.SolrZkClient.makePath makePath: /live_nodes/127.0.0.1:52775_
   [junit4]   2> 1928018 T4452 oascc.SolrZkClient.makePath makePath: /overseer_elect/election
   [junit4]   2> 1928069 T4452 oascc.SolrZkClient.makePath makePath: /overseer_elect/leader
   [junit4]   2> 1928093 T4452 oasc.Overseer.start Overseer (id=90146187566579715-127.0.0.1:52775_-n_0000000000) starting
   [junit4]   2> 1928104 T4452 oascc.SolrZkClient.makePath makePath: /overseer/queue-work
   [junit4]   2> 1928117 T4476 oasc.OverseerCollectionProcessor.run Process current queue of collection creations
   [junit4]   2> 1928130 T4452 oascc.SolrZkClient.makePath makePath: /clusterstate.json
   [junit4]   2> 1928141 T4452 oascc.SolrZkClient.makePath makePath: /aliases.json
   [junit4]   2> 1928148 T4452 oascc.ZkStateReader.createClusterStateWatchersAndUpdate Updating cluster state from ZooKeeper... 
   [junit4]   2> 1928161 T4475 oasc.Overseer$ClusterStateUpdater.run Starting to work on the main queue
   [junit4]   2> 1928162 T4452 oasc.CorePropertiesLocator.discover Looking for core definitions underneath /Users/jenkins/jenkins-slave/workspace/Lucene-Solr-4.x-MacOSX/solr/build/solr-core/test/J0/./org.apache.solr.cloud.CollectionsAPIDistributedZkTest-controljetty-1375521661225
   [junit4]   2> 1928317 T4452 oasc.CorePropertiesLocator.discoverUnder Found core conf in /Users/jenkins/jenkins-slave/workspace/Lucene-Solr-4.x-MacOSX/solr/build/solr-core/test/J0/./org.apache.solr.cloud.CollectionsAPIDistributedZkTest-controljetty-1375521661225/conf/
   [junit4]   2> 1928323 T4452 oasc.CorePropertiesLocator.discover Found 1 core definitions
   [junit4]   2> 1928325 T4452 oass.SolrDispatchFilter.init user.dir=/Users/jenkins/jenkins-slave/workspace/Lucene-Solr-4.x-MacOSX/solr/build/solr-core/test/J0
   [junit4]   2> 1928325 T4452 oass.SolrDispatchFilter.init SolrDispatchFilter.init() done
   [junit4]   2> 1928326 T4452 oascsi.HttpClientUtil.createClient Creating new http client, config:maxConnections=128&maxConnectionsPerHost=32&followRedirects=false
   [junit4]   2> 1928367 T4452 oascsi.HttpClientUtil.createClient Creating new http client, config:
   [junit4]   2> 1928369 T4452 oascc.ConnectionManager.waitForConnected Waiting for client to connect to ZooKeeper
   [junit4]   2> 1928373 T4479 oascc.ConnectionManager.process Watcher org.apache.solr.common.cloud.ConnectionManager@33336b5b name:ZooKeeperConnection Watcher:127.0.0.1:52772/solr got event WatchedEvent state:SyncConnected type:None path:null path:null type:None
   [junit4]   2> 1928374 T4452 oascc.ConnectionManager.waitForConnected Client is connected to ZooKeeper
   [junit4]   2> 1928379 T4452 oascc.ZkStateReader.createClusterStateWatchersAndUpdate Updating cluster state from ZooKeeper... 
   [junit4]   2> 1928392 T4452 oasc.ChaosMonkey.monkeyLog monkey: init - expire sessions:true cause connection loss:true
   [junit4]   2> 1928902 T4452 oejs.Server.doStart jetty-8.1.10.v20130312
   [junit4]   2> 1928909 T4452 oejs.AbstractConnector.doStart Started SelectChannelConnector@127.0.0.1:52779
   [junit4]   2> 1928911 T4452 oass.SolrDispatchFilter.init SolrDispatchFilter.init()
   [junit4]   2> 1928912 T4452 oasc.SolrResourceLoader.locateSolrHome JNDI not configured for solr (NoInitialContextEx)
   [junit4]   2> 1928912 T4452 oasc.SolrResourceLoader.locateSolrHome using system property solr.solr.home: /Users/jenkins/jenkins-slave/workspace/Lucene-Solr-4.x-MacOSX/solr/build/solr-core/test/J0/./org.apache.solr.cloud.CollectionsAPIDistributedZkTest-jetty1-1375521662741
   [junit4]   2> 1928913 T4452 oasc.SolrResourceLoader.<init> new SolrResourceLoader for directory: '/Users/jenkins/jenkins-slave/workspace/Lucene-Solr-4.x-MacOSX/solr/build/solr-core/test/J0/./org.apache.solr.cloud.CollectionsAPIDistributedZkTest-jetty1-1375521662741/'
   [junit4]   2> 1928961 T4452 oasc.ConfigSolr.fromFile Loading container configuration from /Users/jenkins/jenkins-slave/workspace/Lucene-Solr-4.x-MacOSX/solr/build/solr-core/test/J0/./org.apache.solr.cloud.CollectionsAPIDistributedZkTest-jetty1-1375521662741/solr.xml
   [junit4]   2> 1929026 T4452 oasc.ConfigSolrXml.<init> Config-defined core root directory: 
   [junit4]   2> 1929026 T4452 oasc.CoreContainer.<init> New CoreContainer 149863866
   [junit4]   2> 1929027 T4452 oasc.CoreContainer.load Loading cores into CoreContainer [instanceDir=/Users/jenkins/jenkins-slave/workspace/Lucene-Solr-4.x-MacOSX/solr/build/solr-core/test/J0/./org.apache.solr.cloud.CollectionsAPIDistributedZkTest-jetty1-1375521662741/]
   [junit4]   2> 1929029 T4452 oashc.HttpShardHandlerFactory.getParameter Setting socketTimeout to: 120000
   [junit4]   2> 1929030 T4452 oashc.HttpShardHandlerFactory.getParameter Setting urlScheme to: http://
   [junit4]   2> 1929031 T4452 oashc.HttpShardHandlerFactory.getParameter Setting connTimeout to: 15000
   [junit4]   2> 1929032 T4452 oashc.HttpShardHandlerFactory.getParameter Setting maxConnectionsPerHost to: 20
   [junit4]   2> 1929033 T4452 oashc.HttpShardHandlerFactory.getParameter Setting corePoolSize to: 0
   [junit4]   2> 1929034 T4452 oashc.HttpShardHandlerFactory.getParameter Setting maximumPoolSize to: 2147483647
   [junit4]   2> 1929035 T4452 oashc.HttpShardHandlerFactory.getParameter Setting maxThreadIdleTime to: 5
   [junit4]   2> 1929036 T4452 oashc.HttpShardHandlerFactory.getParameter Setting sizeOfQueue to: -1
   [junit4]   2> 1929037 T4452 oashc.HttpShardHandlerFactory.getParameter Setting fairnessPolicy to: false
   [junit4]   2> 1929039 T4452 oascsi.HttpClientUtil.createClient Creating new http client, config:maxConnectionsPerHost=20&maxConnections=10000&socketTimeout=120000&connTimeout=15000&retry=false
   [junit4]   2> 1929088 T4452 oasc.ZkContainer.initZooKeeper Zookeeper client=127.0.0.1:52772/solr
   [junit4]   2> 1929089 T4452 oasc.ZkController.checkChrootPath zkHost includes chroot
   [junit4]   2> 1929090 T4452 oascc.ConnectionManager.waitForConnected Waiting for client to connect to ZooKeeper
   [junit4]   2> 1929097 T4490 oascc.ConnectionManager.process Watcher org.apache.solr.common.cloud.ConnectionManager@71ea02ea name:ZooKeeperConnection Watcher:127.0.0.1:52772 got event WatchedEvent state:SyncConnected type:None path:null path:null type:None
   [junit4]   2> 1929097 T4452 oascc.ConnectionManager.waitForConnected Client is connected to ZooKeeper
   [junit4]   2> 1929108 T4452 oascsi.HttpClientUtil.createClient Creating new http client, config:maxConnections=500&maxConnectionsPerHost=16&socketTimeout=120000&connTimeout=15000
   [junit4]   2> 1929145 T4452 oascc.ConnectionManager.waitForConnected Waiting for client to connect to ZooKeeper
   [junit4]   2> 1929151 T4492 oascc.ConnectionManager.process Watcher org.apache.solr.common.cloud.ConnectionManager@4a785c13 name:ZooKeeperConnection Watcher:127.0.0.1:52772/solr got event WatchedEvent state:SyncConnected type:None path:null path:null type:None
   [junit4]   2> 1929151 T4452 oascc.ConnectionManager.waitForConnected Client is connected to ZooKeeper
   [junit4]   2> 1929172 T4452 oascc.ZkStateReader.createClusterStateWatchersAndUpdate Updating cluster state from ZooKeeper... 
   [junit4]   2> 1930189 T4452 oasc.ZkController.createEphemeralLiveNode Register node as live in ZooKeeper:/live_nodes/127.0.0.1:52779_
   [junit4]   2> 1930193 T4452 oascc.SolrZkClient.makePath makePath: /live_nodes/127.0.0.1:52779_
   [junit4]   2> 1930209 T4479 oascc.ZkStateReader$3.process Updating live nodes... (2)
   [junit4]   2> 1930209 T4474 oascc.ZkStateReader$3.process Updating live nodes... (2)
   [junit4]   2> 1930211 T4492 oascc.ZkStateReader$3.process Updating live nodes... (2)
   [junit4]   2> 1930227 T4452 oasc.CorePropertiesLocator.discover Looking for core definitions underneath /Users/jenkins/jenkins-slave/workspace/Lucene-Solr-4.x-MacOSX/solr/build/solr-core/test/J0/./org.apache.solr.cloud.CollectionsAPIDistributedZkTest-jetty1-1375521662741
   [junit4]   2> 1930427 T4452 oasc.CorePropertiesLocator.discoverUnder Found core conf in /Users/jenkins/jenkins-slave/workspace/Lucene-Solr-4.x-MacOSX/solr/build/solr-core/test/J0/./org.apache.solr.cloud.CollectionsAPIDistributedZkTest-jetty1-1375521662741/conf/
   [junit4]   2> 1930434 T4452 oasc.CorePropertiesLocator.discover Found 1 core definitions
   [junit4]   2> 1930435 T4452 oass.SolrDispatchFilter.init user.dir=/Users/jenkins/jenkins-slave/workspace/Lucene-Solr-4.x-MacOSX/solr/build/solr-core/test/J0
   [junit4]   2> 1930435 T4452 oass.SolrDispatchFilter.init SolrDispatchFilter.init() done
   [junit4]   2> 1930436 T4452 oascsi.HttpClientUtil.createClient Creating new http client, config:maxConnections=128&maxConnectionsPerHost=32&followRedirects=false
   [junit4]   2> 1931372 T4452 oejs.Server.doStart jetty-8.1.10.v20130312
   [junit4]   2> 1931382 T4452 oejs.AbstractConnector.doStart Started SelectChannelConnector@127.0.0.1:52782
   [junit4]   2> 1931384 T4452 oass.SolrDispatchFilter.init SolrDispatchFilter.init()
   [junit4]   2> 1931385 T4452 oasc.SolrResourceLoader.locateSolrHome JNDI not configured for solr (NoInitialContextEx)
   [junit4]   2> 1931387 T4452 oasc.SolrResourceLoader.locateSolrHome using system property solr.solr.home: /Users/jenkins/jenkins-slave/workspace/Lucene-Solr-4.x-MacOSX/solr/build/solr-core/test/J0/./org.apache.solr.cloud.CollectionsAPIDistributedZkTest-jetty2-1375521664816
   [junit4]   2> 1931389 T4452 oasc.SolrResourceLoader.<init> new SolrResourceLoader for directory: '/Users/jenkins/jenkins-slave/workspace/Lucene-Solr-4.x-MacOSX/solr/build/solr-core/test/J0/./org.apache.solr.cloud.CollectionsAPIDistributedZkTest-jetty2-1375521664816/'
   [junit4]   2> 1931448 T4452 oasc.ConfigSolr.fromFile Loading container configuration from /Users/jenkins/jenkins-slave/workspace/Lucene-Solr-4.x-MacOSX/solr/build/solr-core/test/J0/./org.apache.solr.cloud.CollectionsAPIDistributedZkTest-jetty2-1375521664816/solr.xml
   [junit4]   2> 1931541 T4452 oasc.ConfigSolrXml.<init> Config-defined core root directory: 
   [junit4]   2> 1931542 T4452 oasc.CoreContainer.<init> New CoreContainer 823296486
   [junit4]   2> 1931543 T4452 oasc.CoreContainer.load Loading cores into CoreContainer [instanceDir=/Users/jenkins/jenkins-slave/workspace/Lucene-Solr-4.x-MacOSX/solr/build/solr-core/test/J0/./org.apache.solr.cloud.CollectionsAPIDistributedZkTest-jetty2-1375521664816/]
   [junit4]   2> 1931545 T4452 oashc.HttpShardHandlerFactory.getParameter Setting socketTimeout to: 120000
   [junit4]   2> 1931546 T4452 oashc.HttpShardHandlerFactory.getParameter Setting urlScheme to: http://
   [junit4]   2> 1931546 T4452 oashc.HttpShardHandlerFactory.getParameter Setting connTimeout to: 15000
   [junit4]   2> 1931547 T4452 oashc.HttpShardHandlerFactory.getParameter Setting maxConnectionsPerHost to: 20
   [junit4]   2> 1931548 T4452 oashc.HttpShardHandlerFactory.getParameter Setting corePoolSize to: 0
   [junit4]   2> 1931549 T4452 oashc.HttpShardHandlerFactory.getParameter Setting maximumPoolSize to: 2147483647
   [junit4]   2> 1931550 T4452 oashc.HttpShardHandlerFactory.getParameter Setting maxThreadIdleTime to: 5
   [junit4]   2> 1931550 T4452 oashc.HttpShardHandlerFactory.getParameter Setting sizeOfQueue to: -1
   [junit4]   2> 1931551 T4452 oashc.HttpShardHandlerFactory.getParameter Setting fairnessPolicy to: false
   [junit4]   2> 1931552 T4452 oascsi.HttpClientUtil.createClient Creating new http client, config:maxConnectionsPerHost=20&maxConnections=10000&socketTimeout=120000&connTimeout=15000&retry=false
   [junit4]   2> 1931623 T4452 oasc.ZkContainer.initZooKeeper Zookeeper client=127.0.0.1:52772/solr
   [junit4]   2> 1931627 T4452 oasc.ZkController.checkChrootPath zkHost includes chroot
   [junit4]   2> 1931630 T4452 oascc.ConnectionManager.waitForConnected Waiting for client to connect to ZooKeeper
   [junit4]   2> 1931636 T4504 oascc.ConnectionManager.process Watcher org.apache.solr.common.cloud.ConnectionManager@4874f01c name:ZooKeeperConnection Watcher:127.0.0.1:52772 got event WatchedEvent state:SyncConnected type:None path:null path:null type:None
   [junit4]   2> 1931637 T4452 oascc.ConnectionManager.waitForConnected Client is connected to ZooKeeper
   [junit4]   2> 1931646 T4452 oascsi.HttpClientUtil.createClient Creating new http client, config:maxConnections=500&maxConnectionsPerHost=16&socketTimeout=120000&connTimeout=15000
   [junit4]   2> 1931688 T4452 oascc.ConnectionManager.waitForConnected Waiting for client to connect to ZooKeeper
   [junit4]   2> 1931696 T4506 oascc.ConnectionManager.process Watcher org.apache.solr.common.cloud.ConnectionManager@224ce88a name:ZooKeeperConnection Watcher:127.0.0.1:52772/solr got event WatchedEvent state:SyncConnected type:None path:null path:null type:None
   [junit4]   2> 1931697 T4452 oascc.ConnectionManager.waitForConnected Client is connected to ZooKeeper
   [junit4]   2> 1931721 T4452 oascc.ZkStateReader.createClusterStateWatchersAndUpdate Updating cluster state from ZooKeeper... 
   [junit4]   2> 1932739 T4452 oasc.ZkController.createEphemeralLiveNode Register node as live in ZooKeeper:/live_nodes/127.0.0.1:52782_
   [junit4]   2> 1932742 T4452 oascc.SolrZkClient.makePath makePath: /live_nodes/127.0.0.1:52782_
   [junit4]   2> 1932764 T4492 oascc.ZkStateReader$3.process Updating live nodes... (3)
   [junit4]   2> 1932765 T4479 oascc.ZkStateReader$3.process Updating live nodes... (3)
   [junit4]   2> 1932766 T4474 oascc.ZkStateReader$3.process Updating live nodes... (3)
   [junit4]   2> 1932766 T4506 oascc.ZkStateReader$3.process Updating live nodes... (3)
   [junit4]   2> 1932781 T4452 oasc.CorePropertiesLocator.discover Looking for core definitions underneath /Users/jenkins/jenkins-slave/workspace/Lucene-Solr-4.x-MacOSX/solr/build/solr-core/test/J0/./org.apache.solr.cloud.CollectionsAPIDistributedZkTest-jetty2-1375521664816
   [junit4]   2> 1932932 T4452 oasc.CorePropertiesLocator.discoverUnder Found core conf in /Users/jenkins/jenkins-slave/workspace/Lucene-Solr-4.x-MacOSX/solr/build/solr-core/test/J0/./org.apache.solr.cloud.CollectionsAPIDistributedZkTest-jetty2-1375521664816/conf/
   [junit4]   2> 1932944 T4452 oasc.CorePropertiesLocator.discover Found 1 core definitions
   [junit4]   2> 1932946 T4452 oass.SolrDispatchFilter.init user.dir=/Users/jenkins/jenkins-slave/workspace/Lucene-Solr-4.x-MacOSX/solr/build/solr-core/test/J0
   [junit4]   2> 1932946 T4452 oass.SolrDispatchFilter.init SolrDispatchFilter.init() done
   [junit4]   2> 1932947 T4452 oascsi.HttpClientUtil.createClient Creating new http client, config:maxConnections=128&maxConnectionsPerHost=32&followRedirects=false
   [junit4]   2> 1933424 T4452 oejs.Server.doStart jetty-8.1.10.v20130312
   [junit4]   2> 1933430 T4452 oejs.AbstractConnector.doStart Started SelectChannelConnector@127.0.0.1:52785
   [junit4]   2> 1933432 T4452 oass.SolrDispatchFilter.init SolrDispatchFilter.init()
   [junit4]   2> 1933433 T4452 oasc.SolrResourceLoader.locateSolrHome JNDI not configured for solr (NoInitialContextEx)
   [junit4]   2> 1933433 T4452 oasc.SolrResourceLoader.locateSolrHome using system property solr.solr.home: /Users/jenkins/jenkins-slave/workspace/Lucene-Solr-4.x-MacOSX/solr/build/solr-core/test/J0/./org.apache.solr.cloud.CollectionsAPIDistributedZkTest-jetty3-1375521667325
   [junit4]   2> 1933434 T4452 oasc.SolrResourceLoader.<init> new SolrResourceLoader for directory: '/Users/jenkins/jenkins-slave/workspace/Lucene-Solr-4.x-MacOSX/solr/build/solr-core/test/J0/./org.apache.solr.cloud.CollectionsAPIDistributedZkTest-jetty3-1375521667325/'
   [junit4]   2> 1933483 T4452 oasc.ConfigSolr.fromFile Loading container configuration from /Users/jenkins/jenkins-slave/workspace/Lucene-Solr-4.x-MacOSX/solr/build/solr-core/test/J0/./org.apache.solr.cloud.CollectionsAPIDistributedZkTest-jetty3-1375521667325/solr.xml
   [junit4]   2> 1933544 T4452 oasc.ConfigSolrXml.<init> Config-defined core root directory: 
   [junit4]   2> 1933545 T4452 oasc.CoreContainer.<init> New CoreContainer 1821929787
   [junit4]   2> 1933546 T4452 oasc.CoreContainer.load Loading cores into CoreContainer [instanceDir=/Users/jenkins/jenkins-slave/workspace/Lucene-Solr-4.x-MacOSX/solr/build/solr-core/test/J0/./org.apache.solr.cloud.CollectionsAPIDistributedZkTest-jetty3-1375521667325/]
   [junit4]   2> 1933547 T4452 oashc.HttpShardHandlerFactory.getParameter Setting socketTimeout to: 120000
   [junit4]   2> 1933548 T4452 oashc.HttpShardHandlerFactory.getParameter Setting urlScheme to: http://
   [junit4]   2> 1933548 T4452 oashc.HttpShardHandlerFactory.getParameter Setting connTimeout to: 15000
   [junit4]   2> 1933549 T4452 oashc.HttpShardHandlerFactory.getParameter Setting maxConnectionsPerHost to: 20
   [junit4]   2> 1933549 T4452 oashc.HttpShardHandlerFactory.getParameter Setting corePoolSize to: 0
   [junit4]   2> 1933550 T4452 oashc.HttpShardHandlerFactory.getParameter Setting maximumPoolSize to: 2147483647
   [junit4]   2> 1933550 T4452 oashc.HttpShardHandlerFactory.getParameter Setting maxThreadIdleTime to: 5
   [junit4]   2> 1933551 T4452 oashc.HttpShardHandlerFactory.getParameter Setting sizeOfQueue to: -1
   [junit4]   2> 1933551 T4452 oashc.HttpShardHandlerFactory.getParameter Setting fairnessPolicy to: false
   [junit4]   2> 1933552 T4452 oascsi.HttpClientUtil.createClient Creating new http client, config:maxConnectionsPerHost=20&maxConnections=10000&socketTimeout=120000&connTimeout=15000&retry=false
   [junit4]   2> 1933585 T4452 oasc.ZkContainer.initZooKeeper Zookeeper client=127.0.0.1:52772/solr
   [junit4]   2> 1933586 T4452 oasc.ZkController.checkChrootPath zkHost includes chroot
   [junit4]   2> 1933589 T4452 oascc.ConnectionManager.waitForConnected Waiting for client to connect to ZooKeeper
   [junit4]   2> 1933594 T4518 oascc.ConnectionManager.process Watcher org.apache.solr.common.cloud.ConnectionManager@c321030 name:ZooKeeperConnection Watcher:127.0.0.1:52772 got event WatchedEvent state:SyncConnected type:None path:null path:null type:None
   [junit4]   2> 1933595 T4452 oascc.ConnectionManager.waitForConnected Client is connected to ZooKeeper
   [junit4]   2> 1933606 T4452 oascsi.HttpClientUtil.createClient Creating new http client, config:maxConnections=500&maxConnectionsPerHost=16&socketTimeout=120000&connTimeout=15000
   [junit4]   2> 1933640 T4452 oascc.ConnectionManager.waitForConnected Waiting for client to connect to ZooKeeper
   [junit4]   2> 1933646 T4520 oascc.ConnectionManager.process Watcher org.apache.solr.common.cloud.ConnectionManager@7c168dcb name:ZooKeeperConnection Watcher:127.0.0.1:52772/solr got event WatchedEvent state:SyncConnected type:None path:null path:null type:None
   [junit4]   2> 1933646 T4452 oascc.ConnectionManager.waitForConnected Client is connected to ZooKeeper
   [junit4]   2> 1933662 T4452 oascc.ZkStateReader.createClusterStateWatchersAndUpdate Updating cluster state from ZooKeeper... 
   [junit4]   2> 1934683 T4452 oasc.ZkController.createEphemeralLiveNode Register node as live in ZooKeeper:/live_nodes/127.0.0.1:52785_
   [junit4]   2> 1934688 T4452 oascc.SolrZkClient.makePath makePath: /live_nodes/127.0.0.1:52785_
   [junit4]   2> 1934710 T4479 oascc.ZkStateReader$3.process Updating live nodes... (4)
   [junit4]   2> 1934730 T4492 oascc.ZkStateReader$3.process Updating live nodes... (4)
   [junit4]   2> 1934733 T4520 oascc.ZkStateReader$3.process Updating live nodes... (4)
   [junit4]   2> 1934734 T4474 oascc.ZkStateReader$3.process Updating live nodes... (4)
   [junit4]   2> 1934735 T4506 oascc.ZkStateReader$3.process Updating live nodes... (4)
   [junit4]   2> 1934754 T4452 oasc.CorePropertiesLocator.discover Looking for core definitions underneath /Users/jenkins/jenkins-slave/workspace/Lucene-Solr-4.x-MacOSX/solr/build/solr-core/test/J0/./org.apache.solr.cloud.CollectionsAPIDistributedZkTest-jetty3-1375521667325
   [junit4]   2> 1935004 T4452 oasc.CorePropertiesLocator.discoverUnder Found core conf in /Users/jenkins/jenkins-slave/workspace/Lucene-Solr-4.x-MacOSX/solr/build/solr-core/test/J0/./org.apache.solr.cloud.CollectionsAPIDistributedZkTest-jetty3-1375521667325/conf/
   [junit4]   2> 1935011 T4452 oasc.CorePropertiesLocator.discover Found 1 core definitions
   [junit4]   2> 1935015 T4452 oass.SolrDispatchFilter.init user.dir=/Users/jenkins/jenkins-slave/workspace/Lucene-Solr-4.x-MacOSX/solr/build/solr-core/test/J0
   [junit4]   2> 1935015 T4452 oass.SolrDispatchFilter.init SolrDispatchFilter.init() done
   [junit4]   2> 1935016 T4452 oascsi.HttpClientUtil.createClient Creating new http client, config:maxConnections=128&maxConnectionsPerHost=32&followRedirects=false
   [junit4]   2> 1935592 T4452 oejs.Server.doStart jetty-8.1.10.v20130312
   [junit4]   2> 1935598 T4452 oejs.AbstractConnector.doStart Started SelectChannelConnector@127.0.0.1:52788
   [junit4]   2> 1935600 T4452 oass.SolrDispatchFilter.init SolrDispatchFilter.init()
   [junit4]   2> 1935601 T4452 oasc.SolrResourceLoader.locateSolrHome JNDI not configured for solr (NoInitialContextEx)
   [junit4]   2> 1935605 T4452 oasc.SolrResourceLoader.locateSolrHome using system property solr.solr.home: /Users/jenkins/jenkins-slave/workspace/Lucene-Solr-4.x-MacOSX/solr/build/solr-core/test/J0/./org.apache.solr.cloud.CollectionsAPIDistributedZkTest-jetty4-1375521669402
   [junit4]   2> 1935609 T4452 oasc.SolrResourceLoader.<init> new SolrResourceLoader for directory: '/Users/jenkins/jenkins-slave/workspace/Lucene-Solr-4.x-MacOSX/solr/build/solr-core/test/J0/./org.apache.solr.cloud.CollectionsAPIDistributedZkTest-jetty4-1375521669402/'
   [junit4]   2> 1935655 T4452 oasc.ConfigSolr.fromFile Loading container configuration from /Users/jenkins/jenkins-slave/workspace/Lucene-Solr-4.x-MacOSX/solr/build/solr-core/test/J0/./org.apache.solr.cloud.CollectionsAPIDistributedZkTest-jetty4-1375521669402/solr.xml
   [junit4]   2> 1935717 T4452 oasc.ConfigSolrXml.<init> Config-defined core root directory: 
   [junit4]   2> 1935718 T4452 oasc.CoreContainer.<init> New CoreContainer 693125927
   [junit4]   2> 1935718 T4452 oasc.CoreContainer.load Loading cores into CoreContainer [instanceDir=/Users/jenkins/jenkins-slave/workspace/Lucene-Solr-4.x-MacOSX/solr/build/solr-core/test/J0/./org.apache.solr.cloud.CollectionsAPIDistributedZkTest-jetty4-1375521669402/]
   [junit4]   2> 1935725 T4452 oashc.HttpShardHandlerFactory.getParameter Setting socketTimeout to: 120000
   [junit4]   2> 1935726 T4452 oashc.HttpShardHandlerFactory.getParameter Setting urlScheme to: http://
   [junit4]   2> 1935727 T4452 oashc.HttpShardHandlerFactory.getParameter Setting connTimeout to: 15000
   [junit4]   2> 1935729 T4452 oashc.HttpShardHandlerFactory.getParameter Setting maxConnectionsPerHost to: 20
   [junit4]   2> 1935732 T4452 oashc.HttpShardHandlerFactory.getParameter Setting corePoolSize to: 0
   [junit4]   2> 1935733 T4452 oashc.HttpShardHandlerFactory.getParameter Setting maximumPoolSize to: 2147483647
   [junit4]   2> 1935734 T4452 oashc.HttpShardHandlerFactory.getParameter Setting maxThreadIdleTime to: 5
   [junit4]   2> 1935734 T4452 oashc.HttpShardHandlerFactory.getParameter Setting sizeOfQueue to: -1
   [junit4]   2> 1935735 T4452 oashc.HttpShardHandlerFactory.getParameter Setting fairnessPolicy to: false
   [junit4]   2> 1935736 T4452 oascsi.HttpClientUtil.createClient Creating new http client, config:maxConnectionsPerHost=20&maxConnections=10000&socketTimeout=120000&connTimeout=15000&retry=false
   [junit4]   2> 1935771 T4452 oasc.ZkContainer.initZooKeeper Zookeeper client=127.0.0.1:52772/solr
   [junit4]   2> 1935771 T4452 oasc.ZkController.checkChrootPath zkHost includes chroot
   [junit4]   2> 1935774 T4452 oascc.ConnectionManager.waitForConnected Waiting for client to connect to ZooKeeper
   [junit4]   2> 1935780 T4532 oascc.ConnectionManager.process Watcher org.apache.solr.common.cloud.ConnectionManager@5468caa1 name:ZooKeeperConnection Watcher:127.0.0.1:52772 got event WatchedEvent state:SyncConnected type:None path:null path:null type:None
   [junit4]   2> 1935781 T4452 oascc.ConnectionManager.waitForConnected Client is connected to ZooKeeper
   [junit4]   2> 1935787 T4452 oascsi.HttpClientUtil.createClient Creating new http client, config:maxConnections=500&maxConnectionsPerHost=16&socketTimeout=120000&connTimeout=15000
   [junit4]   2> 1935824 T4452 oascc.ConnectionManager.waitForConnected Waiting for client to connect to ZooKeeper
   [junit4]   2> 1935829 T4534 oascc.ConnectionManager.process Watcher org.apache.solr.common.cloud.ConnectionManager@31bcebcd name:ZooKeeperConnection Watcher:127.0.0.1:52772/solr got event WatchedEvent state:SyncConnected type:None path:null path:null type:None
   [junit4]   2> 1935830 T4452 oascc.ConnectionManager.waitForConnected Client is connected to ZooKeeper
   [junit4]   2> 1935847 T4452 oascc.ZkStateReader.createClusterStateWatchersAndUpdate Updating cluster state from ZooKeeper... 
   [junit4]   2> 1936861 T4452 oasc.ZkController.createEphemeralLiveNode Register node as live in ZooKeeper:/live_nodes/127.0.0.1:52788_
   [junit4]   2> 1936866 T4452 oascc.SolrZkClient.makePath makePath: /live_nodes/127.0.0.1:52788_
   [junit4]   2> 1936901 T4520 oascc.ZkStateReader$3.process Updating live nodes... (5)
   [junit4]   2> 1936902 T4479 oascc.ZkStateReader$3.process Updating live nodes... (5)
   [junit4]   2> 1936903 T4492 oascc.ZkStateReader$3.process Updating live nodes... (5)
   [junit4]   2> 1936908 T4474 oascc.ZkStateReader$3.process Updating live nodes... (5)
   [junit4]   2> 1936909 T4534 oascc.ZkStateReader$3.process Updating live nodes... (5)
   [junit4]   2> 1936909 T4506 oascc.ZkStateReader$3.process Updating live nodes... (5)
   [junit4]   2> 1936926 T4452 oasc.CorePropertiesLocator.discover Looking for core definitions underneath /Users/jenkins/jenkins-slave/workspace/Lucene-Solr-4.x-MacOSX/solr/build/solr-core/test/J0/./org.apache.solr.cloud.CollectionsAPIDistributedZkTest-jetty4-1375521669402
   [junit4]   2> 1937141 T4452 oasc.CorePropertiesLocator.discoverUnder Found core conf in /Users/jenkins/jenkins-slave/workspace/Lucene-Solr-4.x-MacOSX/solr/build/solr-core/test/J0/./org.apache.solr.cloud.CollectionsAPIDistributedZkTest-jetty4-1375521669402/conf/
   [junit4]   2> 1937151 T4452 oasc.CorePropertiesLocator.discover Found 1 core definitions
   [junit4]   2> 1937155 T4452 oass.SolrDispatchFilter.init user.dir=/Users/jenkins/jenkins-slave/workspace/Lucene-Solr-4.x-MacOSX/solr/build/solr-core/test/J0
   [junit4]   2> 1937157 T4452 oass.SolrDispatchFilter.init SolrDispatchFilter.init() done
   [junit4]   2> 1937158 T4452 oascsi.HttpClientUtil.createClient Creating new http client, config:maxConnections=128&maxConnectionsPerHost=32&followRedirects=false
   [junit4]   2> 1937237 T4452 oascsi.HttpClientUtil.createClient Creating new http client, config:maxConnections=128&maxConnectionsPerHost=32&followRedirects=false
   [junit4]   2> 1937302 T4484 oasha.CollectionsHandler.handleCreateAction Creating Collection : numShards=2&name=nodes_used_collection&replicationFactor=2&action=CREATE&wt=javabin&version=2
   [junit4]   2> 1937317 T4474 oasc.DistributedQueue$LatchChildWatcher.process Watcher fired on path: /overseer/collection-queue-work state: SyncConnected type NodeChildrenChanged
   [junit4]   2> 1937342 T4476 oasc.OverseerCollectionProcessor.run Overseer Collection Processor: Get the message id:/overseer/collection-queue-work/qn-0000000000 message:{
   [junit4]   2> 	  "operation":"createcollection",
   [junit4]   2> 	  "numShards":"2",
   [junit4]   2> 	  "name":"nodes_used_collection",
   [junit4]   2> 	  "replicationFactor":"2"}
   [junit4]   2> 1937343 T4476 oasc.OverseerCollectionProcessor.processMessage WARN OverseerCollectionProcessor.processMessage : createcollection , {
   [junit4]   2> 	  "operation":"createcollection",
   [junit4]   2> 	  "numShards":"2",
   [junit4]   2> 	  "name":"nodes_used_collection",
   [junit4]   2> 	  "replicationFactor":"2"}
   [junit4]   2> 1938748 T4475 oascc.ZkStateReader.updateClusterState Updating cloud state from ZooKeeper... 
   [junit4]   2> 1938751 T4475 oasc.Overseer$ClusterStateUpdater.buildCollection building a new collection: nodes_used_collection
   [junit4]   2> 1938755 T4475 oasc.Overseer$ClusterStateUpdater.createCollection Create collection nodes_used_collection with shards [shard1, shard2]
   [junit4]   2> 1938777 T4534 oascc.ZkStateReader$2.process A cluster state change: WatchedEvent state:SyncConnected type:NodeDataChanged path:/clusterstate.json, has occurred - updating... (live nodes size: 5)
   [junit4]   2> 1938777 T4520 oascc.ZkStateReader$2.process A cluster state change: WatchedEvent state:SyncConnected type:NodeDataChanged path:/clusterstate.json, has occurred - updating... (live nodes size: 5)
   [junit4]   2> 1938781 T4506 oascc.ZkStateReader$2.process A cluster state change: WatchedEvent state:SyncConnected type:NodeDataChanged path:/clusterstate.json, has occurred - updating... (live nodes size: 5)
   [junit4]   2> 1938783 T4492 oascc.ZkStateReader$2.process A cluster state change: WatchedEvent state:SyncConnected type:NodeDataChanged path:/clusterstate.json, has occurred - updating... (live nodes size: 5)
   [junit4]   2> 1938784 T4479 oascc.ZkStateReader$2.process A cluster state change: WatchedEvent state:SyncConnected type:NodeDataChanged path:/clusterstate.json, has occurred - updating... (live nodes size: 5)
   [junit4]   2> 1938784 T4474 oascc.ZkStateReader$2.process A cluster state change: WatchedEvent state:SyncConnected type:NodeDataChanged path:/clusterstate.json, has occurred - updating... (live nodes size: 5)
   [junit4]   2> 1938876 T4476 oasc.OverseerCollectionProcessor.createCollection going to create cores replicas shardNames [shard1, shard2] , repFactor : 2
   [junit4]   2> 1938878 T4476 oasc.OverseerCollectionProcessor.createCollection Creating shard nodes_used_collection_shard1_replica1 as part of slice shard1 of collection nodes_used_collection on 127.0.0.1:52782_
   [junit4]   2> 1938880 T4476 oasc.OverseerCollectionProcessor.createCollection Creating shard nodes_used_collection_shard1_replica2 as part of slice shard1 of collection nodes_used_collection on 127.0.0.1:52775_
   [junit4]   2> 1938881 T4476 oasc.OverseerCollectionProcessor.createCollection Creating shard nodes_used_collection_shard2_replica1 as part of slice shard2 of collection nodes_used_collection on 127.0.0.1:52785_
   [junit4]   2> 1938901 T4476 oasc.OverseerCollectionProcessor.createCollection Creating shard nodes_used_collection_shard2_replica2 as part of slice shard2 of collection nodes_used_collection on 127.0.0.1:52788_
   [junit4]   2> 1938963 T4511 oasc.ZkController.publish publishing core=nodes_used_collection_shard2_replica1 state=down
   [junit4]   2> 1938967 T4497 oasc.ZkController.publish publishing core=nodes_used_collection_shard1_replica1 state=down
   [junit4]   2> 1938966 T4468 oasc.ZkController.publish publishing core=nodes_used_collection_shard1_replica2 state=down
   [junit4]   2> 1938968 T4527 oasc.ZkController.publish publishing core=nodes_used_collection_shard2_replica2 state=down
   [junit4]   2> 1938971 T4511 oasc.ZkController.waitForCoreNodeName look for our core node name
   [junit4]   2> 1938973 T4497 oasc.ZkController.waitForCoreNodeName look for our core node name
   [junit4]   2> 1938980 T4527 oasc.ZkController.waitForCoreNodeName look for our core node name
   [junit4]   2> 1938980 T4468 oasc.ZkController.waitForCoreNodeName look for our core node name
   [junit4]   2> 1940339 T4475 oascc.ZkStateReader.updateClusterState Updating cloud state from ZooKeeper... 
   [junit4]   2> 1940345 T4475 oasc.Overseer$ClusterStateUpdater.updateState WARN Could not find collection node for nodes_used_collection, skipping publish state
   [junit4]   2> 1940346 T4475 oasc.Overseer$ClusterStateUpdater.updateState Update state numShards=2 message={
   [junit4]   2> 	  "operation":"state",
   [junit4]   2> 	  "core_node_name":"core_node1",
   [junit4]   2> 	  "numShards":"2",
   [junit4]   2> 	  "shard":"shard2",
   [junit4]   2> 	  "roles":null,
   [junit4]   2> 	  "state":"down",
   [junit4]   2> 	  "shard_state":"active",
   [junit4]   2> 	  "core":"nodes_used_collection_shard2_replica1",
   [junit4]   2> 	  "collection":"nodes_used_collection",
   [junit4]   2> 	  "shard_range":null,
   [junit4]   2> 	  "node_name":"127.0.0.1:52785_",
   [junit4]   2> 	  "base_url":"http://127.0.0.1:52785"}
   [junit4]   2> 1940363 T4475 oasc.Overseer$ClusterStateUpdater.updateState WARN Could not find collection node for nodes_used_collection, skipping publish state
   [junit4]   2> 1940364 T4475 oasc.Overseer$ClusterStateUpdater.updateState Update state numShards=2 message={
   [junit4]   2> 	  "operation":"state",
   [junit4]   2> 	  "core_node_name":"core_node2",
   [junit4]   2> 	  "numShards":"2",
   [junit4]   2> 	  "shard":"shard1",
   [junit4]   2> 	  "roles":null,
   [junit4]   2> 	  "state":"down",
   [junit4]   2> 	  "shard_state":"active",
   [junit4]   2> 	  "core":"nodes_used_collection_shard1_replica1",
   [junit4]   2> 	  "collection":"nodes_used_collection",
   [junit4]   2> 	  "shard_range":null,
   [junit4]   2> 	  "node_name":"127.0.0.1:52782_",
   [junit4]   2> 	  "base_url":"http://127.0.0.1:52782"}
   [junit4]   2> 1940388 T4475 oasc.Overseer$ClusterStateUpdater.updateState WARN Could not find collection node for nodes_used_collection, skipping publish state
   [junit4]   2> 1940389 T4475 oasc.Overseer$ClusterStateUpdater.updateState Update state numShards=2 message={
   [junit4]   2> 	  "operation":"state",
   [junit4]   2> 	  "core_node_name":"core_node3",
   [junit4]   2> 	  "numShards":"2",
   [junit4]   2> 	  "shard":"shard1",
   [junit4]   2> 	  "roles":null,
   [junit4]   2> 	  "state":"down",
   [junit4]   2> 	  "shard_state":"active",
   [junit4]   2> 	  "core":"nodes_used_collection_shard1_replica2",
   [junit4]   2> 	  "collection":"nodes_used_collection",
   [junit4]   2> 	  "shard_range":null,
   [junit4]   2> 	  "node_name":"127.0.0.1:52775_",
   [junit4]   2> 	  "base_url":"http://127.0.0.1:52775"}
   [junit4]   2> 1940405 T4475 oasc.Overseer$ClusterStateUpdater.updateState WARN Could not find collection node for nodes_used_collection, skipping publish state
   [junit4]   2> 1940406 T4475 oasc.Overseer$ClusterStateUpdater.updateState Update state numShards=2 message={
   [junit4]   2> 	  "operation":"state",
   [junit4]   2> 	  "core_node_name":"core_node4",
   [junit4]   2> 	  "numShards":"2",
   [junit4]   2> 	  "shard":"shard2",
   [junit4]   2> 	  "roles":null,
   [junit4]   2> 	  "state":"down",
   [junit4]   2> 	  "shard_state":"active",
   [junit4]   2> 	  "core":"nodes_used_collection_shard2_replica2",
   [junit4]   2> 	  "collection":"nodes_used_collection",
   [junit4]   2> 	  "shard_range":null,
   [junit4]   2> 	  "node_name":"127.0.0.1:52788_",
   [junit4]   2> 	  "base_url":"http://127.0.0.1:52788"}
   [junit4]   2> 1940426 T4479 oascc.ZkStateReader$2.process A cluster state change: WatchedEvent state:SyncConnected type:NodeDataChanged path:/clusterstate.json, has occurred - updating... (live nodes size: 5)
   [junit4]   2> 1940427 T4492 oascc.ZkStateReader$2.process A cluster state change: WatchedEvent state:SyncConnected type:NodeDataChanged path:/clusterstate.json, has occurred - updating... (live nodes size: 5)
   [junit4]   2> 1940428 T4474 oascc.ZkStateReader$2.process A cluster state change: WatchedEvent state:SyncConnected type:NodeDataChanged path:/clusterstate.json, has occurred - updating... (live nodes size: 5)
   [junit4]   2> 1940427 T4506 oascc.ZkStateReader$2.process A cluster state change: WatchedEvent state:SyncConnected type:NodeDataChanged path:/clusterstate.json, has occurred - updating... (live nodes size: 5)
   [junit4]   2> 1940430 T4534 oascc.ZkStateReader$2.process A cluster state change: WatchedEvent state:SyncConnected type:NodeDataChanged path:/clusterstate.json, has occurred - updating... (live nodes size: 5)
   [junit4]   2> 1940432 T4520 oascc.ZkStateReader$2.process A cluster state change: WatchedEvent state:SyncConnected type:NodeDataChanged path:/clusterstate.json, has occurred - updating... (live nodes size: 5)
   [junit4]   2> 1940974 T4511 oasc.ZkController.waitForShardId waiting to find shard id in clusterstate for nodes_used_collection_shard2_replica1
   [junit4]   2> 1940975 T4511 oasc.CorePropertiesLocator.writePropertiesFile ERROR Couldn't persist core properties to /Users/jenkins/jenkins-slave/workspace/Lucene-Solr-4.x-MacOSX/solr/build/solr-core/test/J0/./org.apache.solr.cloud.CollectionsAPIDistributedZkTest-jetty3-1375521667325/nodes_used_collection_shard2_replica1/core.properties: java.io.FileNotFoundException: /Users/jenkins/jenkins-slave/workspace/Lucene-Solr-4.x-MacOSX/solr/build/solr-core/test/J0/./org.apache.solr.cloud.CollectionsAPIDistributedZkTest-jetty3-1375521667325/nodes_used_collection_shard2_replica1/core.properties (No such file or directory)
   [junit4]   2> 1940976 T4511 oasc.CoreContainer.create Creating SolrCore 'nodes_used_collection_shard2_replica1' using instanceDir: /Users/jenkins/jenkins-slave/workspace/Lucene-Solr-4.x-MacOSX/solr/build/solr-core/test/J0/./org.apache.solr.cloud.CollectionsAPIDistributedZkTest-jetty3-1375521667325/nodes_used_collection_shard2_replica1
   [junit4]   2> 1940976 T4511 oasc.ZkController.createCollectionZkNode Check for collection zkNode:nodes_used_collection
   [junit4]   2> 1940979 T4497 oasc.ZkController.waitForShardId waiting to find shard id in clusterstate for nodes_used_collection_shard1_replica1
   [junit4]   2> 1940979 T4511 oasc.ZkController.createCollectionZkNode Creating collection in ZooKeeper:nodes_used_collection
   [junit4]   2> 1940980 T4511 oasc.ZkController.getConfName Looking for collection configName
   [junit4]   2> 1940981 T4497 oasc.CorePropertiesLocator.writePropertiesFile ERROR Couldn't persist core properties to /Users/jenkins/jenkins-slave/workspace/Lucene-Solr-4.x-MacOSX/solr/build/solr-core/test/J0/./org.apache.solr.cloud.CollectionsAPIDistributedZkTest-jetty2-1375521664816/nodes_used_collection_shard1_replica1/core.properties: java.io.FileNotFoundException: /Users/jenkins/jenkins-slave/workspace/Lucene-Solr-4.x-MacOSX/solr/build/solr-core/test/J0/./org.apache.solr.cloud.CollectionsAPIDistributedZkTest-jetty2-1375521664816/nodes_used_collection_shard1_replica1/core.properties (No such file or directory)
   [junit4]   2> 1940982 T4497 oasc.CoreContainer.create Creating SolrCore 'nodes_used_collection_shard1_replica1' using instanceDir: /Users/jenkins/jenkins-slave/workspace/Lucene-Solr-4.x-MacOSX/solr/build/solr-core/test/J0/./org.apache.solr.cloud.CollectionsAPIDistributedZkTest-jetty2-1375521664816/nodes_used_collection_shard1_replica1
   [junit4]   2> 1940983 T4497 oasc.ZkController.createCollectionZkNode Check for collection zkNode:nodes_used_collection
   [junit4]   2> 1940983 T4527 oasc.ZkController.waitForShardId waiting to find shard id in clusterstate for nodes_used_collection_shard2_replica2
   [junit4]   2> 1940985 T4527 oasc.CorePropertiesLocator.writePropertiesFile ERROR Couldn't persist core properties to /Users/jenkins/jenkins-slave/workspace/Lucene-Solr-4.x-MacOSX/solr/build/solr-core/test/J0/./org.apache.solr.cloud.CollectionsAPIDistributedZkTest-jetty4-1375521669402/nodes_used_collection_shard2_replica2/core.properties: java.io.FileNotFoundException: /Users/jenkins/jenkins-slave/workspace/Lucene-Solr-4.x-MacOSX/solr/build/solr-core/test/J0/./org.apache.solr.cloud.CollectionsAPIDistributedZkTest-jetty4-1375521669402/nodes_used_collection_shard2_replica2/core.properties (No such file or directory)
   [junit4]   2> 1940985 T4527 oasc.CoreContainer.create Creating SolrCore 'nodes_used_collection_shard2_replica2' using instanceDir: /Users/jenkins/jenkins-slave/workspace/Lucene-Solr-4.x-MacOSX/solr/build/solr-core/test/J0/./org.apache.solr.cloud.CollectionsAPIDistributedZkTest-jetty4-1375521669402/nodes_used_collection_shard2_replica2
   [junit4]   2> 1940985 T4527 oasc.ZkController.createCollectionZkNode Check for collection zkNode:nodes_used_collection
   [junit4]   2> 1940987 T4468 oasc.ZkController.waitForShardId waiting to find shard id in clusterstate for nodes_used_collection_shard1_replica2
   [junit4]   2> 1940989 T4511 oasc.ZkController.getConfName Only one config set found in zk - using it:conf1
   [junit4]   2> 1940989 T4511 oascc.SolrZkClient.makePath makePath: /collections/nodes_used_collection
   [junit4]   2> 1940990 T4468 oasc.CorePropertiesLocator.writePropertiesFile ERROR Couldn't persist core properties to /Users/jenkins/jenkins-slave/workspace/Lucene-Solr-4.x-MacOSX/solr/build/solr-core/test/J0/./org.apache.solr.cloud.CollectionsAPIDistributedZkTest-controljetty-1375521661225/nodes_used_collection_shard1_replica2/core.properties: java.io.FileNotFoundException: /Users/jenkins/jenkins-slave/workspace/Lucene-Solr-4.x-MacOSX/solr/build/solr-core/test/J0/./org.apache.solr.cloud.CollectionsAPIDistributedZkTest-controljetty-1375521661225/nodes_used_collection_shard1_replica2/core.properties (No such file or directory)
   [junit4]   2> 1940991 T4468 oasc.CoreContainer.create Creating SolrCore 'nodes_used_collection_shard1_replica2' using instanceDir: /Users/jenkins/jenkins-slave/workspace/Lucene-Solr-4.x-MacOSX/solr/build/solr-core/test/J0/./org.apache.solr.cloud.CollectionsAPIDistributedZkTest-controljetty-1375521661225/nodes_used_collection_shard1_replica2
   [junit4]   2> 1940992 T4468 oasc.ZkController.createCollectionZkNode Check for collection zkNode:nodes_used_collection
   [junit4]   2> 1940992 T4497 oasc.ZkController.createCollectionZkNode Creating collection in ZooKeeper:nodes_used_collection
   [junit4]   2> 1940993 T4497 oasc.ZkController.getConfName Looking for collection configName
   [junit4]   2> 1940993 T4527 oasc.ZkController.createCollectionZkNode Creating collection in ZooKeeper:nodes_used_collection
   [junit4]   2> 1940994 T4527 oasc.ZkController.getConfName Looking for collection configName
   [junit4]   2> 1941006 T4468 oasc.ZkController.createCollectionZkNode Creating collection in ZooKeeper:nodes_used_collection
   [junit4]   2> 1941007 T4468 oasc.ZkController.getConfName Looking for collection configName
   [junit4]   2> 1941008 T4527 oasc.ZkController.getConfName Only one config set found in zk - using it:conf1
   [junit4]   2> 1941008 T4527 oascc.SolrZkClient.makePath makePath: /collections/nodes_used_collection
   [junit4]   2> 1941009 T4497 oasc.ZkController.getConfName Only one config set found in zk - using it:conf1
   [junit4]   2> 1941010 T4497 oascc.SolrZkClient.makePath makePath: /collections/nodes_used_collection
   [junit4]   2> 1941013 T4511 oasc.ZkController.readConfigName Load collection config from:/collections/nodes_used_collection
   [junit4]   2> 1941026 T4511 oasc.SolrResourceLoader.<init> new SolrResourceLoader for directory: '/Users/jenkins/jenkins-slave/workspace/Lucene-Solr-4.x-MacOSX/solr/build/solr-core/test/J0/./org.apache.solr.cloud.CollectionsAPIDistributedZkTest-jetty3-1375521667325/nodes_used_collection_shard2_replica1/'
   [junit4]   2> 1941029 T4468 oascc.SolrZkClient.makePath makePath: /collections/nodes_used_collection
   [junit4]   2> 1941043 T4527 oasc.ZkController.readConfigName Load collection config from:/collections/nodes_used_collection
   [junit4]   2> 1941051 T4497 oasc.ZkController.readConfigName Load collection config from:/collections/nodes_used_collection
   [junit4]   2> 1941060 T4527 oasc.SolrResourceLoader.<init> new SolrResourceLoader for directory: '/Users/jenkins/jenkins-slave/workspace/Lucene-Solr-4.x-MacOSX/solr/build/solr-core/test/J0/./org.apache.solr.cloud.CollectionsAPIDistributedZkTest-jetty4-1375521669402/nodes_used_collection_shard2_replica2/'
   [junit4]   2> 1941064 T4497 oasc.SolrResourceLoader.<init> new SolrResourceLoader for directory: '/Users/jenkins/jenkins-slave/workspace/Lucene-Solr-4.x-MacOSX/solr/build/solr-core/test/J0/./org.apache.solr.cloud.CollectionsAPIDistributedZkTest-jetty2-1375521664816/nodes_used_collection_shard1_replica1/'
   [junit4]   2> 1941124 T4468 oasc.ZkController.readConfigName Load collection config from:/collections/nodes_used_collection
   [junit4]   2> 1941154 T4468 oasc.SolrResourceLoader.<init> new SolrResourceLoader for directory: '/Users/jenkins/jenkins-slave/workspace/Lucene-Solr-4.x-MacOSX/solr/build/solr-core/test/J0/./org.apache.solr.cloud.CollectionsAPIDistributedZkTest-controljetty-1375521661225/nodes_used_collection_shard1_replica2/'
   [junit4]   2> 1941313 T4511 oasc.SolrConfig.<init> Using Lucene MatchVersion: LUCENE_45
   [junit4]   2> 1941320 T4497 oasc.SolrConfig.<init> Using Lucene MatchVersion: LUCENE_45
   [junit4]   2> 1941322 T4527 oasc.SolrConfig.<init> Using Lucene MatchVersion: LUCENE_45
   [junit4]   2> 1941348 T4468 oasc.SolrConfig.<init> Using Lucene MatchVersion: LUCENE_45
   [junit4]   2> 1941489 T4468 oasc.SolrConfig.<init> Loaded SolrConfig: solrconfig.xml
   [junit4]   2> 1941526 T4468 oass.IndexSchema.readSchema Reading Solr Schema from schema.xml
   [junit4]   2> 1941540 T4527 oasc.SolrConfig.<init> Loaded SolrConfig: solrconfig.xml
   [junit4]   2> 1941546 T4497 oasc.SolrConfig.<init> Loaded SolrConfig: solrconfig.xml
   [junit4]   2> 1941553 T4527 oass.IndexSchema.readSchema Reading Solr Schema from schema.xml
   [junit4]   2> 1941570 T4511 oasc.SolrConfig.<init> Loaded SolrConfig: solrconfig.xml
   [junit4]   2> 1941573 T4527 oass.IndexSchema.readSchema [nodes_used_collection_shard2_replica2] Schema name=test
   [junit4]   2> 1941573 T4497 oass.IndexSchema.readSchema Reading Solr Schema from schema.xml
   [junit4]   2> 1941582 T4511 oass.IndexSchema.readSchema Reading Solr Schema from schema.xml
   [junit4]   2> 1941606 T4511 oass.IndexSchema.readSchema [nodes_used_collection_shard2_replica1] Schema name=test
   [junit4]   2> 1941607 T4497 oass.IndexSchema.readSchema [nodes_used_collection_shard1_replica1] Schema name=test
   [junit4]   2> 1941616 T4468 oass.IndexSchema.readSchema [nodes_used_collection_shard1_replica2] Schema name=test
   [junit4]   2> 1943753 T4511 oass.ByteField.init WARN ByteField is deprecated and will be removed in 5.0. You should use TrieIntField instead.
   [junit4]   2> 1943754 T4511 oass.ShortField.init WARN ShortField is deprecated and will be removed in 5.0. You should use TrieIntField instead.
   [junit4]   2> 1943755 T4511 oass.OpenExchangeRatesOrgProvider.init Initialized with rates=open-exchange-rates.json, refreshInterval=1440.
   [junit4]   2> 1943787 T4497 oass.ByteField.init WARN ByteField is deprecated and will be removed in 5.0. You should use TrieIntField instead.
   [junit4]   2> 1943787 T4497 oass.ShortField.init WARN ShortField is deprecated and will be removed in 5.0. You should use TrieIntField instead.
   [junit4]   2> 1943788 T4497 oass.OpenExchangeRatesOrgProvider.init Initialized with rates=open-exchange-rates.json, refreshInterval=1440.
   [junit4]   2> 1943797 T4511 oass.IndexSchema.readSchema default search field in schema is text
   [junit4]   2> 1943806 T4511 oass.IndexSchema.readSchema unique key field: id
   [junit4]   2> 1943817 T4497 oass.IndexSchema.readSchema default search field in schema is text
   [junit4]   2> 1943826 T4497 oass.IndexSchema.readSchema unique key field: id
   [junit4]   2> 1943842 T4527 oass.ByteField.init WARN ByteField is deprecated and will be removed in 5.0. You should use TrieIntField instead.
   [junit4]   2> 1943843 T4527 oass.ShortField.init WARN ShortField is deprecated and will be removed in 5.0. You should use TrieIntField instead.
   [junit4]   2> 1943844 T4527 oass.OpenExchangeRatesOrgProvider.init Initialized with rates=open-exchange-rates.json, refreshInterval=1440.
   [junit4]   2> 1943866 T4527 oass.IndexSchema.readSchema default search field in schema is text
   [junit4]   2> 1943870 T4527 oass.IndexSchema.readSchema unique key field: id
   [junit4]   2> 1943885 T4468 oass.ByteField.init WARN ByteField is deprecated and will be removed in 5.0. You should use TrieIntField instead.
   [junit4]   2> 1943886 T4468 oass.ShortField.init WARN ShortField is deprecated and will be removed in 5.0. You should use TrieIntField instead.
   [junit4]   2> 1943889 T4468 oass.OpenExchangeRatesOrgProvider.init Initialized with rates=open-exchange-rates.json, refreshInterval=1440.
   [junit4]   2> 1943923 T4468 oass.IndexSchema.readSchema default search field in schema is text
   [junit4]   2> 1943936 T4468 oass.IndexSchema.readSchema unique key field: id
   [junit4]   2> 1943954 T4511 oass.FileExchangeRateProvider.reload Reloading exchange rates from file currency.xml
   [junit4]   2> 1943980 T4511 oass.FileExchangeRateProvider.reload Reloading exchange rates from file currency.xml
   [junit4]   2> 1943997 T4511 oass.OpenExchangeRatesOrgProvider.reload Reloading exchange rates from open-exchange-rates.json
   [junit4]   2> 1944019 T4511 oass.OpenExchangeRatesOrgProvider$OpenExchangeRates.<init> WARN Unknown key IMPORTANT NOTE
   [junit4]   2> 1944020 T4511 oass.OpenExchangeRatesOrgProvider$OpenExchangeRates.<init> WARN Expected key, got STRING
   [junit4]   2> 1944020 T4511 oass.OpenExchangeRatesOrgProvider.reload Reloading exchange rates from open-exchange-rates.json
   [junit4]   2> 1944021 T4497 oass.FileExchangeRateProvider.reload Reloading exchange rates from file currency.xml
   [junit4]   2> 1944039 T4511 oass.OpenExchangeRatesOrgProvider$OpenExchangeRates.<init> WARN Unknown key IMPORTANT NOTE
   [junit4]   2> 1944039 T4511 oass.OpenExchangeRatesOrgProvider$OpenExchangeRates.<init> WARN Expected key, got STRING
   [junit4]   2> 1944040 T4511 oasc.SolrCore.initDirectoryFactory org.apache.solr.core.MockDirectoryFactory
   [junit4]   2> 1944045 T4511 oasc.SolrCore.<init> [nodes_used_collection_shard2_replica1] Opening new SolrCore at /Users/jenkins/jenkins-slave/workspace/Lucene-Solr-4.x-MacOSX/solr/build/solr-core/test/J0/./org.apache.solr.cloud.CollectionsAPIDistributedZkTest-jetty3-1375521667325/nodes_used_collection_shard2_replica1/, dataDir=/Users/jenkins/jenkins-slave/workspace/Lucene-Solr-4.x-MacOSX/solr/build/solr-core/test/J0/./org.apache.solr.cloud.CollectionsAPIDistributedZkTest-jetty3-1375521667325//nodes_used_collection_shard2_replica1/data/
   [junit4]   2> 1944046 T4511 oasc.JmxMonitoredMap.<init> JMX monitoring is enabled. Adding Solr mbeans to JMX Server: com.sun.jmx.mbeanserver.JmxMBeanServer@1e01d652
   [junit4]   2> 1944048 T4511 oasc.CachingDirectoryFactory.get return new directory for /Users/jenkins/jenkins-slave/workspace/Lucene-Solr-4.x-MacOSX/solr/build/solr-core/test/J0/./org.apache.solr.cloud.CollectionsAPIDistributedZkTest-jetty3-1375521667325//nodes_used_collection_shard2_replica1/data
   [junit4]   2> 1944049 T4511 oasc.SolrCore.getNewIndexDir New index directory detected: old=null new=/Users/jenkins/jenkins-slave/workspace/Lucene-Solr-4.x-MacOSX/solr/build/solr-core/test/J0/./org.apache.solr.cloud.CollectionsAPIDistributedZkTest-jetty3-1375521667325//nodes_used_collection_shard2_replica1/data/index/
   [junit4]   2> 1944050 T4511 oasc.SolrCore.initIndex WARN [nodes_used_collection_shard2_replica1] Solr index directory '/Users/jenkins/jenkins-slave/workspace/Lucene-Solr-4.x-MacOSX/solr/build/solr-core/test/J0/./org.apache.solr.cloud.CollectionsAPIDistributedZkTest-jetty3-1375521667325/nodes_used_collection_shard2_replica1/data/index' doesn't exist. Creating new index...
   [junit4]   2> 1944051 T4511 oasc.CachingDirectoryFactory.get return new directory for /Users/jenkins/jenkins-slave/workspace/Lucene-Solr-4.x-MacOSX/solr/build/solr-core/test/J0/./org.apache.solr.cloud.CollectionsAPIDistributedZkTest-jetty3-1375521667325//nodes_used_collection_shard2_replica1/data/index
   [junit4]   2> 1944056 T4497 oass.FileExchangeRateProvider.reload Reloading exchange rates from file currency.xml
   [junit4]   2> 1944057 T4527 oass.FileExchangeRateProvider.reload Reloading exchange rates from file currency.xml
   [junit4]   2> 1944070 T4511 oasc.SolrDeletionPolicy.onCommit SolrDeletionPolicy.onCommit: commits: num=1
   [junit4]   2> 		commit{dir=MockDirWrapper(RateLimitedDirectoryWrapper(org.apache.lucene.store.RAMDirectory@2a2b1f8e lockFactory=org.apache.lucene.store.NativeFSLockFactory@262001a1)),segFN=segments_1,generation=1}
   [junit4]   2> 1944071 T4511 oasc.SolrDeletionPolicy.updateCommits newest commit generation = 1
   [junit4]   2> 1944091 T4527 oass.FileExchangeRateProvider.reload Reloading exchange rates from file currency.xml
   [junit4]   2> 1944102 T4497 oass.OpenExchangeRatesOrgProvider.reload Reloading exchange rates from open-exchange-rates.json
   [junit4]   2> 1944099 T4511 oasup.UpdateRequestProcessorChain.init inserting DistributedUpdateProcessorFactory into updateRequestProcessorChain "dedupe"
   [junit4]   2> 1944107 T4511 oasup.UpdateRequestProcessorChain.init inserting DistributedUpdateProcessorFactory into updateRequestProcessorChain "stored_sig"
   [junit4]   2> 1944108 T4511 oasup.UpdateRequestProcessorChain.init inserting DistributedUpdateProcessorFactory into updateRequestProcessorChain "distrib-dup-test-chain-implicit"
   [junit4]   2> 1944109 T4511 oasc.RequestHandlers.initHandlersFromConfig created standard: solr.StandardRequestHandler
   [junit4]   2> 1944111 T4511 oasc.RequestHandlers.initHandlersFromConfig created /get: solr.RealTimeGetHandler
   [junit4]   2> 1944111 T4511 oasc.RequestHandlers.initHandlersFromConfig adding lazy requestHandler: solr.ReplicationHandler
   [junit4]   2> 1944112 T4511 oasc.RequestHandlers.initHandlersFromConfig created /replication: solr.ReplicationHandler
   [junit4]   2> 1944113 T4511 oasc.RequestHandlers.initHandlersFromConfig created /update: solr.UpdateRequestHandler
   [junit4]   2> 1944115 T4511 oasc.RequestHandlers.initHandlersFromConfig created /admin/: org.apache.solr.handler.admin.AdminHandlers
   [junit4]   2> 1944127 T4497 oass.OpenExchangeRatesOrgProvider$OpenExchangeRates.<init> WARN Unknown key IMPORTANT NOTE
   [junit4]   2> 1944128 T4497 oass.OpenExchangeRatesOrgProvider$OpenExchangeRates.<init> WARN Expected key, got STRING
   [junit4]   2> 1944129 T4497 oass.OpenExchangeRatesOrgProvider.reload Reloading exchange rates from open-exchange-rates.json
   [junit4]   2> 1944134 T4511 oashl.XMLLoader.init xsltCacheLifetimeSeconds=60
   [junit4]   2> 1944139 T4468 oass.FileExchangeRateProvider.reload Reloading exchange rates from file currency.xml
   [junit4]   2> 1944147 T4497 oass.OpenExchangeRatesOrgProvider$OpenExchangeRates.<init> WARN Unknown key IMPORTANT NOTE
   [junit4]   2> 1944148 T4497 oass.OpenExchangeRatesOrgProvider$OpenExchangeRates.<init> WARN Expected key, got STRING
   [junit4]   2> 1944149 T4497 oasc.SolrCore.initDirectoryFactory org.apache.solr.core.MockDirectoryFactory
   [junit4]   2> 1944150 T4497 oasc.SolrCore.<init> [nodes_used_collection_shard1_replica1] Opening new SolrCore at /Users/jenkins/jenkins-slave/workspace/Lucene-Solr-4.x-MacOSX/solr/build/solr-core/test/J0/./org.apache.solr.cloud.CollectionsAPIDistributedZkTest-jetty2-1375521664816/nodes_used_collection_shard1_replica1/, dataDir=/Users/jenkins/jenkins-slave/workspace/Lucene-Solr-4.x-MacOSX/solr/build/solr-core/test/J0/./org.apache.solr.cloud.CollectionsAPIDistributedZkTest-jetty2-1375521664816//nodes_used_collection_shard1_replica1/data/
   [junit4]   2> 1944151 T4497 oasc.JmxMonitoredMap.<init> JMX monitoring is enabled. Adding Solr mbeans to JMX Server: com.sun.jmx.mbeanserver.JmxMBeanServer@1e01d652
   [junit4]   2> 1944153 T4497 oasc.CachingDirectoryFactory.get return new directory for /Users/jenkins/jenkins-slave/workspace/Lucene-Solr-4.x-MacOSX/solr/build/solr-core/test/J0/./org.apache.solr.cloud.CollectionsAPIDistributedZkTest-jetty2-1375521664816//nodes_used_collection_shard1_replica1/data
   [junit4]   2> 1944154 T4497 oasc.SolrCore.getNewIndexDir New index directory detected: old=null new=/Users/jenkins/jenkins-slave/workspace/Lucene-Solr-4.x-MacOSX/solr/build/solr-core/test/J0/./org.apache.solr.cloud.CollectionsAPIDistributedZkTest-jetty2-1375521664816//nodes_used_collection_shard1_replica1/data/index/
   [junit4]   2> 1944155 T4497 oasc.SolrCore.initIndex WARN [nodes_used_collection_shard1_replica1] Solr index directory '/Users/jenkins/jenkins-slave/workspace/Lucene-Solr-4.x-MacOSX/solr/build/solr-core/test/J0/./org.apache.solr.cloud.CollectionsAPIDistributedZkTest-jetty2-1375521664816/nodes_used_collection_shard1_replica1/data/index' doesn't exist. Creating new index...
   [junit4]   2> 1944156 T4497 oasc.CachingDirectoryFactory.get return new directory for /Users/jenkins/jenkins-slave/workspace/Lucene-Solr-4.x-MacOSX/solr/build/solr-core/test/J0/./org.apache.solr.cloud.CollectionsAPIDistributedZkTest-jetty2-1375521664816//nodes_used_collection_shard1_replica1/data/index
   [junit4]   2> 1944157 T4468 oass.FileExchangeRateProvider.reload Reloading exchange rates from file currency.xml
   [junit4]   2> 1944149 T4527 oass.OpenExchangeRatesOrgProvider.reload Reloading exchange rates from open-exchange-rates.json
   [junit4]   2> 1944161 T4511 oass.SolrIndexSearcher.<init> Opening Searcher@2e10891b main
   [junit4]   2> 1944165 T4511 oasu.CommitTracker.<init> Hard AutoCommit: disabled
   [junit4]   2> 1944165 T4511 oasu.CommitTracker.<init> Soft AutoCommit: disabled
   [junit4]   2> 1944172 T4497 oasc.SolrDeletionPolicy.onCommit SolrDeletionPolicy.onCommit: commits: num=1
   [junit4]   2> 		commit{dir=MockDirWrapper(RateLimitedDirectoryWrapper(org.apache.lucene.store.RAMDirectory@2cfbe3a lockFactory=org.apache.lucene.store.NativeFSLockFactory@337d0ea3)),segFN=segments_1,generation=1}
   [junit4]   2> 1944175 T4527 oass.OpenExchangeRatesOrgProvider$OpenExchangeRates.<init> WARN Unknown key IMPORTANT NOTE
   [junit4]   2> 1944176 T4527 oass.OpenExchangeRatesOrgProvider$OpenExchangeRates.<init> WARN Expected key, got STRING
   [junit4]   2> 1944177 T4527 oass.OpenExchangeRatesOrgProvider.reload Reloading exchange rates from open-exchange-rates.json
   [junit4]   2> 1944177 T4497 oasc.SolrDeletionPolicy.updateCommits newest commit generation = 1
   [junit4]   2> 1944180 T4540 oasc.SolrCore.registerSearcher [nodes_used_collection_shard2_replica1] Registered new searcher Searcher@2e10891b main{StandardDirectoryReader(segments_1:1)}
   [junit4]   2> 1944181 T4468 oass.OpenExchangeRatesOrgProvider.reload Reloading exchange rates from open-exchange-rates.json
   [junit4]   2> 1944188 T4468 oass.OpenExchangeRatesOrgProvider$OpenExchangeRates.<init> WARN Unknown key IMPORTANT NOTE
   [junit4]   2> 1944189 T4468 oass.OpenExchangeRatesOrgProvider$OpenExchangeRates.<init> WARN Expected key, got STRING
   [junit4]   2> 1944189 T4468 oass.OpenExchangeRatesOrgProvider.reload Reloading exchange rates from open-exchange-rates.json
   [junit4]   2> 1944191 T4527 oass.OpenExchangeRatesOrgProvider$OpenExchangeRates.<init> WARN Unknown key IMPORTANT NOTE
   [junit4]   2> 1944191 T4527 oass.OpenExchangeRatesOrgProvider$OpenExchangeRates.<init> WARN Expected key, got STRING
   [junit4]   2> 1944192 T4527 oasc.SolrCore.initDirectoryFactory org.apache.solr.core.MockDirectoryFactory
   [junit4]   2> 1944192 T4527 oasc.SolrCore.<init> [nodes_used_collection_shard2_replica2] Opening new SolrCore at /Users/jenkins/jenkins-slave/workspace/Lucene-Solr-4.x-MacOSX/solr/build/solr-core/test/J0/./org.apache.solr.cloud.CollectionsAPIDistributedZkTest-jetty4-1375521669402/nodes_used_collection_shard2_replica2/, dataDir=/Users/jenkins/jenkins-slave/workspace/Lucene-Solr-4.x-MacOSX/solr/build/solr-core/test/J0/./org.apache.solr.cloud.CollectionsAPIDistributedZkTest-jetty4-1375521669402//nodes_used_collection_shard2_replica2/data/
   [junit4]   2> 1944193 T4527 oasc.JmxMonitoredMap.<init> JMX monitoring is enabled. Adding Solr mbeans to JMX Server: com.sun.jmx.mbeanserver.JmxMBeanServer@1e01d652
   [junit4]   2> 1944192 T4511 oasc.CoreContainer.registerCore registering core: nodes_used_collection_shard2_replica1
   [junit4]   2> 1944195 T4511 oasc.ZkController.register Register replica - core:nodes_used_collection_shard2_replica1 address:http://127.0.0.1:52785 collection:nodes_used_collection shard:shard2
   [junit4]   2> 1944196 T4511 oascsi.HttpClientUtil.createClient Creating new http client, config:maxConnections=10000&maxConnectionsPerHost=20&connTimeout=15000&socketTimeout=30000&retry=false
   [junit4]   2> 1944197 T4527 oasc.CachingDirectoryFactory.get return new directory for /Users/jenkins/jenkins-slave/workspace/Lucene-Solr-4.x-MacOSX/solr/build/solr-core/test/J0/./org.apache.solr.cloud.CollectionsAPIDistributedZkTest-jetty4-1375521669402//nodes_used_collection_shard2_replica2/data
   [junit4]   2> 1944198 T4527 oasc.SolrCore.getNewIndexDir New index directory detected: old=null new=/Users/jenkins/jenkins-slave/workspace/Lucene-Solr-4.x-MacOSX/solr/build/solr-core/test/J0/./org.apache.solr.cloud.CollectionsAPIDistributedZkTest-jetty4-1375521669402//nodes_used_collection_shard2_replica2/data/index/
   [junit4]   2> 1944198 T4527 oasc.SolrCore.initIndex WARN [nodes_used_collection_shard2_replica2] Solr index directory '/Users/jenkins/jenkins-slave/workspace/Lucene-Solr-4.x-MacOSX/solr/build/solr-core/test/J0/./org.apache.solr.cloud.CollectionsAPIDistributedZkTest-jetty4-1375521669402/nodes_used_collection_shard2_replica2/data/index' doesn't exist. Creating new index...
   [junit4]   2> 1944199 T4527 oasc.CachingDirectoryFactory.get return new directory for /Users/jenkins/jenkins-slave/workspace/Lucene-Solr-4.x-MacOSX/solr/build/solr-core/test/J0/./org.apache.solr.cloud.CollectionsAPIDistributedZkTest-jetty4-1375521669402//nodes_used_collection_shard2_replica2/data/index
   [junit4]   2> 1944196 T4497 oasup.UpdateRequestProcessorChain.init inserting DistributedUpdateProcessorFactory into updateRequestProcessorChain "dedupe"
   [junit4]   2> 1944202 T4497 oasup.UpdateRequestProcessorChain.init inserting DistributedUpdateProcessorFactory into updateRequestProcessorChain "stored_sig"
   [junit4]   2> 1944203 T4497 oasup.UpdateRequestProcessorChain.init inserting DistributedUpdateProcessorFactory into updateRequestProcessorChain "distrib-dup-test-chain-implicit"
   [junit4]   2> 1944205 T4468 oass.OpenExchangeRatesOrgProvider$OpenExchangeRates.<init> WARN Unknown key IMPORTANT NOTE
   [junit4]   2> 1944207 T4468 oass.OpenExchangeRatesOrgProvider$OpenExchangeRates.<init> WARN Expected key, got STRING
   [junit4]   2> 1944204 T4527 oasc.SolrDeletionPolicy.onCommit SolrDeletionPolicy.onCommit: commits: num=1
   [junit4]   2> 		commit{dir=MockDirWrapper(RateLimitedDirectoryWrapper(org.apache.lucene.store.RAMDirectory@481055a1 lockFactory=org.apache.lucene.store.NativeFSLockFactory@5beb6a5c)),segFN=segments_1,generation=1}
   [junit4]   2> 1944208 T4527 oasc.SolrDeletionPolicy.updateCommits newest commit generation = 1
   [junit4]   2> 1944207 T4468 oasc.SolrCore.initDirectoryFactory org.apache.solr.core.MockDirectoryFactory
   [junit4]   2> 1944209 T4468 oasc.SolrCore.<init> [nodes_used_collection_shard1_replica2] Opening new SolrCore at /Users/jenkins/jenkins-slave/workspace/Lucene-Solr-4.x-MacOSX/solr/build/solr-core/test/J0/./org.apache.solr.cloud.CollectionsAPIDistributedZkTest-controljetty-1375521661225/nodes_used_collection_shard1_replica2/, dataDir=/Users/jenkins/jenkins-slave/workspace/Lucene-Solr-4.x-MacOSX/solr/build/solr-core/test/J0/./org.apache.solr.cloud.CollectionsAPIDistributedZkTest-controljetty-1375521661225//nodes_used_collection_shard1_replica2/data/
   [junit4]   2> 1944210 T4468 oasc.JmxMonitoredMap.<init> JMX monitoring is enabled. Adding Solr mbeans to JMX Server: com.sun.jmx.mbeanserver.JmxMBeanServer@1e01d652
   [junit4]   2> 1944211 T4497 oasc.RequestHandlers.initHandlersFromConfig created standard: solr.StandardRequestHandler
   [junit4]   2> 1944212 T4468 oasc.CachingDirectoryFactory.get return new directory for /Users/jenkins/jenkins-slave/workspace/Lucene-Solr-4.x-MacOSX/solr/build/solr-core/test/J0/./org.apache.solr.cloud.CollectionsAPIDistributedZkTest-controljetty-1375521661225//nodes_used_collection_shard1_replica2/data
   [junit4]   2> 1944213 T4468 oasc.SolrCore.getNewIndexDir New index directory detected: old=null new=/Users/jenkins/jenkins-slave/workspace/Lucene-Solr-4.x-MacOSX/solr/build/solr-core/test/J0/./org.apache.solr.cloud.CollectionsAPIDistributedZkTest-controljetty-1375521661225//nodes_used_collection_shard1_replica2/data/index/
   [junit4]   2> 1944213 T4468 oasc.SolrCore.initIndex WARN [nodes_used_collection_shard1_replica2] Solr index directory '/Users/jenkins/jenkins-slave/workspace/Lucene-Solr-4.x-MacOSX/solr/build/solr-core/test/J0/./org.apache.solr.cloud.CollectionsAPIDistributedZkTest-controljetty-1375521661225/nodes_used_collection_shard1_replica2/data/index' doesn't exist. Creating new index...
   [junit4]   2> 1944214 T4468 oasc.CachingDirectoryFactory.get return new directory for /Users/jenkins/jenkins-slave/workspace/Lucene-Solr-4.x-MacOSX/solr/build/solr-core/test/J0/./org.apache.solr.cloud.CollectionsAPIDistributedZkTest-controljetty-1375521661225//nodes_used_collection_shard1_replica2/data/index
   [junit4]   2> 1944218 T4527 oasup.UpdateRequestProcessorChain.init inserting DistributedUpdateProcessorFactory into updateRequestProcessorChain "dedupe"
   [junit4]   2> 1944218 T4527 oasup.UpdateRequestProcessorChain.init inserting DistributedUpdateProcessorFactory into updateRequestProcessorChain "stored_sig"
   [junit4]   2> 1944219 T4527 oasup.UpdateRequestProcessorChain.init inserting DistributedUpdateProcessorFactory into updateRequestProcessorChain "distrib-dup-test-chain-implicit"
   [junit4]   2> 1944220 T4527 oasc.RequestHandlers.initHandlersFromConfig created standard: solr.StandardRequestHandler
   [junit4]   2> 1944221 T4527 oasc.RequestHandlers.initHandlersFromConfig created /get: solr.RealTimeGetHandler
   [junit4]   2> 1944222 T4527 oasc.RequestHandlers.initHandlersFromConfig adding lazy requestHandler: solr.ReplicationHandler
   [junit4]   2> 1944223 T4527 oasc.RequestHandlers.initHandlersFromConfig created /replication: solr.ReplicationHandler
   [junit4]   2> 1944224 T4527 oasc.RequestHandlers.initHandlersFromConfig created /update: solr.UpdateRequestHandler
   [junit4]   2> 1944225 T4527 oasc.RequestHandlers.initHandlersFromConfig created /admin/: org.apache.solr.handler.admin.AdminHandlers
   [junit4]   2> 1944212 T4497 oasc.RequestHandlers.initHandlersFromConfig created /get: solr.RealTimeGetHandler
   [junit4]   2> 1944228 T4497 oasc.RequestHandlers.initHandlersFromConfig adding lazy requestHandler: solr.ReplicationHandler
   [junit4]   2> 1944229 T4497 oasc.RequestHandlers.initHandlersFromConfig created /replication: solr.ReplicationHandler
   [junit4]   2> 1944230 T4497 oasc.RequestHandlers.initHandlersFromConfig created /update: solr.UpdateRequestHandler
   [junit4]   2> 1944231 T4497 oasc.RequestHandlers.initHandlersFromConfig created /admin/: org.apache.solr.handler.admin.AdminHandlers
   [junit4]   2> 1944235 T4527 oashl.XMLLoader.init xsltCacheLifetimeSeconds=60
   [junit4]   2> 1944241 T4468 oasc.SolrDeletionPolicy.onCommit SolrDeletionPolicy.onCommit: commits: num=1
   [junit4]   2> 		commit{dir=MockDirWrapper(RateLimitedDirectoryWrapper(org.apache.lucene.store.RAMDirectory@1e667ac6 lockFactory=org.apache.lucene.store.NativeFSLockFactory@39dd957b)),segFN=segments_1,generation=1}
   [junit4]   2> 1944242 T4468 oasc.SolrDeletionPolicy.updateCommits newest commit generation = 1
   [junit4]   2> 1944241 T4497 oashl.XMLLoader.init xsltCacheLifetimeSeconds=60
   [junit4]   2> 1944259 T4511 oascc.SolrZkClient.makePath makePath: /collections/nodes_used_collection/leader_elect/shard2/election
   [junit4]   2> 1944261 T4468 oasup.UpdateRequestProcessorChain.init inserting DistributedUpdateProcessorFactory into updateRequestProcessorChain "dedupe"
   [junit4]   2> 1944261 T4468 oasup.UpdateRequestProcessorChain.init inserting DistributedUpdateProcessorFactory into updateRequestProcessorChain "stored_sig"
   [junit4]   2> 1944264 T4468 oasup.UpdateRequestProcessorChain.init inserting DistributedUpdateProcessorFactory into updateRequestProcessorChain "distrib-dup-test-chain-implicit"
   [junit4]   2> 1944265 T4468 oasc.RequestHandlers.initHandlersFromConfig created standard: solr.StandardRequestHandler
   [junit4]   2> 1944266 T4468 oasc.RequestHandlers.initHandlersFromConfig created /get: solr.RealTimeGetHandler
   [junit4]   2> 1944267 T4468 oasc.RequestHandlers.initHandlersFromConfig adding lazy requestHandler: solr.ReplicationHandler
   [junit4]   2> 1944268 T4468 oasc.RequestHandlers.initHandlersFromConfig created /replication: solr.ReplicationHandler
   [junit4]   2> 1944268 T4468 oasc.RequestHandlers.initHandlersFromConfig created /update: solr.UpdateRequestHandler
   [junit4]   2> 1944269 T4468 oasc.RequestHandlers.initHandlersFromConfig created /admin/: org.apache.solr.handler.admin.AdminHandlers
   [junit4]   2> 1944263 T4527 oass.SolrIndexSearcher.<init> Opening Searcher@6583023d main
   [junit4]   2> 1944274 T4527 oasu.CommitTracker.<init> Hard AutoCommit: disabled
   [junit4]   2> 1944275 T4527 oasu.CommitTracker.<init> Soft AutoCommit: disabled
   [junit4]   2> 1944279 T4468 oashl.XMLLoader.init xsltCacheLifetimeSeconds=60
   [junit4]   2> 1944280 T4541 oasc.SolrCore.registerSearcher [nodes_used_collection_shard2_replica2] Registered new searcher Searcher@6583023d main{StandardDirectoryReader(segments_1:1)}
   [junit4]   2> 1944275 T4497 oass.SolrIndexSearcher.<init> Opening Searcher@18eaaaa main
   [junit4]   2> 1944284 T4527 oasc.CoreContainer.registerCore registering core: nodes_used_collection_shard2_replica2
   [junit4]   2> 1944284 T4527 oasc.ZkController.register Register replica - core:nodes_used_collection_shard2_replica2 address:http://127.0.0.1:52788 collection:nodes_used_collection shard:shard2
   [junit4]   2> 1944294 T4527 oascsi.HttpClientUtil.createClient Creating new http client, config:maxConnections=10000&maxConnectionsPerHost=20&connTimeout=15000&socketTimeout=30000&retry=false
   [junit4]   2> 1944289 T4468 oass.SolrIndexSearcher.<init> Opening Searcher@13b7e076 main
   [junit4]   2> 1944285 T4497 oasu.CommitTracker.<init> Hard AutoCommit: disabled
   [junit4]   2> 1944304 T4497 oasu.CommitTracker.<init> Soft AutoCommit: disabled
   [junit4]   2> 1944305 T4468 oasu.CommitTracker.<init> Hard AutoCommit: disabled
   [junit4]   2> 1944305 T4468 oasu.CommitTracker.<init> Soft AutoCommit: disabled
   [junit4]   2> 1944312 T4543 oasc.SolrCore.registerSearcher [nodes_used_collection_shard1_replica2] Registered new searcher Searcher@13b7e076 main{StandardDirectoryReader(segments_1:1)}
   [junit4]   2> 1944312 T4542 oasc.SolrCore.registerSearcher [nodes_used_collection_shard1_replica1] Registered new searcher Searcher@18eaaaa main{StandardDirectoryReader(segments_1:1)}
   [junit4]   2> 1944316 T4497 oasc.CoreContainer.registerCore registering core: nodes_used_collection_shard1_replica1
   [junit4]   2> 1944317 T4497 oasc.ZkController.register Register replica - core:nodes_used_collection_shard1_replica1 address:http://127.0.0.1:52782 collection:nodes_used_collection shard:shard1
   [junit4]   2> 1944317 T4497 oascsi.HttpClientUtil.createClient Creating new http client, config:maxConnections=10000&maxConnectionsPerHost=20&connTimeout=15000&socketTimeout=30000&retry=false
   [junit4]   2> 1944339 T4468 oasc.CoreContainer.registerCore registering core: nodes_used_collection_shard1_replica2
   [junit4]   2> 1944340 T4468 oasc.ZkController.register Register replica - core:nodes_used_collection_shard1_replica2 address:http://127.0.0.1:52775 collection:nodes_used_collection shard:shard1
   [junit4]   2> 1944340 T4468 oascsi.HttpClientUtil.createClient Creating new http client, config:maxConnections=10000&maxConnectionsPerHost=20&connTimeout=15000&socketTimeout=30000&retry=false
   [junit4]   2> 1944359 T4497 oascc.SolrZkClient.makePath makePath: /collections/nodes_used_collection/leader_elect/shard1/election
   [junit4]   2> 1944385 T4527 oascc.SolrZkClient.makePath makePath: /collections/nodes_used_collection/leader_elect/shard2/election
   [junit4]   2> 1944396 T4468 oascc.SolrZkClient.makePath makePath: /collections/nodes_used_collection/leader_elect/shard1/election
   [junit4]   2> 1944429 T4511 oasc.ShardLeaderElectionContext.runLeaderProcess Running the leader process for shard shard2
   [junit4]   2> 1944453 T4511 oasc.ShardLeaderElectionContext.waitForReplicasToComeUp Enough replicas found to continue.
   [junit4]   2> 1944454 T4511 oasc.ShardLeaderElectionContext.runLeaderProcess I may be the new leader - try and sync
   [junit4]   2> 1944454 T4511 oasc.SyncStrategy.sync Sync replicas to http://127.0.0.1:52785/nodes_used_collection_shard2_replica1/
   [junit4]   2> 1944455 T4511 oasu.PeerSync.sync PeerSync: core=nodes_used_collection_shard2_replica1 url=http://127.0.0.1:52785 START replicas=[http://127.0.0.1:52788/nodes_used_collection_shard2_replica2/] nUpdates=100
   [junit4]   2> 1944457 T4511 oasu.PeerSync.sync PeerSync: core=nodes_used_collection_shard2_replica1 url=http://127.0.0.1:52785 DONE.  We have no versions.  sync failed.
   [junit4]   2> 1944458 T4511 oasc.SyncStrategy.syncReplicas Leader's attempt to sync with shard failed, moving to the next candidate
   [junit4]   2> 1944478 T4511 oasc.ShardLeaderElectionContext.runLeaderProcess We failed sync, but we have no versions - we can't sync in that case - we were active before, so become leader anyway
   [junit4]   2> ASYNC  NEW_CORE C680 name=nodes_used_collection_shard2_replica2 org.apache.solr.core.SolrCore@2a780f52 url=http://127.0.0.1:52788/nodes_used_collection_shard2_replica2 node=127.0.0.1:52788_ C680_STATE=coll:nodes_used_collection core:nodes_used_colle

[...truncated too long message...]

31556 T4451 ccr.ThreadLeakControl.checkThreadLeaks WARNING Will linger awaiting termination of 2 leaked thread(s).
   [junit4]   2> 2158985 T4534 oasc.LeaderElector$1.process WARN  org.apache.zookeeper.KeeperException$SessionExpiredException: KeeperErrorCode = Session expired for /collections/new_implicit_coll_0/leader_elect/c/election
   [junit4]   2> 	at org.apache.zookeeper.KeeperException.create(KeeperException.java:127)
   [junit4]   2> 	at org.apache.zookeeper.KeeperException.create(KeeperException.java:51)
   [junit4]   2> 	at org.apache.zookeeper.ZooKeeper.getChildren(ZooKeeper.java:1468)
   [junit4]   2> 	at org.apache.solr.common.cloud.SolrZkClient$6.execute(SolrZkClient.java:235)
   [junit4]   2> 	at org.apache.solr.common.cloud.SolrZkClient$6.execute(SolrZkClient.java:232)
   [junit4]   2> 	at org.apache.solr.common.cloud.ZkCmdExecutor.retryOperation(ZkCmdExecutor.java:65)
   [junit4]   2> 	at org.apache.solr.common.cloud.SolrZkClient.getChildren(SolrZkClient.java:232)
   [junit4]   2> 	at org.apache.solr.cloud.LeaderElector.checkIfIamLeader(LeaderElector.java:84)
   [junit4]   2> 	at org.apache.solr.cloud.LeaderElector.access$000(LeaderElector.java:55)
   [junit4]   2> 	at org.apache.solr.cloud.LeaderElector$1.process(LeaderElector.java:129)
   [junit4]   2> 	at org.apache.zookeeper.ClientCnxn$EventThread.processEvent(ClientCnxn.java:519)
   [junit4]   2> 	at org.apache.zookeeper.ClientCnxn$EventThread.run(ClientCnxn.java:495)
   [junit4]   2> 
   [junit4]   2> 2158986 T4534 oasc.LeaderElector$1.process WARN  org.apache.zookeeper.KeeperException$SessionExpiredException: KeeperErrorCode = Session expired for /collections/new_implicit_coll_0/leader_elect/d/election
   [junit4]   2> 	at org.apache.zookeeper.KeeperException.create(KeeperException.java:127)
   [junit4]   2> 	at org.apache.zookeeper.KeeperException.create(KeeperException.java:51)
   [junit4]   2> 	at org.apache.zookeeper.ZooKeeper.getChildren(ZooKeeper.java:1468)
   [junit4]   2> 	at org.apache.solr.common.cloud.SolrZkClient$6.execute(SolrZkClient.java:235)
   [junit4]   2> 	at org.apache.solr.common.cloud.SolrZkClient$6.execute(SolrZkClient.java:232)
   [junit4]   2> 	at org.apache.solr.common.cloud.ZkCmdExecutor.retryOperation(ZkCmdExecutor.java:65)
   [junit4]   2> 	at org.apache.solr.common.cloud.SolrZkClient.getChildren(SolrZkClient.java:232)
   [junit4]   2> 	at org.apache.solr.cloud.LeaderElector.checkIfIamLeader(LeaderElector.java:84)
   [junit4]   2> 	at org.apache.solr.cloud.LeaderElector.access$000(LeaderElector.java:55)
   [junit4]   2> 	at org.apache.solr.cloud.LeaderElector$1.process(LeaderElector.java:129)
   [junit4]   2> 	at org.apache.zookeeper.ClientCnxn$EventThread.processEvent(ClientCnxn.java:519)
   [junit4]   2> 	at org.apache.zookeeper.ClientCnxn$EventThread.run(ClientCnxn.java:495)
   [junit4]   2> 
   [junit4]   2> 2158987 T4534 oasc.LeaderElector$1.process WARN  org.apache.zookeeper.KeeperException$SessionExpiredException: KeeperErrorCode = Session expired for /collections/new_implicit_coll_0/leader_elect/a/election
   [junit4]   2> 	at org.apache.zookeeper.KeeperException.create(KeeperException.java:127)
   [junit4]   2> 	at org.apache.zookeeper.KeeperException.create(KeeperException.java:51)
   [junit4]   2> 	at org.apache.zookeeper.ZooKeeper.getChildren(ZooKeeper.java:1468)
   [junit4]   2> 	at org.apache.solr.common.cloud.SolrZkClient$6.execute(SolrZkClient.java:235)
   [junit4]   2> 	at org.apache.solr.common.cloud.SolrZkClient$6.execute(SolrZkClient.java:232)
   [junit4]   2> 	at org.apache.solr.common.cloud.ZkCmdExecutor.retryOperation(ZkCmdExecutor.java:65)
   [junit4]   2> 	at org.apache.solr.common.cloud.SolrZkClient.getChildren(SolrZkClient.java:232)
   [junit4]   2> 	at org.apache.solr.cloud.LeaderElector.checkIfIamLeader(LeaderElector.java:84)
   [junit4]   2> 	at org.apache.solr.cloud.LeaderElector.access$000(LeaderElector.java:55)
   [junit4]   2> 	at org.apache.solr.cloud.LeaderElector$1.process(LeaderElector.java:129)
   [junit4]   2> 	at org.apache.zookeeper.ClientCnxn$EventThread.processEvent(ClientCnxn.java:519)
   [junit4]   2> 	at org.apache.zookeeper.ClientCnxn$EventThread.run(ClientCnxn.java:495)
   [junit4]   2> 
   [junit4]   2> 2158988 T4534 oascc.ZkStateReader$3.process WARN ZooKeeper watch triggered, but Solr cannot talk to ZK
   [junit4]   2> 2158988 T4534 oascc.ZkStateReader$2.process A cluster state change: WatchedEvent state:SyncConnected type:NodeChildrenChanged path:/live_nodes, has occurred - updating... (live nodes size: 1)
   [junit4]   2> 2158989 T4534 oascc.ZkStateReader$2.process WARN ZooKeeper watch triggered, but Solr cannot talk to ZK
   [junit4]   2> NOTE: test params are: codec=Asserting, sim=RandomSimilarityProvider(queryNorm=false,coord=yes): {}, locale=pl, timezone=Europe/Sofia
   [junit4]   2> NOTE: Mac OS X 10.8.4 x86_64/Apple Inc. 1.6.0_51 (64-bit)/cpus=2,threads=1,free=190788800,total=381878272
   [junit4]   2> NOTE: All tests run in this JVM: [SampleTest, TestAddFieldRealTimeGet, TestCharFilters, TestCopyFieldCollectionResource, HdfsChaosMonkeySafeLeaderTest, SuggesterFSTTest, TestZkChroot, TestSolrXMLSerializer, HdfsCollectionsAPIDistributedZkTest, UpdateRequestProcessorFactoryTest, ShardRoutingTest, TestLazyCores, AddSchemaFieldsUpdateProcessorFactoryTest, TestFieldCollectionResource, TestFoldingMultitermQuery, ResourceLoaderTest, DirectUpdateHandlerOptimizeTest, DistanceFunctionTest, DocumentBuilderTest, SuggesterTSTTest, ScriptEngineTest, BasicDistributedZkTest, IndexSchemaRuntimeFieldTest, IndexReaderFactoryTest, UUIDFieldTest, SliceStateUpdateTest, TestManagedSchema, StandardRequestHandlerTest, DisMaxRequestHandlerTest, RequiredFieldsTest, TestFieldTypeCollectionResource, TestQuerySenderListener, BinaryUpdateRequestHandlerTest, TestPartialUpdateDeduplication, TestNumberUtils, TestSolrQueryParserResource, TestTrie, SolrIndexSplitterTest, UniqFieldsUpdateProcessorFactoryTest, TestXIncludeConfig, TestRandomDVFaceting, TestFaceting, SolrCmdDistributorTest, ZkSolrClientTest, TestLMJelinekMercerSimilarityFactory, MBeansHandlerTest, TestBinaryResponseWriter, LegacyHTMLStripCharFilterTest, PrimitiveFieldTypeTest, BlockDirectoryTest, CSVRequestHandlerTest, LoggingHandlerTest, CoreAdminCreateDiscoverTest, AutoCommitTest, TestSchemaResource, TestRecovery, TestMergePolicyConfig, DebugComponentTest, SpellCheckCollatorTest, ChaosMonkeySafeLeaderTest, TestPluginEnable, PingRequestHandlerTest, SolrRequestParserTest, QueryResultKeyTest, TestPHPSerializedResponseWriter, ResponseLogComponentTest, LeaderElectionIntegrationTest, RegexBoostProcessorTest, TestDocumentBuilder, TestJoin, OpenExchangeRatesOrgProviderTest, BadComponentTest, CircularListTest, FieldAnalysisRequestHandlerTest, LeaderElectionTest, TestPropInjectDefaults, JsonLoaderTest, TestJmxIntegration, DocValuesTest, PathHierarchyTokenizerFactoryTest, HighlighterTest, ParsingFieldUpdateProcessorsTest, QueryParsingTest, TestIndexSearcher, ShardRoutingCustomTest, InfoHandlerTest, TestQueryUtils, UnloadDistributedZkTest, TestPropInject, TestWriterPerf, ZkNodePropsTest, JSONWriterTest, SimplePostToolTest, CoreContainerCoreInitFailuresTest, TestPostingsSolrHighlighter, TestBadConfig, EchoParamsTest, TestClassNameShortening, TestCollationKeyRangeQueries, PrimUtilsTest, SchemaVersionSpecificBehaviorTest, TestCoreDiscovery, TestFuzzyAnalyzedSuggestions, TestRandomFaceting, TestIndexingPerformance, CacheHeaderTest, TestFastLRUCache, AlternateDirectoryTest, PolyFieldTest, TestSolrXmlPersistence, TestStressRecovery, TestSweetSpotSimilarityFactory, RequestHandlersTest, TestSerializedLuceneMatchVersion, TestSolrQueryParser, ShowFileRequestHandlerTest, PreAnalyzedUpdateProcessorTest, RAMDirectoryFactoryTest, TestDynamicFieldResource, HdfsUnloadDistributedZkTest, TestSolrDeletionPolicy1, TestFunctionQuery, StatelessScriptUpdateProcessorFactoryTest, BadCopyFieldTest, TestOmitPositions, TestSchemaNameResource, TestSuggestSpellingConverter, TestComponentsName, ExternalFileFieldSortTest, TestDistributedSearch, TestFiltering, PeerSyncTest, TestInfoStreamLogging, TestDefaultSimilarityFactory, TestDocSet, TestSchemaVersionResource, TestBinaryField, FieldMutatingUpdateProcessorTest, DistributedSpellCheckComponentTest, DateFieldTest, SpellPossibilityIteratorTest, TestShardHandlerFactory, TestConfig, XsltUpdateRequestHandlerTest, HardAutoCommitTest, TestReplicationHandler, TestLRUCache, TestCSVLoader, UpdateParamsTest, FastVectorHighlighterTest, ClusterStateTest, WordBreakSolrSpellCheckerTest, HighlighterConfigTest, BasicDistributedZk2Test, CollectionsAPIDistributedZkTest]
   [junit4] Completed in 232.65s, 1 test, 1 error <<< FAILURES!

[...truncated 502 lines...]
BUILD FAILED
/Users/jenkins/jenkins-slave/workspace/Lucene-Solr-4.x-MacOSX/build.xml:395: The following error occurred while executing this line:
/Users/jenkins/jenkins-slave/workspace/Lucene-Solr-4.x-MacOSX/build.xml:375: The following error occurred while executing this line:
/Users/jenkins/jenkins-slave/workspace/Lucene-Solr-4.x-MacOSX/build.xml:39: The following error occurred while executing this line:
/Users/jenkins/jenkins-slave/workspace/Lucene-Solr-4.x-MacOSX/solr/build.xml:181: The following error occurred while executing this line:
/Users/jenkins/jenkins-slave/workspace/Lucene-Solr-4.x-MacOSX/solr/common-build.xml:449: The following error occurred while executing this line:
/Users/jenkins/jenkins-slave/workspace/Lucene-Solr-4.x-MacOSX/lucene/common-build.xml:1233: The following error occurred while executing this line:
/Users/jenkins/jenkins-slave/workspace/Lucene-Solr-4.x-MacOSX/lucene/common-build.xml:876: There were test failures: 321 suites, 1352 tests, 1 error, 39 ignored (5 assumptions)

Total time: 109 minutes 39 seconds
Build step 'Invoke Ant' marked build as failure
Description set: Java: 64bit/jdk1.6.0 -XX:-UseCompressedOops -XX:+UseParallelGC
Archiving artifacts
Recording test results
Email was triggered for: Failure
Sending email for trigger: Failure



Mime
View raw message