lucene-dev mailing list archives

Site index · List index
Message view « Date » · « Thread »
Top « Date » · « Thread »
From Policeman Jenkins Server <jenk...@thetaphi.de>
Subject [JENKINS] Lucene-Solr-4.x-Linux (32bit/jdk1.6.0_45) - Build # 6766 - Still Failing!
Date Fri, 02 Aug 2013 13:07:58 GMT
Build: http://jenkins.thetaphi.de/job/Lucene-Solr-4.x-Linux/6766/
Java: 32bit/jdk1.6.0_45 -client -XX:+UseConcMarkSweepGC

1 tests failed.
FAILED:  org.apache.solr.cloud.CollectionsAPIDistributedZkTest.testDistribSearch

Error Message:
Server refused connection at: http://127.0.0.1:44646/cl

Stack Trace:
org.apache.solr.client.solrj.SolrServerException: Server refused connection at: http://127.0.0.1:44646/cl
	at __randomizedtesting.SeedInfo.seed([7F855C675969A854:FE63D27F2E36C868]:0)
	at org.apache.solr.client.solrj.impl.HttpSolrServer.request(HttpSolrServer.java:428)
	at org.apache.solr.client.solrj.impl.HttpSolrServer.request(HttpSolrServer.java:180)
	at org.apache.solr.cloud.AbstractFullDistribZkTestBase.createCollection(AbstractFullDistribZkTestBase.java:1535)
	at org.apache.solr.cloud.CollectionsAPIDistributedZkTest.testCustomCollectionsAPI(CollectionsAPIDistributedZkTest.java:677)
	at org.apache.solr.cloud.CollectionsAPIDistributedZkTest.doTest(CollectionsAPIDistributedZkTest.java:159)
	at org.apache.solr.BaseDistributedSearchTestCase.testDistribSearch(BaseDistributedSearchTestCase.java:835)
	at sun.reflect.NativeMethodAccessorImpl.invoke0(Native Method)
	at sun.reflect.NativeMethodAccessorImpl.invoke(NativeMethodAccessorImpl.java:39)
	at sun.reflect.DelegatingMethodAccessorImpl.invoke(DelegatingMethodAccessorImpl.java:25)
	at java.lang.reflect.Method.invoke(Method.java:597)
	at com.carrotsearch.randomizedtesting.RandomizedRunner.invoke(RandomizedRunner.java:1559)
	at com.carrotsearch.randomizedtesting.RandomizedRunner.access$600(RandomizedRunner.java:79)
	at com.carrotsearch.randomizedtesting.RandomizedRunner$6.evaluate(RandomizedRunner.java:737)
	at com.carrotsearch.randomizedtesting.RandomizedRunner$7.evaluate(RandomizedRunner.java:773)
	at com.carrotsearch.randomizedtesting.RandomizedRunner$8.evaluate(RandomizedRunner.java:787)
	at com.carrotsearch.randomizedtesting.rules.SystemPropertiesRestoreRule$1.evaluate(SystemPropertiesRestoreRule.java:53)
	at org.apache.lucene.util.TestRuleSetupTeardownChained$1.evaluate(TestRuleSetupTeardownChained.java:50)
	at org.apache.lucene.util.TestRuleFieldCacheSanity$1.evaluate(TestRuleFieldCacheSanity.java:51)
	at org.apache.lucene.util.AbstractBeforeAfterRule$1.evaluate(AbstractBeforeAfterRule.java:46)
	at com.carrotsearch.randomizedtesting.rules.SystemPropertiesInvariantRule$1.evaluate(SystemPropertiesInvariantRule.java:55)
	at org.apache.lucene.util.TestRuleThreadAndTestName$1.evaluate(TestRuleThreadAndTestName.java:49)
	at org.apache.lucene.util.TestRuleIgnoreAfterMaxFailures$1.evaluate(TestRuleIgnoreAfterMaxFailures.java:70)
	at org.apache.lucene.util.TestRuleMarkFailure$1.evaluate(TestRuleMarkFailure.java:48)
	at com.carrotsearch.randomizedtesting.rules.StatementAdapter.evaluate(StatementAdapter.java:36)
	at com.carrotsearch.randomizedtesting.ThreadLeakControl$StatementRunner.run(ThreadLeakControl.java:358)
	at com.carrotsearch.randomizedtesting.ThreadLeakControl.forkTimeoutingTask(ThreadLeakControl.java:782)
	at com.carrotsearch.randomizedtesting.ThreadLeakControl$3.evaluate(ThreadLeakControl.java:442)
	at com.carrotsearch.randomizedtesting.RandomizedRunner.runSingleTest(RandomizedRunner.java:746)
	at com.carrotsearch.randomizedtesting.RandomizedRunner$3.evaluate(RandomizedRunner.java:648)
	at com.carrotsearch.randomizedtesting.RandomizedRunner$4.evaluate(RandomizedRunner.java:682)
	at com.carrotsearch.randomizedtesting.RandomizedRunner$5.evaluate(RandomizedRunner.java:693)
	at com.carrotsearch.randomizedtesting.rules.StatementAdapter.evaluate(StatementAdapter.java:36)
	at com.carrotsearch.randomizedtesting.rules.SystemPropertiesRestoreRule$1.evaluate(SystemPropertiesRestoreRule.java:53)
	at org.apache.lucene.util.AbstractBeforeAfterRule$1.evaluate(AbstractBeforeAfterRule.java:46)
	at org.apache.lucene.util.TestRuleStoreClassName$1.evaluate(TestRuleStoreClassName.java:42)
	at com.carrotsearch.randomizedtesting.rules.SystemPropertiesInvariantRule$1.evaluate(SystemPropertiesInvariantRule.java:55)
	at com.carrotsearch.randomizedtesting.rules.NoShadowingOrOverridesOnMethodsRule$1.evaluate(NoShadowingOrOverridesOnMethodsRule.java:39)
	at com.carrotsearch.randomizedtesting.rules.NoShadowingOrOverridesOnMethodsRule$1.evaluate(NoShadowingOrOverridesOnMethodsRule.java:39)
	at com.carrotsearch.randomizedtesting.rules.StatementAdapter.evaluate(StatementAdapter.java:36)
	at org.apache.lucene.util.TestRuleAssertionsRequired$1.evaluate(TestRuleAssertionsRequired.java:43)
	at org.apache.lucene.util.TestRuleMarkFailure$1.evaluate(TestRuleMarkFailure.java:48)
	at org.apache.lucene.util.TestRuleIgnoreAfterMaxFailures$1.evaluate(TestRuleIgnoreAfterMaxFailures.java:70)
	at org.apache.lucene.util.TestRuleIgnoreTestSuites$1.evaluate(TestRuleIgnoreTestSuites.java:55)
	at com.carrotsearch.randomizedtesting.rules.StatementAdapter.evaluate(StatementAdapter.java:36)
	at com.carrotsearch.randomizedtesting.ThreadLeakControl$StatementRunner.run(ThreadLeakControl.java:358)
	at java.lang.Thread.run(Thread.java:662)
Caused by: org.apache.http.conn.HttpHostConnectException: Connection to http://127.0.0.1:44646 refused
	at org.apache.http.impl.conn.DefaultClientConnectionOperator.openConnection(DefaultClientConnectionOperator.java:190)
	at org.apache.http.impl.conn.ManagedClientConnectionImpl.open(ManagedClientConnectionImpl.java:294)
	at org.apache.http.impl.client.DefaultRequestDirector.tryConnect(DefaultRequestDirector.java:645)
	at org.apache.http.impl.client.DefaultRequestDirector.execute(DefaultRequestDirector.java:480)
	at org.apache.http.impl.client.AbstractHttpClient.execute(AbstractHttpClient.java:906)
	at org.apache.http.impl.client.AbstractHttpClient.execute(AbstractHttpClient.java:805)
	at org.apache.http.impl.client.AbstractHttpClient.execute(AbstractHttpClient.java:784)
	at org.apache.solr.client.solrj.impl.HttpSolrServer.request(HttpSolrServer.java:365)
	... 45 more
Caused by: java.net.ConnectException: Connection refused
	at java.net.PlainSocketImpl.socketConnect(Native Method)
	at java.net.PlainSocketImpl.doConnect(PlainSocketImpl.java:351)
	at java.net.PlainSocketImpl.connectToAddress(PlainSocketImpl.java:213)
	at java.net.PlainSocketImpl.connect(PlainSocketImpl.java:200)
	at java.net.SocksSocketImpl.connect(SocksSocketImpl.java:366)
	at java.net.Socket.connect(Socket.java:529)
	at org.apache.http.conn.scheme.PlainSocketFactory.connectSocket(PlainSocketFactory.java:127)
	at org.apache.http.impl.conn.DefaultClientConnectionOperator.openConnection(DefaultClientConnectionOperator.java:180)
	... 52 more




Build Log:
[...truncated 9234 lines...]
   [junit4] Suite: org.apache.solr.cloud.CollectionsAPIDistributedZkTest
   [junit4]   2> 876480 T2070 oas.BaseDistributedSearchTestCase.initHostContext Setting hostContext system property: /cl/
   [junit4]   2> 876484 T2070 oas.SolrTestCaseJ4.setUp ###Starting testDistribSearch
   [junit4]   2> Creating dataDir: /mnt/ssd/jenkins/workspace/Lucene-Solr-4.x-Linux/solr/build/solr-core/test/J1/./solrtest-CollectionsAPIDistributedZkTest-1375448162651
   [junit4]   2> 876484 T2070 oasc.ZkTestServer.run STARTING ZK TEST SERVER
   [junit4]   2> 876485 T2071 oasc.ZkTestServer$ZKServerMain.runFromConfig Starting server
   [junit4]   2> 876585 T2070 oasc.ZkTestServer.run start zk server on port:50487
   [junit4]   2> 876586 T2070 oascc.ConnectionManager.waitForConnected Waiting for client to connect to ZooKeeper
   [junit4]   2> 876688 T2077 oascc.ConnectionManager.process Watcher org.apache.solr.common.cloud.ConnectionManager@1fc421c name:ZooKeeperConnection Watcher:127.0.0.1:50487 got event WatchedEvent state:SyncConnected type:None path:null path:null type:None
   [junit4]   2> 876689 T2070 oascc.ConnectionManager.waitForConnected Client is connected to ZooKeeper
   [junit4]   2> 876689 T2070 oascc.SolrZkClient.makePath makePath: /solr
   [junit4]   2> 876699 T2070 oascc.ConnectionManager.waitForConnected Waiting for client to connect to ZooKeeper
   [junit4]   2> 876700 T2079 oascc.ConnectionManager.process Watcher org.apache.solr.common.cloud.ConnectionManager@e3f8e8 name:ZooKeeperConnection Watcher:127.0.0.1:50487/solr got event WatchedEvent state:SyncConnected type:None path:null path:null type:None
   [junit4]   2> 876701 T2070 oascc.ConnectionManager.waitForConnected Client is connected to ZooKeeper
   [junit4]   2> 876701 T2070 oascc.SolrZkClient.makePath makePath: /collections/collection1
   [junit4]   2> 876710 T2070 oascc.SolrZkClient.makePath makePath: /collections/collection1/shards
   [junit4]   2> 876719 T2070 oascc.SolrZkClient.makePath makePath: /collections/control_collection
   [junit4]   2> 876726 T2070 oascc.SolrZkClient.makePath makePath: /collections/control_collection/shards
   [junit4]   2> 876734 T2070 oasc.AbstractZkTestCase.putConfig put /mnt/ssd/jenkins/workspace/Lucene-Solr-4.x-Linux/solr/build/solr-core/test-files/solr/collection1/conf/solrconfig-tlog.xml to /configs/conf1/solrconfig.xml
   [junit4]   2> 876734 T2070 oascc.SolrZkClient.makePath makePath: /configs/conf1/solrconfig.xml
   [junit4]   2> 876747 T2070 oasc.AbstractZkTestCase.putConfig put /mnt/ssd/jenkins/workspace/Lucene-Solr-4.x-Linux/solr/build/solr-core/test-files/solr/collection1/conf/schema.xml to /configs/conf1/schema.xml
   [junit4]   2> 876748 T2070 oascc.SolrZkClient.makePath makePath: /configs/conf1/schema.xml
   [junit4]   2> 876759 T2070 oasc.AbstractZkTestCase.putConfig put /mnt/ssd/jenkins/workspace/Lucene-Solr-4.x-Linux/solr/build/solr-core/test-files/solr/collection1/conf/stopwords.txt to /configs/conf1/stopwords.txt
   [junit4]   2> 876760 T2070 oascc.SolrZkClient.makePath makePath: /configs/conf1/stopwords.txt
   [junit4]   2> 876768 T2070 oasc.AbstractZkTestCase.putConfig put /mnt/ssd/jenkins/workspace/Lucene-Solr-4.x-Linux/solr/build/solr-core/test-files/solr/collection1/conf/protwords.txt to /configs/conf1/protwords.txt
   [junit4]   2> 876769 T2070 oascc.SolrZkClient.makePath makePath: /configs/conf1/protwords.txt
   [junit4]   2> 876779 T2070 oasc.AbstractZkTestCase.putConfig put /mnt/ssd/jenkins/workspace/Lucene-Solr-4.x-Linux/solr/build/solr-core/test-files/solr/collection1/conf/currency.xml to /configs/conf1/currency.xml
   [junit4]   2> 876780 T2070 oascc.SolrZkClient.makePath makePath: /configs/conf1/currency.xml
   [junit4]   2> 876789 T2070 oasc.AbstractZkTestCase.putConfig put /mnt/ssd/jenkins/workspace/Lucene-Solr-4.x-Linux/solr/build/solr-core/test-files/solr/collection1/conf/open-exchange-rates.json to /configs/conf1/open-exchange-rates.json
   [junit4]   2> 876790 T2070 oascc.SolrZkClient.makePath makePath: /configs/conf1/open-exchange-rates.json
   [junit4]   2> 876800 T2070 oasc.AbstractZkTestCase.putConfig put /mnt/ssd/jenkins/workspace/Lucene-Solr-4.x-Linux/solr/build/solr-core/test-files/solr/collection1/conf/mapping-ISOLatin1Accent.txt to /configs/conf1/mapping-ISOLatin1Accent.txt
   [junit4]   2> 876801 T2070 oascc.SolrZkClient.makePath makePath: /configs/conf1/mapping-ISOLatin1Accent.txt
   [junit4]   2> 876810 T2070 oasc.AbstractZkTestCase.putConfig put /mnt/ssd/jenkins/workspace/Lucene-Solr-4.x-Linux/solr/build/solr-core/test-files/solr/collection1/conf/old_synonyms.txt to /configs/conf1/old_synonyms.txt
   [junit4]   2> 876811 T2070 oascc.SolrZkClient.makePath makePath: /configs/conf1/old_synonyms.txt
   [junit4]   2> 876819 T2070 oasc.AbstractZkTestCase.putConfig put /mnt/ssd/jenkins/workspace/Lucene-Solr-4.x-Linux/solr/build/solr-core/test-files/solr/collection1/conf/synonyms.txt to /configs/conf1/synonyms.txt
   [junit4]   2> 876820 T2070 oascc.SolrZkClient.makePath makePath: /configs/conf1/synonyms.txt
   [junit4]   2> 876913 T2070 oejs.Server.doStart jetty-8.1.10.v20130312
   [junit4]   2> 876925 T2070 oejs.AbstractConnector.doStart Started SelectChannelConnector@127.0.0.1:53160
   [junit4]   2> 876926 T2070 oass.SolrDispatchFilter.init SolrDispatchFilter.init()
   [junit4]   2> 876927 T2070 oasc.SolrResourceLoader.locateSolrHome JNDI not configured for solr (NoInitialContextEx)
   [junit4]   2> 876928 T2070 oasc.SolrResourceLoader.locateSolrHome using system property solr.solr.home: /mnt/ssd/jenkins/workspace/Lucene-Solr-4.x-Linux/solr/build/solr-core/test/J1/./org.apache.solr.cloud.CollectionsAPIDistributedZkTest-controljetty-1375448162997
   [junit4]   2> 876928 T2070 oasc.SolrResourceLoader.<init> new SolrResourceLoader for directory: '/mnt/ssd/jenkins/workspace/Lucene-Solr-4.x-Linux/solr/build/solr-core/test/J1/./org.apache.solr.cloud.CollectionsAPIDistributedZkTest-controljetty-1375448162997/'
   [junit4]   2> 876945 T2070 oasc.ConfigSolr.fromFile Loading container configuration from /mnt/ssd/jenkins/workspace/Lucene-Solr-4.x-Linux/solr/build/solr-core/test/J1/./org.apache.solr.cloud.CollectionsAPIDistributedZkTest-controljetty-1375448162997/solr.xml
   [junit4]   2> 877000 T2070 oasc.ConfigSolrXml.<init> Config-defined core root directory: 
   [junit4]   2> 877001 T2070 oasc.CoreContainer.<init> New CoreContainer 16810267
   [junit4]   2> 877001 T2070 oasc.CoreContainer.load Loading cores into CoreContainer [instanceDir=/mnt/ssd/jenkins/workspace/Lucene-Solr-4.x-Linux/solr/build/solr-core/test/J1/./org.apache.solr.cloud.CollectionsAPIDistributedZkTest-controljetty-1375448162997/]
   [junit4]   2> 877003 T2070 oashc.HttpShardHandlerFactory.getParameter Setting socketTimeout to: 120000
   [junit4]   2> 877004 T2070 oashc.HttpShardHandlerFactory.getParameter Setting urlScheme to: http://
   [junit4]   2> 877004 T2070 oashc.HttpShardHandlerFactory.getParameter Setting connTimeout to: 15000
   [junit4]   2> 877005 T2070 oashc.HttpShardHandlerFactory.getParameter Setting maxConnectionsPerHost to: 20
   [junit4]   2> 877005 T2070 oashc.HttpShardHandlerFactory.getParameter Setting corePoolSize to: 0
   [junit4]   2> 877006 T2070 oashc.HttpShardHandlerFactory.getParameter Setting maximumPoolSize to: 2147483647
   [junit4]   2> 877006 T2070 oashc.HttpShardHandlerFactory.getParameter Setting maxThreadIdleTime to: 5
   [junit4]   2> 877007 T2070 oashc.HttpShardHandlerFactory.getParameter Setting sizeOfQueue to: -1
   [junit4]   2> 877007 T2070 oashc.HttpShardHandlerFactory.getParameter Setting fairnessPolicy to: false
   [junit4]   2> 877008 T2070 oascsi.HttpClientUtil.createClient Creating new http client, config:maxConnectionsPerHost=20&maxConnections=10000&socketTimeout=120000&connTimeout=15000&retry=false
   [junit4]   2> 877012 T2070 oasc.ZkContainer.initZooKeeper Zookeeper client=127.0.0.1:50487/solr
   [junit4]   2> 877012 T2070 oasc.ZkController.checkChrootPath zkHost includes chroot
   [junit4]   2> 877013 T2070 oascc.ConnectionManager.waitForConnected Waiting for client to connect to ZooKeeper
   [junit4]   2> 877015 T2090 oascc.ConnectionManager.process Watcher org.apache.solr.common.cloud.ConnectionManager@1c2dc5 name:ZooKeeperConnection Watcher:127.0.0.1:50487 got event WatchedEvent state:SyncConnected type:None path:null path:null type:None
   [junit4]   2> 877015 T2070 oascc.ConnectionManager.waitForConnected Client is connected to ZooKeeper
   [junit4]   2> 877018 T2070 oascsi.HttpClientUtil.createClient Creating new http client, config:maxConnections=500&maxConnectionsPerHost=16&socketTimeout=120000&connTimeout=15000
   [junit4]   2> 877021 T2070 oascc.ConnectionManager.waitForConnected Waiting for client to connect to ZooKeeper
   [junit4]   2> 877022 T2092 oascc.ConnectionManager.process Watcher org.apache.solr.common.cloud.ConnectionManager@8b0170 name:ZooKeeperConnection Watcher:127.0.0.1:50487/solr got event WatchedEvent state:SyncConnected type:None path:null path:null type:None
   [junit4]   2> 877023 T2070 oascc.ConnectionManager.waitForConnected Client is connected to ZooKeeper
   [junit4]   2> 877026 T2070 oascc.SolrZkClient.makePath makePath: /overseer/queue
   [junit4]   2> 877034 T2070 oascc.SolrZkClient.makePath makePath: /overseer/collection-queue-work
   [junit4]   2> 877052 T2070 oascc.SolrZkClient.makePath makePath: /live_nodes
   [junit4]   2> 877057 T2070 oasc.ZkController.createEphemeralLiveNode Register node as live in ZooKeeper:/live_nodes/127.0.0.1:53160_cl
   [junit4]   2> 877058 T2070 oascc.SolrZkClient.makePath makePath: /live_nodes/127.0.0.1:53160_cl
   [junit4]   2> 877064 T2070 oascc.SolrZkClient.makePath makePath: /overseer_elect/election
   [junit4]   2> 877071 T2070 oascc.SolrZkClient.makePath makePath: /overseer_elect/leader
   [junit4]   2> 877074 T2070 oasc.Overseer.start Overseer (id=90141370787692547-127.0.0.1:53160_cl-n_0000000000) starting
   [junit4]   2> 877079 T2070 oascc.SolrZkClient.makePath makePath: /overseer/queue-work
   [junit4]   2> 877085 T2094 oasc.OverseerCollectionProcessor.run Process current queue of collection creations
   [junit4]   2> 877086 T2070 oascc.SolrZkClient.makePath makePath: /clusterstate.json
   [junit4]   2> 877091 T2070 oascc.SolrZkClient.makePath makePath: /aliases.json
   [junit4]   2> 877094 T2070 oascc.ZkStateReader.createClusterStateWatchersAndUpdate Updating cluster state from ZooKeeper... 
   [junit4]   2> 877101 T2093 oasc.Overseer$ClusterStateUpdater.run Starting to work on the main queue
   [junit4]   2> 877103 T2070 oasc.CorePropertiesLocator.discover Looking for core definitions underneath /mnt/ssd/jenkins/workspace/Lucene-Solr-4.x-Linux/solr/build/solr-core/test/J1/./org.apache.solr.cloud.CollectionsAPIDistributedZkTest-controljetty-1375448162997
   [junit4]   2> 877143 T2070 oasc.CorePropertiesLocator.discoverUnder Found core conf in /mnt/ssd/jenkins/workspace/Lucene-Solr-4.x-Linux/solr/build/solr-core/test/J1/./org.apache.solr.cloud.CollectionsAPIDistributedZkTest-controljetty-1375448162997/conf/
   [junit4]   2> 877143 T2070 oasc.CorePropertiesLocator.discover Found 1 core definitions
   [junit4]   2> 877144 T2070 oass.SolrDispatchFilter.init user.dir=/mnt/ssd/jenkins/workspace/Lucene-Solr-4.x-Linux/solr/build/solr-core/test/J1
   [junit4]   2> 877144 T2070 oass.SolrDispatchFilter.init SolrDispatchFilter.init() done
   [junit4]   2> 877145 T2070 oascsi.HttpClientUtil.createClient Creating new http client, config:maxConnections=128&maxConnectionsPerHost=32&followRedirects=false
   [junit4]   2> 877148 T2070 oascsi.HttpClientUtil.createClient Creating new http client, config:
   [junit4]   2> 877149 T2070 oascc.ConnectionManager.waitForConnected Waiting for client to connect to ZooKeeper
   [junit4]   2> 877151 T2097 oascc.ConnectionManager.process Watcher org.apache.solr.common.cloud.ConnectionManager@1dd8c97 name:ZooKeeperConnection Watcher:127.0.0.1:50487/solr got event WatchedEvent state:SyncConnected type:None path:null path:null type:None
   [junit4]   2> 877151 T2070 oascc.ConnectionManager.waitForConnected Client is connected to ZooKeeper
   [junit4]   2> 877153 T2070 oascc.ZkStateReader.createClusterStateWatchersAndUpdate Updating cluster state from ZooKeeper... 
   [junit4]   2> 877157 T2070 oasc.ChaosMonkey.monkeyLog monkey: init - expire sessions:true cause connection loss:true
   [junit4]   2> 877237 T2070 oejs.Server.doStart jetty-8.1.10.v20130312
   [junit4]   2> 877239 T2070 oejs.AbstractConnector.doStart Started SelectChannelConnector@127.0.0.1:35800
   [junit4]   2> 877240 T2070 oass.SolrDispatchFilter.init SolrDispatchFilter.init()
   [junit4]   2> 877240 T2070 oasc.SolrResourceLoader.locateSolrHome JNDI not configured for solr (NoInitialContextEx)
   [junit4]   2> 877241 T2070 oasc.SolrResourceLoader.locateSolrHome using system property solr.solr.home: /mnt/ssd/jenkins/workspace/Lucene-Solr-4.x-Linux/solr/build/solr-core/test/J1/./org.apache.solr.cloud.CollectionsAPIDistributedZkTest-jetty1-1375448163324
   [junit4]   2> 877241 T2070 oasc.SolrResourceLoader.<init> new SolrResourceLoader for directory: '/mnt/ssd/jenkins/workspace/Lucene-Solr-4.x-Linux/solr/build/solr-core/test/J1/./org.apache.solr.cloud.CollectionsAPIDistributedZkTest-jetty1-1375448163324/'
   [junit4]   2> 877262 T2070 oasc.ConfigSolr.fromFile Loading container configuration from /mnt/ssd/jenkins/workspace/Lucene-Solr-4.x-Linux/solr/build/solr-core/test/J1/./org.apache.solr.cloud.CollectionsAPIDistributedZkTest-jetty1-1375448163324/solr.xml
   [junit4]   2> 877319 T2070 oasc.ConfigSolrXml.<init> Config-defined core root directory: 
   [junit4]   2> 877320 T2070 oasc.CoreContainer.<init> New CoreContainer 33492279
   [junit4]   2> 877320 T2070 oasc.CoreContainer.load Loading cores into CoreContainer [instanceDir=/mnt/ssd/jenkins/workspace/Lucene-Solr-4.x-Linux/solr/build/solr-core/test/J1/./org.apache.solr.cloud.CollectionsAPIDistributedZkTest-jetty1-1375448163324/]
   [junit4]   2> 877322 T2070 oashc.HttpShardHandlerFactory.getParameter Setting socketTimeout to: 120000
   [junit4]   2> 877322 T2070 oashc.HttpShardHandlerFactory.getParameter Setting urlScheme to: http://
   [junit4]   2> 877322 T2070 oashc.HttpShardHandlerFactory.getParameter Setting connTimeout to: 15000
   [junit4]   2> 877323 T2070 oashc.HttpShardHandlerFactory.getParameter Setting maxConnectionsPerHost to: 20
   [junit4]   2> 877323 T2070 oashc.HttpShardHandlerFactory.getParameter Setting corePoolSize to: 0
   [junit4]   2> 877324 T2070 oashc.HttpShardHandlerFactory.getParameter Setting maximumPoolSize to: 2147483647
   [junit4]   2> 877324 T2070 oashc.HttpShardHandlerFactory.getParameter Setting maxThreadIdleTime to: 5
   [junit4]   2> 877325 T2070 oashc.HttpShardHandlerFactory.getParameter Setting sizeOfQueue to: -1
   [junit4]   2> 877325 T2070 oashc.HttpShardHandlerFactory.getParameter Setting fairnessPolicy to: false
   [junit4]   2> 877325 T2070 oascsi.HttpClientUtil.createClient Creating new http client, config:maxConnectionsPerHost=20&maxConnections=10000&socketTimeout=120000&connTimeout=15000&retry=false
   [junit4]   2> 877329 T2070 oasc.ZkContainer.initZooKeeper Zookeeper client=127.0.0.1:50487/solr
   [junit4]   2> 877329 T2070 oasc.ZkController.checkChrootPath zkHost includes chroot
   [junit4]   2> 877331 T2070 oascc.ConnectionManager.waitForConnected Waiting for client to connect to ZooKeeper
   [junit4]   2> 877332 T2108 oascc.ConnectionManager.process Watcher org.apache.solr.common.cloud.ConnectionManager@1bcc409 name:ZooKeeperConnection Watcher:127.0.0.1:50487 got event WatchedEvent state:SyncConnected type:None path:null path:null type:None
   [junit4]   2> 877333 T2070 oascc.ConnectionManager.waitForConnected Client is connected to ZooKeeper
   [junit4]   2> 877337 T2070 oascsi.HttpClientUtil.createClient Creating new http client, config:maxConnections=500&maxConnectionsPerHost=16&socketTimeout=120000&connTimeout=15000
   [junit4]   2> 877340 T2070 oascc.ConnectionManager.waitForConnected Waiting for client to connect to ZooKeeper
   [junit4]   2> 877342 T2110 oascc.ConnectionManager.process Watcher org.apache.solr.common.cloud.ConnectionManager@487e08 name:ZooKeeperConnection Watcher:127.0.0.1:50487/solr got event WatchedEvent state:SyncConnected type:None path:null path:null type:None
   [junit4]   2> 877343 T2070 oascc.ConnectionManager.waitForConnected Client is connected to ZooKeeper
   [junit4]   2> 877353 T2070 oascc.ZkStateReader.createClusterStateWatchersAndUpdate Updating cluster state from ZooKeeper... 
   [junit4]   2> 878362 T2070 oasc.ZkController.createEphemeralLiveNode Register node as live in ZooKeeper:/live_nodes/127.0.0.1:35800_cl
   [junit4]   2> 878364 T2070 oascc.SolrZkClient.makePath makePath: /live_nodes/127.0.0.1:35800_cl
   [junit4]   2> 878374 T2110 oascc.ZkStateReader$3.process Updating live nodes... (2)
   [junit4]   2> 878376 T2097 oascc.ZkStateReader$3.process Updating live nodes... (2)
   [junit4]   2> 878377 T2092 oascc.ZkStateReader$3.process Updating live nodes... (2)
   [junit4]   2> 878389 T2070 oasc.CorePropertiesLocator.discover Looking for core definitions underneath /mnt/ssd/jenkins/workspace/Lucene-Solr-4.x-Linux/solr/build/solr-core/test/J1/./org.apache.solr.cloud.CollectionsAPIDistributedZkTest-jetty1-1375448163324
   [junit4]   2> 878434 T2070 oasc.CorePropertiesLocator.discoverUnder Found core conf in /mnt/ssd/jenkins/workspace/Lucene-Solr-4.x-Linux/solr/build/solr-core/test/J1/./org.apache.solr.cloud.CollectionsAPIDistributedZkTest-jetty1-1375448163324/conf/
   [junit4]   2> 878435 T2070 oasc.CorePropertiesLocator.discover Found 1 core definitions
   [junit4]   2> 878435 T2070 oass.SolrDispatchFilter.init user.dir=/mnt/ssd/jenkins/workspace/Lucene-Solr-4.x-Linux/solr/build/solr-core/test/J1
   [junit4]   2> 878436 T2070 oass.SolrDispatchFilter.init SolrDispatchFilter.init() done
   [junit4]   2> 878436 T2070 oascsi.HttpClientUtil.createClient Creating new http client, config:maxConnections=128&maxConnectionsPerHost=32&followRedirects=false
   [junit4]   2> 878511 T2070 oejs.Server.doStart jetty-8.1.10.v20130312
   [junit4]   2> 878514 T2070 oejs.AbstractConnector.doStart Started SelectChannelConnector@127.0.0.1:44646
   [junit4]   2> 878515 T2070 oass.SolrDispatchFilter.init SolrDispatchFilter.init()
   [junit4]   2> 878515 T2070 oasc.SolrResourceLoader.locateSolrHome JNDI not configured for solr (NoInitialContextEx)
   [junit4]   2> 878515 T2070 oasc.SolrResourceLoader.locateSolrHome using system property solr.solr.home: /mnt/ssd/jenkins/workspace/Lucene-Solr-4.x-Linux/solr/build/solr-core/test/J1/./org.apache.solr.cloud.CollectionsAPIDistributedZkTest-jetty2-1375448164606
   [junit4]   2> 878516 T2070 oasc.SolrResourceLoader.<init> new SolrResourceLoader for directory: '/mnt/ssd/jenkins/workspace/Lucene-Solr-4.x-Linux/solr/build/solr-core/test/J1/./org.apache.solr.cloud.CollectionsAPIDistributedZkTest-jetty2-1375448164606/'
   [junit4]   2> 878530 T2070 oasc.ConfigSolr.fromFile Loading container configuration from /mnt/ssd/jenkins/workspace/Lucene-Solr-4.x-Linux/solr/build/solr-core/test/J1/./org.apache.solr.cloud.CollectionsAPIDistributedZkTest-jetty2-1375448164606/solr.xml
   [junit4]   2> 878585 T2070 oasc.ConfigSolrXml.<init> Config-defined core root directory: 
   [junit4]   2> 878585 T2070 oasc.CoreContainer.<init> New CoreContainer 20066052
   [junit4]   2> 878586 T2070 oasc.CoreContainer.load Loading cores into CoreContainer [instanceDir=/mnt/ssd/jenkins/workspace/Lucene-Solr-4.x-Linux/solr/build/solr-core/test/J1/./org.apache.solr.cloud.CollectionsAPIDistributedZkTest-jetty2-1375448164606/]
   [junit4]   2> 878587 T2070 oashc.HttpShardHandlerFactory.getParameter Setting socketTimeout to: 120000
   [junit4]   2> 878587 T2070 oashc.HttpShardHandlerFactory.getParameter Setting urlScheme to: http://
   [junit4]   2> 878588 T2070 oashc.HttpShardHandlerFactory.getParameter Setting connTimeout to: 15000
   [junit4]   2> 878588 T2070 oashc.HttpShardHandlerFactory.getParameter Setting maxConnectionsPerHost to: 20
   [junit4]   2> 878589 T2070 oashc.HttpShardHandlerFactory.getParameter Setting corePoolSize to: 0
   [junit4]   2> 878589 T2070 oashc.HttpShardHandlerFactory.getParameter Setting maximumPoolSize to: 2147483647
   [junit4]   2> 878589 T2070 oashc.HttpShardHandlerFactory.getParameter Setting maxThreadIdleTime to: 5
   [junit4]   2> 878590 T2070 oashc.HttpShardHandlerFactory.getParameter Setting sizeOfQueue to: -1
   [junit4]   2> 878590 T2070 oashc.HttpShardHandlerFactory.getParameter Setting fairnessPolicy to: false
   [junit4]   2> 878590 T2070 oascsi.HttpClientUtil.createClient Creating new http client, config:maxConnectionsPerHost=20&maxConnections=10000&socketTimeout=120000&connTimeout=15000&retry=false
   [junit4]   2> 878593 T2070 oasc.ZkContainer.initZooKeeper Zookeeper client=127.0.0.1:50487/solr
   [junit4]   2> 878594 T2070 oasc.ZkController.checkChrootPath zkHost includes chroot
   [junit4]   2> 878595 T2070 oascc.ConnectionManager.waitForConnected Waiting for client to connect to ZooKeeper
   [junit4]   2> 878596 T2122 oascc.ConnectionManager.process Watcher org.apache.solr.common.cloud.ConnectionManager@1acb55a name:ZooKeeperConnection Watcher:127.0.0.1:50487 got event WatchedEvent state:SyncConnected type:None path:null path:null type:None
   [junit4]   2> 878596 T2070 oascc.ConnectionManager.waitForConnected Client is connected to ZooKeeper
   [junit4]   2> 878599 T2070 oascsi.HttpClientUtil.createClient Creating new http client, config:maxConnections=500&maxConnectionsPerHost=16&socketTimeout=120000&connTimeout=15000
   [junit4]   2> 878602 T2070 oascc.ConnectionManager.waitForConnected Waiting for client to connect to ZooKeeper
   [junit4]   2> 878603 T2124 oascc.ConnectionManager.process Watcher org.apache.solr.common.cloud.ConnectionManager@1fb6ae5 name:ZooKeeperConnection Watcher:127.0.0.1:50487/solr got event WatchedEvent state:SyncConnected type:None path:null path:null type:None
   [junit4]   2> 878603 T2070 oascc.ConnectionManager.waitForConnected Client is connected to ZooKeeper
   [junit4]   2> 878614 T2070 oascc.ZkStateReader.createClusterStateWatchersAndUpdate Updating cluster state from ZooKeeper... 
   [junit4]   2> 879623 T2070 oasc.ZkController.createEphemeralLiveNode Register node as live in ZooKeeper:/live_nodes/127.0.0.1:44646_cl
   [junit4]   2> 879626 T2070 oascc.SolrZkClient.makePath makePath: /live_nodes/127.0.0.1:44646_cl
   [junit4]   2> 879637 T2097 oascc.ZkStateReader$3.process Updating live nodes... (3)
   [junit4]   2> 879637 T2092 oascc.ZkStateReader$3.process Updating live nodes... (3)
   [junit4]   2> 879639 T2110 oascc.ZkStateReader$3.process Updating live nodes... (3)
   [junit4]   2> 879640 T2124 oascc.ZkStateReader$3.process Updating live nodes... (3)
   [junit4]   2> 879654 T2070 oasc.CorePropertiesLocator.discover Looking for core definitions underneath /mnt/ssd/jenkins/workspace/Lucene-Solr-4.x-Linux/solr/build/solr-core/test/J1/./org.apache.solr.cloud.CollectionsAPIDistributedZkTest-jetty2-1375448164606
   [junit4]   2> 879681 T2070 oasc.CorePropertiesLocator.discoverUnder Found core conf in /mnt/ssd/jenkins/workspace/Lucene-Solr-4.x-Linux/solr/build/solr-core/test/J1/./org.apache.solr.cloud.CollectionsAPIDistributedZkTest-jetty2-1375448164606/conf/
   [junit4]   2> 879682 T2070 oasc.CorePropertiesLocator.discover Found 1 core definitions
   [junit4]   2> 879682 T2070 oass.SolrDispatchFilter.init user.dir=/mnt/ssd/jenkins/workspace/Lucene-Solr-4.x-Linux/solr/build/solr-core/test/J1
   [junit4]   2> 879683 T2070 oass.SolrDispatchFilter.init SolrDispatchFilter.init() done
   [junit4]   2> 879683 T2070 oascsi.HttpClientUtil.createClient Creating new http client, config:maxConnections=128&maxConnectionsPerHost=32&followRedirects=false
   [junit4]   2> 879767 T2070 oejs.Server.doStart jetty-8.1.10.v20130312
   [junit4]   2> 879770 T2070 oejs.AbstractConnector.doStart Started SelectChannelConnector@127.0.0.1:46558
   [junit4]   2> 879771 T2070 oass.SolrDispatchFilter.init SolrDispatchFilter.init()
   [junit4]   2> 879771 T2070 oasc.SolrResourceLoader.locateSolrHome JNDI not configured for solr (NoInitialContextEx)
   [junit4]   2> 879772 T2070 oasc.SolrResourceLoader.locateSolrHome using system property solr.solr.home: /mnt/ssd/jenkins/workspace/Lucene-Solr-4.x-Linux/solr/build/solr-core/test/J1/./org.apache.solr.cloud.CollectionsAPIDistributedZkTest-jetty3-1375448165853
   [junit4]   2> 879772 T2070 oasc.SolrResourceLoader.<init> new SolrResourceLoader for directory: '/mnt/ssd/jenkins/workspace/Lucene-Solr-4.x-Linux/solr/build/solr-core/test/J1/./org.apache.solr.cloud.CollectionsAPIDistributedZkTest-jetty3-1375448165853/'
   [junit4]   2> 879785 T2070 oasc.ConfigSolr.fromFile Loading container configuration from /mnt/ssd/jenkins/workspace/Lucene-Solr-4.x-Linux/solr/build/solr-core/test/J1/./org.apache.solr.cloud.CollectionsAPIDistributedZkTest-jetty3-1375448165853/solr.xml
   [junit4]   2> 879838 T2070 oasc.ConfigSolrXml.<init> Config-defined core root directory: 
   [junit4]   2> 879839 T2070 oasc.CoreContainer.<init> New CoreContainer 7207035
   [junit4]   2> 879839 T2070 oasc.CoreContainer.load Loading cores into CoreContainer [instanceDir=/mnt/ssd/jenkins/workspace/Lucene-Solr-4.x-Linux/solr/build/solr-core/test/J1/./org.apache.solr.cloud.CollectionsAPIDistributedZkTest-jetty3-1375448165853/]
   [junit4]   2> 879840 T2070 oashc.HttpShardHandlerFactory.getParameter Setting socketTimeout to: 120000
   [junit4]   2> 879841 T2070 oashc.HttpShardHandlerFactory.getParameter Setting urlScheme to: http://
   [junit4]   2> 879841 T2070 oashc.HttpShardHandlerFactory.getParameter Setting connTimeout to: 15000
   [junit4]   2> 879842 T2070 oashc.HttpShardHandlerFactory.getParameter Setting maxConnectionsPerHost to: 20
   [junit4]   2> 879842 T2070 oashc.HttpShardHandlerFactory.getParameter Setting corePoolSize to: 0
   [junit4]   2> 879842 T2070 oashc.HttpShardHandlerFactory.getParameter Setting maximumPoolSize to: 2147483647
   [junit4]   2> 879843 T2070 oashc.HttpShardHandlerFactory.getParameter Setting maxThreadIdleTime to: 5
   [junit4]   2> 879843 T2070 oashc.HttpShardHandlerFactory.getParameter Setting sizeOfQueue to: -1
   [junit4]   2> 879843 T2070 oashc.HttpShardHandlerFactory.getParameter Setting fairnessPolicy to: false
   [junit4]   2> 879844 T2070 oascsi.HttpClientUtil.createClient Creating new http client, config:maxConnectionsPerHost=20&maxConnections=10000&socketTimeout=120000&connTimeout=15000&retry=false
   [junit4]   2> 879847 T2070 oasc.ZkContainer.initZooKeeper Zookeeper client=127.0.0.1:50487/solr
   [junit4]   2> 879847 T2070 oasc.ZkController.checkChrootPath zkHost includes chroot
   [junit4]   2> 879848 T2070 oascc.ConnectionManager.waitForConnected Waiting for client to connect to ZooKeeper
   [junit4]   2> 879850 T2136 oascc.ConnectionManager.process Watcher org.apache.solr.common.cloud.ConnectionManager@1d46a06 name:ZooKeeperConnection Watcher:127.0.0.1:50487 got event WatchedEvent state:SyncConnected type:None path:null path:null type:None
   [junit4]   2> 879850 T2070 oascc.ConnectionManager.waitForConnected Client is connected to ZooKeeper
   [junit4]   2> 879852 T2070 oascsi.HttpClientUtil.createClient Creating new http client, config:maxConnections=500&maxConnectionsPerHost=16&socketTimeout=120000&connTimeout=15000
   [junit4]   2> 879855 T2070 oascc.ConnectionManager.waitForConnected Waiting for client to connect to ZooKeeper
   [junit4]   2> 879856 T2138 oascc.ConnectionManager.process Watcher org.apache.solr.common.cloud.ConnectionManager@57ac32 name:ZooKeeperConnection Watcher:127.0.0.1:50487/solr got event WatchedEvent state:SyncConnected type:None path:null path:null type:None
   [junit4]   2> 879857 T2070 oascc.ConnectionManager.waitForConnected Client is connected to ZooKeeper
   [junit4]   2> 879866 T2070 oascc.ZkStateReader.createClusterStateWatchersAndUpdate Updating cluster state from ZooKeeper... 
   [junit4]   2> 880874 T2070 oasc.ZkController.createEphemeralLiveNode Register node as live in ZooKeeper:/live_nodes/127.0.0.1:46558_cl
   [junit4]   2> 880877 T2070 oascc.SolrZkClient.makePath makePath: /live_nodes/127.0.0.1:46558_cl
   [junit4]   2> 880889 T2097 oascc.ZkStateReader$3.process Updating live nodes... (4)
   [junit4]   2> 880890 T2092 oascc.ZkStateReader$3.process Updating live nodes... (4)
   [junit4]   2> 880890 T2124 oascc.ZkStateReader$3.process Updating live nodes... (4)
   [junit4]   2> 880892 T2110 oascc.ZkStateReader$3.process Updating live nodes... (4)
   [junit4]   2> 880892 T2138 oascc.ZkStateReader$3.process Updating live nodes... (4)
   [junit4]   2> 880906 T2070 oasc.CorePropertiesLocator.discover Looking for core definitions underneath /mnt/ssd/jenkins/workspace/Lucene-Solr-4.x-Linux/solr/build/solr-core/test/J1/./org.apache.solr.cloud.CollectionsAPIDistributedZkTest-jetty3-1375448165853
   [junit4]   2> 880952 T2070 oasc.CorePropertiesLocator.discoverUnder Found core conf in /mnt/ssd/jenkins/workspace/Lucene-Solr-4.x-Linux/solr/build/solr-core/test/J1/./org.apache.solr.cloud.CollectionsAPIDistributedZkTest-jetty3-1375448165853/conf/
   [junit4]   2> 880953 T2070 oasc.CorePropertiesLocator.discover Found 1 core definitions
   [junit4]   2> 880953 T2070 oass.SolrDispatchFilter.init user.dir=/mnt/ssd/jenkins/workspace/Lucene-Solr-4.x-Linux/solr/build/solr-core/test/J1
   [junit4]   2> 880954 T2070 oass.SolrDispatchFilter.init SolrDispatchFilter.init() done
   [junit4]   2> 880954 T2070 oascsi.HttpClientUtil.createClient Creating new http client, config:maxConnections=128&maxConnectionsPerHost=32&followRedirects=false
   [junit4]   2> 881036 T2070 oejs.Server.doStart jetty-8.1.10.v20130312
   [junit4]   2> 881038 T2070 oejs.AbstractConnector.doStart Started SelectChannelConnector@127.0.0.1:38060
   [junit4]   2> 881039 T2070 oass.SolrDispatchFilter.init SolrDispatchFilter.init()
   [junit4]   2> 881040 T2070 oasc.SolrResourceLoader.locateSolrHome JNDI not configured for solr (NoInitialContextEx)
   [junit4]   2> 881040 T2070 oasc.SolrResourceLoader.locateSolrHome using system property solr.solr.home: /mnt/ssd/jenkins/workspace/Lucene-Solr-4.x-Linux/solr/build/solr-core/test/J1/./org.apache.solr.cloud.CollectionsAPIDistributedZkTest-jetty4-1375448167124
   [junit4]   2> 881040 T2070 oasc.SolrResourceLoader.<init> new SolrResourceLoader for directory: '/mnt/ssd/jenkins/workspace/Lucene-Solr-4.x-Linux/solr/build/solr-core/test/J1/./org.apache.solr.cloud.CollectionsAPIDistributedZkTest-jetty4-1375448167124/'
   [junit4]   2> 881060 T2070 oasc.ConfigSolr.fromFile Loading container configuration from /mnt/ssd/jenkins/workspace/Lucene-Solr-4.x-Linux/solr/build/solr-core/test/J1/./org.apache.solr.cloud.CollectionsAPIDistributedZkTest-jetty4-1375448167124/solr.xml
   [junit4]   2> 881107 T2070 oasc.ConfigSolrXml.<init> Config-defined core root directory: 
   [junit4]   2> 881108 T2070 oasc.CoreContainer.<init> New CoreContainer 12034826
   [junit4]   2> 881108 T2070 oasc.CoreContainer.load Loading cores into CoreContainer [instanceDir=/mnt/ssd/jenkins/workspace/Lucene-Solr-4.x-Linux/solr/build/solr-core/test/J1/./org.apache.solr.cloud.CollectionsAPIDistributedZkTest-jetty4-1375448167124/]
   [junit4]   2> 881109 T2070 oashc.HttpShardHandlerFactory.getParameter Setting socketTimeout to: 120000
   [junit4]   2> 881110 T2070 oashc.HttpShardHandlerFactory.getParameter Setting urlScheme to: http://
   [junit4]   2> 881110 T2070 oashc.HttpShardHandlerFactory.getParameter Setting connTimeout to: 15000
   [junit4]   2> 881111 T2070 oashc.HttpShardHandlerFactory.getParameter Setting maxConnectionsPerHost to: 20
   [junit4]   2> 881111 T2070 oashc.HttpShardHandlerFactory.getParameter Setting corePoolSize to: 0
   [junit4]   2> 881111 T2070 oashc.HttpShardHandlerFactory.getParameter Setting maximumPoolSize to: 2147483647
   [junit4]   2> 881112 T2070 oashc.HttpShardHandlerFactory.getParameter Setting maxThreadIdleTime to: 5
   [junit4]   2> 881112 T2070 oashc.HttpShardHandlerFactory.getParameter Setting sizeOfQueue to: -1
   [junit4]   2> 881113 T2070 oashc.HttpShardHandlerFactory.getParameter Setting fairnessPolicy to: false
   [junit4]   2> 881113 T2070 oascsi.HttpClientUtil.createClient Creating new http client, config:maxConnectionsPerHost=20&maxConnections=10000&socketTimeout=120000&connTimeout=15000&retry=false
   [junit4]   2> 881116 T2070 oasc.ZkContainer.initZooKeeper Zookeeper client=127.0.0.1:50487/solr
   [junit4]   2> 881116 T2070 oasc.ZkController.checkChrootPath zkHost includes chroot
   [junit4]   2> 881117 T2070 oascc.ConnectionManager.waitForConnected Waiting for client to connect to ZooKeeper
   [junit4]   2> 881119 T2150 oascc.ConnectionManager.process Watcher org.apache.solr.common.cloud.ConnectionManager@3103a3 name:ZooKeeperConnection Watcher:127.0.0.1:50487 got event WatchedEvent state:SyncConnected type:None path:null path:null type:None
   [junit4]   2> 881120 T2070 oascc.ConnectionManager.waitForConnected Client is connected to ZooKeeper
   [junit4]   2> 881124 T2070 oascsi.HttpClientUtil.createClient Creating new http client, config:maxConnections=500&maxConnectionsPerHost=16&socketTimeout=120000&connTimeout=15000
   [junit4]   2> 881127 T2070 oascc.ConnectionManager.waitForConnected Waiting for client to connect to ZooKeeper
   [junit4]   2> 881128 T2152 oascc.ConnectionManager.process Watcher org.apache.solr.common.cloud.ConnectionManager@d729bb name:ZooKeeperConnection Watcher:127.0.0.1:50487/solr got event WatchedEvent state:SyncConnected type:None path:null path:null type:None
   [junit4]   2> 881129 T2070 oascc.ConnectionManager.waitForConnected Client is connected to ZooKeeper
   [junit4]   2> 881141 T2070 oascc.ZkStateReader.createClusterStateWatchersAndUpdate Updating cluster state from ZooKeeper... 
   [junit4]   2> 882151 T2070 oasc.ZkController.createEphemeralLiveNode Register node as live in ZooKeeper:/live_nodes/127.0.0.1:38060_cl
   [junit4]   2> 882154 T2070 oascc.SolrZkClient.makePath makePath: /live_nodes/127.0.0.1:38060_cl
   [junit4]   2> 882166 T2097 oascc.ZkStateReader$3.process Updating live nodes... (5)
   [junit4]   2> 882167 T2110 oascc.ZkStateReader$3.process Updating live nodes... (5)
   [junit4]   2> 882168 T2152 oascc.ZkStateReader$3.process Updating live nodes... (5)
   [junit4]   2> 882168 T2138 oascc.ZkStateReader$3.process Updating live nodes... (5)
   [junit4]   2> 882170 T2092 oascc.ZkStateReader$3.process Updating live nodes... (5)
   [junit4]   2> 882171 T2124 oascc.ZkStateReader$3.process Updating live nodes... (5)
   [junit4]   2> 882197 T2070 oasc.CorePropertiesLocator.discover Looking for core definitions underneath /mnt/ssd/jenkins/workspace/Lucene-Solr-4.x-Linux/solr/build/solr-core/test/J1/./org.apache.solr.cloud.CollectionsAPIDistributedZkTest-jetty4-1375448167124
   [junit4]   2> 882228 T2070 oasc.CorePropertiesLocator.discoverUnder Found core conf in /mnt/ssd/jenkins/workspace/Lucene-Solr-4.x-Linux/solr/build/solr-core/test/J1/./org.apache.solr.cloud.CollectionsAPIDistributedZkTest-jetty4-1375448167124/conf/
   [junit4]   2> 882229 T2070 oasc.CorePropertiesLocator.discover Found 1 core definitions
   [junit4]   2> 882230 T2070 oass.SolrDispatchFilter.init user.dir=/mnt/ssd/jenkins/workspace/Lucene-Solr-4.x-Linux/solr/build/solr-core/test/J1
   [junit4]   2> 882230 T2070 oass.SolrDispatchFilter.init SolrDispatchFilter.init() done
   [junit4]   2> 882231 T2070 oascsi.HttpClientUtil.createClient Creating new http client, config:maxConnections=128&maxConnectionsPerHost=32&followRedirects=false
   [junit4]   2> 882234 T2070 oascsi.HttpClientUtil.createClient Creating new http client, config:maxConnections=128&maxConnectionsPerHost=32&followRedirects=false
   [junit4]   2> 882238 T2105 oasha.CollectionsHandler.handleCreateAction Creating Collection : numShards=2&name=nodes_used_collection&replicationFactor=2&action=CREATE&wt=javabin&version=2
   [junit4]   2> 882239 T2092 oasc.DistributedQueue$LatchChildWatcher.process Watcher fired on path: /overseer/collection-queue-work state: SyncConnected type NodeChildrenChanged
   [junit4]   2> 882241 T2092 oasc.DistributedQueue$LatchChildWatcher.process Watcher fired on path: /overseer/collection-queue-work state: SyncConnected type NodeChildrenChanged
   [junit4]   2> 882243 T2094 oasc.OverseerCollectionProcessor.run Overseer Collection Processor: Get the message id:/overseer/collection-queue-work/qn-0000000000 message:{
   [junit4]   2> 	  "operation":"createcollection",
   [junit4]   2> 	  "numShards":"2",
   [junit4]   2> 	  "name":"nodes_used_collection",
   [junit4]   2> 	  "replicationFactor":"2"}
   [junit4]   2> 882243 T2094 oasc.OverseerCollectionProcessor.processMessage WARN OverseerCollectionProcessor.processMessage : createcollection , {
   [junit4]   2> 	  "operation":"createcollection",
   [junit4]   2> 	  "numShards":"2",
   [junit4]   2> 	  "name":"nodes_used_collection",
   [junit4]   2> 	  "replicationFactor":"2"}
   [junit4]   2> 883125 T2093 oascc.ZkStateReader.updateClusterState Updating cloud state from ZooKeeper... 
   [junit4]   2> 883127 T2093 oasc.Overseer$ClusterStateUpdater.buildCollection building a new collection: nodes_used_collection
   [junit4]   2> 883128 T2093 oasc.Overseer$ClusterStateUpdater.createCollection Create collection nodes_used_collection with shards [shard1, shard2]
   [junit4]   2> 883138 T2097 oascc.ZkStateReader$2.process A cluster state change: WatchedEvent state:SyncConnected type:NodeDataChanged path:/clusterstate.json, has occurred - updating... (live nodes size: 5)
   [junit4]   2> 883138 T2138 oascc.ZkStateReader$2.process A cluster state change: WatchedEvent state:SyncConnected type:NodeDataChanged path:/clusterstate.json, has occurred - updating... (live nodes size: 5)
   [junit4]   2> 883139 T2110 oascc.ZkStateReader$2.process A cluster state change: WatchedEvent state:SyncConnected type:NodeDataChanged path:/clusterstate.json, has occurred - updating... (live nodes size: 5)
   [junit4]   2> 883139 T2124 oascc.ZkStateReader$2.process A cluster state change: WatchedEvent state:SyncConnected type:NodeDataChanged path:/clusterstate.json, has occurred - updating... (live nodes size: 5)
   [junit4]   2> 883138 T2092 oascc.ZkStateReader$2.process A cluster state change: WatchedEvent state:SyncConnected type:NodeDataChanged path:/clusterstate.json, has occurred - updating... (live nodes size: 5)
   [junit4]   2> 883139 T2152 oascc.ZkStateReader$2.process A cluster state change: WatchedEvent state:SyncConnected type:NodeDataChanged path:/clusterstate.json, has occurred - updating... (live nodes size: 5)
   [junit4]   2> 883250 T2094 oasc.OverseerCollectionProcessor.createCollection going to create cores replicas shardNames [shard1, shard2] , repFactor : 2
   [junit4]   2> 883250 T2094 oasc.OverseerCollectionProcessor.createCollection Creating shard nodes_used_collection_shard1_replica1 as part of slice shard1 of collection nodes_used_collection on 127.0.0.1:46558_cl
   [junit4]   2> 883251 T2094 oasc.OverseerCollectionProcessor.createCollection Creating shard nodes_used_collection_shard1_replica2 as part of slice shard1 of collection nodes_used_collection on 127.0.0.1:35800_cl
   [junit4]   2> 883253 T2094 oasc.OverseerCollectionProcessor.createCollection Creating shard nodes_used_collection_shard2_replica1 as part of slice shard2 of collection nodes_used_collection on 127.0.0.1:38060_cl
   [junit4]   2> 883254 T2094 oasc.OverseerCollectionProcessor.createCollection Creating shard nodes_used_collection_shard2_replica2 as part of slice shard2 of collection nodes_used_collection on 127.0.0.1:44646_cl
   [junit4]   2> 883255 T2132 oasc.ZkController.publish publishing core=nodes_used_collection_shard1_replica1 state=down
   [junit4]   2> 883256 T2147 oasc.ZkController.publish publishing core=nodes_used_collection_shard2_replica1 state=down
   [junit4]   2> 883255 T2106 oasc.ZkController.publish publishing core=nodes_used_collection_shard1_replica2 state=down
   [junit4]   2> 883257 T2118 oasc.ZkController.publish publishing core=nodes_used_collection_shard2_replica2 state=down
   [junit4]   2> 883259 T2132 oasc.ZkController.waitForCoreNodeName look for our core node name
   [junit4]   2> 883260 T2106 oasc.ZkController.waitForCoreNodeName look for our core node name
   [junit4]   2> 883261 T2118 oasc.ZkController.waitForCoreNodeName look for our core node name
   [junit4]   2> 883261 T2147 oasc.ZkController.waitForCoreNodeName look for our core node name
   [junit4]   2> 884666 T2093 oascc.ZkStateReader.updateClusterState Updating cloud state from ZooKeeper... 
   [junit4]   2> 884670 T2093 oasc.Overseer$ClusterStateUpdater.updateState WARN Could not find collection node for nodes_used_collection, skipping publish state
   [junit4]   2> 884670 T2093 oasc.Overseer$ClusterStateUpdater.updateState Update state numShards=2 message={
   [junit4]   2> 	  "operation":"state",
   [junit4]   2> 	  "core_node_name":"core_node1",
   [junit4]   2> 	  "numShards":"2",
   [junit4]   2> 	  "shard":"shard1",
   [junit4]   2> 	  "roles":null,
   [junit4]   2> 	  "state":"down",
   [junit4]   2> 	  "shard_state":"active",
   [junit4]   2> 	  "core":"nodes_used_collection_shard1_replica1",
   [junit4]   2> 	  "collection":"nodes_used_collection",
   [junit4]   2> 	  "shard_range":null,
   [junit4]   2> 	  "node_name":"127.0.0.1:46558_cl",
   [junit4]   2> 	  "base_url":"http://127.0.0.1:46558/cl"}
   [junit4]   2> 884682 T2093 oasc.Overseer$ClusterStateUpdater.updateState WARN Could not find collection node for nodes_used_collection, skipping publish state
   [junit4]   2> 884682 T2093 oasc.Overseer$ClusterStateUpdater.updateState Update state numShards=2 message={
   [junit4]   2> 	  "operation":"state",
   [junit4]   2> 	  "core_node_name":"core_node2",
   [junit4]   2> 	  "numShards":"2",
   [junit4]   2> 	  "shard":"shard2",
   [junit4]   2> 	  "roles":null,
   [junit4]   2> 	  "state":"down",
   [junit4]   2> 	  "shard_state":"active",
   [junit4]   2> 	  "core":"nodes_used_collection_shard2_replica1",
   [junit4]   2> 	  "collection":"nodes_used_collection",
   [junit4]   2> 	  "shard_range":null,
   [junit4]   2> 	  "node_name":"127.0.0.1:38060_cl",
   [junit4]   2> 	  "base_url":"http://127.0.0.1:38060/cl"}
   [junit4]   2> 884694 T2093 oasc.Overseer$ClusterStateUpdater.updateState WARN Could not find collection node for nodes_used_collection, skipping publish state
   [junit4]   2> 884695 T2093 oasc.Overseer$ClusterStateUpdater.updateState Update state numShards=2 message={
   [junit4]   2> 	  "operation":"state",
   [junit4]   2> 	  "core_node_name":"core_node3",
   [junit4]   2> 	  "numShards":"2",
   [junit4]   2> 	  "shard":"shard1",
   [junit4]   2> 	  "roles":null,
   [junit4]   2> 	  "state":"down",
   [junit4]   2> 	  "shard_state":"active",
   [junit4]   2> 	  "core":"nodes_used_collection_shard1_replica2",
   [junit4]   2> 	  "collection":"nodes_used_collection",
   [junit4]   2> 	  "shard_range":null,
   [junit4]   2> 	  "node_name":"127.0.0.1:35800_cl",
   [junit4]   2> 	  "base_url":"http://127.0.0.1:35800/cl"}
   [junit4]   2> 884706 T2093 oasc.Overseer$ClusterStateUpdater.updateState WARN Could not find collection node for nodes_used_collection, skipping publish state
   [junit4]   2> 884707 T2093 oasc.Overseer$ClusterStateUpdater.updateState Update state numShards=2 message={
   [junit4]   2> 	  "operation":"state",
   [junit4]   2> 	  "core_node_name":"core_node4",
   [junit4]   2> 	  "numShards":"2",
   [junit4]   2> 	  "shard":"shard2",
   [junit4]   2> 	  "roles":null,
   [junit4]   2> 	  "state":"down",
   [junit4]   2> 	  "shard_state":"active",
   [junit4]   2> 	  "core":"nodes_used_collection_shard2_replica2",
   [junit4]   2> 	  "collection":"nodes_used_collection",
   [junit4]   2> 	  "shard_range":null,
   [junit4]   2> 	  "node_name":"127.0.0.1:44646_cl",
   [junit4]   2> 	  "base_url":"http://127.0.0.1:44646/cl"}
   [junit4]   2> 884717 T2097 oascc.ZkStateReader$2.process A cluster state change: WatchedEvent state:SyncConnected type:NodeDataChanged path:/clusterstate.json, has occurred - updating... (live nodes size: 5)
   [junit4]   2> 884717 T2092 oascc.ZkStateReader$2.process A cluster state change: WatchedEvent state:SyncConnected type:NodeDataChanged path:/clusterstate.json, has occurred - updating... (live nodes size: 5)
   [junit4]   2> 884717 T2138 oascc.ZkStateReader$2.process A cluster state change: WatchedEvent state:SyncConnected type:NodeDataChanged path:/clusterstate.json, has occurred - updating... (live nodes size: 5)
   [junit4]   2> 884718 T2152 oascc.ZkStateReader$2.process A cluster state change: WatchedEvent state:SyncConnected type:NodeDataChanged path:/clusterstate.json, has occurred - updating... (live nodes size: 5)
   [junit4]   2> 884717 T2124 oascc.ZkStateReader$2.process A cluster state change: WatchedEvent state:SyncConnected type:NodeDataChanged path:/clusterstate.json, has occurred - updating... (live nodes size: 5)
   [junit4]   2> 884717 T2110 oascc.ZkStateReader$2.process A cluster state change: WatchedEvent state:SyncConnected type:NodeDataChanged path:/clusterstate.json, has occurred - updating... (live nodes size: 5)
   [junit4]   2> 885260 T2132 oasc.ZkController.waitForShardId waiting to find shard id in clusterstate for nodes_used_collection_shard1_replica1
   [junit4]   2> 885261 T2106 oasc.ZkController.waitForShardId waiting to find shard id in clusterstate for nodes_used_collection_shard1_replica2
   [junit4]   2> 885263 T2147 oasc.ZkController.waitForShardId waiting to find shard id in clusterstate for nodes_used_collection_shard2_replica1
   [junit4]   2> 885262 T2118 oasc.ZkController.waitForShardId waiting to find shard id in clusterstate for nodes_used_collection_shard2_replica2
   [junit4]   2> 885261 T2132 oasc.CorePropertiesLocator.writePropertiesFile ERROR Couldn't persist core properties to /mnt/ssd/jenkins/workspace/Lucene-Solr-4.x-Linux/solr/build/solr-core/test/J1/./org.apache.solr.cloud.CollectionsAPIDistributedZkTest-jetty3-1375448165853/nodes_used_collection_shard1_replica1/core.properties: java.io.FileNotFoundException: /mnt/ssd/jenkins/workspace/Lucene-Solr-4.x-Linux/solr/build/solr-core/test/J1/./org.apache.solr.cloud.CollectionsAPIDistributedZkTest-jetty3-1375448165853/nodes_used_collection_shard1_replica1/core.properties (No such file or directory)
   [junit4]   2> 885265 T2118 oasc.CorePropertiesLocator.writePropertiesFile ERROR Couldn't persist core properties to /mnt/ssd/jenkins/workspace/Lucene-Solr-4.x-Linux/solr/build/solr-core/test/J1/./org.apache.solr.cloud.CollectionsAPIDistributedZkTest-jetty2-1375448164606/nodes_used_collection_shard2_replica2/core.properties: java.io.FileNotFoundException: /mnt/ssd/jenkins/workspace/Lucene-Solr-4.x-Linux/solr/build/solr-core/test/J1/./org.apache.solr.cloud.CollectionsAPIDistributedZkTest-jetty2-1375448164606/nodes_used_collection_shard2_replica2/core.properties (No such file or directory)
   [junit4]   2> 885264 T2147 oasc.CorePropertiesLocator.writePropertiesFile ERROR Couldn't persist core properties to /mnt/ssd/jenkins/workspace/Lucene-Solr-4.x-Linux/solr/build/solr-core/test/J1/./org.apache.solr.cloud.CollectionsAPIDistributedZkTest-jetty4-1375448167124/nodes_used_collection_shard2_replica1/core.properties: java.io.FileNotFoundException: /mnt/ssd/jenkins/workspace/Lucene-Solr-4.x-Linux/solr/build/solr-core/test/J1/./org.apache.solr.cloud.CollectionsAPIDistributedZkTest-jetty4-1375448167124/nodes_used_collection_shard2_replica1/core.properties (No such file or directory)
   [junit4]   2> 885263 T2106 oasc.CorePropertiesLocator.writePropertiesFile ERROR Couldn't persist core properties to /mnt/ssd/jenkins/workspace/Lucene-Solr-4.x-Linux/solr/build/solr-core/test/J1/./org.apache.solr.cloud.CollectionsAPIDistributedZkTest-jetty1-1375448163324/nodes_used_collection_shard1_replica2/core.properties: java.io.FileNotFoundException: /mnt/ssd/jenkins/workspace/Lucene-Solr-4.x-Linux/solr/build/solr-core/test/J1/./org.apache.solr.cloud.CollectionsAPIDistributedZkTest-jetty1-1375448163324/nodes_used_collection_shard1_replica2/core.properties (No such file or directory)
   [junit4]   2> 885267 T2147 oasc.CoreContainer.create Creating SolrCore 'nodes_used_collection_shard2_replica1' using instanceDir: /mnt/ssd/jenkins/workspace/Lucene-Solr-4.x-Linux/solr/build/solr-core/test/J1/./org.apache.solr.cloud.CollectionsAPIDistributedZkTest-jetty4-1375448167124/nodes_used_collection_shard2_replica1
   [junit4]   2> 885269 T2147 oasc.ZkController.createCollectionZkNode Check for collection zkNode:nodes_used_collection
   [junit4]   2> 885266 T2118 oasc.CoreContainer.create Creating SolrCore 'nodes_used_collection_shard2_replica2' using instanceDir: /mnt/ssd/jenkins/workspace/Lucene-Solr-4.x-Linux/solr/build/solr-core/test/J1/./org.apache.solr.cloud.CollectionsAPIDistributedZkTest-jetty2-1375448164606/nodes_used_collection_shard2_replica2
   [junit4]   2> 885270 T2118 oasc.ZkController.createCollectionZkNode Check for collection zkNode:nodes_used_collection
   [junit4]   2> 885271 T2147 oasc.ZkController.createCollectionZkNode Creating collection in ZooKeeper:nodes_used_collection
   [junit4]   2> 885265 T2132 oasc.CoreContainer.create Creating SolrCore 'nodes_used_collection_shard1_replica1' using instanceDir: /mnt/ssd/jenkins/workspace/Lucene-Solr-4.x-Linux/solr/build/solr-core/test/J1/./org.apache.solr.cloud.CollectionsAPIDistributedZkTest-jetty3-1375448165853/nodes_used_collection_shard1_replica1
   [junit4]   2> 885272 T2118 oasc.ZkController.createCollectionZkNode Creating collection in ZooKeeper:nodes_used_collection
   [junit4]   2> 885272 T2132 oasc.ZkController.createCollectionZkNode Check for collection zkNode:nodes_used_collection
   [junit4]   2> 885272 T2147 oasc.ZkController.getConfName Looking for collection configName
   [junit4]   2> 885268 T2106 oasc.CoreContainer.create Creating SolrCore 'nodes_used_collection_shard1_replica2' using instanceDir: /mnt/ssd/jenkins/workspace/Lucene-Solr-4.x-Linux/solr/build/solr-core/test/J1/./org.apache.solr.cloud.CollectionsAPIDistributedZkTest-jetty1-1375448163324/nodes_used_collection_shard1_replica2
   [junit4]   2> 885275 T2106 oasc.ZkController.createCollectionZkNode Check for collection zkNode:nodes_used_collection
   [junit4]   2> 885273 T2118 oasc.ZkController.getConfName Looking for collection configName
   [junit4]   2> 885275 T2132 oasc.ZkController.createCollectionZkNode Creating collection in ZooKeeper:nodes_used_collection
   [junit4]   2> 885278 T2132 oasc.ZkController.getConfName Looking for collection configName
   [junit4]   2> 885281 T2106 oasc.ZkController.createCollectionZkNode Creating collection in ZooKeeper:nodes_used_collection
   [junit4]   2> 885282 T2106 oasc.ZkController.getConfName Looking for collection configName
   [junit4]   2> 885283 T2147 oasc.ZkController.getConfName Only one config set found in zk - using it:conf1
   [junit4]   2> 885283 T2118 oasc.ZkController.getConfName Only one config set found in zk - using it:conf1
   [junit4]   2> 885284 T2147 oascc.SolrZkClient.makePath makePath: /collections/nodes_used_collection
   [junit4]   2> 885285 T2118 oascc.SolrZkClient.makePath makePath: /collections/nodes_used_collection
   [junit4]   2> 885286 T2132 oasc.ZkController.getConfName Only one config set found in zk - using it:conf1
   [junit4]   2> 885287 T2132 oascc.SolrZkClient.makePath makePath: /collections/nodes_used_collection
   [junit4]   2> 885291 T2106 oasc.ZkController.getConfName Only one config set found in zk - using it:conf1
   [junit4]   2> 885292 T2106 oascc.SolrZkClient.makePath makePath: /collections/nodes_used_collection
   [junit4]   2> 885300 T2118 oasc.ZkController.readConfigName Load collection config from:/collections/nodes_used_collection
   [junit4]   2> 885303 T2106 oasc.ZkController.readConfigName Load collection config from:/collections/nodes_used_collection
   [junit4]   2> 885304 T2132 oasc.ZkController.readConfigName Load collection config from:/collections/nodes_used_collection
   [junit4]   2> 885305 T2147 oasc.ZkController.readConfigName Load collection config from:/collections/nodes_used_collection
   [junit4]   2> 885307 T2118 oasc.SolrResourceLoader.<init> new SolrResourceLoader for directory: '/mnt/ssd/jenkins/workspace/Lucene-Solr-4.x-Linux/solr/build/solr-core/test/J1/./org.apache.solr.cloud.CollectionsAPIDistributedZkTest-jetty2-1375448164606/nodes_used_collection_shard2_replica2/'
   [junit4]   2> 885310 T2106 oasc.SolrResourceLoader.<init> new SolrResourceLoader for directory: '/mnt/ssd/jenkins/workspace/Lucene-Solr-4.x-Linux/solr/build/solr-core/test/J1/./org.apache.solr.cloud.CollectionsAPIDistributedZkTest-jetty1-1375448163324/nodes_used_collection_shard1_replica2/'
   [junit4]   2> 885313 T2132 oasc.SolrResourceLoader.<init> new SolrResourceLoader for directory: '/mnt/ssd/jenkins/workspace/Lucene-Solr-4.x-Linux/solr/build/solr-core/test/J1/./org.apache.solr.cloud.CollectionsAPIDistributedZkTest-jetty3-1375448165853/nodes_used_collection_shard1_replica1/'
   [junit4]   2> 885314 T2147 oasc.SolrResourceLoader.<init> new SolrResourceLoader for directory: '/mnt/ssd/jenkins/workspace/Lucene-Solr-4.x-Linux/solr/build/solr-core/test/J1/./org.apache.solr.cloud.CollectionsAPIDistributedZkTest-jetty4-1375448167124/nodes_used_collection_shard2_replica1/'
   [junit4]   2> 885419 T2132 oasc.SolrConfig.<init> Using Lucene MatchVersion: LUCENE_45
   [junit4]   2> 885432 T2118 oasc.SolrConfig.<init> Using Lucene MatchVersion: LUCENE_45
   [junit4]   2> 885435 T2147 oasc.SolrConfig.<init> Using Lucene MatchVersion: LUCENE_45
   [junit4]   2> 885468 T2106 oasc.SolrConfig.<init> Using Lucene MatchVersion: LUCENE_45
   [junit4]   2> 885511 T2132 oasc.SolrConfig.<init> Loaded SolrConfig: solrconfig.xml
   [junit4]   2> 885514 T2132 oass.IndexSchema.readSchema Reading Solr Schema from schema.xml
   [junit4]   2> 885528 T2118 oasc.SolrConfig.<init> Loaded SolrConfig: solrconfig.xml
   [junit4]   2> 885529 T2147 oasc.SolrConfig.<init> Loaded SolrConfig: solrconfig.xml
   [junit4]   2> 885530 T2118 oass.IndexSchema.readSchema Reading Solr Schema from schema.xml
   [junit4]   2> 885530 T2132 oass.IndexSchema.readSchema [nodes_used_collection_shard1_replica1] Schema name=test
   [junit4]   2> 885531 T2147 oass.IndexSchema.readSchema Reading Solr Schema from schema.xml
   [junit4]   2> 885546 T2118 oass.IndexSchema.readSchema [nodes_used_collection_shard2_replica2] Schema name=test
   [junit4]   2> 885549 T2147 oass.IndexSchema.readSchema [nodes_used_collection_shard2_replica1] Schema name=test
   [junit4]   2> 885566 T2106 oasc.SolrConfig.<init> Loaded SolrConfig: solrconfig.xml
   [junit4]   2> 885568 T2106 oass.IndexSchema.readSchema Reading Solr Schema from schema.xml
   [junit4]   2> 885586 T2106 oass.IndexSchema.readSchema [nodes_used_collection_shard1_replica2] Schema name=test
   [junit4]   2> 886480 T2132 oass.ByteField.init WARN ByteField is deprecated and will be removed in 5.0. You should use TrieIntField instead.
   [junit4]   2> 886481 T2132 oass.ShortField.init WARN ShortField is deprecated and will be removed in 5.0. You should use TrieIntField instead.
   [junit4]   2> 886482 T2132 oass.OpenExchangeRatesOrgProvider.init Initialized with rates=open-exchange-rates.json, refreshInterval=1440.
   [junit4]   2> 886487 T2147 oass.ByteField.init WARN ByteField is deprecated and will be removed in 5.0. You should use TrieIntField instead.
   [junit4]   2> 886487 T2147 oass.ShortField.init WARN ShortField is deprecated and will be removed in 5.0. You should use TrieIntField instead.
   [junit4]   2> 886488 T2147 oass.OpenExchangeRatesOrgProvider.init Initialized with rates=open-exchange-rates.json, refreshInterval=1440.
   [junit4]   2> 886502 T2132 oass.IndexSchema.readSchema default search field in schema is text
   [junit4]   2> 886504 T2147 oass.IndexSchema.readSchema default search field in schema is text
   [junit4]   2> 886508 T2147 oass.IndexSchema.readSchema unique key field: id
   [junit4]   2> 886508 T2132 oass.IndexSchema.readSchema unique key field: id
   [junit4]   2> 886547 T2118 oass.ByteField.init WARN ByteField is deprecated and will be removed in 5.0. You should use TrieIntField instead.
   [junit4]   2> 886548 T2118 oass.ShortField.init WARN ShortField is deprecated and will be removed in 5.0. You should use TrieIntField instead.
   [junit4]   2> 886549 T2118 oass.OpenExchangeRatesOrgProvider.init Initialized with rates=open-exchange-rates.json, refreshInterval=1440.
   [junit4]   2> 886553 T2147 oass.FileExchangeRateProvider.reload Reloading exchange rates from file currency.xml
   [junit4]   2> 886556 T2118 oass.IndexSchema.readSchema default search field in schema is text
   [junit4]   2> 886556 T2132 oass.FileExchangeRateProvider.reload Reloading exchange rates from file currency.xml
   [junit4]   2> 886559 T2118 oass.IndexSchema.readSchema unique key field: id
   [junit4]   2> 886560 T2106 oass.ByteField.init WARN ByteField is deprecated and will be removed in 5.0. You should use TrieIntField instead.
   [junit4]   2> 886560 T2147 oass.FileExchangeRateProvider.reload Reloading exchange rates from file currency.xml
   [junit4]   2> 886560 T2106 oass.ShortField.init WARN ShortField is deprecated and will be removed in 5.0. You should use TrieIntField instead.
   [junit4]   2> 886561 T2132 oass.FileExchangeRateProvider.reload Reloading exchange rates from file currency.xml
   [junit4]   2> 886568 T2106 oass.OpenExchangeRatesOrgProvider.init Initialized with rates=open-exchange-rates.json, refreshInterval=1440.
   [junit4]   2> 886572 T2147 oass.OpenExchangeRatesOrgProvider.reload Reloading exchange rates from open-exchange-rates.json
   [junit4]   2> 886573 T2132 oass.OpenExchangeRatesOrgProvider.reload Reloading exchange rates from open-exchange-rates.json
   [junit4]   2> 886576 T2147 oass.OpenExchangeRatesOrgProvider$OpenExchangeRates.<init> WARN Unknown key IMPORTANT NOTE
   [junit4]   2> 886576 T2147 oass.OpenExchangeRatesOrgProvider$OpenExchangeRates.<init> WARN Expected key, got STRING
   [junit4]   2> 886576 T2106 oass.IndexSchema.readSchema default search field in schema is text
   [junit4]   2> 886577 T2147 oass.OpenExchangeRatesOrgProvider.reload Reloading exchange rates from open-exchange-rates.json
   [junit4]   2> 886577 T2132 oass.OpenExchangeRatesOrgProvider$OpenExchangeRates.<init> WARN Unknown key IMPORTANT NOTE
   [junit4]   2> 886578 T2132 oass.OpenExchangeRatesOrgProvider$OpenExchangeRates.<init> WARN Expected key, got STRING
   [junit4]   2> 886578 T2132 oass.OpenExchangeRatesOrgProvider.reload Reloading exchange rates from open-exchange-rates.json
   [junit4]   2> 886580 T2106 oass.IndexSchema.readSchema unique key field: id
   [junit4]   2> 886581 T2132 oass.OpenExchangeRatesOrgProvider$OpenExchangeRates.<init> WARN Unknown key IMPORTANT NOTE
   [junit4]   2> 886581 T2132 oass.OpenExchangeRatesOrgProvider$OpenExchangeRates.<init> WARN Expected key, got STRING
   [junit4]   2> 886581 T2147 oass.OpenExchangeRatesOrgProvider$OpenExchangeRates.<init> WARN Unknown key IMPORTANT NOTE
   [junit4]   2> 886582 T2147 oass.OpenExchangeRatesOrgProvider$OpenExchangeRates.<init> WARN Expected key, got STRING
   [junit4]   2> 886582 T2132 oasc.SolrCore.initDirectoryFactory org.apache.solr.core.MockDirectoryFactory
   [junit4]   2> 886583 T2147 oasc.SolrCore.initDirectoryFactory org.apache.solr.core.MockDirectoryFactory
   [junit4]   2> 886583 T2132 oasc.SolrCore.<init> [nodes_used_collection_shard1_replica1] Opening new SolrCore at /mnt/ssd/jenkins/workspace/Lucene-Solr-4.x-Linux/solr/build/solr-core/test/J1/./org.apache.solr.cloud.CollectionsAPIDistributedZkTest-jetty3-1375448165853/nodes_used_collection_shard1_replica1/, dataDir=/mnt/ssd/jenkins/workspace/Lucene-Solr-4.x-Linux/solr/build/solr-core/test/J1/./org.apache.solr.cloud.CollectionsAPIDistributedZkTest-jetty3-1375448165853//nodes_used_collection_shard1_replica1/data/
   [junit4]   2> 886584 T2147 oasc.SolrCore.<init> [nodes_used_collection_shard2_replica1] Opening new SolrCore at /mnt/ssd/jenkins/workspace/Lucene-Solr-4.x-Linux/solr/build/solr-core/test/J1/./org.apache.solr.cloud.CollectionsAPIDistributedZkTest-jetty4-1375448167124/nodes_used_collection_shard2_replica1/, dataDir=/mnt/ssd/jenkins/workspace/Lucene-Solr-4.x-Linux/solr/build/solr-core/test/J1/./org.apache.solr.cloud.CollectionsAPIDistributedZkTest-jetty4-1375448167124//nodes_used_collection_shard2_replica1/data/
   [junit4]   2> 886584 T2132 oasc.JmxMonitoredMap.<init> JMX monitoring is enabled. Adding Solr mbeans to JMX Server: com.sun.jmx.mbeanserver.JmxMBeanServer@1ed7524
   [junit4]   2> 886585 T2147 oasc.JmxMonitoredMap.<init> JMX monitoring is enabled. Adding Solr mbeans to JMX Server: com.sun.jmx.mbeanserver.JmxMBeanServer@1ed7524
   [junit4]   2> 886586 T2132 oasc.CachingDirectoryFactory.get return new directory for /mnt/ssd/jenkins/workspace/Lucene-Solr-4.x-Linux/solr/build/solr-core/test/J1/./org.apache.solr.cloud.CollectionsAPIDistributedZkTest-jetty3-1375448165853//nodes_used_collection_shard1_replica1/data
   [junit4]   2> 886586 T2147 oasc.CachingDirectoryFactory.get return new directory for /mnt/ssd/jenkins/workspace/Lucene-Solr-4.x-Linux/solr/build/solr-core/test/J1/./org.apache.solr.cloud.CollectionsAPIDistributedZkTest-jetty4-1375448167124//nodes_used_collection_shard2_replica1/data
   [junit4]   2> 886587 T2132 oasc.SolrCore.getNewIndexDir New index directory detected: old=null new=/mnt/ssd/jenkins/workspace/Lucene-Solr-4.x-Linux/solr/build/solr-core/test/J1/./org.apache.solr.cloud.CollectionsAPIDistributedZkTest-jetty3-1375448165853//nodes_used_collection_shard1_replica1/data/index/
   [junit4]   2> 886587 T2147 oasc.SolrCore.getNewIndexDir New index directory detected: old=null new=/mnt/ssd/jenkins/workspace/Lucene-Solr-4.x-Linux/solr/build/solr-core/test/J1/./org.apache.solr.cloud.CollectionsAPIDistributedZkTest-jetty4-1375448167124//nodes_used_collection_shard2_replica1/data/index/
   [junit4]   2> 886588 T2132 oasc.SolrCore.initIndex WARN [nodes_used_collection_shard1_replica1] Solr index directory '/mnt/ssd/jenkins/workspace/Lucene-Solr-4.x-Linux/solr/build/solr-core/test/J1/./org.apache.solr.cloud.CollectionsAPIDistributedZkTest-jetty3-1375448165853/nodes_used_collection_shard1_replica1/data/index' doesn't exist. Creating new index...
   [junit4]   2> 886588 T2147 oasc.SolrCore.initIndex WARN [nodes_used_collection_shard2_replica1] Solr index directory '/mnt/ssd/jenkins/workspace/Lucene-Solr-4.x-Linux/solr/build/solr-core/test/J1/./org.apache.solr.cloud.CollectionsAPIDistributedZkTest-jetty4-1375448167124/nodes_used_collection_shard2_replica1/data/index' doesn't exist. Creating new index...
   [junit4]   2> 886588 T2132 oasc.CachingDirectoryFactory.get return new directory for /mnt/ssd/jenkins/workspace/Lucene-Solr-4.x-Linux/solr/build/solr-core/test/J1/./org.apache.solr.cloud.CollectionsAPIDistributedZkTest-jetty3-1375448165853//nodes_used_collection_shard1_replica1/data/index
   [junit4]   2> 886589 T2147 oasc.CachingDirectoryFactory.get return new directory for /mnt/ssd/jenkins/workspace/Lucene-Solr-4.x-Linux/solr/build/solr-core/test/J1/./org.apache.solr.cloud.CollectionsAPIDistributedZkTest-jetty4-1375448167124//nodes_used_collection_shard2_replica1/data/index
   [junit4]   2> 886591 T2132 oasc.SolrDeletionPolicy.onCommit SolrDeletionPolicy.onCommit: commits: num=1
   [junit4]   2> 		commit{dir=MockDirWrapper(org.apache.lucene.store.RAMDirectory@1779d31 lockFactory=org.apache.lucene.store.NativeFSLockFactory@ebbaf0),segFN=segments_1,generation=1}
   [junit4]   2> 886591 T2147 oasc.SolrDeletionPolicy.onCommit SolrDeletionPolicy.onCommit: commits: num=1
   [junit4]   2> 		commit{dir=MockDirWrapper(org.apache.lucene.store.RAMDirectory@1e862f7 lockFactory=org.apache.lucene.store.NativeFSLockFactory@fa253e),segFN=segments_1,generation=1}
   [junit4]   2> 886591 T2132 oasc.SolrDeletionPolicy.updateCommits newest commit generation = 1
   [junit4]   2> 886592 T2147 oasc.SolrDeletionPolicy.updateCommits newest commit generation = 1
   [junit4]   2> 886594 T2118 oass.FileExchangeRateProvider.reload Reloading exchange rates from file currency.xml
   [junit4]   2> 886597 T2132 oasup.UpdateRequestProcessorChain.init inserting DistributedUpdateProcessorFactory into updateRequestProcessorChain "dedupe"
   [junit4]   2> 886597 T2147 oasup.UpdateRequestProcessorChain.init inserting DistributedUpdateProcessorFactory into updateRequestProcessorChain "dedupe"
   [junit4]   2> 886597 T2132 oasup.UpdateRequestProcessorChain.init inserting DistributedUpdateProcessorFactory into updateRequestProcessorChain "stored_sig"
   [junit4]   2> 886598 T2147 oasup.UpdateRequestProcessorChain.init inserting DistributedUpdateProcessorFactory into updateRequestProcessorChain "stored_sig"
   [junit4]   2> 886599 T2132 oasup.UpdateRequestProcessorChain.init inserting DistributedUpdateProcessorFactory into updateRequestProcessorChain "distrib-dup-test-chain-implicit"
   [junit4]   2> 886599 T2147 oasup.UpdateRequestProcessorChain.init inserting DistributedUpdateProcessorFactory into updateRequestProcessorChain "distrib-dup-test-chain-implicit"
   [junit4]   2> 886600 T2132 oasc.RequestHandlers.initHandlersFromConfig created standard: solr.StandardRequestHandler
   [junit4]   2> 886600 T2147 oasc.RequestHandlers.initHandlersFromConfig created standard: solr.StandardRequestHandler
   [junit4]   2> 886601 T2132 oasc.RequestHandlers.initHandlersFromConfig created /get: solr.RealTimeGetHandler
   [junit4]   2> 886601 T2132 oasc.RequestHandlers.initHandlersFromConfig adding lazy requestHandler: solr.ReplicationHandler
   [junit4]   2> 886601 T2147 oasc.RequestHandlers.initHandlersFromConfig created /get: solr.RealTimeGetHandler
   [junit4]   2> 886602 T2147 oasc.RequestHandlers.initHandlersFromConfig adding lazy requestHandler: solr.ReplicationHandler
   [junit4]   2> 886601 T2118 oass.FileExchangeRateProvider.reload Reloading exchange rates from file currency.xml
   [junit4]   2> 886602 T2147 oasc.RequestHandlers.initHandlersFromConfig created /replication: solr.ReplicationHandler
   [junit4]   2> 886602 T2132 oasc.RequestHandlers.initHandlersFromConfig created /replication: solr.ReplicationHandler
   [junit4]   2> 886603 T2147 oasc.RequestHandlers.initHandlersFromConfig created /update: solr.UpdateRequestHandler
   [junit4]   2> 886604 T2132 oasc.RequestHandlers.initHandlersFromConfig created /update: solr.UpdateRequestHandler
   [junit4]   2> 886604 T2147 oasc.RequestHandlers.initHandlersFromConfig created /admin/: org.apache.solr.handler.admin.AdminHandlers
   [junit4]   2> 886605 T2106 oass.FileExchangeRateProvider.reload Reloading exchange rates from file currency.xml
   [junit4]   2> 886604 T2132 oasc.RequestHandlers.initHandlersFromConfig created /admin/: org.apache.solr.handler.admin.AdminHandlers
   [junit4]   2> 886614 T2147 oashl.XMLLoader.init xsltCacheLifetimeSeconds=60
   [junit4]   2> 886614 T2132 oashl.XMLLoader.init xsltCacheLifetimeSeconds=60
   [junit4]   2> 886615 T2118 oass.OpenExchangeRatesOrgProvider.reload Reloading exchange rates from open-exchange-rates.json
   [junit4]   2> 886616 T2147 oass.SolrIndexSearcher.<init> Opening Searcher@19fb0c4 main
   [junit4]   2> 886616 T2106 oass.FileExchangeRateProvider.reload Reloading exchange rates from file currency.xml
   [junit4]   2> 886616 T2118 oass.OpenExchangeRatesOrgProvider$OpenExchangeRates.<init> WARN Unknown key IMPORTANT NOTE
   [junit4]   2> 886617 T2118 oass.OpenExchangeRatesOrgProvider$OpenExchangeRates.<init> WARN Expected key, got STRING
   [junit4]   2> 886617 T2147 oasu.CommitTracker.<init> Hard AutoCommit: disabled
   [junit4]   2> 886617 T2132 oass.SolrIndexSearcher.<init> Opening Searcher@827329 main
   [junit4]   2> 886618 T2147 oasu.CommitTracker.<init> Soft AutoCommit: disabled
   [junit4]   2> 886618 T2118 oass.OpenExchangeRatesOrgProvider.reload Reloading exchange rates from open-exchange-rates.json
   [junit4]   2> 886619 T2132 oasu.CommitTracker.<init> Hard AutoCommit: disabled
   [junit4]   2> 886620 T2132 oasu.CommitTracker.<init> Soft AutoCommit: disabled
   [junit4]   2> 886621 T2118 oass.OpenExchangeRatesOrgProvider$OpenExchangeRates.<init> WARN Unknown key IMPORTANT NOTE
   [junit4]   2> 886621 T2118 oass.OpenExchangeRatesOrgProvider$OpenExchangeRates.<init> WARN Expected key, got STRING
   [junit4]   2> 886622 T2118 oasc.SolrCore.initDirectoryFactory org.apache.solr.core.MockDirectoryFactory
   [junit4]   2> 886622 T2106 oass.OpenExchangeRatesOrgProvider.reload Reloading exchange rates from open-exchange-rates.json
   [junit4]   2> 886622 T2118 oasc.SolrCore.<init> [nodes_used_collection_shard2_replica2] Opening new SolrCore at /mnt/ssd/jenkins/workspace/Lucene-Solr-4.x-Linux/solr/build/solr-core/test/J1/./org.apache.solr.cloud.CollectionsAPIDistributedZkTest-jetty2-1375448164606/nodes_used_collection_shard2_replica2/, dataDir=/mnt/ssd/jenkins/workspace/Lucene-Solr-4.x-Linux/solr/build/solr-core/test/J1/./org.apache.solr.cloud.CollectionsAPIDistributedZkTest-jetty2-1375448164606//nodes_used_collection_shard2_replica2/data/
   [junit4]   2> 886623 T2158 oasc.SolrCore.registerSearcher [nodes_used_collection_shard2_replica1] Registered new searcher Searcher@19fb0c4 main{StandardDirectoryReader(segments_1:1)}
   [junit4]   2> 886623 T2159 oasc.SolrCore.registerSearcher [nodes_used_collection_shard1_replica1] Registered new searcher Searcher@827329 main{StandardDirectoryReader(segments_1:1)}
   [junit4]   2> 886623 T2118 oasc.JmxMonitoredMap.<init> JMX monitoring is enabled. Adding Solr mbeans to JMX Server: com.sun.jmx.mbeanserver.JmxMBeanServer@1ed7524
   [junit4]   2> 886624 T2106 oass.OpenExchangeRatesOrgProvider$OpenExchangeRates.<init> WARN Unknown key IMPORTANT NOTE
   [junit4]   2> 886624 T2106 oass.OpenExchangeRatesOrgProvider$OpenExchangeRates.<init> WARN Expected key, got STRING
   [junit4]   2> 886625 T2118 oasc.CachingDirectoryFactory.get return new directory for /mnt/ssd/jenkins/workspace/Lucene-Solr-4.x-Linux/solr/build/solr-core/test/J1/./org.apache.solr.cloud.CollectionsAPIDistributedZkTest-jetty2-1375448164606//nodes_used_collection_shard2_replica2/data
   [junit4]   2> 886625 T2147 oasc.CoreContainer.registerCore registering core: nodes_used_collection_shard2_replica1
   [junit4]   2> 886625 T2106 oass.OpenExchangeRatesOrgProvider.reload Reloading exchange rates from open-exchange-rates.json
   [junit4]   2> 886626 T2147 oasc.ZkController.register Register replica - core:nodes_used_collection_shard2_replica1 address:http://127.0.0.1:38060/cl collection:nodes_used_collection shard:shard2
   [junit4]   2> 886625 T2132 oasc.CoreContainer.registerCore registering core: nodes_used_collection_shard1_replica1
   [junit4]   2> 886625 T2118 oasc.SolrCore.getNewIndexDir New index directory detected: old=null new=/mnt/ssd/jenkins/workspace/Lucene-Solr-4.x-Linux/solr/build/solr-core/test/J1/./org.apache.solr.cloud.CollectionsAPIDistributedZkTest-jetty2-1375448164606//nodes_used_collection_shard2_replica2/data/index/
   [junit4]   2> 886627 T2132 oasc.ZkController.register Register replica - core:nodes_used_collection_shard1_replica1 address:http://127.0.0.1:46558/cl collection:nodes_used_collection shard:shard1
   [junit4]   2> 886626 T2147 oascsi.HttpClientUtil.createClient Creating new http client, config:maxConnections=10000&maxConnectionsPerHost=20&connTimeout=15000&socketTimeout=30000&retry=false
   [junit4]   2> 886628 T2132 oascsi.HttpClientUtil.createClient Creating new http client, config:maxConnections=10000&maxConnectionsPerHost=20&connTimeout=15000&socketTimeout=30000&retry=false
   [junit4]   2> 886628 T2106 oass.OpenExchangeRatesOrgProvider$OpenExchangeRates.<init> WARN Unknown key IMPORTANT NOTE
   [junit4]   2> 886629 T2106 oass.OpenExchangeRatesOrgProvider$OpenExchangeRates.<init> WARN Expected key, got STRING
   [junit4]   2> 886627 T2118 oasc.SolrCore.initIndex WARN [nodes_used_collection_shard2_replica2] Solr index directory '/mnt/ssd/jenkins/workspace/Lucene-Solr-4.x-Linux/solr/build/solr-core/test/J1/./org.apache.solr.cloud.CollectionsAPIDistributedZkTest-jetty2-1375448164606/nodes_used_collection_shard2_replica2/data/index' doesn't exist. Creating new index...
   [junit4]   2> 886629 T2106 oasc.SolrCore.initDirectoryFactory org.apache.solr.core.MockDirectoryFactory
   [junit4]   2> 886630 T2118 oasc.CachingDirectoryFactory.get return new directory for /mnt/ssd/jenkins/workspace/Lucene-Solr-4.x-Linux/solr/build/solr-core/test/J1/./org.apache.solr.cloud.CollectionsAPIDistributedZkTest-jetty2-1375448164606//nodes_used_collection_shard2_replica2/data/index
   [junit4]   2> 886630 T2106 oasc.SolrCore.<init> [nodes_used_collection_shard1_replica2] Opening new SolrCore at /mnt/ssd/jenkins/workspace/Lucene-Solr-4.x-Linux/solr/build/solr-core/test/J1/./org.apache.solr.cloud.CollectionsAPIDistributedZkTest-jetty1-1375448163324/nodes_used_collection_shard1_replica2/, dataDir=/mnt/ssd/jenkins/workspace/Lucene-Solr-4.x-Linux/solr/build/solr-core/test/J1/./org.apache.solr.cloud.CollectionsAPIDistributedZkTest-jetty1-1375448163324//nodes_used_collection_shard1_replica2/data/
   [junit4]   2> 886631 T2106 oasc.JmxMonitoredMap.<init> JMX monitoring is enabled. Adding Solr mbeans to JMX Server: com.sun.jmx.mbeanserver.JmxMBeanServer@1ed7524
   [junit4]   2> 886632 T2118 oasc.SolrDeletionPolicy.onCommit SolrDeletionPolicy.onCommit: commits: num=1
   [junit4]   2> 		commit{dir=MockDirWrapper(org.apache.lucene.store.RAMDirectory@1d509db lockFactory=org.apache.lucene.store.NativeFSLockFactory@10e1702),segFN=segments_1,generation=1}
   [junit4]   2> 886632 T2132 oascc.SolrZkClient.makePath makePath: /collections/nodes_used_collection/leader_elect/shard1/election
   [junit4]   2> 886632 T2106 oasc.CachingDirectoryFactory.get return new directory for /mnt/ssd/jenkins/workspace/Lucene-Solr-4.x-Linux/solr/build/solr-core/test/J1/./org.apache.solr.cloud.CollectionsAPIDistributedZkTest-jetty1-1375448163324//nodes_used_collection_shard1_replica2/data
   [junit4]   2> 886632 T2147 oascc.SolrZkClient.makePath makePath: /collections/nodes_used_collection/leader_elect/shard2/election
   [junit4]   2> 886633 T2106 oasc.SolrCore.getNewIndexDir New index directory detected: old=null new=/mnt/ssd/jenkins/workspace/Lucene-Solr-4.x-Linux/solr/build/solr-core/test/J1/./org.apache.solr.cloud.CollectionsAPIDistributedZkTest-jetty1-1375448163324//nodes_used_collection_shard1_replica2/data/index/
   [junit4]   2> 886632 T2118 oasc.SolrDeletionPolicy.updateCommits newest commit generation = 1
   [junit4]   2> 886634 T2106 oasc.SolrCore.initIndex WARN [nodes_used_collection_shard1_replica2] Solr index directory '/mnt/ssd/jenkins/workspace/Lucene-Solr-4.x-Linux/solr/build/solr-core/test/J1/./org.apache.solr.cloud.CollectionsAPIDistributedZkTest-jetty1-1375448163324/nodes_used_collection_shard1_replica2/data/index' doesn't exist. Creating new index...
   [junit4]   2> 886635 T2106 oasc.CachingDirectoryFactory.get return new directory for /mnt/ssd/jenkins/workspace/Lucene-Solr-4.x-Linux/solr/build/solr-core/test/J1/./org.apache.solr.cloud.CollectionsAPIDistributedZkTest-jetty1-1375448163324//nodes_used_collection_shard1_replica2/data/index
   [junit4]   2> 886637 T2106 oasc.SolrDeletionPolicy.onCommit SolrDeletionPolicy.onCommit: commits: num=1
   [junit4]   2> 		commit{dir=MockDirWrapper(org.apache.lucene.store.RAMDirectory@c559b3 lockFactory=org.apache.lucene.store.NativeFSLockFactory@bddfd7),segFN=segments_1,generation=1}
   [junit4]   2> 886638 T2106 oasc.SolrDeletionPolicy.updateCommits newest commit generation = 1
   [junit4]   2> 886641 T2118 oasup.UpdateRequestProcessorChain.init inserting DistributedUpdateProcessorFactory into updateRequestProcessorChain "dedupe"
   [junit4]   2> 886642 T2118 oasup.UpdateRequestProcessorChain.init inserting DistributedUpdateProcessorFactory into updateRequestProcessorChain "stored_sig"
   [junit4]   2> 886643 T2118 oasup.UpdateRequestProcessorChain.init inserting DistributedUpdateProcessorFactory into updateRequestProcessorChain "distrib-dup-test-chain-implicit"
   [junit4]   2> 886643 T2106 oasup.UpdateRequestProcessorChain.init inserting DistributedUpdateProcessorFactory into updateRequestProcessorChain "dedupe"
   [junit4]   2> 886644 T2118 oasc.RequestHandlers.initHandlersFromConfig created standard: solr.StandardRequestHandler
   [junit4]   2> 886645 T2106 oasup.UpdateRequestProcessorChain.init inserting DistributedUpdateProcessorFactory into updateRequestProcessorChain "stored_sig"
   [junit4]   2> 886646 T2118 oasc.RequestHandlers.initHandlersFromConfig created /get: solr.RealTimeGetHandler
   [junit4]   2> 886646 T2118 oasc.RequestHandlers.initHandlersFromConfig adding lazy requestHandler: solr.ReplicationHandler
   [junit4]   2> 886646 T2106 oasup.UpdateRequestProcessorChain.init inserting DistributedUpdateProcessorFactory into updateRequestProcessorChain "distrib-dup-test-chain-implicit"
   [junit4]   2> 886647 T2118 oasc.RequestHandlers.initHandlersFromConfig created /replication: solr.ReplicationHandler
   [junit4]   2> 886648 T2106 oasc.RequestHandlers.initHandlersFromConfig created standard: solr.StandardRequestHandler
   [junit4]   2> 886649 T2118 oasc.RequestHandlers.initHandlersFromConfig created /update: solr.UpdateRequestHandler
   [junit4]   2> 886649 T2106 oasc.RequestHandlers.initHandlersFromConfig created /get: solr.RealTimeGetHandler
   [junit4]   2> 886659 T2106 oasc.RequestHandlers.initHandlersFromConfig adding lazy requestHandler: solr.ReplicationHandler
   [junit4]   2> 886659 T2118 oasc.RequestHandlers.initHandlersFromConfig created /admin/: org.apache.solr.handler.admin.AdminHandlers
   [junit4]   2> 886659 T2106 oasc.RequestHandlers.initHandlersFromConfig created /replication: solr.ReplicationHandler
   [junit4]   2> 886660 T2106 oasc.RequestHandlers.initHandlersFromConfig created /update: solr.UpdateRequestHandler
   [junit4]   2> 886661 T2106 oasc.RequestHandlers.initHandlersFromConfig created /admin/: org.apache.solr.handler.admin.AdminHandlers
   [junit4]   2> 886661 T2132 oasc.ShardLeaderElectionContext.runLeaderProcess Running the leader process for shard shard1
   [junit4]   2> 886661 T2147 oasc.ShardLeaderElectionContext.runLeaderProcess Running the leader process for shard shard2
   [junit4]   2> 886662 T2118 oashl.XMLLoader.init xsltCacheLifetimeSeconds=60
   [junit4]   2> 886662 T2106 oashl.XMLLoader.init xsltCacheLifetimeSeconds=60
   [junit4]   2> 886665 T2106 oass.SolrIndexSearcher.<init> Opening Searcher@170afe0 main
   [junit4]   2> 886666 T2118 oass.SolrIndexSearcher.<init> Opening Searcher@18f6a4f main
   [junit4]   2> 886666 T2106 oasu.CommitTracker.<init> Hard AutoCommit: disabled
   [junit4]   2> 886667 T2132 oasc.ShardLeaderElectionContext.waitForReplicasToComeUp Waiting until we see more replicas up for shard shard1: total=2 found=1 timeoutin=179998
   [junit4]   2> 886667 T2118 oasu.CommitTracker.<init> Hard AutoCommit: disabled
   [junit4]   2> 886667 T2106 oasu.CommitTracker.<init> Soft AutoCommit: disabled
   [junit4]   2> 886668 T2118 oasu.CommitTracker.<init> Soft AutoCommit: disabled
   [junit4]   2> 886668 T2147 oasc.ShardLeaderElectionContext.waitForReplicasToComeUp Waiting until we see more replicas up for shard shard2: total=2 found=1 timeoutin=179999
   [junit4]   2> 886671 T2160 oasc.SolrCore.registerSearcher [nodes_used_collection_shard1_replica2] Registered new searcher Searcher@170afe0 main{StandardDirectoryReader(segments_1:1)}
   [junit4]   2> 886671 T2161 oasc.SolrCore.registerSearcher [nodes_used_collection_shard2_replica2] Registered new searcher Searcher@18f6a4f main{StandardDirectoryReader(segments_1:1)}
   [junit4]   2> 886673 T2106 oasc.CoreContainer.registerCore registering core: nodes_used_collection_shard1_replica2
   [junit4]   2> 886674 T2106 oasc.ZkController.register Register replica - core:nodes_used_collection_shard1_replica2 address:http://127.0.0.1:35800/cl collection:nodes_used_collection shard:shard1
   [junit4]   2> 886674 T2118 oasc.CoreContainer.registerCore registering core: nodes_used_collection_shard2_replica2
   [junit4]   2> 886674 T2106 oascsi.HttpClientUtil.createClient Creating new http client, config:maxConnections=10000&maxConnectionsPerHost=20&connTimeout=15000&socketTimeout=30000&retry=false
   [junit4]   2> 886675 T2118 oasc.ZkController.register Register replica - core:nodes_used_collection_shard2_replica2 address:http://127.0.0.1:44646/cl collection:nodes_used_collection shard:shard2
   [junit4]   2> 886675 T2118 oascsi.HttpClientUtil.createClient Creating new http client, config:maxConnections=10000&maxConnectionsPerHost=20&connTimeout=15000&socketTimeout=30000&retry=false
   [junit4]   2> 887169 T2132 oasc.ShardLeaderElectionContext.waitForReplicasToComeUp Enough replicas found to continue.
   [junit4]   2> 887170 T2132 oasc.ShardLeaderElectionContext.runLeaderProcess I may be the new leader - try and sync
   [junit4]   2> 887170 T2147 oasc.ShardLeaderElectionContext.waitForReplicasToComeUp Enough replicas found to continue.
   [junit4]   2> 887171 T2147 oasc.ShardLeaderElectionContext.runLeaderProcess I may be the new leader - try and sync
   [junit4]   2> 887171 T2132 oasc.SyncStrategy.sync Sync replicas to http://127.0.0.1:46558/cl/nodes_used_collection_shard1_replica1/
   [junit4]   2> 887172 T2147 oasc.SyncStrategy.sync Sync replicas to http://127.0.0.1:38060/cl/nodes_used_collection_shard2_replica1/
   [junit4]   2> 887173 T2132 oasu.PeerSync.sync PeerSync: core=nodes_used_collection_shard1_replica1 url=http://127.0.0.1:46558/cl START replicas=[http://127.0.0.1:35800/cl/nodes_used_collection_shard1_replica2/] nUpdates=100
   [junit4]   2> 887174 T2147 oasu.PeerSync.sync PeerSync: core=nodes_used_collection_shard2_replica1 url=http://127.0.0.1:38060/cl START replicas=[http://127.0.0.1:44646/cl/nodes_used_collection_shard2_replica2/] nUpdates=100
   [junit4]   2> 887175 T2132 oasu.PeerSync.sync PeerSync: core=nodes_used_collection_shard1_replica1 url=http://127.0.0.1:46558/cl DONE.  We have no versions.  sync failed.
   [junit4]   2> 887177 T2132 oasc.SyncStrategy.syncReplicas Leader's attempt to sync with shard failed, moving to the next candidate
   [junit4]   2> 887176 T2147 oasu.PeerSync.sync PeerSync: core=nodes_used_collection_shard2_replica1 url=http://127.0.0.1:38060/cl DONE.  We have no versions.  sync failed.
   [junit4]   2> 887178 T2147 oasc.SyncStrategy.syncReplicas Leader's attempt to sync with shard failed, moving to the next candidate
   [junit4]   2> 887178 T2132 oasc.ShardLeaderElectionContext.runLeaderProcess We failed sync, but we have no versions - we can't sync in that case - we were active before, so become leader anyway
   [junit4]   2> 887180 T2132 oasc.ShardLeaderElectionContext.runLeaderProcess I am the new leader: http://127.0.0.1:46558/cl/nodes_used_collection_shard1_replica1/ shard1
   [junit4]   2> 887179 T2147 oasc.ShardLeaderElectionContext.runLeaderProcess We failed sync, but we have no versions - we can't sync in that case - we were active before, so become leader anyway
   [junit4]   2> 887182 T2147 oasc.ShardLeaderElectionContext.runLeaderProcess I am the new leader: http://127.0.0.1:38060/cl/nodes_used_collection_shard2_

[...truncated too long message...]

testcase=CollectionsAPIDistributedZkTest -Dtests.method=testDistribSearch -Dtests.seed=7F855C675969A854 -Dtests.multiplier=3 -Dtests.slow=true -Dtests.locale=sl -Dtests.timezone=Cuba -Dtests.file.encoding=UTF-8
   [junit4] ERROR    111s J1 | CollectionsAPIDistributedZkTest.testDistribSearch <<<
   [junit4]    > Throwable #1: org.apache.solr.client.solrj.SolrServerException: Server refused connection at: http://127.0.0.1:44646/cl
   [junit4]    > 	at __randomizedtesting.SeedInfo.seed([7F855C675969A854:FE63D27F2E36C868]:0)
   [junit4]    > 	at org.apache.solr.client.solrj.impl.HttpSolrServer.request(HttpSolrServer.java:428)
   [junit4]    > 	at org.apache.solr.client.solrj.impl.HttpSolrServer.request(HttpSolrServer.java:180)
   [junit4]    > 	at org.apache.solr.cloud.AbstractFullDistribZkTestBase.createCollection(AbstractFullDistribZkTestBase.java:1535)
   [junit4]    > 	at org.apache.solr.cloud.CollectionsAPIDistributedZkTest.testCustomCollectionsAPI(CollectionsAPIDistributedZkTest.java:677)
   [junit4]    > 	at org.apache.solr.cloud.CollectionsAPIDistributedZkTest.doTest(CollectionsAPIDistributedZkTest.java:159)
   [junit4]    > 	at org.apache.solr.BaseDistributedSearchTestCase.testDistribSearch(BaseDistributedSearchTestCase.java:835)
   [junit4]    > 	at java.lang.Thread.run(Thread.java:662)
   [junit4]    > Caused by: org.apache.http.conn.HttpHostConnectException: Connection to http://127.0.0.1:44646 refused
   [junit4]    > 	at org.apache.http.impl.conn.DefaultClientConnectionOperator.openConnection(DefaultClientConnectionOperator.java:190)
   [junit4]    > 	at org.apache.http.impl.conn.ManagedClientConnectionImpl.open(ManagedClientConnectionImpl.java:294)
   [junit4]    > 	at org.apache.http.impl.client.DefaultRequestDirector.tryConnect(DefaultRequestDirector.java:645)
   [junit4]    > 	at org.apache.http.impl.client.DefaultRequestDirector.execute(DefaultRequestDirector.java:480)
   [junit4]    > 	at org.apache.http.impl.client.AbstractHttpClient.execute(AbstractHttpClient.java:906)
   [junit4]    > 	at org.apache.http.impl.client.AbstractHttpClient.execute(AbstractHttpClient.java:805)
   [junit4]    > 	at org.apache.http.impl.client.AbstractHttpClient.execute(AbstractHttpClient.java:784)
   [junit4]    > 	at org.apache.solr.client.solrj.impl.HttpSolrServer.request(HttpSolrServer.java:365)
   [junit4]    > 	... 45 more
   [junit4]    > Caused by: java.net.ConnectException: Connection refused
   [junit4]    > 	at java.net.PlainSocketImpl.socketConnect(Native Method)
   [junit4]    > 	at java.net.PlainSocketImpl.doConnect(PlainSocketImpl.java:351)
   [junit4]    > 	at java.net.PlainSocketImpl.connectToAddress(PlainSocketImpl.java:213)
   [junit4]    > 	at java.net.PlainSocketImpl.connect(PlainSocketImpl.java:200)
   [junit4]    > 	at java.net.SocksSocketImpl.connect(SocksSocketImpl.java:366)
   [junit4]    > 	at java.net.Socket.connect(Socket.java:529)
   [junit4]    > 	at org.apache.http.conn.scheme.PlainSocketFactory.connectSocket(PlainSocketFactory.java:127)
   [junit4]    > 	at org.apache.http.impl.conn.DefaultClientConnectionOperator.openConnection(DefaultClientConnectionOperator.java:180)
   [junit4]    > 	... 52 more
   [junit4]   2> 987145 T2070 oas.SolrTestCaseJ4.deleteCore ###deleteCore
   [junit4]   2> 110671 T2069 ccr.ThreadLeakControl.checkThreadLeaks WARNING Will linger awaiting termination of 2 leaked thread(s).
   [junit4]   2> 988331 T2152 oasc.LeaderElector$1.process WARN  org.apache.zookeeper.KeeperException$SessionExpiredException: KeeperErrorCode = Session expired for /collections/new_implicit_coll_1/leader_elect/a/election
   [junit4]   2> 	at org.apache.zookeeper.KeeperException.create(KeeperException.java:127)
   [junit4]   2> 	at org.apache.zookeeper.KeeperException.create(KeeperException.java:51)
   [junit4]   2> 	at org.apache.zookeeper.ZooKeeper.getChildren(ZooKeeper.java:1468)
   [junit4]   2> 	at org.apache.solr.common.cloud.SolrZkClient$6.execute(SolrZkClient.java:235)
   [junit4]   2> 	at org.apache.solr.common.cloud.SolrZkClient$6.execute(SolrZkClient.java:232)
   [junit4]   2> 	at org.apache.solr.common.cloud.ZkCmdExecutor.retryOperation(ZkCmdExecutor.java:65)
   [junit4]   2> 	at org.apache.solr.common.cloud.SolrZkClient.getChildren(SolrZkClient.java:232)
   [junit4]   2> 	at org.apache.solr.cloud.LeaderElector.checkIfIamLeader(LeaderElector.java:84)
   [junit4]   2> 	at org.apache.solr.cloud.LeaderElector.access$000(LeaderElector.java:55)
   [junit4]   2> 	at org.apache.solr.cloud.LeaderElector$1.process(LeaderElector.java:129)
   [junit4]   2> 	at org.apache.zookeeper.ClientCnxn$EventThread.processEvent(ClientCnxn.java:519)
   [junit4]   2> 	at org.apache.zookeeper.ClientCnxn$EventThread.run(ClientCnxn.java:495)
   [junit4]   2> 
   [junit4]   2> 988332 T2152 oasc.LeaderElector$1.process WARN  org.apache.zookeeper.KeeperException$SessionExpiredException: KeeperErrorCode = Session expired for /collections/new_implicit_coll_1/leader_elect/d/election
   [junit4]   2> 	at org.apache.zookeeper.KeeperException.create(KeeperException.java:127)
   [junit4]   2> 	at org.apache.zookeeper.KeeperException.create(KeeperException.java:51)
   [junit4]   2> 	at org.apache.zookeeper.ZooKeeper.getChildren(ZooKeeper.java:1468)
   [junit4]   2> 	at org.apache.solr.common.cloud.SolrZkClient$6.execute(SolrZkClient.java:235)
   [junit4]   2> 	at org.apache.solr.common.cloud.SolrZkClient$6.execute(SolrZkClient.java:232)
   [junit4]   2> 	at org.apache.solr.common.cloud.ZkCmdExecutor.retryOperation(ZkCmdExecutor.java:65)
   [junit4]   2> 	at org.apache.solr.common.cloud.SolrZkClient.getChildren(SolrZkClient.java:232)
   [junit4]   2> 	at org.apache.solr.cloud.LeaderElector.checkIfIamLeader(LeaderElector.java:84)
   [junit4]   2> 	at org.apache.solr.cloud.LeaderElector.access$000(LeaderElector.java:55)
   [junit4]   2> 	at org.apache.solr.cloud.LeaderElector$1.process(LeaderElector.java:129)
   [junit4]   2> 	at org.apache.zookeeper.ClientCnxn$EventThread.processEvent(ClientCnxn.java:519)
   [junit4]   2> 	at org.apache.zookeeper.ClientCnxn$EventThread.run(ClientCnxn.java:495)
   [junit4]   2> 
   [junit4]   2> 988333 T2152 oascc.ZkStateReader$3.process WARN ZooKeeper watch triggered, but Solr cannot talk to ZK
   [junit4]   2> 988334 T2152 oascc.ZkStateReader$2.process A cluster state change: WatchedEvent state:SyncConnected type:NodeChildrenChanged path:/live_nodes, has occurred - updating... (live nodes size: 1)
   [junit4]   2> 988334 T2152 oascc.ZkStateReader$2.process WARN ZooKeeper watch triggered, but Solr cannot talk to ZK
   [junit4]   2> NOTE: test params are: codec=Lucene41, sim=DefaultSimilarity, locale=sl, timezone=Cuba
   [junit4]   2> NOTE: Linux 3.2.0-51-generic i386/Sun Microsystems Inc. 1.6.0_45 (32-bit)/cpus=8,threads=2,free=66956800,total=188964864
   [junit4]   2> NOTE: All tests run in this JVM: [TestSchemaResource, TestDynamicFieldResource, TestRangeQuery, TestSolr4Spatial, PathHierarchyTokenizerFactoryTest, SolrCoreCheckLockOnStartupTest, TestCSVResponseWriter, NumericFieldsTest, TestBinaryResponseWriter, TestNumberUtils, RequestHandlersTest, TestStressReorder, DirectUpdateHandlerTest, TestCollationField, TestManagedSchemaFieldResource, BasicZkTest, TestAddFieldRealTimeGet, TestRTGBase, SortByFunctionTest, ChaosMonkeySafeLeaderTest, FieldAnalysisRequestHandlerTest, StatsComponentTest, NoCacheHeaderTest, TestSolrXMLSerializer, TestLazyCores, SignatureUpdateProcessorFactoryTest, HdfsBasicDistributedZk2Test, XsltUpdateRequestHandlerTest, SolrPluginUtilsTest, NotRequiredUniqueKeyTest, CoreContainerCoreInitFailuresTest, IndexBasedSpellCheckerTest, TestSolrJ, TimeZoneUtilsTest, ShardSplitTest, TestHashPartitioner, LeaderElectionIntegrationTest, ZkNodePropsTest, TestSuggestSpellingConverter, SolrRequestParserTest, TestMergePolicyConfig, TestRandomMergePolicy, UpdateParamsTest, TestSchemaSimilarityResource, BasicDistributedZk2Test, TestCoreDiscovery, SpellCheckComponentTest, DebugComponentTest, ShardRoutingCustomTest, TestQueryTypes, TestDistributedSearch, TestSerializedLuceneMatchVersion, BlockCacheTest, OpenExchangeRatesOrgProviderTest, TestPostingsSolrHighlighter, TestRandomFaceting, TestInfoStreamLogging, TestUtils, TestCloudManagedSchema, SpellCheckCollatorTest, TestClassNameShortening, TestIndexingPerformance, DateMathParserTest, DisMaxRequestHandlerTest, ConvertedLegacyTest, HighlighterConfigTest, TestFastOutputStream, BadCopyFieldTest, TestLMJelinekMercerSimilarityFactory, TestOmitPositions, TestComponentsName, TestBM25SimilarityFactory, RequiredFieldsTest, TestMultiCoreConfBootstrap, DistanceFunctionTest, AssignTest, TestWordDelimiterFilterFactory, HardAutoCommitTest, CollectionsAPIDistributedZkTest]
   [junit4] Completed on J1 in 111.98s, 1 test, 1 error <<< FAILURES!

[...truncated 496 lines...]
BUILD FAILED
/mnt/ssd/jenkins/workspace/Lucene-Solr-4.x-Linux/build.xml:395: The following error occurred while executing this line:
/mnt/ssd/jenkins/workspace/Lucene-Solr-4.x-Linux/build.xml:375: The following error occurred while executing this line:
/mnt/ssd/jenkins/workspace/Lucene-Solr-4.x-Linux/build.xml:39: The following error occurred while executing this line:
/mnt/ssd/jenkins/workspace/Lucene-Solr-4.x-Linux/solr/build.xml:181: The following error occurred while executing this line:
/mnt/ssd/jenkins/workspace/Lucene-Solr-4.x-Linux/solr/common-build.xml:449: The following error occurred while executing this line:
/mnt/ssd/jenkins/workspace/Lucene-Solr-4.x-Linux/lucene/common-build.xml:1233: The following error occurred while executing this line:
/mnt/ssd/jenkins/workspace/Lucene-Solr-4.x-Linux/lucene/common-build.xml:876: There were test failures: 321 suites, 1352 tests, 1 error, 34 ignored (6 assumptions)

Total time: 44 minutes 52 seconds
Build step 'Invoke Ant' marked build as failure
Description set: Java: 32bit/jdk1.6.0_45 -client -XX:+UseConcMarkSweepGC
Archiving artifacts
Recording test results
Email was triggered for: Failure
Sending email for trigger: Failure



Mime
View raw message