lucene-dev mailing list archives

Site index · List index
Message view « Date » · « Thread »
Top « Date » · « Thread »
From Policeman Jenkins Server <jenk...@thetaphi.de>
Subject [JENKINS] Lucene-Solr-4.x-MacOSX (64bit/jdk1.6.0) - Build # 682 - Still Failing!
Date Sat, 03 Aug 2013 02:59:49 GMT
Build: http://jenkins.thetaphi.de/job/Lucene-Solr-4.x-MacOSX/682/
Java: 64bit/jdk1.6.0 -XX:+UseCompressedOops -XX:+UseSerialGC

1 tests failed.
FAILED:  org.apache.solr.cloud.CollectionsAPIDistributedZkTest.testDistribSearch

Error Message:
Server refused connection at: http://127.0.0.1:52954

Stack Trace:
org.apache.solr.client.solrj.SolrServerException: Server refused connection at: http://127.0.0.1:52954
	at __randomizedtesting.SeedInfo.seed([CEF2CA95B7058532:4F14448DC05AE50E]:0)
	at org.apache.solr.client.solrj.impl.HttpSolrServer.request(HttpSolrServer.java:428)
	at org.apache.solr.client.solrj.impl.HttpSolrServer.request(HttpSolrServer.java:180)
	at org.apache.solr.cloud.CollectionsAPIDistributedZkTest.testCustomCollectionsAPI(CollectionsAPIDistributedZkTest.java:764)
	at org.apache.solr.cloud.CollectionsAPIDistributedZkTest.doTest(CollectionsAPIDistributedZkTest.java:159)
	at org.apache.solr.BaseDistributedSearchTestCase.testDistribSearch(BaseDistributedSearchTestCase.java:835)
	at sun.reflect.NativeMethodAccessorImpl.invoke0(Native Method)
	at sun.reflect.NativeMethodAccessorImpl.invoke(NativeMethodAccessorImpl.java:39)
	at sun.reflect.DelegatingMethodAccessorImpl.invoke(DelegatingMethodAccessorImpl.java:25)
	at java.lang.reflect.Method.invoke(Method.java:597)
	at com.carrotsearch.randomizedtesting.RandomizedRunner.invoke(RandomizedRunner.java:1559)
	at com.carrotsearch.randomizedtesting.RandomizedRunner.access$600(RandomizedRunner.java:79)
	at com.carrotsearch.randomizedtesting.RandomizedRunner$6.evaluate(RandomizedRunner.java:737)
	at com.carrotsearch.randomizedtesting.RandomizedRunner$7.evaluate(RandomizedRunner.java:773)
	at com.carrotsearch.randomizedtesting.RandomizedRunner$8.evaluate(RandomizedRunner.java:787)
	at com.carrotsearch.randomizedtesting.rules.SystemPropertiesRestoreRule$1.evaluate(SystemPropertiesRestoreRule.java:53)
	at org.apache.lucene.util.TestRuleSetupTeardownChained$1.evaluate(TestRuleSetupTeardownChained.java:50)
	at org.apache.lucene.util.TestRuleFieldCacheSanity$1.evaluate(TestRuleFieldCacheSanity.java:51)
	at org.apache.lucene.util.AbstractBeforeAfterRule$1.evaluate(AbstractBeforeAfterRule.java:46)
	at com.carrotsearch.randomizedtesting.rules.SystemPropertiesInvariantRule$1.evaluate(SystemPropertiesInvariantRule.java:55)
	at org.apache.lucene.util.TestRuleThreadAndTestName$1.evaluate(TestRuleThreadAndTestName.java:49)
	at org.apache.lucene.util.TestRuleIgnoreAfterMaxFailures$1.evaluate(TestRuleIgnoreAfterMaxFailures.java:70)
	at org.apache.lucene.util.TestRuleMarkFailure$1.evaluate(TestRuleMarkFailure.java:48)
	at com.carrotsearch.randomizedtesting.rules.StatementAdapter.evaluate(StatementAdapter.java:36)
	at com.carrotsearch.randomizedtesting.ThreadLeakControl$StatementRunner.run(ThreadLeakControl.java:358)
	at com.carrotsearch.randomizedtesting.ThreadLeakControl.forkTimeoutingTask(ThreadLeakControl.java:782)
	at com.carrotsearch.randomizedtesting.ThreadLeakControl$3.evaluate(ThreadLeakControl.java:442)
	at com.carrotsearch.randomizedtesting.RandomizedRunner.runSingleTest(RandomizedRunner.java:746)
	at com.carrotsearch.randomizedtesting.RandomizedRunner$3.evaluate(RandomizedRunner.java:648)
	at com.carrotsearch.randomizedtesting.RandomizedRunner$4.evaluate(RandomizedRunner.java:682)
	at com.carrotsearch.randomizedtesting.RandomizedRunner$5.evaluate(RandomizedRunner.java:693)
	at com.carrotsearch.randomizedtesting.rules.StatementAdapter.evaluate(StatementAdapter.java:36)
	at com.carrotsearch.randomizedtesting.rules.SystemPropertiesRestoreRule$1.evaluate(SystemPropertiesRestoreRule.java:53)
	at org.apache.lucene.util.AbstractBeforeAfterRule$1.evaluate(AbstractBeforeAfterRule.java:46)
	at org.apache.lucene.util.TestRuleStoreClassName$1.evaluate(TestRuleStoreClassName.java:42)
	at com.carrotsearch.randomizedtesting.rules.SystemPropertiesInvariantRule$1.evaluate(SystemPropertiesInvariantRule.java:55)
	at com.carrotsearch.randomizedtesting.rules.NoShadowingOrOverridesOnMethodsRule$1.evaluate(NoShadowingOrOverridesOnMethodsRule.java:39)
	at com.carrotsearch.randomizedtesting.rules.NoShadowingOrOverridesOnMethodsRule$1.evaluate(NoShadowingOrOverridesOnMethodsRule.java:39)
	at com.carrotsearch.randomizedtesting.rules.StatementAdapter.evaluate(StatementAdapter.java:36)
	at org.apache.lucene.util.TestRuleAssertionsRequired$1.evaluate(TestRuleAssertionsRequired.java:43)
	at org.apache.lucene.util.TestRuleMarkFailure$1.evaluate(TestRuleMarkFailure.java:48)
	at org.apache.lucene.util.TestRuleIgnoreAfterMaxFailures$1.evaluate(TestRuleIgnoreAfterMaxFailures.java:70)
	at org.apache.lucene.util.TestRuleIgnoreTestSuites$1.evaluate(TestRuleIgnoreTestSuites.java:55)
	at com.carrotsearch.randomizedtesting.rules.StatementAdapter.evaluate(StatementAdapter.java:36)
	at com.carrotsearch.randomizedtesting.ThreadLeakControl$StatementRunner.run(ThreadLeakControl.java:358)
	at java.lang.Thread.run(Thread.java:680)
Caused by: org.apache.http.conn.HttpHostConnectException: Connection to http://127.0.0.1:52954 refused
	at org.apache.http.impl.conn.DefaultClientConnectionOperator.openConnection(DefaultClientConnectionOperator.java:190)
	at org.apache.http.impl.conn.ManagedClientConnectionImpl.open(ManagedClientConnectionImpl.java:294)
	at org.apache.http.impl.client.DefaultRequestDirector.tryConnect(DefaultRequestDirector.java:645)
	at org.apache.http.impl.client.DefaultRequestDirector.execute(DefaultRequestDirector.java:480)
	at org.apache.http.impl.client.AbstractHttpClient.execute(AbstractHttpClient.java:906)
	at org.apache.http.impl.client.AbstractHttpClient.execute(AbstractHttpClient.java:805)
	at org.apache.http.impl.client.AbstractHttpClient.execute(AbstractHttpClient.java:784)
	at org.apache.solr.client.solrj.impl.HttpSolrServer.request(HttpSolrServer.java:365)
	... 44 more
Caused by: java.net.ConnectException: Connection refused
	at java.net.PlainSocketImpl.socketConnect(Native Method)
	at java.net.PlainSocketImpl.doConnect(PlainSocketImpl.java:382)
	at java.net.PlainSocketImpl.connectToAddress(PlainSocketImpl.java:241)
	at java.net.PlainSocketImpl.connect(PlainSocketImpl.java:228)
	at java.net.SocksSocketImpl.connect(SocksSocketImpl.java:431)
	at java.net.Socket.connect(Socket.java:527)
	at org.apache.http.conn.scheme.PlainSocketFactory.connectSocket(PlainSocketFactory.java:127)
	at org.apache.http.impl.conn.DefaultClientConnectionOperator.openConnection(DefaultClientConnectionOperator.java:180)
	... 51 more




Build Log:
[...truncated 9231 lines...]
   [junit4] Suite: org.apache.solr.cloud.CollectionsAPIDistributedZkTest
   [junit4]   2> 1905232 T4095 oas.BaseDistributedSearchTestCase.initHostContext Setting hostContext system property: /
   [junit4]   2> 1905240 T4095 oas.SolrTestCaseJ4.setUp ###Starting testDistribSearch
   [junit4]   2> Creating dataDir: /Users/jenkins/jenkins-slave/workspace/Lucene-Solr-4.x-MacOSX/solr/build/solr-core/test/J0/./solrtest-CollectionsAPIDistributedZkTest-1375496799946
   [junit4]   2> 1905243 T4095 oasc.ZkTestServer.run STARTING ZK TEST SERVER
   [junit4]   2> 1905244 T4096 oasc.ZkTestServer$ZKServerMain.runFromConfig Starting server
   [junit4]   2> 1905345 T4095 oasc.ZkTestServer.run start zk server on port:52947
   [junit4]   2> 1905348 T4095 oascc.ConnectionManager.waitForConnected Waiting for client to connect to ZooKeeper
   [junit4]   2> 1905363 T4102 oascc.ConnectionManager.process Watcher org.apache.solr.common.cloud.ConnectionManager@218fe32 name:ZooKeeperConnection Watcher:127.0.0.1:52947 got event WatchedEvent state:SyncConnected type:None path:null path:null type:None
   [junit4]   2> 1905363 T4095 oascc.ConnectionManager.waitForConnected Client is connected to ZooKeeper
   [junit4]   2> 1905364 T4095 oascc.SolrZkClient.makePath makePath: /solr
   [junit4]   2> 1905381 T4095 oascc.ConnectionManager.waitForConnected Waiting for client to connect to ZooKeeper
   [junit4]   2> 1905387 T4104 oascc.ConnectionManager.process Watcher org.apache.solr.common.cloud.ConnectionManager@18b1afdb name:ZooKeeperConnection Watcher:127.0.0.1:52947/solr got event WatchedEvent state:SyncConnected type:None path:null path:null type:None
   [junit4]   2> 1905387 T4095 oascc.ConnectionManager.waitForConnected Client is connected to ZooKeeper
   [junit4]   2> 1905388 T4095 oascc.SolrZkClient.makePath makePath: /collections/collection1
   [junit4]   2> 1905407 T4095 oascc.SolrZkClient.makePath makePath: /collections/collection1/shards
   [junit4]   2> 1905418 T4095 oascc.SolrZkClient.makePath makePath: /collections/control_collection
   [junit4]   2> 1905428 T4095 oascc.SolrZkClient.makePath makePath: /collections/control_collection/shards
   [junit4]   2> 1905444 T4095 oasc.AbstractZkTestCase.putConfig put /Users/jenkins/jenkins-slave/workspace/Lucene-Solr-4.x-MacOSX/solr/build/solr-core/test-files/solr/collection1/conf/solrconfig-tlog.xml to /configs/conf1/solrconfig.xml
   [junit4]   2> 1905446 T4095 oascc.SolrZkClient.makePath makePath: /configs/conf1/solrconfig.xml
   [junit4]   2> 1905464 T4095 oasc.AbstractZkTestCase.putConfig put /Users/jenkins/jenkins-slave/workspace/Lucene-Solr-4.x-MacOSX/solr/build/solr-core/test-files/solr/collection1/conf/schema.xml to /configs/conf1/schema.xml
   [junit4]   2> 1905465 T4095 oascc.SolrZkClient.makePath makePath: /configs/conf1/schema.xml
   [junit4]   2> 1905477 T4095 oasc.AbstractZkTestCase.putConfig put /Users/jenkins/jenkins-slave/workspace/Lucene-Solr-4.x-MacOSX/solr/build/solr-core/test-files/solr/collection1/conf/stopwords.txt to /configs/conf1/stopwords.txt
   [junit4]   2> 1905479 T4095 oascc.SolrZkClient.makePath makePath: /configs/conf1/stopwords.txt
   [junit4]   2> 1905491 T4095 oasc.AbstractZkTestCase.putConfig put /Users/jenkins/jenkins-slave/workspace/Lucene-Solr-4.x-MacOSX/solr/build/solr-core/test-files/solr/collection1/conf/protwords.txt to /configs/conf1/protwords.txt
   [junit4]   2> 1905492 T4095 oascc.SolrZkClient.makePath makePath: /configs/conf1/protwords.txt
   [junit4]   2> 1905503 T4095 oasc.AbstractZkTestCase.putConfig put /Users/jenkins/jenkins-slave/workspace/Lucene-Solr-4.x-MacOSX/solr/build/solr-core/test-files/solr/collection1/conf/currency.xml to /configs/conf1/currency.xml
   [junit4]   2> 1905504 T4095 oascc.SolrZkClient.makePath makePath: /configs/conf1/currency.xml
   [junit4]   2> 1905514 T4095 oasc.AbstractZkTestCase.putConfig put /Users/jenkins/jenkins-slave/workspace/Lucene-Solr-4.x-MacOSX/solr/build/solr-core/test-files/solr/collection1/conf/open-exchange-rates.json to /configs/conf1/open-exchange-rates.json
   [junit4]   2> 1905522 T4095 oascc.SolrZkClient.makePath makePath: /configs/conf1/open-exchange-rates.json
   [junit4]   2> 1905533 T4095 oasc.AbstractZkTestCase.putConfig put /Users/jenkins/jenkins-slave/workspace/Lucene-Solr-4.x-MacOSX/solr/build/solr-core/test-files/solr/collection1/conf/mapping-ISOLatin1Accent.txt to /configs/conf1/mapping-ISOLatin1Accent.txt
   [junit4]   2> 1905534 T4095 oascc.SolrZkClient.makePath makePath: /configs/conf1/mapping-ISOLatin1Accent.txt
   [junit4]   2> 1905546 T4095 oasc.AbstractZkTestCase.putConfig put /Users/jenkins/jenkins-slave/workspace/Lucene-Solr-4.x-MacOSX/solr/build/solr-core/test-files/solr/collection1/conf/old_synonyms.txt to /configs/conf1/old_synonyms.txt
   [junit4]   2> 1905547 T4095 oascc.SolrZkClient.makePath makePath: /configs/conf1/old_synonyms.txt
   [junit4]   2> 1905557 T4095 oasc.AbstractZkTestCase.putConfig put /Users/jenkins/jenkins-slave/workspace/Lucene-Solr-4.x-MacOSX/solr/build/solr-core/test-files/solr/collection1/conf/synonyms.txt to /configs/conf1/synonyms.txt
   [junit4]   2> 1905558 T4095 oascc.SolrZkClient.makePath makePath: /configs/conf1/synonyms.txt
   [junit4]   2> 1906215 T4095 oejs.Server.doStart jetty-8.1.10.v20130312
   [junit4]   2> 1906224 T4095 oejs.AbstractConnector.doStart Started SelectChannelConnector@127.0.0.1:52950
   [junit4]   2> 1906226 T4095 oass.SolrDispatchFilter.init SolrDispatchFilter.init()
   [junit4]   2> 1906227 T4095 oasc.SolrResourceLoader.locateSolrHome JNDI not configured for solr (NoInitialContextEx)
   [junit4]   2> 1906229 T4095 oasc.SolrResourceLoader.locateSolrHome using system property solr.solr.home: /Users/jenkins/jenkins-slave/workspace/Lucene-Solr-4.x-MacOSX/solr/build/solr-core/test/J0/./org.apache.solr.cloud.CollectionsAPIDistributedZkTest-controljetty-1375496800275
   [junit4]   2> 1906230 T4095 oasc.SolrResourceLoader.<init> new SolrResourceLoader for directory: '/Users/jenkins/jenkins-slave/workspace/Lucene-Solr-4.x-MacOSX/solr/build/solr-core/test/J0/./org.apache.solr.cloud.CollectionsAPIDistributedZkTest-controljetty-1375496800275/'
   [junit4]   2> 1906307 T4095 oasc.ConfigSolr.fromFile Loading container configuration from /Users/jenkins/jenkins-slave/workspace/Lucene-Solr-4.x-MacOSX/solr/build/solr-core/test/J0/./org.apache.solr.cloud.CollectionsAPIDistributedZkTest-controljetty-1375496800275/solr.xml
   [junit4]   2> 1906395 T4095 oasc.ConfigSolrXml.<init> Config-defined core root directory: 
   [junit4]   2> 1906396 T4095 oasc.CoreContainer.<init> New CoreContainer 615067401
   [junit4]   2> 1906396 T4095 oasc.CoreContainer.load Loading cores into CoreContainer [instanceDir=/Users/jenkins/jenkins-slave/workspace/Lucene-Solr-4.x-MacOSX/solr/build/solr-core/test/J0/./org.apache.solr.cloud.CollectionsAPIDistributedZkTest-controljetty-1375496800275/]
   [junit4]   2> 1906398 T4095 oashc.HttpShardHandlerFactory.getParameter Setting socketTimeout to: 120000
   [junit4]   2> 1906398 T4095 oashc.HttpShardHandlerFactory.getParameter Setting urlScheme to: http://
   [junit4]   2> 1906399 T4095 oashc.HttpShardHandlerFactory.getParameter Setting connTimeout to: 15000
   [junit4]   2> 1906399 T4095 oashc.HttpShardHandlerFactory.getParameter Setting maxConnectionsPerHost to: 20
   [junit4]   2> 1906400 T4095 oashc.HttpShardHandlerFactory.getParameter Setting corePoolSize to: 0
   [junit4]   2> 1906400 T4095 oashc.HttpShardHandlerFactory.getParameter Setting maximumPoolSize to: 2147483647
   [junit4]   2> 1906401 T4095 oashc.HttpShardHandlerFactory.getParameter Setting maxThreadIdleTime to: 5
   [junit4]   2> 1906401 T4095 oashc.HttpShardHandlerFactory.getParameter Setting sizeOfQueue to: -1
   [junit4]   2> 1906402 T4095 oashc.HttpShardHandlerFactory.getParameter Setting fairnessPolicy to: false
   [junit4]   2> 1906402 T4095 oascsi.HttpClientUtil.createClient Creating new http client, config:maxConnectionsPerHost=20&maxConnections=10000&socketTimeout=120000&connTimeout=15000&retry=false
   [junit4]   2> 1906438 T4095 oasc.ZkContainer.initZooKeeper Zookeeper client=127.0.0.1:52947/solr
   [junit4]   2> 1906439 T4095 oasc.ZkController.checkChrootPath zkHost includes chroot
   [junit4]   2> 1906443 T4095 oascc.ConnectionManager.waitForConnected Waiting for client to connect to ZooKeeper
   [junit4]   2> 1906452 T4115 oascc.ConnectionManager.process Watcher org.apache.solr.common.cloud.ConnectionManager@5f4f0aac name:ZooKeeperConnection Watcher:127.0.0.1:52947 got event WatchedEvent state:SyncConnected type:None path:null path:null type:None
   [junit4]   2> 1906452 T4095 oascc.ConnectionManager.waitForConnected Client is connected to ZooKeeper
   [junit4]   2> 1906457 T4095 oascsi.HttpClientUtil.createClient Creating new http client, config:maxConnections=500&maxConnectionsPerHost=16&socketTimeout=120000&connTimeout=15000
   [junit4]   2> 1906491 T4095 oascc.ConnectionManager.waitForConnected Waiting for client to connect to ZooKeeper
   [junit4]   2> 1906496 T4117 oascc.ConnectionManager.process Watcher org.apache.solr.common.cloud.ConnectionManager@a368222 name:ZooKeeperConnection Watcher:127.0.0.1:52947/solr got event WatchedEvent state:SyncConnected type:None path:null path:null type:None
   [junit4]   2> 1906496 T4095 oascc.ConnectionManager.waitForConnected Client is connected to ZooKeeper
   [junit4]   2> 1906502 T4095 oascc.SolrZkClient.makePath makePath: /overseer/queue
   [junit4]   2> 1906515 T4095 oascc.SolrZkClient.makePath makePath: /overseer/collection-queue-work
   [junit4]   2> 1906528 T4095 oascc.SolrZkClient.makePath makePath: /live_nodes
   [junit4]   2> 1906535 T4095 oasc.ZkController.createEphemeralLiveNode Register node as live in ZooKeeper:/live_nodes/127.0.0.1:52950_
   [junit4]   2> 1906543 T4095 oascc.SolrZkClient.makePath makePath: /live_nodes/127.0.0.1:52950_
   [junit4]   2> 1906558 T4095 oascc.SolrZkClient.makePath makePath: /overseer_elect/election
   [junit4]   2> 1906577 T4095 oascc.SolrZkClient.makePath makePath: /overseer_elect/leader
   [junit4]   2> 1906585 T4095 oasc.Overseer.start Overseer (id=90144558282178563-127.0.0.1:52950_-n_0000000000) starting
   [junit4]   2> 1906597 T4095 oascc.SolrZkClient.makePath makePath: /overseer/queue-work
   [junit4]   2> 1906618 T4119 oasc.OverseerCollectionProcessor.run Process current queue of collection creations
   [junit4]   2> 1906622 T4095 oascc.SolrZkClient.makePath makePath: /clusterstate.json
   [junit4]   2> 1906632 T4095 oascc.SolrZkClient.makePath makePath: /aliases.json
   [junit4]   2> 1906638 T4095 oascc.ZkStateReader.createClusterStateWatchersAndUpdate Updating cluster state from ZooKeeper... 
   [junit4]   2> 1906650 T4118 oasc.Overseer$ClusterStateUpdater.run Starting to work on the main queue
   [junit4]   2> 1906655 T4095 oasc.CorePropertiesLocator.discover Looking for core definitions underneath /Users/jenkins/jenkins-slave/workspace/Lucene-Solr-4.x-MacOSX/solr/build/solr-core/test/J0/./org.apache.solr.cloud.CollectionsAPIDistributedZkTest-controljetty-1375496800275
   [junit4]   2> 1906812 T4095 oasc.CorePropertiesLocator.discoverUnder Found core conf in /Users/jenkins/jenkins-slave/workspace/Lucene-Solr-4.x-MacOSX/solr/build/solr-core/test/J0/./org.apache.solr.cloud.CollectionsAPIDistributedZkTest-controljetty-1375496800275/conf/
   [junit4]   2> 1906820 T4095 oasc.CorePropertiesLocator.discover Found 1 core definitions
   [junit4]   2> 1906822 T4095 oass.SolrDispatchFilter.init user.dir=/Users/jenkins/jenkins-slave/workspace/Lucene-Solr-4.x-MacOSX/solr/build/solr-core/test/J0
   [junit4]   2> 1906827 T4095 oass.SolrDispatchFilter.init SolrDispatchFilter.init() done
   [junit4]   2> 1906831 T4095 oascsi.HttpClientUtil.createClient Creating new http client, config:maxConnections=128&maxConnectionsPerHost=32&followRedirects=false
   [junit4]   2> 1906912 T4095 oascsi.HttpClientUtil.createClient Creating new http client, config:
   [junit4]   2> 1906919 T4095 oascc.ConnectionManager.waitForConnected Waiting for client to connect to ZooKeeper
   [junit4]   2> 1906926 T4122 oascc.ConnectionManager.process Watcher org.apache.solr.common.cloud.ConnectionManager@1e3566c3 name:ZooKeeperConnection Watcher:127.0.0.1:52947/solr got event WatchedEvent state:SyncConnected type:None path:null path:null type:None
   [junit4]   2> 1906927 T4095 oascc.ConnectionManager.waitForConnected Client is connected to ZooKeeper
   [junit4]   2> 1906938 T4095 oascc.ZkStateReader.createClusterStateWatchersAndUpdate Updating cluster state from ZooKeeper... 
   [junit4]   2> 1906958 T4095 oasc.ChaosMonkey.monkeyLog monkey: init - expire sessions:true cause connection loss:true
   [junit4]   2> 1907519 T4095 oejs.Server.doStart jetty-8.1.10.v20130312
   [junit4]   2> 1907527 T4095 oejs.AbstractConnector.doStart Started SelectChannelConnector@127.0.0.1:52954
   [junit4]   2> 1907528 T4095 oass.SolrDispatchFilter.init SolrDispatchFilter.init()
   [junit4]   2> 1907528 T4095 oasc.SolrResourceLoader.locateSolrHome JNDI not configured for solr (NoInitialContextEx)
   [junit4]   2> 1907529 T4095 oasc.SolrResourceLoader.locateSolrHome using system property solr.solr.home: /Users/jenkins/jenkins-slave/workspace/Lucene-Solr-4.x-MacOSX/solr/build/solr-core/test/J0/./org.apache.solr.cloud.CollectionsAPIDistributedZkTest-jetty1-1375496801663
   [junit4]   2> 1907529 T4095 oasc.SolrResourceLoader.<init> new SolrResourceLoader for directory: '/Users/jenkins/jenkins-slave/workspace/Lucene-Solr-4.x-MacOSX/solr/build/solr-core/test/J0/./org.apache.solr.cloud.CollectionsAPIDistributedZkTest-jetty1-1375496801663/'
   [junit4]   2> 1907575 T4095 oasc.ConfigSolr.fromFile Loading container configuration from /Users/jenkins/jenkins-slave/workspace/Lucene-Solr-4.x-MacOSX/solr/build/solr-core/test/J0/./org.apache.solr.cloud.CollectionsAPIDistributedZkTest-jetty1-1375496801663/solr.xml
   [junit4]   2> 1907637 T4095 oasc.ConfigSolrXml.<init> Config-defined core root directory: 
   [junit4]   2> 1907637 T4095 oasc.CoreContainer.<init> New CoreContainer 667124370
   [junit4]   2> 1907638 T4095 oasc.CoreContainer.load Loading cores into CoreContainer [instanceDir=/Users/jenkins/jenkins-slave/workspace/Lucene-Solr-4.x-MacOSX/solr/build/solr-core/test/J0/./org.apache.solr.cloud.CollectionsAPIDistributedZkTest-jetty1-1375496801663/]
   [junit4]   2> 1907640 T4095 oashc.HttpShardHandlerFactory.getParameter Setting socketTimeout to: 120000
   [junit4]   2> 1907640 T4095 oashc.HttpShardHandlerFactory.getParameter Setting urlScheme to: http://
   [junit4]   2> 1907641 T4095 oashc.HttpShardHandlerFactory.getParameter Setting connTimeout to: 15000
   [junit4]   2> 1907642 T4095 oashc.HttpShardHandlerFactory.getParameter Setting maxConnectionsPerHost to: 20
   [junit4]   2> 1907642 T4095 oashc.HttpShardHandlerFactory.getParameter Setting corePoolSize to: 0
   [junit4]   2> 1907642 T4095 oashc.HttpShardHandlerFactory.getParameter Setting maximumPoolSize to: 2147483647
   [junit4]   2> 1907643 T4095 oashc.HttpShardHandlerFactory.getParameter Setting maxThreadIdleTime to: 5
   [junit4]   2> 1907644 T4095 oashc.HttpShardHandlerFactory.getParameter Setting sizeOfQueue to: -1
   [junit4]   2> 1907644 T4095 oashc.HttpShardHandlerFactory.getParameter Setting fairnessPolicy to: false
   [junit4]   2> 1907645 T4095 oascsi.HttpClientUtil.createClient Creating new http client, config:maxConnectionsPerHost=20&maxConnections=10000&socketTimeout=120000&connTimeout=15000&retry=false
   [junit4]   2> 1907683 T4095 oasc.ZkContainer.initZooKeeper Zookeeper client=127.0.0.1:52947/solr
   [junit4]   2> 1907684 T4095 oasc.ZkController.checkChrootPath zkHost includes chroot
   [junit4]   2> 1907686 T4095 oascc.ConnectionManager.waitForConnected Waiting for client to connect to ZooKeeper
   [junit4]   2> 1907691 T4133 oascc.ConnectionManager.process Watcher org.apache.solr.common.cloud.ConnectionManager@14b153a3 name:ZooKeeperConnection Watcher:127.0.0.1:52947 got event WatchedEvent state:SyncConnected type:None path:null path:null type:None
   [junit4]   2> 1907692 T4095 oascc.ConnectionManager.waitForConnected Client is connected to ZooKeeper
   [junit4]   2> 1907699 T4095 oascsi.HttpClientUtil.createClient Creating new http client, config:maxConnections=500&maxConnectionsPerHost=16&socketTimeout=120000&connTimeout=15000
   [junit4]   2> 1907740 T4095 oascc.ConnectionManager.waitForConnected Waiting for client to connect to ZooKeeper
   [junit4]   2> 1907747 T4135 oascc.ConnectionManager.process Watcher org.apache.solr.common.cloud.ConnectionManager@6b6813ad name:ZooKeeperConnection Watcher:127.0.0.1:52947/solr got event WatchedEvent state:SyncConnected type:None path:null path:null type:None
   [junit4]   2> 1907747 T4095 oascc.ConnectionManager.waitForConnected Client is connected to ZooKeeper
   [junit4]   2> 1907764 T4095 oascc.ZkStateReader.createClusterStateWatchersAndUpdate Updating cluster state from ZooKeeper... 
   [junit4]   2> 1908780 T4095 oasc.ZkController.createEphemeralLiveNode Register node as live in ZooKeeper:/live_nodes/127.0.0.1:52954_
   [junit4]   2> 1908784 T4095 oascc.SolrZkClient.makePath makePath: /live_nodes/127.0.0.1:52954_
   [junit4]   2> 1908799 T4135 oascc.ZkStateReader$3.process Updating live nodes... (2)
   [junit4]   2> 1908811 T4122 oascc.ZkStateReader$3.process Updating live nodes... (2)
   [junit4]   2> 1908811 T4117 oascc.ZkStateReader$3.process Updating live nodes... (2)
   [junit4]   2> 1908828 T4095 oasc.CorePropertiesLocator.discover Looking for core definitions underneath /Users/jenkins/jenkins-slave/workspace/Lucene-Solr-4.x-MacOSX/solr/build/solr-core/test/J0/./org.apache.solr.cloud.CollectionsAPIDistributedZkTest-jetty1-1375496801663
   [junit4]   2> 1909016 T4095 oasc.CorePropertiesLocator.discoverUnder Found core conf in /Users/jenkins/jenkins-slave/workspace/Lucene-Solr-4.x-MacOSX/solr/build/solr-core/test/J0/./org.apache.solr.cloud.CollectionsAPIDistributedZkTest-jetty1-1375496801663/conf/
   [junit4]   2> 1909024 T4095 oasc.CorePropertiesLocator.discover Found 1 core definitions
   [junit4]   2> 1909025 T4095 oass.SolrDispatchFilter.init user.dir=/Users/jenkins/jenkins-slave/workspace/Lucene-Solr-4.x-MacOSX/solr/build/solr-core/test/J0
   [junit4]   2> 1909026 T4095 oass.SolrDispatchFilter.init SolrDispatchFilter.init() done
   [junit4]   2> 1909027 T4095 oascsi.HttpClientUtil.createClient Creating new http client, config:maxConnections=128&maxConnectionsPerHost=32&followRedirects=false
   [junit4]   2> 1909544 T4095 oejs.Server.doStart jetty-8.1.10.v20130312
   [junit4]   2> 1909551 T4095 oejs.AbstractConnector.doStart Started SelectChannelConnector@127.0.0.1:52957
   [junit4]   2> 1909553 T4095 oass.SolrDispatchFilter.init SolrDispatchFilter.init()
   [junit4]   2> 1909554 T4095 oasc.SolrResourceLoader.locateSolrHome JNDI not configured for solr (NoInitialContextEx)
   [junit4]   2> 1909554 T4095 oasc.SolrResourceLoader.locateSolrHome using system property solr.solr.home: /Users/jenkins/jenkins-slave/workspace/Lucene-Solr-4.x-MacOSX/solr/build/solr-core/test/J0/./org.apache.solr.cloud.CollectionsAPIDistributedZkTest-jetty2-1375496803774
   [junit4]   2> 1909555 T4095 oasc.SolrResourceLoader.<init> new SolrResourceLoader for directory: '/Users/jenkins/jenkins-slave/workspace/Lucene-Solr-4.x-MacOSX/solr/build/solr-core/test/J0/./org.apache.solr.cloud.CollectionsAPIDistributedZkTest-jetty2-1375496803774/'
   [junit4]   2> 1909593 T4095 oasc.ConfigSolr.fromFile Loading container configuration from /Users/jenkins/jenkins-slave/workspace/Lucene-Solr-4.x-MacOSX/solr/build/solr-core/test/J0/./org.apache.solr.cloud.CollectionsAPIDistributedZkTest-jetty2-1375496803774/solr.xml
   [junit4]   2> 1909654 T4095 oasc.ConfigSolrXml.<init> Config-defined core root directory: 
   [junit4]   2> 1909654 T4095 oasc.CoreContainer.<init> New CoreContainer 1558560504
   [junit4]   2> 1909655 T4095 oasc.CoreContainer.load Loading cores into CoreContainer [instanceDir=/Users/jenkins/jenkins-slave/workspace/Lucene-Solr-4.x-MacOSX/solr/build/solr-core/test/J0/./org.apache.solr.cloud.CollectionsAPIDistributedZkTest-jetty2-1375496803774/]
   [junit4]   2> 1909657 T4095 oashc.HttpShardHandlerFactory.getParameter Setting socketTimeout to: 120000
   [junit4]   2> 1909657 T4095 oashc.HttpShardHandlerFactory.getParameter Setting urlScheme to: http://
   [junit4]   2> 1909658 T4095 oashc.HttpShardHandlerFactory.getParameter Setting connTimeout to: 15000
   [junit4]   2> 1909659 T4095 oashc.HttpShardHandlerFactory.getParameter Setting maxConnectionsPerHost to: 20
   [junit4]   2> 1909659 T4095 oashc.HttpShardHandlerFactory.getParameter Setting corePoolSize to: 0
   [junit4]   2> 1909660 T4095 oashc.HttpShardHandlerFactory.getParameter Setting maximumPoolSize to: 2147483647
   [junit4]   2> 1909660 T4095 oashc.HttpShardHandlerFactory.getParameter Setting maxThreadIdleTime to: 5
   [junit4]   2> 1909660 T4095 oashc.HttpShardHandlerFactory.getParameter Setting sizeOfQueue to: -1
   [junit4]   2> 1909661 T4095 oashc.HttpShardHandlerFactory.getParameter Setting fairnessPolicy to: false
   [junit4]   2> 1909661 T4095 oascsi.HttpClientUtil.createClient Creating new http client, config:maxConnectionsPerHost=20&maxConnections=10000&socketTimeout=120000&connTimeout=15000&retry=false
   [junit4]   2> 1909729 T4095 oasc.ZkContainer.initZooKeeper Zookeeper client=127.0.0.1:52947/solr
   [junit4]   2> 1909730 T4095 oasc.ZkController.checkChrootPath zkHost includes chroot
   [junit4]   2> 1909740 T4095 oascc.ConnectionManager.waitForConnected Waiting for client to connect to ZooKeeper
   [junit4]   2> 1909746 T4147 oascc.ConnectionManager.process Watcher org.apache.solr.common.cloud.ConnectionManager@6f5cbb6d name:ZooKeeperConnection Watcher:127.0.0.1:52947 got event WatchedEvent state:SyncConnected type:None path:null path:null type:None
   [junit4]   2> 1909747 T4095 oascc.ConnectionManager.waitForConnected Client is connected to ZooKeeper
   [junit4]   2> 1909753 T4095 oascsi.HttpClientUtil.createClient Creating new http client, config:maxConnections=500&maxConnectionsPerHost=16&socketTimeout=120000&connTimeout=15000
   [junit4]   2> 1909778 T4095 oascc.ConnectionManager.waitForConnected Waiting for client to connect to ZooKeeper
   [junit4]   2> 1909783 T4149 oascc.ConnectionManager.process Watcher org.apache.solr.common.cloud.ConnectionManager@16bcfc97 name:ZooKeeperConnection Watcher:127.0.0.1:52947/solr got event WatchedEvent state:SyncConnected type:None path:null path:null type:None
   [junit4]   2> 1909784 T4095 oascc.ConnectionManager.waitForConnected Client is connected to ZooKeeper
   [junit4]   2> 1909806 T4095 oascc.ZkStateReader.createClusterStateWatchersAndUpdate Updating cluster state from ZooKeeper... 
   [junit4]   2> 1910818 T4095 oasc.ZkController.createEphemeralLiveNode Register node as live in ZooKeeper:/live_nodes/127.0.0.1:52957_
   [junit4]   2> 1910821 T4095 oascc.SolrZkClient.makePath makePath: /live_nodes/127.0.0.1:52957_
   [junit4]   2> 1910835 T4117 oascc.ZkStateReader$3.process Updating live nodes... (3)
   [junit4]   2> 1910837 T4149 oascc.ZkStateReader$3.process Updating live nodes... (3)
   [junit4]   2> 1910837 T4122 oascc.ZkStateReader$3.process Updating live nodes... (3)
   [junit4]   2> 1910838 T4135 oascc.ZkStateReader$3.process Updating live nodes... (3)
   [junit4]   2> 1910857 T4095 oasc.CorePropertiesLocator.discover Looking for core definitions underneath /Users/jenkins/jenkins-slave/workspace/Lucene-Solr-4.x-MacOSX/solr/build/solr-core/test/J0/./org.apache.solr.cloud.CollectionsAPIDistributedZkTest-jetty2-1375496803774
   [junit4]   2> 1911015 T4095 oasc.CorePropertiesLocator.discoverUnder Found core conf in /Users/jenkins/jenkins-slave/workspace/Lucene-Solr-4.x-MacOSX/solr/build/solr-core/test/J0/./org.apache.solr.cloud.CollectionsAPIDistributedZkTest-jetty2-1375496803774/conf/
   [junit4]   2> 1911023 T4095 oasc.CorePropertiesLocator.discover Found 1 core definitions
   [junit4]   2> 1911024 T4095 oass.SolrDispatchFilter.init user.dir=/Users/jenkins/jenkins-slave/workspace/Lucene-Solr-4.x-MacOSX/solr/build/solr-core/test/J0
   [junit4]   2> 1911025 T4095 oass.SolrDispatchFilter.init SolrDispatchFilter.init() done
   [junit4]   2> 1911025 T4095 oascsi.HttpClientUtil.createClient Creating new http client, config:maxConnections=128&maxConnectionsPerHost=32&followRedirects=false
   [junit4]   2> 1911598 T4095 oejs.Server.doStart jetty-8.1.10.v20130312
   [junit4]   2> 1911606 T4095 oejs.AbstractConnector.doStart Started SelectChannelConnector@127.0.0.1:52960
   [junit4]   2> 1911609 T4095 oass.SolrDispatchFilter.init SolrDispatchFilter.init()
   [junit4]   2> 1911610 T4095 oasc.SolrResourceLoader.locateSolrHome JNDI not configured for solr (NoInitialContextEx)
   [junit4]   2> 1911611 T4095 oasc.SolrResourceLoader.locateSolrHome using system property solr.solr.home: /Users/jenkins/jenkins-slave/workspace/Lucene-Solr-4.x-MacOSX/solr/build/solr-core/test/J0/./org.apache.solr.cloud.CollectionsAPIDistributedZkTest-jetty3-1375496805766
   [junit4]   2> 1911612 T4095 oasc.SolrResourceLoader.<init> new SolrResourceLoader for directory: '/Users/jenkins/jenkins-slave/workspace/Lucene-Solr-4.x-MacOSX/solr/build/solr-core/test/J0/./org.apache.solr.cloud.CollectionsAPIDistributedZkTest-jetty3-1375496805766/'
   [junit4]   2> 1911698 T4095 oasc.ConfigSolr.fromFile Loading container configuration from /Users/jenkins/jenkins-slave/workspace/Lucene-Solr-4.x-MacOSX/solr/build/solr-core/test/J0/./org.apache.solr.cloud.CollectionsAPIDistributedZkTest-jetty3-1375496805766/solr.xml
   [junit4]   2> 1911760 T4095 oasc.ConfigSolrXml.<init> Config-defined core root directory: 
   [junit4]   2> 1911761 T4095 oasc.CoreContainer.<init> New CoreContainer 1855168441
   [junit4]   2> 1911762 T4095 oasc.CoreContainer.load Loading cores into CoreContainer [instanceDir=/Users/jenkins/jenkins-slave/workspace/Lucene-Solr-4.x-MacOSX/solr/build/solr-core/test/J0/./org.apache.solr.cloud.CollectionsAPIDistributedZkTest-jetty3-1375496805766/]
   [junit4]   2> 1911763 T4095 oashc.HttpShardHandlerFactory.getParameter Setting socketTimeout to: 120000
   [junit4]   2> 1911764 T4095 oashc.HttpShardHandlerFactory.getParameter Setting urlScheme to: http://
   [junit4]   2> 1911764 T4095 oashc.HttpShardHandlerFactory.getParameter Setting connTimeout to: 15000
   [junit4]   2> 1911767 T4095 oashc.HttpShardHandlerFactory.getParameter Setting maxConnectionsPerHost to: 20
   [junit4]   2> 1911771 T4095 oashc.HttpShardHandlerFactory.getParameter Setting corePoolSize to: 0
   [junit4]   2> 1911771 T4095 oashc.HttpShardHandlerFactory.getParameter Setting maximumPoolSize to: 2147483647
   [junit4]   2> 1911772 T4095 oashc.HttpShardHandlerFactory.getParameter Setting maxThreadIdleTime to: 5
   [junit4]   2> 1911772 T4095 oashc.HttpShardHandlerFactory.getParameter Setting sizeOfQueue to: -1
   [junit4]   2> 1911773 T4095 oashc.HttpShardHandlerFactory.getParameter Setting fairnessPolicy to: false
   [junit4]   2> 1911773 T4095 oascsi.HttpClientUtil.createClient Creating new http client, config:maxConnectionsPerHost=20&maxConnections=10000&socketTimeout=120000&connTimeout=15000&retry=false
   [junit4]   2> 1911808 T4095 oasc.ZkContainer.initZooKeeper Zookeeper client=127.0.0.1:52947/solr
   [junit4]   2> 1911809 T4095 oasc.ZkController.checkChrootPath zkHost includes chroot
   [junit4]   2> 1911812 T4095 oascc.ConnectionManager.waitForConnected Waiting for client to connect to ZooKeeper
   [junit4]   2> 1911817 T4161 oascc.ConnectionManager.process Watcher org.apache.solr.common.cloud.ConnectionManager@1ddb6366 name:ZooKeeperConnection Watcher:127.0.0.1:52947 got event WatchedEvent state:SyncConnected type:None path:null path:null type:None
   [junit4]   2> 1911817 T4095 oascc.ConnectionManager.waitForConnected Client is connected to ZooKeeper
   [junit4]   2> 1911823 T4095 oascsi.HttpClientUtil.createClient Creating new http client, config:maxConnections=500&maxConnectionsPerHost=16&socketTimeout=120000&connTimeout=15000
   [junit4]   2> 1911859 T4095 oascc.ConnectionManager.waitForConnected Waiting for client to connect to ZooKeeper
   [junit4]   2> 1911864 T4163 oascc.ConnectionManager.process Watcher org.apache.solr.common.cloud.ConnectionManager@1bcab62f name:ZooKeeperConnection Watcher:127.0.0.1:52947/solr got event WatchedEvent state:SyncConnected type:None path:null path:null type:None
   [junit4]   2> 1911864 T4095 oascc.ConnectionManager.waitForConnected Client is connected to ZooKeeper
   [junit4]   2> 1911881 T4095 oascc.ZkStateReader.createClusterStateWatchersAndUpdate Updating cluster state from ZooKeeper... 
   [junit4]   2> 1912894 T4095 oasc.ZkController.createEphemeralLiveNode Register node as live in ZooKeeper:/live_nodes/127.0.0.1:52960_
   [junit4]   2> 1912897 T4095 oascc.SolrZkClient.makePath makePath: /live_nodes/127.0.0.1:52960_
   [junit4]   2> 1912912 T4149 oascc.ZkStateReader$3.process Updating live nodes... (4)
   [junit4]   2> 1912918 T4117 oascc.ZkStateReader$3.process Updating live nodes... (4)
   [junit4]   2> 1912919 T4135 oascc.ZkStateReader$3.process Updating live nodes... (4)
   [junit4]   2> 1912920 T4163 oascc.ZkStateReader$3.process Updating live nodes... (4)
   [junit4]   2> 1912921 T4122 oascc.ZkStateReader$3.process Updating live nodes... (4)
   [junit4]   2> 1912933 T4095 oasc.CorePropertiesLocator.discover Looking for core definitions underneath /Users/jenkins/jenkins-slave/workspace/Lucene-Solr-4.x-MacOSX/solr/build/solr-core/test/J0/./org.apache.solr.cloud.CollectionsAPIDistributedZkTest-jetty3-1375496805766
   [junit4]   2> 1913151 T4095 oasc.CorePropertiesLocator.discoverUnder Found core conf in /Users/jenkins/jenkins-slave/workspace/Lucene-Solr-4.x-MacOSX/solr/build/solr-core/test/J0/./org.apache.solr.cloud.CollectionsAPIDistributedZkTest-jetty3-1375496805766/conf/
   [junit4]   2> 1913162 T4095 oasc.CorePropertiesLocator.discover Found 1 core definitions
   [junit4]   2> 1913165 T4095 oass.SolrDispatchFilter.init user.dir=/Users/jenkins/jenkins-slave/workspace/Lucene-Solr-4.x-MacOSX/solr/build/solr-core/test/J0
   [junit4]   2> 1913166 T4095 oass.SolrDispatchFilter.init SolrDispatchFilter.init() done
   [junit4]   2> 1913167 T4095 oascsi.HttpClientUtil.createClient Creating new http client, config:maxConnections=128&maxConnectionsPerHost=32&followRedirects=false
   [junit4]   2> 1913799 T4095 oejs.Server.doStart jetty-8.1.10.v20130312
   [junit4]   2> 1913812 T4095 oejs.AbstractConnector.doStart Started SelectChannelConnector@127.0.0.1:52963
   [junit4]   2> 1913815 T4095 oass.SolrDispatchFilter.init SolrDispatchFilter.init()
   [junit4]   2> 1913817 T4095 oasc.SolrResourceLoader.locateSolrHome JNDI not configured for solr (NoInitialContextEx)
   [junit4]   2> 1913818 T4095 oasc.SolrResourceLoader.locateSolrHome using system property solr.solr.home: /Users/jenkins/jenkins-slave/workspace/Lucene-Solr-4.x-MacOSX/solr/build/solr-core/test/J0/./org.apache.solr.cloud.CollectionsAPIDistributedZkTest-jetty4-1375496807921
   [junit4]   2> 1913819 T4095 oasc.SolrResourceLoader.<init> new SolrResourceLoader for directory: '/Users/jenkins/jenkins-slave/workspace/Lucene-Solr-4.x-MacOSX/solr/build/solr-core/test/J0/./org.apache.solr.cloud.CollectionsAPIDistributedZkTest-jetty4-1375496807921/'
   [junit4]   2> 1913874 T4095 oasc.ConfigSolr.fromFile Loading container configuration from /Users/jenkins/jenkins-slave/workspace/Lucene-Solr-4.x-MacOSX/solr/build/solr-core/test/J0/./org.apache.solr.cloud.CollectionsAPIDistributedZkTest-jetty4-1375496807921/solr.xml
   [junit4]   2> 1913955 T4095 oasc.ConfigSolrXml.<init> Config-defined core root directory: 
   [junit4]   2> 1913956 T4095 oasc.CoreContainer.<init> New CoreContainer 1944274233
   [junit4]   2> 1913956 T4095 oasc.CoreContainer.load Loading cores into CoreContainer [instanceDir=/Users/jenkins/jenkins-slave/workspace/Lucene-Solr-4.x-MacOSX/solr/build/solr-core/test/J0/./org.apache.solr.cloud.CollectionsAPIDistributedZkTest-jetty4-1375496807921/]
   [junit4]   2> 1913958 T4095 oashc.HttpShardHandlerFactory.getParameter Setting socketTimeout to: 120000
   [junit4]   2> 1913958 T4095 oashc.HttpShardHandlerFactory.getParameter Setting urlScheme to: http://
   [junit4]   2> 1913959 T4095 oashc.HttpShardHandlerFactory.getParameter Setting connTimeout to: 15000
   [junit4]   2> 1913959 T4095 oashc.HttpShardHandlerFactory.getParameter Setting maxConnectionsPerHost to: 20
   [junit4]   2> 1913960 T4095 oashc.HttpShardHandlerFactory.getParameter Setting corePoolSize to: 0
   [junit4]   2> 1913960 T4095 oashc.HttpShardHandlerFactory.getParameter Setting maximumPoolSize to: 2147483647
   [junit4]   2> 1913962 T4095 oashc.HttpShardHandlerFactory.getParameter Setting maxThreadIdleTime to: 5
   [junit4]   2> 1913962 T4095 oashc.HttpShardHandlerFactory.getParameter Setting sizeOfQueue to: -1
   [junit4]   2> 1913962 T4095 oashc.HttpShardHandlerFactory.getParameter Setting fairnessPolicy to: false
   [junit4]   2> 1913963 T4095 oascsi.HttpClientUtil.createClient Creating new http client, config:maxConnectionsPerHost=20&maxConnections=10000&socketTimeout=120000&connTimeout=15000&retry=false
   [junit4]   2> 1913998 T4095 oasc.ZkContainer.initZooKeeper Zookeeper client=127.0.0.1:52947/solr
   [junit4]   2> 1913999 T4095 oasc.ZkController.checkChrootPath zkHost includes chroot
   [junit4]   2> 1914001 T4095 oascc.ConnectionManager.waitForConnected Waiting for client to connect to ZooKeeper
   [junit4]   2> 1914019 T4175 oascc.ConnectionManager.process Watcher org.apache.solr.common.cloud.ConnectionManager@4dd5dc9f name:ZooKeeperConnection Watcher:127.0.0.1:52947 got event WatchedEvent state:SyncConnected type:None path:null path:null type:None
   [junit4]   2> 1914019 T4095 oascc.ConnectionManager.waitForConnected Client is connected to ZooKeeper
   [junit4]   2> 1914026 T4095 oascsi.HttpClientUtil.createClient Creating new http client, config:maxConnections=500&maxConnectionsPerHost=16&socketTimeout=120000&connTimeout=15000
   [junit4]   2> 1914063 T4095 oascc.ConnectionManager.waitForConnected Waiting for client to connect to ZooKeeper
   [junit4]   2> 1914070 T4177 oascc.ConnectionManager.process Watcher org.apache.solr.common.cloud.ConnectionManager@4862678f name:ZooKeeperConnection Watcher:127.0.0.1:52947/solr got event WatchedEvent state:SyncConnected type:None path:null path:null type:None
   [junit4]   2> 1914071 T4095 oascc.ConnectionManager.waitForConnected Client is connected to ZooKeeper
   [junit4]   2> 1914089 T4095 oascc.ZkStateReader.createClusterStateWatchersAndUpdate Updating cluster state from ZooKeeper... 
   [junit4]   2> 1915106 T4095 oasc.ZkController.createEphemeralLiveNode Register node as live in ZooKeeper:/live_nodes/127.0.0.1:52963_
   [junit4]   2> 1915110 T4095 oascc.SolrZkClient.makePath makePath: /live_nodes/127.0.0.1:52963_
   [junit4]   2> 1915145 T4163 oascc.ZkStateReader$3.process Updating live nodes... (5)
   [junit4]   2> 1915146 T4122 oascc.ZkStateReader$3.process Updating live nodes... (5)
   [junit4]   2> 1915148 T4149 oascc.ZkStateReader$3.process Updating live nodes... (5)
   [junit4]   2> 1915147 T4117 oascc.ZkStateReader$3.process Updating live nodes... (5)
   [junit4]   2> 1915149 T4135 oascc.ZkStateReader$3.process Updating live nodes... (5)
   [junit4]   2> 1915149 T4177 oascc.ZkStateReader$3.process Updating live nodes... (5)
   [junit4]   2> 1915164 T4095 oasc.CorePropertiesLocator.discover Looking for core definitions underneath /Users/jenkins/jenkins-slave/workspace/Lucene-Solr-4.x-MacOSX/solr/build/solr-core/test/J0/./org.apache.solr.cloud.CollectionsAPIDistributedZkTest-jetty4-1375496807921
   [junit4]   2> 1915382 T4095 oasc.CorePropertiesLocator.discoverUnder Found core conf in /Users/jenkins/jenkins-slave/workspace/Lucene-Solr-4.x-MacOSX/solr/build/solr-core/test/J0/./org.apache.solr.cloud.CollectionsAPIDistributedZkTest-jetty4-1375496807921/conf/
   [junit4]   2> 1915389 T4095 oasc.CorePropertiesLocator.discover Found 1 core definitions
   [junit4]   2> 1915390 T4095 oass.SolrDispatchFilter.init user.dir=/Users/jenkins/jenkins-slave/workspace/Lucene-Solr-4.x-MacOSX/solr/build/solr-core/test/J0
   [junit4]   2> 1915391 T4095 oass.SolrDispatchFilter.init SolrDispatchFilter.init() done
   [junit4]   2> 1915391 T4095 oascsi.HttpClientUtil.createClient Creating new http client, config:maxConnections=128&maxConnectionsPerHost=32&followRedirects=false
   [junit4]   2> 1915434 T4095 oascsi.HttpClientUtil.createClient Creating new http client, config:maxConnections=128&maxConnectionsPerHost=32&followRedirects=false
   [junit4]   2> 1915478 T4126 oasha.CollectionsHandler.handleCreateAction Creating Collection : numShards=2&name=nodes_used_collection&replicationFactor=2&action=CREATE&wt=javabin&version=2
   [junit4]   2> 1915482 T4117 oasc.DistributedQueue$LatchChildWatcher.process Watcher fired on path: /overseer/collection-queue-work state: SyncConnected type NodeChildrenChanged
   [junit4]   2> 1915490 T4117 oasc.DistributedQueue$LatchChildWatcher.process Watcher fired on path: /overseer/collection-queue-work state: SyncConnected type NodeChildrenChanged
   [junit4]   2> 1915491 T4119 oasc.OverseerCollectionProcessor.run Overseer Collection Processor: Get the message id:/overseer/collection-queue-work/qn-0000000000 message:{
   [junit4]   2> 	  "operation":"createcollection",
   [junit4]   2> 	  "numShards":"2",
   [junit4]   2> 	  "name":"nodes_used_collection",
   [junit4]   2> 	  "replicationFactor":"2"}
   [junit4]   2> 1915491 T4119 oasc.OverseerCollectionProcessor.processMessage WARN OverseerCollectionProcessor.processMessage : createcollection , {
   [junit4]   2> 	  "operation":"createcollection",
   [junit4]   2> 	  "numShards":"2",
   [junit4]   2> 	  "name":"nodes_used_collection",
   [junit4]   2> 	  "replicationFactor":"2"}
   [junit4]   2> 1915720 T4118 oascc.ZkStateReader.updateClusterState Updating cloud state from ZooKeeper... 
   [junit4]   2> 1915724 T4118 oasc.Overseer$ClusterStateUpdater.buildCollection building a new collection: nodes_used_collection
   [junit4]   2> 1915724 T4118 oasc.Overseer$ClusterStateUpdater.createCollection Create collection nodes_used_collection with shards [shard1, shard2]
   [junit4]   2> 1915750 T4122 oascc.ZkStateReader$2.process A cluster state change: WatchedEvent state:SyncConnected type:NodeDataChanged path:/clusterstate.json, has occurred - updating... (live nodes size: 5)
   [junit4]   2> 1915751 T4177 oascc.ZkStateReader$2.process A cluster state change: WatchedEvent state:SyncConnected type:NodeDataChanged path:/clusterstate.json, has occurred - updating... (live nodes size: 5)
   [junit4]   2> 1915751 T4163 oascc.ZkStateReader$2.process A cluster state change: WatchedEvent state:SyncConnected type:NodeDataChanged path:/clusterstate.json, has occurred - updating... (live nodes size: 5)
   [junit4]   2> 1915751 T4149 oascc.ZkStateReader$2.process A cluster state change: WatchedEvent state:SyncConnected type:NodeDataChanged path:/clusterstate.json, has occurred - updating... (live nodes size: 5)
   [junit4]   2> 1915751 T4117 oascc.ZkStateReader$2.process A cluster state change: WatchedEvent state:SyncConnected type:NodeDataChanged path:/clusterstate.json, has occurred - updating... (live nodes size: 5)
   [junit4]   2> 1915751 T4135 oascc.ZkStateReader$2.process A cluster state change: WatchedEvent state:SyncConnected type:NodeDataChanged path:/clusterstate.json, has occurred - updating... (live nodes size: 5)
   [junit4]   2> 1915804 T4119 oasc.OverseerCollectionProcessor.createCollection going to create cores replicas shardNames [shard1, shard2] , repFactor : 2
   [junit4]   2> 1915807 T4119 oasc.OverseerCollectionProcessor.createCollection Creating shard nodes_used_collection_shard1_replica1 as part of slice shard1 of collection nodes_used_collection on 127.0.0.1:52963_
   [junit4]   2> 1915808 T4119 oasc.OverseerCollectionProcessor.createCollection Creating shard nodes_used_collection_shard1_replica2 as part of slice shard1 of collection nodes_used_collection on 127.0.0.1:52957_
   [junit4]   2> 1915822 T4119 oasc.OverseerCollectionProcessor.createCollection Creating shard nodes_used_collection_shard2_replica1 as part of slice shard2 of collection nodes_used_collection on 127.0.0.1:52950_
   [junit4]   2> 1915827 T4119 oasc.OverseerCollectionProcessor.createCollection Creating shard nodes_used_collection_shard2_replica2 as part of slice shard2 of collection nodes_used_collection on 127.0.0.1:52954_
   [junit4]   2> 1915834 T4113 oasc.ZkController.publish publishing core=nodes_used_collection_shard2_replica1 state=down
   [junit4]   2> 1915844 T4143 oasc.ZkController.publish publishing core=nodes_used_collection_shard1_replica2 state=down
   [junit4]   2> 1915856 T4173 oasc.ZkController.publish publishing core=nodes_used_collection_shard1_replica1 state=down
   [junit4]   2> 1915863 T4127 oasc.ZkController.publish publishing core=nodes_used_collection_shard2_replica2 state=down
   [junit4]   2> 1915866 T4113 oasc.ZkController.waitForCoreNodeName look for our core node name
   [junit4]   2> 1915867 T4143 oasc.ZkController.waitForCoreNodeName look for our core node name
   [junit4]   2> 1915869 T4173 oasc.ZkController.waitForCoreNodeName look for our core node name
   [junit4]   2> 1915870 T4127 oasc.ZkController.waitForCoreNodeName look for our core node name
   [junit4]   2> 1917270 T4118 oascc.ZkStateReader.updateClusterState Updating cloud state from ZooKeeper... 
   [junit4]   2> 1917274 T4118 oasc.Overseer$ClusterStateUpdater.updateState WARN Could not find collection node for nodes_used_collection, skipping publish state
   [junit4]   2> 1917275 T4118 oasc.Overseer$ClusterStateUpdater.updateState Update state numShards=2 message={
   [junit4]   2> 	  "operation":"state",
   [junit4]   2> 	  "core_node_name":"core_node1",
   [junit4]   2> 	  "numShards":"2",
   [junit4]   2> 	  "shard":"shard2",
   [junit4]   2> 	  "roles":null,
   [junit4]   2> 	  "state":"down",
   [junit4]   2> 	  "shard_state":"active",
   [junit4]   2> 	  "core":"nodes_used_collection_shard2_replica1",
   [junit4]   2> 	  "collection":"nodes_used_collection",
   [junit4]   2> 	  "shard_range":null,
   [junit4]   2> 	  "node_name":"127.0.0.1:52950_",
   [junit4]   2> 	  "base_url":"http://127.0.0.1:52950"}
   [junit4]   2> 1917301 T4118 oasc.Overseer$ClusterStateUpdater.updateState WARN Could not find collection node for nodes_used_collection, skipping publish state
   [junit4]   2> 1917301 T4118 oasc.Overseer$ClusterStateUpdater.updateState Update state numShards=2 message={
   [junit4]   2> 	  "operation":"state",
   [junit4]   2> 	  "core_node_name":"core_node2",
   [junit4]   2> 	  "numShards":"2",
   [junit4]   2> 	  "shard":"shard1",
   [junit4]   2> 	  "roles":null,
   [junit4]   2> 	  "state":"down",
   [junit4]   2> 	  "shard_state":"active",
   [junit4]   2> 	  "core":"nodes_used_collection_shard1_replica2",
   [junit4]   2> 	  "collection":"nodes_used_collection",
   [junit4]   2> 	  "shard_range":null,
   [junit4]   2> 	  "node_name":"127.0.0.1:52957_",
   [junit4]   2> 	  "base_url":"http://127.0.0.1:52957"}
   [junit4]   2> 1917324 T4118 oasc.Overseer$ClusterStateUpdater.updateState WARN Could not find collection node for nodes_used_collection, skipping publish state
   [junit4]   2> 1917324 T4118 oasc.Overseer$ClusterStateUpdater.updateState Update state numShards=2 message={
   [junit4]   2> 	  "operation":"state",
   [junit4]   2> 	  "core_node_name":"core_node3",
   [junit4]   2> 	  "numShards":"2",
   [junit4]   2> 	  "shard":"shard1",
   [junit4]   2> 	  "roles":null,
   [junit4]   2> 	  "state":"down",
   [junit4]   2> 	  "shard_state":"active",
   [junit4]   2> 	  "core":"nodes_used_collection_shard1_replica1",
   [junit4]   2> 	  "collection":"nodes_used_collection",
   [junit4]   2> 	  "shard_range":null,
   [junit4]   2> 	  "node_name":"127.0.0.1:52963_",
   [junit4]   2> 	  "base_url":"http://127.0.0.1:52963"}
   [junit4]   2> 1917339 T4118 oasc.Overseer$ClusterStateUpdater.updateState WARN Could not find collection node for nodes_used_collection, skipping publish state
   [junit4]   2> 1917340 T4118 oasc.Overseer$ClusterStateUpdater.updateState Update state numShards=2 message={
   [junit4]   2> 	  "operation":"state",
   [junit4]   2> 	  "core_node_name":"core_node4",
   [junit4]   2> 	  "numShards":"2",
   [junit4]   2> 	  "shard":"shard2",
   [junit4]   2> 	  "roles":null,
   [junit4]   2> 	  "state":"down",
   [junit4]   2> 	  "shard_state":"active",
   [junit4]   2> 	  "core":"nodes_used_collection_shard2_replica2",
   [junit4]   2> 	  "collection":"nodes_used_collection",
   [junit4]   2> 	  "shard_range":null,
   [junit4]   2> 	  "node_name":"127.0.0.1:52954_",
   [junit4]   2> 	  "base_url":"http://127.0.0.1:52954"}
   [junit4]   2> 1917354 T4122 oascc.ZkStateReader$2.process A cluster state change: WatchedEvent state:SyncConnected type:NodeDataChanged path:/clusterstate.json, has occurred - updating... (live nodes size: 5)
   [junit4]   2> 1917354 T4135 oascc.ZkStateReader$2.process A cluster state change: WatchedEvent state:SyncConnected type:NodeDataChanged path:/clusterstate.json, has occurred - updating... (live nodes size: 5)
   [junit4]   2> 1917356 T4117 oascc.ZkStateReader$2.process A cluster state change: WatchedEvent state:SyncConnected type:NodeDataChanged path:/clusterstate.json, has occurred - updating... (live nodes size: 5)
   [junit4]   2> 1917357 T4163 oascc.ZkStateReader$2.process A cluster state change: WatchedEvent state:SyncConnected type:NodeDataChanged path:/clusterstate.json, has occurred - updating... (live nodes size: 5)
   [junit4]   2> 1917369 T4149 oascc.ZkStateReader$2.process A cluster state change: WatchedEvent state:SyncConnected type:NodeDataChanged path:/clusterstate.json, has occurred - updating... (live nodes size: 5)
   [junit4]   2> 1917370 T4177 oascc.ZkStateReader$2.process A cluster state change: WatchedEvent state:SyncConnected type:NodeDataChanged path:/clusterstate.json, has occurred - updating... (live nodes size: 5)
   [junit4]   2> 1917869 T4113 oasc.ZkController.waitForShardId waiting to find shard id in clusterstate for nodes_used_collection_shard2_replica1
   [junit4]   2> 1917871 T4113 oasc.CorePropertiesLocator.writePropertiesFile ERROR Couldn't persist core properties to /Users/jenkins/jenkins-slave/workspace/Lucene-Solr-4.x-MacOSX/solr/build/solr-core/test/J0/./org.apache.solr.cloud.CollectionsAPIDistributedZkTest-controljetty-1375496800275/nodes_used_collection_shard2_replica1/core.properties: java.io.FileNotFoundException: /Users/jenkins/jenkins-slave/workspace/Lucene-Solr-4.x-MacOSX/solr/build/solr-core/test/J0/./org.apache.solr.cloud.CollectionsAPIDistributedZkTest-controljetty-1375496800275/nodes_used_collection_shard2_replica1/core.properties (No such file or directory)
   [junit4]   2> 1917871 T4113 oasc.CoreContainer.create Creating SolrCore 'nodes_used_collection_shard2_replica1' using instanceDir: /Users/jenkins/jenkins-slave/workspace/Lucene-Solr-4.x-MacOSX/solr/build/solr-core/test/J0/./org.apache.solr.cloud.CollectionsAPIDistributedZkTest-controljetty-1375496800275/nodes_used_collection_shard2_replica1
   [junit4]   2> 1917872 T4113 oasc.ZkController.createCollectionZkNode Check for collection zkNode:nodes_used_collection
   [junit4]   2> 1917872 T4143 oasc.ZkController.waitForShardId waiting to find shard id in clusterstate for nodes_used_collection_shard1_replica2
   [junit4]   2> 1917873 T4143 oasc.CorePropertiesLocator.writePropertiesFile ERROR Couldn't persist core properties to /Users/jenkins/jenkins-slave/workspace/Lucene-Solr-4.x-MacOSX/solr/build/solr-core/test/J0/./org.apache.solr.cloud.CollectionsAPIDistributedZkTest-jetty2-1375496803774/nodes_used_collection_shard1_replica2/core.properties: java.io.FileNotFoundException: /Users/jenkins/jenkins-slave/workspace/Lucene-Solr-4.x-MacOSX/solr/build/solr-core/test/J0/./org.apache.solr.cloud.CollectionsAPIDistributedZkTest-jetty2-1375496803774/nodes_used_collection_shard1_replica2/core.properties (No such file or directory)
   [junit4]   2> 1917873 T4143 oasc.CoreContainer.create Creating SolrCore 'nodes_used_collection_shard1_replica2' using instanceDir: /Users/jenkins/jenkins-slave/workspace/Lucene-Solr-4.x-MacOSX/solr/build/solr-core/test/J0/./org.apache.solr.cloud.CollectionsAPIDistributedZkTest-jetty2-1375496803774/nodes_used_collection_shard1_replica2
   [junit4]   2> 1917874 T4143 oasc.ZkController.createCollectionZkNode Check for collection zkNode:nodes_used_collection
   [junit4]   2> 1917876 T4113 oasc.ZkController.createCollectionZkNode Creating collection in ZooKeeper:nodes_used_collection
   [junit4]   2> 1917877 T4113 oasc.ZkController.getConfName Looking for collection configName
   [junit4]   2> 1917880 T4173 oasc.ZkController.waitForShardId waiting to find shard id in clusterstate for nodes_used_collection_shard1_replica1
   [junit4]   2> 1917888 T4127 oasc.ZkController.waitForShardId waiting to find shard id in clusterstate for nodes_used_collection_shard2_replica2
   [junit4]   2> 1917882 T4113 oasc.ZkController.getConfName Only one config set found in zk - using it:conf1
   [junit4]   2> 1917889 T4113 oascc.SolrZkClient.makePath makePath: /collections/nodes_used_collection
   [junit4]   2> 1917890 T4127 oasc.CorePropertiesLocator.writePropertiesFile ERROR Couldn't persist core properties to /Users/jenkins/jenkins-slave/workspace/Lucene-Solr-4.x-MacOSX/solr/build/solr-core/test/J0/./org.apache.solr.cloud.CollectionsAPIDistributedZkTest-jetty1-1375496801663/nodes_used_collection_shard2_replica2/core.properties: java.io.FileNotFoundException: /Users/jenkins/jenkins-slave/workspace/Lucene-Solr-4.x-MacOSX/solr/build/solr-core/test/J0/./org.apache.solr.cloud.CollectionsAPIDistributedZkTest-jetty1-1375496801663/nodes_used_collection_shard2_replica2/core.properties (No such file or directory)
   [junit4]   2> 1917891 T4127 oasc.CoreContainer.create Creating SolrCore 'nodes_used_collection_shard2_replica2' using instanceDir: /Users/jenkins/jenkins-slave/workspace/Lucene-Solr-4.x-MacOSX/solr/build/solr-core/test/J0/./org.apache.solr.cloud.CollectionsAPIDistributedZkTest-jetty1-1375496801663/nodes_used_collection_shard2_replica2
   [junit4]   2> 1917891 T4127 oasc.ZkController.createCollectionZkNode Check for collection zkNode:nodes_used_collection
   [junit4]   2> 1917890 T4173 oasc.CorePropertiesLocator.writePropertiesFile ERROR Couldn't persist core properties to /Users/jenkins/jenkins-slave/workspace/Lucene-Solr-4.x-MacOSX/solr/build/solr-core/test/J0/./org.apache.solr.cloud.CollectionsAPIDistributedZkTest-jetty4-1375496807921/nodes_used_collection_shard1_replica1/core.properties: java.io.FileNotFoundException: /Users/jenkins/jenkins-slave/workspace/Lucene-Solr-4.x-MacOSX/solr/build/solr-core/test/J0/./org.apache.solr.cloud.CollectionsAPIDistributedZkTest-jetty4-1375496807921/nodes_used_collection_shard1_replica1/core.properties (No such file or directory)
   [junit4]   2> 1917892 T4173 oasc.CoreContainer.create Creating SolrCore 'nodes_used_collection_shard1_replica1' using instanceDir: /Users/jenkins/jenkins-slave/workspace/Lucene-Solr-4.x-MacOSX/solr/build/solr-core/test/J0/./org.apache.solr.cloud.CollectionsAPIDistributedZkTest-jetty4-1375496807921/nodes_used_collection_shard1_replica1
   [junit4]   2> 1917893 T4173 oasc.ZkController.createCollectionZkNode Check for collection zkNode:nodes_used_collection
   [junit4]   2> 1917895 T4127 oasc.ZkController.createCollectionZkNode Creating collection in ZooKeeper:nodes_used_collection
   [junit4]   2> 1917896 T4127 oasc.ZkController.getConfName Looking for collection configName
   [junit4]   2> 1917898 T4143 oasc.ZkController.createCollectionZkNode Creating collection in ZooKeeper:nodes_used_collection
   [junit4]   2> 1917898 T4143 oasc.ZkController.getConfName Looking for collection configName
   [junit4]   2> 1917909 T4127 oasc.ZkController.getConfName Only one config set found in zk - using it:conf1
   [junit4]   2> 1917912 T4127 oascc.SolrZkClient.makePath makePath: /collections/nodes_used_collection
   [junit4]   2> 1917913 T4143 oasc.ZkController.getConfName Only one config set found in zk - using it:conf1
   [junit4]   2> 1917914 T4143 oascc.SolrZkClient.makePath makePath: /collections/nodes_used_collection
   [junit4]   2> 1917917 T4173 oasc.ZkController.createCollectionZkNode Creating collection in ZooKeeper:nodes_used_collection
   [junit4]   2> 1917918 T4173 oasc.ZkController.getConfName Looking for collection configName
   [junit4]   2> 1917930 T4127 oasc.ZkController.readConfigName Load collection config from:/collections/nodes_used_collection
   [junit4]   2> 1917935 T4143 oasc.ZkController.readConfigName Load collection config from:/collections/nodes_used_collection
   [junit4]   2> 1917943 T4113 oasc.ZkController.readConfigName Load collection config from:/collections/nodes_used_collection
   [junit4]   2> 1917944 T4143 oasc.SolrResourceLoader.<init> new SolrResourceLoader for directory: '/Users/jenkins/jenkins-slave/workspace/Lucene-Solr-4.x-MacOSX/solr/build/solr-core/test/J0/./org.apache.solr.cloud.CollectionsAPIDistributedZkTest-jetty2-1375496803774/nodes_used_collection_shard1_replica2/'
   [junit4]   2> 1917947 T4127 oasc.SolrResourceLoader.<init> new SolrResourceLoader for directory: '/Users/jenkins/jenkins-slave/workspace/Lucene-Solr-4.x-MacOSX/solr/build/solr-core/test/J0/./org.apache.solr.cloud.CollectionsAPIDistributedZkTest-jetty1-1375496801663/nodes_used_collection_shard2_replica2/'
   [junit4]   2> 1917949 T4173 oascc.SolrZkClient.makePath makePath: /collections/nodes_used_collection
   [junit4]   2> 1917964 T4113 oasc.SolrResourceLoader.<init> new SolrResourceLoader for directory: '/Users/jenkins/jenkins-slave/workspace/Lucene-Solr-4.x-MacOSX/solr/build/solr-core/test/J0/./org.apache.solr.cloud.CollectionsAPIDistributedZkTest-controljetty-1375496800275/nodes_used_collection_shard2_replica1/'
   [junit4]   2> 1917981 T4173 oasc.ZkController.readConfigName Load collection config from:/collections/nodes_used_collection
   [junit4]   2> 1917990 T4173 oasc.SolrResourceLoader.<init> new SolrResourceLoader for directory: '/Users/jenkins/jenkins-slave/workspace/Lucene-Solr-4.x-MacOSX/solr/build/solr-core/test/J0/./org.apache.solr.cloud.CollectionsAPIDistributedZkTest-jetty4-1375496807921/nodes_used_collection_shard1_replica1/'
   [junit4]   2> 1918171 T4127 oasc.SolrConfig.<init> Using Lucene MatchVersion: LUCENE_45
   [junit4]   2> 1918208 T4113 oasc.SolrConfig.<init> Using Lucene MatchVersion: LUCENE_45
   [junit4]   2> 1918211 T4143 oasc.SolrConfig.<init> Using Lucene MatchVersion: LUCENE_45
   [junit4]   2> 1918232 T4173 oasc.SolrConfig.<init> Using Lucene MatchVersion: LUCENE_45
   [junit4]   2> 1918348 T4127 oasc.SolrConfig.<init> Loaded SolrConfig: solrconfig.xml
   [junit4]   2> 1918357 T4127 oass.IndexSchema.readSchema Reading Solr Schema from schema.xml
   [junit4]   2> 1918418 T4127 oass.IndexSchema.readSchema [nodes_used_collection_shard2_replica2] Schema name=test
   [junit4]   2> 1918430 T4143 oasc.SolrConfig.<init> Loaded SolrConfig: solrconfig.xml
   [junit4]   2> 1918438 T4113 oasc.SolrConfig.<init> Loaded SolrConfig: solrconfig.xml
   [junit4]   2> 1918445 T4173 oasc.SolrConfig.<init> Loaded SolrConfig: solrconfig.xml
   [junit4]   2> 1918447 T4143 oass.IndexSchema.readSchema Reading Solr Schema from schema.xml
   [junit4]   2> 1918455 T4113 oass.IndexSchema.readSchema Reading Solr Schema from schema.xml
   [junit4]   2> 1918456 T4173 oass.IndexSchema.readSchema Reading Solr Schema from schema.xml
   [junit4]   2> 1918472 T4113 oass.IndexSchema.readSchema [nodes_used_collection_shard2_replica1] Schema name=test
   [junit4]   2> 1918495 T4143 oass.IndexSchema.readSchema [nodes_used_collection_shard1_replica2] Schema name=test
   [junit4]   2> 1918521 T4173 oass.IndexSchema.readSchema [nodes_used_collection_shard1_replica1] Schema name=test
   [junit4]   2> 1920814 T4143 oass.ByteField.init WARN ByteField is deprecated and will be removed in 5.0. You should use TrieIntField instead.
   [junit4]   2> 1920815 T4143 oass.ShortField.init WARN ShortField is deprecated and will be removed in 5.0. You should use TrieIntField instead.
   [junit4]   2> 1920816 T4143 oass.OpenExchangeRatesOrgProvider.init Initialized with rates=open-exchange-rates.json, refreshInterval=1440.
   [junit4]   2> 1920828 T4143 oass.IndexSchema.readSchema default search field in schema is text
   [junit4]   2> 1920831 T4143 oass.IndexSchema.readSchema unique key field: id
   [junit4]   2> 1920886 T4113 oass.ByteField.init WARN ByteField is deprecated and will be removed in 5.0. You should use TrieIntField instead.
   [junit4]   2> 1920887 T4113 oass.ShortField.init WARN ShortField is deprecated and will be removed in 5.0. You should use TrieIntField instead.
   [junit4]   2> 1920890 T4113 oass.OpenExchangeRatesOrgProvider.init Initialized with rates=open-exchange-rates.json, refreshInterval=1440.
   [junit4]   2> 1920923 T4113 oass.IndexSchema.readSchema default search field in schema is text
   [junit4]   2> 1920928 T4173 oass.ByteField.init WARN ByteField is deprecated and will be removed in 5.0. You should use TrieIntField instead.
   [junit4]   2> 1920929 T4173 oass.ShortField.init WARN ShortField is deprecated and will be removed in 5.0. You should use TrieIntField instead.
   [junit4]   2> 1920930 T4173 oass.OpenExchangeRatesOrgProvider.init Initialized with rates=open-exchange-rates.json, refreshInterval=1440.
   [junit4]   2> 1920935 T4113 oass.IndexSchema.readSchema unique key field: id
   [junit4]   2> 1920940 T4127 oass.ByteField.init WARN ByteField is deprecated and will be removed in 5.0. You should use TrieIntField instead.
   [junit4]   2> 1920945 T4127 oass.ShortField.init WARN ShortField is deprecated and will be removed in 5.0. You should use TrieIntField instead.
   [junit4]   2> 1920950 T4173 oass.IndexSchema.readSchema default search field in schema is text
   [junit4]   2> 1920950 T4127 oass.OpenExchangeRatesOrgProvider.init Initialized with rates=open-exchange-rates.json, refreshInterval=1440.
   [junit4]   2> 1920954 T4173 oass.IndexSchema.readSchema unique key field: id
   [junit4]   2> 1920969 T4127 oass.IndexSchema.readSchema default search field in schema is text
   [junit4]   2> 1920974 T4127 oass.IndexSchema.readSchema unique key field: id
   [junit4]   2> 1921056 T4143 oass.FileExchangeRateProvider.reload Reloading exchange rates from file currency.xml
   [junit4]   2> 1921074 T4143 oass.FileExchangeRateProvider.reload Reloading exchange rates from file currency.xml
   [junit4]   2> 1921081 T4113 oass.FileExchangeRateProvider.reload Reloading exchange rates from file currency.xml
   [junit4]   2> 1921086 T4173 oass.FileExchangeRateProvider.reload Reloading exchange rates from file currency.xml
   [junit4]   2> 1921102 T4143 oass.OpenExchangeRatesOrgProvider.reload Reloading exchange rates from open-exchange-rates.json
   [junit4]   2> 1921105 T4113 oass.FileExchangeRateProvider.reload Reloading exchange rates from file currency.xml
   [junit4]   2> 1921113 T4173 oass.FileExchangeRateProvider.reload Reloading exchange rates from file currency.xml
   [junit4]   2> 1921121 T4113 oass.OpenExchangeRatesOrgProvider.reload Reloading exchange rates from open-exchange-rates.json
   [junit4]   2> 1921128 T4143 oass.OpenExchangeRatesOrgProvider$OpenExchangeRates.<init> WARN Unknown key IMPORTANT NOTE
   [junit4]   2> 1921128 T4143 oass.OpenExchangeRatesOrgProvider$OpenExchangeRates.<init> WARN Expected key, got STRING
   [junit4]   2> 1921129 T4143 oass.OpenExchangeRatesOrgProvider.reload Reloading exchange rates from open-exchange-rates.json
   [junit4]   2> 1921135 T4113 oass.OpenExchangeRatesOrgProvider$OpenExchangeRates.<init> WARN Unknown key IMPORTANT NOTE
   [junit4]   2> 1921136 T4113 oass.OpenExchangeRatesOrgProvider$OpenExchangeRates.<init> WARN Expected key, got STRING
   [junit4]   2> 1921136 T4113 oass.OpenExchangeRatesOrgProvider.reload Reloading exchange rates from open-exchange-rates.json
   [junit4]   2> 1921131 T4173 oass.OpenExchangeRatesOrgProvider.reload Reloading exchange rates from open-exchange-rates.json
   [junit4]   2> 1921140 T4127 oass.FileExchangeRateProvider.reload Reloading exchange rates from file currency.xml
   [junit4]   2> 1921147 T4173 oass.OpenExchangeRatesOrgProvider$OpenExchangeRates.<init> WARN Unknown key IMPORTANT NOTE
   [junit4]   2> 1921147 T4173 oass.OpenExchangeRatesOrgProvider$OpenExchangeRates.<init> WARN Expected key, got STRING
   [junit4]   2> 1921148 T4173 oass.OpenExchangeRatesOrgProvider.reload Reloading exchange rates from open-exchange-rates.json
   [junit4]   2> 1921149 T4143 oass.OpenExchangeRatesOrgProvider$OpenExchangeRates.<init> WARN Unknown key IMPORTANT NOTE
   [junit4]   2> 1921149 T4143 oass.OpenExchangeRatesOrgProvider$OpenExchangeRates.<init> WARN Expected key, got STRING
   [junit4]   2> 1921150 T4143 oasc.SolrCore.initDirectoryFactory org.apache.solr.core.MockDirectoryFactory
   [junit4]   2> 1921150 T4113 oass.OpenExchangeRatesOrgProvider$OpenExchangeRates.<init> WARN Unknown key IMPORTANT NOTE
   [junit4]   2> 1921151 T4113 oass.OpenExchangeRatesOrgProvider$OpenExchangeRates.<init> WARN Expected key, got STRING
   [junit4]   2> 1921152 T4113 oasc.SolrCore.initDirectoryFactory org.apache.solr.core.MockDirectoryFactory
   [junit4]   2> 1921152 T4113 oasc.SolrCore.<init> [nodes_used_collection_shard2_replica1] Opening new SolrCore at /Users/jenkins/jenkins-slave/workspace/Lucene-Solr-4.x-MacOSX/solr/build/solr-core/test/J0/./org.apache.solr.cloud.CollectionsAPIDistributedZkTest-controljetty-1375496800275/nodes_used_collection_shard2_replica1/, dataDir=/Users/jenkins/jenkins-slave/workspace/Lucene-Solr-4.x-MacOSX/solr/build/solr-core/test/J0/./org.apache.solr.cloud.CollectionsAPIDistributedZkTest-controljetty-1375496800275//nodes_used_collection_shard2_replica1/data/
   [junit4]   2> 1921152 T4113 oasc.JmxMonitoredMap.<init> JMX monitoring is enabled. Adding Solr mbeans to JMX Server: com.sun.jmx.mbeanserver.JmxMBeanServer@58b51c29
   [junit4]   2> 1921154 T4113 oasc.CachingDirectoryFactory.get return new directory for /Users/jenkins/jenkins-slave/workspace/Lucene-Solr-4.x-MacOSX/solr/build/solr-core/test/J0/./org.apache.solr.cloud.CollectionsAPIDistributedZkTest-controljetty-1375496800275//nodes_used_collection_shard2_replica1/data
   [junit4]   2> 1921154 T4143 oasc.SolrCore.<init> [nodes_used_collection_shard1_replica2] Opening new SolrCore at /Users/jenkins/jenkins-slave/workspace/Lucene-Solr-4.x-MacOSX/solr/build/solr-core/test/J0/./org.apache.solr.cloud.CollectionsAPIDistributedZkTest-jetty2-1375496803774/nodes_used_collection_shard1_replica2/, dataDir=/Users/jenkins/jenkins-slave/workspace/Lucene-Solr-4.x-MacOSX/solr/build/solr-core/test/J0/./org.apache.solr.cloud.CollectionsAPIDistributedZkTest-jetty2-1375496803774//nodes_used_collection_shard1_replica2/data/
   [junit4]   2> 1921155 T4143 oasc.JmxMonitoredMap.<init> JMX monitoring is enabled. Adding Solr mbeans to JMX Server: com.sun.jmx.mbeanserver.JmxMBeanServer@58b51c29
   [junit4]   2> 1921156 T4143 oasc.CachingDirectoryFactory.get return new directory for /Users/jenkins/jenkins-slave/workspace/Lucene-Solr-4.x-MacOSX/solr/build/solr-core/test/J0/./org.apache.solr.cloud.CollectionsAPIDistributedZkTest-jetty2-1375496803774//nodes_used_collection_shard1_replica2/data
   [junit4]   2> 1921157 T4113 oasc.SolrCore.getNewIndexDir New index directory detected: old=null new=/Users/jenkins/jenkins-slave/workspace/Lucene-Solr-4.x-MacOSX/solr/build/solr-core/test/J0/./org.apache.solr.cloud.CollectionsAPIDistributedZkTest-controljetty-1375496800275//nodes_used_collection_shard2_replica1/data/index/
   [junit4]   2> 1921157 T4113 oasc.SolrCore.initIndex WARN [nodes_used_collection_shard2_replica1] Solr index directory '/Users/jenkins/jenkins-slave/workspace/Lucene-Solr-4.x-MacOSX/solr/build/solr-core/test/J0/./org.apache.solr.cloud.CollectionsAPIDistributedZkTest-controljetty-1375496800275/nodes_used_collection_shard2_replica1/data/index' doesn't exist. Creating new index...
   [junit4]   2> 1921159 T4143 oasc.SolrCore.getNewIndexDir New index directory detected: old=null new=/Users/jenkins/jenkins-slave/workspace/Lucene-Solr-4.x-MacOSX/solr/build/solr-core/test/J0/./org.apache.solr.cloud.CollectionsAPIDistributedZkTest-jetty2-1375496803774//nodes_used_collection_shard1_replica2/data/index/
   [junit4]   2> 1921159 T4143 oasc.SolrCore.initIndex WARN [nodes_used_collection_shard1_replica2] Solr index directory '/Users/jenkins/jenkins-slave/workspace/Lucene-Solr-4.x-MacOSX/solr/build/solr-core/test/J0/./org.apache.solr.cloud.CollectionsAPIDistributedZkTest-jetty2-1375496803774/nodes_used_collection_shard1_replica2/data/index' doesn't exist. Creating new index...
   [junit4]   2> 1921165 T4127 oass.FileExchangeRateProvider.reload Reloading exchange rates from file currency.xml
   [junit4]   2> 1921168 T4143 oasc.CachingDirectoryFactory.get return new directory for /Users/jenkins/jenkins-slave/workspace/Lucene-Solr-4.x-MacOSX/solr/build/solr-core/test/J0/./org.apache.solr.cloud.CollectionsAPIDistributedZkTest-jetty2-1375496803774//nodes_used_collection_shard1_replica2/data/index
   [junit4]   2> 1921168 T4173 oass.OpenExchangeRatesOrgProvider$OpenExchangeRates.<init> WARN Unknown key IMPORTANT NOTE
   [junit4]   2> 1921169 T4173 oass.OpenExchangeRatesOrgProvider$OpenExchangeRates.<init> WARN Expected key, got STRING
   [junit4]   2> 1921170 T4173 oasc.SolrCore.initDirectoryFactory org.apache.solr.core.MockDirectoryFactory
   [junit4]   2> 1921170 T4173 oasc.SolrCore.<init> [nodes_used_collection_shard1_replica1] Opening new SolrCore at /Users/jenkins/jenkins-slave/workspace/Lucene-Solr-4.x-MacOSX/solr/build/solr-core/test/J0/./org.apache.solr.cloud.CollectionsAPIDistributedZkTest-jetty4-1375496807921/nodes_used_collection_shard1_replica1/, dataDir=/Users/jenkins/jenkins-slave/workspace/Lucene-Solr-4.x-MacOSX/solr/build/solr-core/test/J0/./org.apache.solr.cloud.CollectionsAPIDistributedZkTest-jetty4-1375496807921//nodes_used_collection_shard1_replica1/data/
   [junit4]   2> 1921170 T4173 oasc.JmxMonitoredMap.<init> JMX monitoring is enabled. Adding Solr mbeans to JMX Server: com.sun.jmx.mbeanserver.JmxMBeanServer@58b51c29
   [junit4]   2> 1921172 T4113 oasc.CachingDirectoryFactory.get return new directory for /Users/jenkins/jenkins-slave/workspace/Lucene-Solr-4.x-MacOSX/solr/build/solr-core/test/J0/./org.apache.solr.cloud.CollectionsAPIDistributedZkTest-controljetty-1375496800275//nodes_used_collection_shard2_replica1/data/index
   [junit4]   2> 1921172 T4173 oasc.CachingDirectoryFactory.get return new directory for /Users/jenkins/jenkins-slave/workspace/Lucene-Solr-4.x-MacOSX/solr/build/solr-core/test/J0/./org.apache.solr.cloud.CollectionsAPIDistributedZkTest-jetty4-1375496807921//nodes_used_collection_shard1_replica1/data
   [junit4]   2> 1921174 T4173 oasc.SolrCore.getNewIndexDir New index directory detected: old=null new=/Users/jenkins/jenkins-slave/workspace/Lucene-Solr-4.x-MacOSX/solr/build/solr-core/test/J0/./org.apache.solr.cloud.CollectionsAPIDistributedZkTest-jetty4-1375496807921//nodes_used_collection_shard1_replica1/data/index/
   [junit4]   2> 1921174 T4173 oasc.SolrCore.initIndex WARN [nodes_used_collection_shard1_replica1] Solr index directory '/Users/jenkins/jenkins-slave/workspace/Lucene-Solr-4.x-MacOSX/solr/build/solr-core/test/J0/./org.apache.solr.cloud.CollectionsAPIDistributedZkTest-jetty4-1375496807921/nodes_used_collection_shard1_replica1/data/index' doesn't exist. Creating new index...
   [junit4]   2> 1921175 T4173 oasc.CachingDirectoryFactory.get return new directory for /Users/jenkins/jenkins-slave/workspace/Lucene-Solr-4.x-MacOSX/solr/build/solr-core/test/J0/./org.apache.solr.cloud.CollectionsAPIDistributedZkTest-jetty4-1375496807921//nodes_used_collection_shard1_replica1/data/index
   [junit4]   2> 1921181 T4113 oasc.SolrDeletionPolicy.onCommit SolrDeletionPolicy.onCommit: commits: num=1
   [junit4]   2> 		commit{dir=MockDirWrapper(org.apache.lucene.store.RAMDirectory@178b28e7 lockFactory=org.apache.lucene.store.NativeFSLockFactory@5ecadecc),segFN=segments_1,generation=1}
   [junit4]   2> 1921182 T4113 oasc.SolrDeletionPolicy.updateCommits newest commit generation = 1
   [junit4]   2> 1921188 T4113 oasup.UpdateRequestProcessorChain.init inserting DistributedUpdateProcessorFactory into updateRequestProcessorChain "dedupe"
   [junit4]   2> 1921189 T4113 oasup.UpdateRequestProcessorChain.init inserting DistributedUpdateProcessorFactory into updateRequestProcessorChain "stored_sig"
   [junit4]   2> 1921190 T4113 oasup.UpdateRequestProcessorChain.init inserting DistributedUpdateProcessorFactory into updateRequestProcessorChain "distrib-dup-test-chain-implicit"
   [junit4]   2> 1921181 T4143 oasc.SolrDeletionPolicy.onCommit SolrDeletionPolicy.onCommit: commits: num=1
   [junit4]   2> 		commit{dir=MockDirWrapper(org.apache.lucene.store.RAMDirectory@635c073b lockFactory=org.apache.lucene.store.NativeFSLockFactory@241e5e2e),segFN=segments_1,generation=1}
   [junit4]   2> 1921191 T4143 oasc.SolrDeletionPolicy.updateCommits newest commit generation = 1
   [junit4]   2> 1921191 T4127 oass.OpenExchangeRatesOrgProvider.reload Reloading exchange rates from open-exchange-rates.json
   [junit4]   2> 1921191 T4113 oasc.RequestHandlers.initHandlersFromConfig created standard: solr.StandardRequestHandler
   [junit4]   2> 1921191 T4173 oasc.SolrDeletionPolicy.onCommit SolrDeletionPolicy.onCommit: commits: num=1
   [junit4]   2> 		commit{dir=MockDirWrapper(org.apache.lucene.store.RAMDirectory@2fd58f84 lockFactory=org.apache.lucene.store.NativeFSLockFactory@43f42672),segFN=segments_1,generation=1}
   [junit4]   2> 1921194 T4173 oasc.SolrDeletionPolicy.updateCommits newest commit generation = 1
   [junit4]   2> 1921202 T4113 oasc.RequestHandlers.initHandlersFromConfig created /get: solr.RealTimeGetHandler
   [junit4]   2> 1921203 T4113 oasc.RequestHandlers.initHandlersFromConfig adding lazy requestHandler: solr.ReplicationHandler
   [junit4]   2> 1921203 T4127 oass.OpenExchangeRatesOrgProvider$OpenExchangeRates.<init> WARN Unknown key IMPORTANT NOTE
   [junit4]   2> 1921206 T4127 oass.OpenExchangeRatesOrgProvider$OpenExchangeRates.<init> WARN Expected key, got STRING
   [junit4]   2> 1921206 T4127 oass.OpenExchangeRatesOrgProvider.reload Reloading exchange rates from open-exchange-rates.json
   [junit4]   2> 1921206 T4113 oasc.RequestHandlers.initHandlersFromConfig created /replication: solr.ReplicationHandler
   [junit4]   2> 1921208 T4113 oasc.RequestHandlers.initHandlersFromConfig created /update: solr.UpdateRequestHandler
   [junit4]   2> 1921209 T4113 oasc.RequestHandlers.initHandlersFromConfig created /admin/: org.apache.solr.handler.admin.AdminHandlers
   [junit4]   2> 1921206 T4143 oasup.UpdateRequestProcessorChain.init inserting DistributedUpdateProcessorFactory into updateRequestProcessorChain "dedupe"
   [junit4]   2> 1921242 T4143 oasup.UpdateRequestProcessorChain.init inserting DistributedUpdateProcessorFactory into updateRequestProcessorChain "stored_sig"
   [junit4]   2> 1921243 T4143 oasup.UpdateRequestProcessorChain.init inserting DistributedUpdateProcessorFactory into updateRequestProcessorChain "distrib-dup-test-chain-implicit"
   [junit4]   2> 1921244 T4143 oasc.RequestHandlers.initHandlersFromConfig created standard: solr.StandardRequestHandler
   [junit4]   2> 1921245 T4143 oasc.RequestHandlers.initHandlersFromConfig created /get: solr.RealTimeGetHandler
   [junit4]   2> 1921245 T4143 oasc.RequestHandlers.initHandlersFromConfig adding lazy requestHandler: solr.ReplicationHandler
   [junit4]   2> 1921246 T4143 oasc.RequestHandlers.initHandlersFromConfig created /replication: solr.ReplicationHandler
   [junit4]   2> 1921241 T4127 oass.OpenExchangeRatesOrgProvider$OpenExchangeRates.<init> WARN Unknown key IMPORTANT NOTE
   [junit4]   2> 1921247 T4127 oass.OpenExchangeRatesOrgProvider$OpenExchangeRates.<init> WARN Expected key, got STRING
   [junit4]   2> 1921248 T4127 oasc.SolrCore.initDirectoryFactory org.apache.solr.core.MockDirectoryFactory
   [junit4]   2> 1921248 T4127 oasc.SolrCore.<init> [nodes_used_collection_shard2_replica2] Opening new SolrCore at /Users/jenkins/jenkins-slave/workspace/Lucene-Solr-4.x-MacOSX/solr/build/solr-core/test/J0/./org.apache.solr.cloud.CollectionsAPIDistributedZkTest-jetty1-1375496801663/nodes_used_collection_shard2_replica2/, dataDir=/Users/jenkins/jenkins-slave/workspace/Lucene-Solr-4.x-MacOSX/solr/build/solr-core/test/J0/./org.apache.solr.cloud.CollectionsAPIDistributedZkTest-jetty1-1375496801663//nodes_used_collection_shard2_replica2/data/
   [junit4]   2> 1921249 T4127 oasc.JmxMonitoredMap.<init> JMX monitoring is enabled. Adding Solr mbeans to JMX Server: com.sun.jmx.mbeanserver.JmxMBeanServer@58b51c29
   [junit4]   2> 1921250 T4127 oasc.CachingDirectoryFactory.get return new directory for /Users/jenkins/jenkins-slave/workspace/Lucene-Solr-4.x-MacOSX/solr/build/solr-core/test/J0/./org.apache.solr.cloud.CollectionsAPIDistributedZkTest-jetty1-1375496801663//nodes_used_collection_shard2_replica2/data
   [junit4]   2> 1921241 T4113 oashl.XMLLoader.init xsltCacheLifetimeSeconds=60
   [junit4]   2> 1921235 T4173 oasup.UpdateRequestProcessorChain.init inserting DistributedUpdateProcessorFactory into updateRequestProcessorChain "dedupe"
   [junit4]   2> 1921257 T4173 oasup.UpdateRequestProcessorChain.init inserting DistributedUpdateProcessorFactory into updateRequestProcessorChain "stored_sig"
   [junit4]   2> 1921258 T4173 oasup.UpdateRequestProcessorChain.init inserting DistributedUpdateProcessorFactory into updateRequestProcessorChain "distrib-dup-test-chain-implicit"
   [junit4]   2> 1921259 T4173 oasc.RequestHandlers.initHandlersFromConfig created standard: solr.StandardRequestHandler
   [junit4]   2> 1921261 T4173 oasc.RequestHandlers.initHandlersFromConfig created /get: solr.RealTimeGetHandler
   [junit4]   2> 1921262 T4173 oasc.RequestHandlers.initHandlersFromConfig adding lazy requestHandler: solr.ReplicationHandler
   [junit4]   2> 1921262 T4173 oasc.RequestHandlers.initHandlersFromConfig created /replication: solr.ReplicationHandler
   [junit4]   2> 1921263 T4173 oasc.RequestHandlers.initHandlersFromConfig created /update: solr.UpdateRequestHandler
   [junit4]   2> 1921264 T4173 oasc.RequestHandlers.initHandlersFromConfig created /admin/: org.apache.solr.handler.admin.AdminHandlers
   [junit4]   2> 1921266 T4173 oashl.XMLLoader.init xsltCacheLifetimeSeconds=60
   [junit4]   2> 1921247 T4143 oasc.RequestHandlers.initHandlersFromConfig created /update: solr.UpdateRequestHandler
   [junit4]   2> 1921260 T4113 oass.SolrIndexSearcher.<init> Opening Searcher@5b059611 main
   [junit4]   2> 1921270 T4113 oasu.CommitTracker.<init> Hard AutoCommit: disabled
   [junit4]   2> 1921271 T4113 oasu.CommitTracker.<init> Soft AutoCommit: disabled
   [junit4]   2> 1921260 T4127 oasc.SolrCore.getNewIndexDir New index directory detected: old=null new=/Users/jenkins/jenkins-slave/workspace/Lucene-Solr-4.x-MacOSX/solr/build/solr-core/test/J0/./org.apache.solr.cloud.CollectionsAPIDistributedZkTest-jetty1-1375496801663//nodes_used_collection_shard2_replica2/data/index/
   [junit4]   2> 1921278 T4127 oasc.SolrCore.initIndex WARN [nodes_used_collection_shard2_replica2] Solr index directory '/Users/jenkins/jenkins-slave/workspace/Lucene-Solr-4.x-MacOSX/solr/build/solr-core/test/J0/./org.apache.solr.cloud.CollectionsAPIDistributedZkTest-jetty1-1375496801663/nodes_used_collection_shard2_replica2/data/index' doesn't exist. Creating new index...
   [junit4]   2> 1921267 T4143 oasc.RequestHandlers.initHandlersFromConfig created /admin/: org.apache.solr.handler.admin.AdminHandlers
   [junit4]   2> 1921280 T4143 oashl.XMLLoader.init xsltCacheLifetimeSeconds=60
   [junit4]   2> 1921281 T4127 oasc.CachingDirectoryFactory.get return new directory for /Users/jenkins/jenkins-slave/workspace/Lucene-Solr-4.x-MacOSX/solr/build/solr-core/test/J0/./org.apache.solr.cloud.CollectionsAPIDistributedZkTest-jetty1-1375496801663//nodes_used_collection_shard2_replica2/data/index
   [junit4]   2> 1921285 T4173 oass.SolrIndexSearcher.<init> Opening Searcher@297eefb6 main
   [junit4]   2> 1921285 T4183 oasc.SolrCore.registerSearcher [nodes_used_collection_shard2_replica1] Registered new searcher Searcher@5b059611 main{StandardDirectoryReader(segments_1:1)}
   [junit4]   2> 1921292 T4143 oass.SolrIndexSearcher.<init> Opening Searcher@12a63f80 main
   [junit4]   2> 1921294 T4143 oasu.CommitTracker.<init> Hard AutoCommit: disabled
   [junit4]   2> 1921300 T4143 oasu.CommitTracker.<init> Soft AutoCommit: disabled
   [junit4]   2> 1921300 T4173 oasu.CommitTracker.<init> Hard AutoCommit: disabled
   [junit4]   2> 1921300 T4173 oasu.CommitTracker.<init> Soft AutoCommit: disabled
   [junit4]   2> 1921308 T4127 oasc.SolrDeletionPolicy.onCommit SolrDeletionPolicy.onCommit: commits: num=1
   [junit4]   2> 		commit{dir=MockDirWrapper(org.apache.lucene.store.RAMDirectory@409e2085 lockFactory=org.apache.lucene.store.NativeFSLockFactory@41239e4c),segFN=segments_1,generation=1}
   [junit4]   2> 1921314 T4127 oasc.SolrDeletionPolicy.updateCommits newest commit generation = 1
   [junit4]   2> 1921316 T4184 oasc.SolrCore.registerSearcher [nodes_used_collection_shard1_replica1] Registered new searcher Searcher@297eefb6 main{StandardDirectoryReader(segments_1:1)}
   [junit4]   2> 1921322 T4113 oasc.CoreContainer.registerCore registering core: nodes_used_collection_shard2_replica1
   [junit4]   2> 1921323 T4113 oasc.ZkController.register Register replica - core:nodes_used_collection_shard2_replica1 address:http://127.0.0.1:52950 collection:nodes_used_collection shard:shard2
   [junit4]   2> 1921324 T4113 oascsi.HttpClientUtil.createClient Creating new http client, config:maxConnections=10000&maxConnectionsPerHost=20&connTimeout=15000&socketTimeout=30000&retry=false
   [junit4]   2> 1921324 T4185 oasc.SolrCore.registerSearcher [nodes_used_collection_shard1_replica2] Registered new searcher Searcher@12a63f80 main{StandardDirectoryReader(segments_1:1)}
   [junit4]   2> 1921329 T4173 oasc.CoreContainer.registerCore registering core: nodes_used_collection_shard1_replica1
   [junit4]   2> 1921329 T4173 oasc.ZkController.register Register replica - core:nodes_used_collection_shard1_replica1 address:http://127.0.0.1:52963 collection:nodes_used_collection shard:shard1
   [junit4]   2> 1921329 T4173 oascsi.HttpClientUtil.createClient Creating new http client, config:maxConnections=10000&maxConnectionsPerHost=20&connTimeout=15000&socketTimeout=30000&retry=false
   [junit4]   2> 1921336 T4127 oasup.UpdateRequestProcessorChain.init inserting DistributedUpdateProcessorFactory into updateRequestProcessorChain "dedupe"
   [junit4]   2> 1921337 T4127 oasup.UpdateRequestProcessorChain.init inserting DistributedUpdateProcessorFactory into updateRequestProcessorChain "stored_sig"
   [junit4]   2> 1921338 T4127 oasup.UpdateRequestProcessorChain.init inserting DistributedUpdateProcessorFactory into updateRequestProcessorChain "distrib-dup-test-chain-implicit"
   [junit4]   2> 1921339 T4127 oasc.RequestHandlers.initHandlersFromConfig created standard: solr.StandardRequestHandler
   [junit4]   2> 1921340 T4127 oasc.RequestHandlers.initHandlersFromConfig created /get: solr.RealTimeGetHandler
   [junit4]   2> 1921340 T4127 oasc.RequestHandlers.initHandlersFromConfig adding lazy requestHandler: solr.ReplicationHandler
   [junit4]   2> 1921341 T4127 oasc.RequestHandlers.initHandlersFromConfig created /replication: solr.ReplicationHandler
   [junit4]   2> 1921341 T4127 oasc.RequestHandlers.initHandlersFromConfig created /update: solr.UpdateRequestHandler
   [junit4]   2> 1921348 T4127 oasc.RequestHandlers.initHandlersFromConfig created /admin/: org.apache.solr.handler.admin.AdminHandlers
   [junit4]   2> 1921329 T4143 oasc.CoreContainer.registerCore registering core: nodes_used_collection_shard1_replica2
   [junit4]   2> 1921351 T4143 oasc.ZkController.register Register replica - core:nodes_used_collection_shard1_replica2 address:http://127.0.0.1:52957 collection:nodes_used_collection shard:shard1
   [junit4]   2> 1921352 T4143 oascsi.HttpClientUtil.createClient Creating new http client, config:maxConnections=10000&maxConnectionsPerHost=20&connTimeout=15000&socketTimeout=30000&retry=false
   [junit4]   2> 1921360 T4127 oashl.XMLLoader.init xsltCacheLifetimeSeconds=60
   [junit4]   2> 1921409 T4143 oascc.SolrZkClient.makePath makePath: /collections/nodes_used_collection/leader_elect/shard1/election
   [junit4]   2> 1921413 T4113 oascc.SolrZkClient.makePath makePath: /collections/nodes_used_collection/leader_elect/shard2/election
   [junit4]   2> 1921417 T4127 oass.SolrIndexSearcher.<init> Opening Searcher@7e9c8da8 main
   [junit4]   2> 1921419 T4127 oasu.CommitTracker.<init> Hard AutoCommit: disabled
   [junit4]   2> 1921419 T4127 oasu.CommitTracker.<init> Soft AutoCommit: disabled
   [junit4]   2> 1921424 T4173 oascc.SolrZkClient.makePath makePath: /collections/nodes_used_collection/leader_elect/shard1/election
   [junit4]   2> 1921426 T4186 oasc.SolrCore.registerSearcher [nodes_used_collection_shard2_replica2] Registered new searcher Searcher@7e9c8da8 main{StandardDirectoryReader(segments_1:1)}
   [junit4]   2> 1921430 T4127 oasc.CoreContainer.registerCore registering core: nodes_used_collection_shard2_replica2
   [junit4]   2> 1921431 T4127 oasc.ZkController.register Register replica - core:nodes_used_collection_shard2_replica2 address:http://127.0.0.1:52954 collection:nodes_used_collection shard:shard2
   [junit4]   2> 1921433 T4127 oascsi.HttpClientUtil.createClient Creating new http client, config:maxConnections=10000&maxConnectionsPerHost=20&connTimeout=15000&socketTimeout=30000&retry=false
   [junit4]   2> 1921496 T4143 oasc.ShardLeaderElectionContext.runLeaderProcess Running the leader process for shard shard1
   [junit4]   2> 1921500 T4127 oasc.ShardLeaderElectionContext.runLeaderProcess Running the leader process for shard shard2
   [junit4]   2> 1921521 T4143 oasc.ShardLeaderElectionContext.waitForReplicasToComeUp Enough replicas found to continue.
   [junit4]   2> 1921521 T4143 oasc.ShardLeaderElectionContext.runLeaderProcess I may be the new leader - try and sync
   [junit4]   2> 1921522 T4143 oasc.SyncStrategy.sync Sync replicas to http://127.0.0.1:52957/nodes_used_collection_shard1_replica2/
   [junit4]   2> 1921522 T4143 oasu.PeerSync.sync PeerSync: core=nodes_used_collection_shard1_replica2 url=http://127.0.0.1:52957 START replicas=[http://127.0.0.1:52963/nodes_used_collection_shard1_replica1/] nUpdates=100
   [junit4]   2> 1921524 T4143 oasu.PeerSync.sync PeerSync: core=nodes_used_collection_shard1_replica2 url=http://127.0.0.1:52957 DONE.  We have no versions.  sync failed.
   [junit4]   2> 1921531 T4143 oasc.SyncStrategy.syncReplicas Leader's attempt to sync with shard failed, moving to the next candidate
   [junit4]   2> 1921532 T4143 oasc.ShardLeaderElectionContext.runLeaderProcess We failed sync, but we have no versions - we can't sync in that case - we were active before, so become leader anyway
   [junit4]   2> 1921532 T4143 oasc.ShardLeaderElectionContext.runLeaderProcess I am the new leader: http://127.0.0.1:52957/nodes_used_collection_shard1_replica2/ shard1
   [junit4]   2> 1921532 T4143 oascc.So

[...truncated too long message...]

.ThreadLeakControl.checkThreadLeaks WARNING Will linger awaiting termination of 2 leaked thread(s).
   [junit4]   2> 2164409 T4177 oasc.LeaderElector$1.process WARN  org.apache.zookeeper.KeeperException$SessionExpiredException: KeeperErrorCode = Session expired for /collections/new_implicit_coll_1/leader_elect/d/election
   [junit4]   2> 	at org.apache.zookeeper.KeeperException.create(KeeperException.java:127)
   [junit4]   2> 	at org.apache.zookeeper.KeeperException.create(KeeperException.java:51)
   [junit4]   2> 	at org.apache.zookeeper.ZooKeeper.getChildren(ZooKeeper.java:1468)
   [junit4]   2> 	at org.apache.solr.common.cloud.SolrZkClient$6.execute(SolrZkClient.java:235)
   [junit4]   2> 	at org.apache.solr.common.cloud.SolrZkClient$6.execute(SolrZkClient.java:232)
   [junit4]   2> 	at org.apache.solr.common.cloud.ZkCmdExecutor.retryOperation(ZkCmdExecutor.java:65)
   [junit4]   2> 	at org.apache.solr.common.cloud.SolrZkClient.getChildren(SolrZkClient.java:232)
   [junit4]   2> 	at org.apache.solr.cloud.LeaderElector.checkIfIamLeader(LeaderElector.java:84)
   [junit4]   2> 	at org.apache.solr.cloud.LeaderElector.access$000(LeaderElector.java:55)
   [junit4]   2> 	at org.apache.solr.cloud.LeaderElector$1.process(LeaderElector.java:129)
   [junit4]   2> 	at org.apache.zookeeper.ClientCnxn$EventThread.processEvent(ClientCnxn.java:519)
   [junit4]   2> 	at org.apache.zookeeper.ClientCnxn$EventThread.run(ClientCnxn.java:495)
   [junit4]   2> 
   [junit4]   2> 2164410 T4177 oascc.ZkStateReader$3.process WARN ZooKeeper watch triggered, but Solr cannot talk to ZK
   [junit4]   2> 2164410 T4177 oascc.ZkStateReader$2.process A cluster state change: WatchedEvent state:SyncConnected type:NodeChildrenChanged path:/live_nodes, has occurred - updating... (live nodes size: 1)
   [junit4]   2> 2164411 T4177 oascc.ZkStateReader$2.process WARN ZooKeeper watch triggered, but Solr cannot talk to ZK
   [junit4]   2> 2164411 T4177 oasc.LeaderElector$1.process WARN  org.apache.zookeeper.KeeperException$SessionExpiredException: KeeperErrorCode = Session expired for /collections/new_implicit_coll_1/leader_elect/a/election
   [junit4]   2> 	at org.apache.zookeeper.KeeperException.create(KeeperException.java:127)
   [junit4]   2> 	at org.apache.zookeeper.KeeperException.create(KeeperException.java:51)
   [junit4]   2> 	at org.apache.zookeeper.ZooKeeper.getChildren(ZooKeeper.java:1468)
   [junit4]   2> 	at org.apache.solr.common.cloud.SolrZkClient$6.execute(SolrZkClient.java:235)
   [junit4]   2> 	at org.apache.solr.common.cloud.SolrZkClient$6.execute(SolrZkClient.java:232)
   [junit4]   2> 	at org.apache.solr.common.cloud.ZkCmdExecutor.retryOperation(ZkCmdExecutor.java:65)
   [junit4]   2> 	at org.apache.solr.common.cloud.SolrZkClient.getChildren(SolrZkClient.java:232)
   [junit4]   2> 	at org.apache.solr.cloud.LeaderElector.checkIfIamLeader(LeaderElector.java:84)
   [junit4]   2> 	at org.apache.solr.cloud.LeaderElector.access$000(LeaderElector.java:55)
   [junit4]   2> 	at org.apache.solr.cloud.LeaderElector$1.process(LeaderElector.java:129)
   [junit4]   2> 	at org.apache.zookeeper.ClientCnxn$EventThread.processEvent(ClientCnxn.java:519)
   [junit4]   2> 	at org.apache.zookeeper.ClientCnxn$EventThread.run(ClientCnxn.java:495)
   [junit4]   2> 
   [junit4]   2> 2164412 T4177 oasc.LeaderElector$1.process WARN  org.apache.zookeeper.KeeperException$SessionExpiredException: KeeperErrorCode = Session expired for /collections/new_implicit_coll_1/leader_elect/b/election
   [junit4]   2> 	at org.apache.zookeeper.KeeperException.create(KeeperException.java:127)
   [junit4]   2> 	at org.apache.zookeeper.KeeperException.create(KeeperException.java:51)
   [junit4]   2> 	at org.apache.zookeeper.ZooKeeper.getChildren(ZooKeeper.java:1468)
   [junit4]   2> 	at org.apache.solr.common.cloud.SolrZkClient$6.execute(SolrZkClient.java:235)
   [junit4]   2> 	at org.apache.solr.common.cloud.SolrZkClient$6.execute(SolrZkClient.java:232)
   [junit4]   2> 	at org.apache.solr.common.cloud.ZkCmdExecutor.retryOperation(ZkCmdExecutor.java:65)
   [junit4]   2> 	at org.apache.solr.common.cloud.SolrZkClient.getChildren(SolrZkClient.java:232)
   [junit4]   2> 	at org.apache.solr.cloud.LeaderElector.checkIfIamLeader(LeaderElector.java:84)
   [junit4]   2> 	at org.apache.solr.cloud.LeaderElector.access$000(LeaderElector.java:55)
   [junit4]   2> 	at org.apache.solr.cloud.LeaderElector$1.process(LeaderElector.java:129)
   [junit4]   2> 	at org.apache.zookeeper.ClientCnxn$EventThread.processEvent(ClientCnxn.java:519)
   [junit4]   2> 	at org.apache.zookeeper.ClientCnxn$EventThread.run(ClientCnxn.java:495)
   [junit4]   2> 
   [junit4]   2> NOTE: test params are: codec=Lucene3x, sim=DefaultSimilarity, locale=ga, timezone=Africa/Djibouti
   [junit4]   2> NOTE: Mac OS X 10.8.4 x86_64/Apple Inc. 1.6.0_51 (64-bit)/cpus=2,threads=1,free=77596840,total=172920832
   [junit4]   2> NOTE: All tests run in this JVM: [TimeZoneUtilsTest, HdfsCollectionsAPIDistributedZkTest, ZkNodePropsTest, IndexReaderFactoryTest, TestSolrIndexConfig, SolrRequestParserTest, FieldMutatingUpdateProcessorTest, PingRequestHandlerTest, TestBinaryResponseWriter, SolrIndexSplitterTest, ShowFileRequestHandlerTest, DistributedSpellCheckComponentTest, TestPseudoReturnFields, RAMDirectoryFactoryTest, BlockCacheTest, CSVRequestHandlerTest, TestDistributedSearch, TestReloadAndDeleteDocs, AddSchemaFieldsUpdateProcessorFactoryTest, TestComponentsName, TestBinaryField, ClusterStateTest, LegacyHTMLStripCharFilterTest, ResourceLoaderTest, MoreLikeThisHandlerTest, PeerSyncTest, TestCodecSupport, TestFieldTypeCollectionResource, ExternalFileFieldSortTest, PathHierarchyTokenizerFactoryTest, NotRequiredUniqueKeyTest, TestTrie, ZkSolrClientTest, UpdateRequestProcessorFactoryTest, ShardSplitTest, AnalysisAfterCoreReloadTest, TestMultiCoreConfBootstrap, TestDFRSimilarityFactory, ConvertedLegacyTest, TestJoin, BasicDistributedZk2Test, ScriptEngineTest, HdfsDirectoryTest, TestNumberUtils, CachingDirectoryFactoryTest, TestManagedSchemaFieldResource, SolrCoreTest, SuggesterWFSTTest, TestIBSimilarityFactory, TestSolrDeletionPolicy2, TestAddFieldRealTimeGet, SchemaVersionSpecificBehaviorTest, TestIndexingPerformance, IndexSchemaTest, TestAtomicUpdateErrorCases, ZkControllerTest, ShardRoutingTest, DirectUpdateHandlerTest, BinaryUpdateRequestHandlerTest, DOMUtilTest, TestDefaultSimilarityFactory, SampleTest, TestFunctionQuery, TestSolr4Spatial, DateFieldTest, UnloadDistributedZkTest, TestSuggestSpellingConverter, CoreAdminCreateDiscoverTest, TestDocSet, DistributedQueryElevationComponentTest, TestXIncludeConfig, ZkCLITest, ReturnFieldsTest, HdfsSyncSliceTest, TestShardHandlerFactory, TestUpdate, WordBreakSolrSpellCheckerTest, ChaosMonkeySafeLeaderTest, TestCSVResponseWriter, TestSolrQueryParserDefaultOperatorResource, TestCloudManagedSchema, TestLuceneMatchVersion, CacheHeaderTest, SolrIndexConfigTest, AutoCommitTest, TestSolrXml, DirectUpdateHandlerOptimizeTest, TestRangeQuery, FileUtilsTest, DistributedTermsComponentTest, RegexBoostProcessorTest, OpenCloseCoreStressTest, TestArbitraryIndexDir, SpellPossibilityIteratorTest, TestCharFilters, TestCopyFieldCollectionResource, OpenExchangeRatesOrgProviderTest, HdfsRecoveryZkTest, TestSolrDeletionPolicy1, TestJmxMonitoredMap, DocValuesTest, TestSweetSpotSimilarityFactory, SuggesterFSTTest, TestSearchPerf, TestLMJelinekMercerSimilarityFactory, HdfsBasicDistributedZk2Test, TestDefaultSearchFieldResource, TestPropInject, TestMergePolicyConfig, TestPropInjectDefaults, TestSchemaVersionResource, DocValuesMultiTest, LukeRequestHandlerTest, NumericFieldsTest, TestPhraseSuggestions, JsonLoaderTest, EchoParamsTest, StandardRequestHandlerTest, MBeansHandlerTest, SolrCoreCheckLockOnStartupTest, TestDynamicFieldCollectionResource, BadCopyFieldTest, SOLR749Test, HardAutoCommitTest, DateMathParserTest, CircularListTest, TermVectorComponentTest, AliasIntegrationTest, TestSchemaResource, TestQueryTypes, FieldAnalysisRequestHandlerTest, ShardRoutingCustomTest, TestPHPSerializedResponseWriter, TestPartialUpdateDeduplication, TestSerializedLuceneMatchVersion, CoreMergeIndexesAdminHandlerTest, TestSolrXmlPersistence, ResponseLogComponentTest, BasicZkTest, TestManagedSchema, LoggingHandlerTest, SyncSliceTest, BasicFunctionalityTest, TestQuerySenderListener, TestStressReorder, TestElisionMultitermQuery, TestSchemaSimilarityResource, DisMaxRequestHandlerTest, CurrencyFieldXmlFileTest, AlternateDirectoryTest, SystemInfoHandlerTest, TestFiltering, SimplePostToolTest, TestRTGBase, PrimUtilsTest, BasicDistributedZkTest, CollectionsAPIDistributedZkTest]
   [junit4] Completed in 260.07s, 1 test, 1 error <<< FAILURES!

[...truncated 489 lines...]
BUILD FAILED
/Users/jenkins/jenkins-slave/workspace/Lucene-Solr-4.x-MacOSX/build.xml:395: The following error occurred while executing this line:
/Users/jenkins/jenkins-slave/workspace/Lucene-Solr-4.x-MacOSX/build.xml:375: The following error occurred while executing this line:
/Users/jenkins/jenkins-slave/workspace/Lucene-Solr-4.x-MacOSX/build.xml:39: The following error occurred while executing this line:
/Users/jenkins/jenkins-slave/workspace/Lucene-Solr-4.x-MacOSX/solr/build.xml:181: The following error occurred while executing this line:
/Users/jenkins/jenkins-slave/workspace/Lucene-Solr-4.x-MacOSX/solr/common-build.xml:449: The following error occurred while executing this line:
/Users/jenkins/jenkins-slave/workspace/Lucene-Solr-4.x-MacOSX/lucene/common-build.xml:1233: The following error occurred while executing this line:
/Users/jenkins/jenkins-slave/workspace/Lucene-Solr-4.x-MacOSX/lucene/common-build.xml:876: There were test failures: 321 suites, 1352 tests, 1 error, 39 ignored (5 assumptions)

Total time: 113 minutes 32 seconds
Build step 'Invoke Ant' marked build as failure
Description set: Java: 64bit/jdk1.6.0 -XX:+UseCompressedOops -XX:+UseSerialGC
Archiving artifacts
Recording test results
Email was triggered for: Failure
Sending email for trigger: Failure



Mime
View raw message