lucene-dev mailing list archives

Site index · List index
Message view « Date » · « Thread »
Top « Date » · « Thread »
From Apache Jenkins Server <jenk...@builds.apache.org>
Subject [JENKINS] Lucene-Solr-Tests-4.x-Java6 - Build # 1868 - Still Failing
Date Sat, 03 Aug 2013 06:48:10 GMT
Build: https://builds.apache.org/job/Lucene-Solr-Tests-4.x-Java6/1868/

1 tests failed.
FAILED:  org.apache.solr.cloud.CollectionsAPIDistributedZkTest.testDistribSearch

Error Message:
IOException occured when talking to server at: http://127.0.0.1:44045/l/rk

Stack Trace:
org.apache.solr.client.solrj.SolrServerException: IOException occured when talking to server at: http://127.0.0.1:44045/l/rk
	at __randomizedtesting.SeedInfo.seed([F5BA2F83AA80DA4F:745CA19BDDDFBA73]:0)
	at org.apache.solr.client.solrj.impl.HttpSolrServer.request(HttpSolrServer.java:435)
	at org.apache.solr.client.solrj.impl.HttpSolrServer.request(HttpSolrServer.java:180)
	at org.apache.solr.cloud.AbstractFullDistribZkTestBase.createCollection(AbstractFullDistribZkTestBase.java:1535)
	at org.apache.solr.cloud.CollectionsAPIDistributedZkTest.testCustomCollectionsAPI(CollectionsAPIDistributedZkTest.java:677)
	at org.apache.solr.cloud.CollectionsAPIDistributedZkTest.doTest(CollectionsAPIDistributedZkTest.java:159)
	at org.apache.solr.BaseDistributedSearchTestCase.testDistribSearch(BaseDistributedSearchTestCase.java:835)
	at sun.reflect.NativeMethodAccessorImpl.invoke0(Native Method)
	at sun.reflect.NativeMethodAccessorImpl.invoke(NativeMethodAccessorImpl.java:57)
	at sun.reflect.DelegatingMethodAccessorImpl.invoke(DelegatingMethodAccessorImpl.java:43)
	at java.lang.reflect.Method.invoke(Method.java:616)
	at com.carrotsearch.randomizedtesting.RandomizedRunner.invoke(RandomizedRunner.java:1559)
	at com.carrotsearch.randomizedtesting.RandomizedRunner.access$600(RandomizedRunner.java:79)
	at com.carrotsearch.randomizedtesting.RandomizedRunner$6.evaluate(RandomizedRunner.java:737)
	at com.carrotsearch.randomizedtesting.RandomizedRunner$7.evaluate(RandomizedRunner.java:773)
	at com.carrotsearch.randomizedtesting.RandomizedRunner$8.evaluate(RandomizedRunner.java:787)
	at com.carrotsearch.randomizedtesting.rules.SystemPropertiesRestoreRule$1.evaluate(SystemPropertiesRestoreRule.java:53)
	at org.apache.lucene.util.TestRuleSetupTeardownChained$1.evaluate(TestRuleSetupTeardownChained.java:50)
	at org.apache.lucene.util.TestRuleFieldCacheSanity$1.evaluate(TestRuleFieldCacheSanity.java:51)
	at org.apache.lucene.util.AbstractBeforeAfterRule$1.evaluate(AbstractBeforeAfterRule.java:46)
	at com.carrotsearch.randomizedtesting.rules.SystemPropertiesInvariantRule$1.evaluate(SystemPropertiesInvariantRule.java:55)
	at org.apache.lucene.util.TestRuleThreadAndTestName$1.evaluate(TestRuleThreadAndTestName.java:49)
	at org.apache.lucene.util.TestRuleIgnoreAfterMaxFailures$1.evaluate(TestRuleIgnoreAfterMaxFailures.java:70)
	at org.apache.lucene.util.TestRuleMarkFailure$1.evaluate(TestRuleMarkFailure.java:48)
	at com.carrotsearch.randomizedtesting.rules.StatementAdapter.evaluate(StatementAdapter.java:36)
	at com.carrotsearch.randomizedtesting.ThreadLeakControl$StatementRunner.run(ThreadLeakControl.java:358)
	at com.carrotsearch.randomizedtesting.ThreadLeakControl.forkTimeoutingTask(ThreadLeakControl.java:782)
	at com.carrotsearch.randomizedtesting.ThreadLeakControl$3.evaluate(ThreadLeakControl.java:442)
	at com.carrotsearch.randomizedtesting.RandomizedRunner.runSingleTest(RandomizedRunner.java:746)
	at com.carrotsearch.randomizedtesting.RandomizedRunner$3.evaluate(RandomizedRunner.java:648)
	at com.carrotsearch.randomizedtesting.RandomizedRunner$4.evaluate(RandomizedRunner.java:682)
	at com.carrotsearch.randomizedtesting.RandomizedRunner$5.evaluate(RandomizedRunner.java:693)
	at com.carrotsearch.randomizedtesting.rules.StatementAdapter.evaluate(StatementAdapter.java:36)
	at com.carrotsearch.randomizedtesting.rules.SystemPropertiesRestoreRule$1.evaluate(SystemPropertiesRestoreRule.java:53)
	at org.apache.lucene.util.AbstractBeforeAfterRule$1.evaluate(AbstractBeforeAfterRule.java:46)
	at org.apache.lucene.util.TestRuleStoreClassName$1.evaluate(TestRuleStoreClassName.java:42)
	at com.carrotsearch.randomizedtesting.rules.SystemPropertiesInvariantRule$1.evaluate(SystemPropertiesInvariantRule.java:55)
	at com.carrotsearch.randomizedtesting.rules.NoShadowingOrOverridesOnMethodsRule$1.evaluate(NoShadowingOrOverridesOnMethodsRule.java:39)
	at com.carrotsearch.randomizedtesting.rules.NoShadowingOrOverridesOnMethodsRule$1.evaluate(NoShadowingOrOverridesOnMethodsRule.java:39)
	at com.carrotsearch.randomizedtesting.rules.StatementAdapter.evaluate(StatementAdapter.java:36)
	at org.apache.lucene.util.TestRuleAssertionsRequired$1.evaluate(TestRuleAssertionsRequired.java:43)
	at org.apache.lucene.util.TestRuleMarkFailure$1.evaluate(TestRuleMarkFailure.java:48)
	at org.apache.lucene.util.TestRuleIgnoreAfterMaxFailures$1.evaluate(TestRuleIgnoreAfterMaxFailures.java:70)
	at org.apache.lucene.util.TestRuleIgnoreTestSuites$1.evaluate(TestRuleIgnoreTestSuites.java:55)
	at com.carrotsearch.randomizedtesting.rules.StatementAdapter.evaluate(StatementAdapter.java:36)
	at com.carrotsearch.randomizedtesting.ThreadLeakControl$StatementRunner.run(ThreadLeakControl.java:358)
	at java.lang.Thread.run(Thread.java:679)
Caused by: org.apache.http.conn.ConnectTimeoutException: Connect to 127.0.0.1:44045 timed out
	at org.apache.http.conn.scheme.PlainSocketFactory.connectSocket(PlainSocketFactory.java:129)
	at org.apache.http.impl.conn.DefaultClientConnectionOperator.openConnection(DefaultClientConnectionOperator.java:180)
	at org.apache.http.impl.conn.ManagedClientConnectionImpl.open(ManagedClientConnectionImpl.java:294)
	at org.apache.http.impl.client.DefaultRequestDirector.tryConnect(DefaultRequestDirector.java:645)
	at org.apache.http.impl.client.DefaultRequestDirector.execute(DefaultRequestDirector.java:480)
	at org.apache.http.impl.client.AbstractHttpClient.execute(AbstractHttpClient.java:906)
	at org.apache.http.impl.client.AbstractHttpClient.execute(AbstractHttpClient.java:805)
	at org.apache.http.impl.client.AbstractHttpClient.execute(AbstractHttpClient.java:784)
	at org.apache.solr.client.solrj.impl.HttpSolrServer.request(HttpSolrServer.java:365)
	... 45 more




Build Log:
[...truncated 9253 lines...]
   [junit4] Suite: org.apache.solr.cloud.CollectionsAPIDistributedZkTest
   [junit4]   2> 1207883 T2093 oas.BaseDistributedSearchTestCase.initHostContext Setting hostContext system property: /l/rk
   [junit4]   2> 1207888 T2093 oas.SolrTestCaseJ4.setUp ###Starting testDistribSearch
   [junit4]   2> Creating dataDir: /usr/home/hudson/hudson-slave/workspace/Lucene-Solr-Tests-4.x-Java6/solr/build/solr-core/test/J1/./solrtest-CollectionsAPIDistributedZkTest-1375511438454
   [junit4]   2> 1207890 T2093 oasc.ZkTestServer.run STARTING ZK TEST SERVER
   [junit4]   2> 1207890 T2094 oasc.ZkTestServer$ZKServerMain.runFromConfig Starting server
   [junit4]   2> 1207992 T2093 oasc.ZkTestServer.run start zk server on port:59274
   [junit4]   2> 1207993 T2093 oascc.ConnectionManager.waitForConnected Waiting for client to connect to ZooKeeper
   [junit4]   2> 1207997 T2100 oascc.ConnectionManager.process Watcher org.apache.solr.common.cloud.ConnectionManager@5fbeafb9 name:ZooKeeperConnection Watcher:127.0.0.1:59274 got event WatchedEvent state:SyncConnected type:None path:null path:null type:None
   [junit4]   2> 1207997 T2093 oascc.ConnectionManager.waitForConnected Client is connected to ZooKeeper
   [junit4]   2> 1207998 T2093 oascc.SolrZkClient.makePath makePath: /solr
   [junit4]   2> 1208019 T2093 oascc.ConnectionManager.waitForConnected Waiting for client to connect to ZooKeeper
   [junit4]   2> 1208021 T2102 oascc.ConnectionManager.process Watcher org.apache.solr.common.cloud.ConnectionManager@3005c72d name:ZooKeeperConnection Watcher:127.0.0.1:59274/solr got event WatchedEvent state:SyncConnected type:None path:null path:null type:None
   [junit4]   2> 1208022 T2093 oascc.ConnectionManager.waitForConnected Client is connected to ZooKeeper
   [junit4]   2> 1208022 T2093 oascc.SolrZkClient.makePath makePath: /collections/collection1
   [junit4]   2> 1208037 T2093 oascc.SolrZkClient.makePath makePath: /collections/collection1/shards
   [junit4]   2> 1208043 T2093 oascc.SolrZkClient.makePath makePath: /collections/control_collection
   [junit4]   2> 1208045 T2093 oascc.SolrZkClient.makePath makePath: /collections/control_collection/shards
   [junit4]   2> 1208058 T2093 oasc.AbstractZkTestCase.putConfig put /usr/home/hudson/hudson-slave/workspace/Lucene-Solr-Tests-4.x-Java6/solr/build/solr-core/test-files/solr/collection1/conf/solrconfig-tlog.xml to /configs/conf1/solrconfig.xml
   [junit4]   2> 1208059 T2093 oascc.SolrZkClient.makePath makePath: /configs/conf1/solrconfig.xml
   [junit4]   2> 1208072 T2093 oasc.AbstractZkTestCase.putConfig put /usr/home/hudson/hudson-slave/workspace/Lucene-Solr-Tests-4.x-Java6/solr/build/solr-core/test-files/solr/collection1/conf/schema.xml to /configs/conf1/schema.xml
   [junit4]   2> 1208073 T2093 oascc.SolrZkClient.makePath makePath: /configs/conf1/schema.xml
   [junit4]   2> 1208178 T2093 oasc.AbstractZkTestCase.putConfig put /usr/home/hudson/hudson-slave/workspace/Lucene-Solr-Tests-4.x-Java6/solr/build/solr-core/test-files/solr/collection1/conf/stopwords.txt to /configs/conf1/stopwords.txt
   [junit4]   2> 1208179 T2093 oascc.SolrZkClient.makePath makePath: /configs/conf1/stopwords.txt
   [junit4]   2> 1208183 T2093 oasc.AbstractZkTestCase.putConfig put /usr/home/hudson/hudson-slave/workspace/Lucene-Solr-Tests-4.x-Java6/solr/build/solr-core/test-files/solr/collection1/conf/protwords.txt to /configs/conf1/protwords.txt
   [junit4]   2> 1208183 T2093 oascc.SolrZkClient.makePath makePath: /configs/conf1/protwords.txt
   [junit4]   2> 1208195 T2093 oasc.AbstractZkTestCase.putConfig put /usr/home/hudson/hudson-slave/workspace/Lucene-Solr-Tests-4.x-Java6/solr/build/solr-core/test-files/solr/collection1/conf/currency.xml to /configs/conf1/currency.xml
   [junit4]   2> 1208195 T2093 oascc.SolrZkClient.makePath makePath: /configs/conf1/currency.xml
   [junit4]   2> 1208198 T2093 oasc.AbstractZkTestCase.putConfig put /usr/home/hudson/hudson-slave/workspace/Lucene-Solr-Tests-4.x-Java6/solr/build/solr-core/test-files/solr/collection1/conf/open-exchange-rates.json to /configs/conf1/open-exchange-rates.json
   [junit4]   2> 1208199 T2093 oascc.SolrZkClient.makePath makePath: /configs/conf1/open-exchange-rates.json
   [junit4]   2> 1208202 T2093 oasc.AbstractZkTestCase.putConfig put /usr/home/hudson/hudson-slave/workspace/Lucene-Solr-Tests-4.x-Java6/solr/build/solr-core/test-files/solr/collection1/conf/mapping-ISOLatin1Accent.txt to /configs/conf1/mapping-ISOLatin1Accent.txt
   [junit4]   2> 1208203 T2093 oascc.SolrZkClient.makePath makePath: /configs/conf1/mapping-ISOLatin1Accent.txt
   [junit4]   2> 1208206 T2093 oasc.AbstractZkTestCase.putConfig put /usr/home/hudson/hudson-slave/workspace/Lucene-Solr-Tests-4.x-Java6/solr/build/solr-core/test-files/solr/collection1/conf/old_synonyms.txt to /configs/conf1/old_synonyms.txt
   [junit4]   2> 1208207 T2093 oascc.SolrZkClient.makePath makePath: /configs/conf1/old_synonyms.txt
   [junit4]   2> 1208210 T2093 oasc.AbstractZkTestCase.putConfig put /usr/home/hudson/hudson-slave/workspace/Lucene-Solr-Tests-4.x-Java6/solr/build/solr-core/test-files/solr/collection1/conf/synonyms.txt to /configs/conf1/synonyms.txt
   [junit4]   2> 1208210 T2093 oascc.SolrZkClient.makePath makePath: /configs/conf1/synonyms.txt
   [junit4]   2> 1208494 T2093 oejs.Server.doStart jetty-8.1.10.v20130312
   [junit4]   2> 1208499 T2093 oejs.AbstractConnector.doStart Started SocketConnector@127.0.0.1:34614
   [junit4]   2> 1208500 T2093 oass.SolrDispatchFilter.init SolrDispatchFilter.init()
   [junit4]   2> 1208500 T2093 oasc.SolrResourceLoader.locateSolrHome JNDI not configured for solr (NoInitialContextEx)
   [junit4]   2> 1208500 T2093 oasc.SolrResourceLoader.locateSolrHome using system property solr.solr.home: /usr/home/hudson/hudson-slave/workspace/Lucene-Solr-Tests-4.x-Java6/solr/build/solr-core/test/J1/./org.apache.solr.cloud.CollectionsAPIDistributedZkTest-controljetty-1375511438786
   [junit4]   2> 1208501 T2093 oasc.SolrResourceLoader.<init> new SolrResourceLoader for directory: '/usr/home/hudson/hudson-slave/workspace/Lucene-Solr-Tests-4.x-Java6/solr/build/solr-core/test/J1/./org.apache.solr.cloud.CollectionsAPIDistributedZkTest-controljetty-1375511438786/'
   [junit4]   2> 1208538 T2093 oasc.ConfigSolr.fromFile Loading container configuration from /usr/home/hudson/hudson-slave/workspace/Lucene-Solr-Tests-4.x-Java6/solr/build/solr-core/test/J1/./org.apache.solr.cloud.CollectionsAPIDistributedZkTest-controljetty-1375511438786/solr.xml
   [junit4]   2> 1208610 T2093 oasc.ConfigSolrXml.<init> Config-defined core root directory: 
   [junit4]   2> 1208611 T2093 oasc.CoreContainer.<init> New CoreContainer 1093543276
   [junit4]   2> 1208612 T2093 oasc.CoreContainer.load Loading cores into CoreContainer [instanceDir=/usr/home/hudson/hudson-slave/workspace/Lucene-Solr-Tests-4.x-Java6/solr/build/solr-core/test/J1/./org.apache.solr.cloud.CollectionsAPIDistributedZkTest-controljetty-1375511438786/]
   [junit4]   2> 1208614 T2093 oashc.HttpShardHandlerFactory.getParameter Setting socketTimeout to: 120000
   [junit4]   2> 1208614 T2093 oashc.HttpShardHandlerFactory.getParameter Setting urlScheme to: http://
   [junit4]   2> 1208615 T2093 oashc.HttpShardHandlerFactory.getParameter Setting connTimeout to: 15000
   [junit4]   2> 1208615 T2093 oashc.HttpShardHandlerFactory.getParameter Setting maxConnectionsPerHost to: 20
   [junit4]   2> 1208615 T2093 oashc.HttpShardHandlerFactory.getParameter Setting corePoolSize to: 0
   [junit4]   2> 1208616 T2093 oashc.HttpShardHandlerFactory.getParameter Setting maximumPoolSize to: 2147483647
   [junit4]   2> 1208616 T2093 oashc.HttpShardHandlerFactory.getParameter Setting maxThreadIdleTime to: 5
   [junit4]   2> 1208617 T2093 oashc.HttpShardHandlerFactory.getParameter Setting sizeOfQueue to: -1
   [junit4]   2> 1208617 T2093 oashc.HttpShardHandlerFactory.getParameter Setting fairnessPolicy to: false
   [junit4]   2> 1208618 T2093 oascsi.HttpClientUtil.createClient Creating new http client, config:maxConnectionsPerHost=20&maxConnections=10000&socketTimeout=120000&connTimeout=15000&retry=false
   [junit4]   2> 1208635 T2093 oasc.ZkContainer.initZooKeeper Zookeeper client=127.0.0.1:59274/solr
   [junit4]   2> 1208635 T2093 oasc.ZkController.checkChrootPath zkHost includes chroot
   [junit4]   2> 1208636 T2093 oascc.ConnectionManager.waitForConnected Waiting for client to connect to ZooKeeper
   [junit4]   2> 1208639 T2113 oascc.ConnectionManager.process Watcher org.apache.solr.common.cloud.ConnectionManager@3c9af6e2 name:ZooKeeperConnection Watcher:127.0.0.1:59274 got event WatchedEvent state:SyncConnected type:None path:null path:null type:None
   [junit4]   2> 1208639 T2093 oascc.ConnectionManager.waitForConnected Client is connected to ZooKeeper
   [junit4]   2> 1208653 T2093 oascsi.HttpClientUtil.createClient Creating new http client, config:maxConnections=500&maxConnectionsPerHost=16&socketTimeout=120000&connTimeout=15000
   [junit4]   2> 1208664 T2093 oascc.ConnectionManager.waitForConnected Waiting for client to connect to ZooKeeper
   [junit4]   2> 1208666 T2115 oascc.ConnectionManager.process Watcher org.apache.solr.common.cloud.ConnectionManager@6a43ab06 name:ZooKeeperConnection Watcher:127.0.0.1:59274/solr got event WatchedEvent state:SyncConnected type:None path:null path:null type:None
   [junit4]   2> 1208666 T2093 oascc.ConnectionManager.waitForConnected Client is connected to ZooKeeper
   [junit4]   2> 1208669 T2093 oascc.SolrZkClient.makePath makePath: /overseer/queue
   [junit4]   2> 1208681 T2093 oascc.SolrZkClient.makePath makePath: /overseer/collection-queue-work
   [junit4]   2> 1208684 T2093 oascc.SolrZkClient.makePath makePath: /live_nodes
   [junit4]   2> 1208687 T2093 oasc.ZkController.createEphemeralLiveNode Register node as live in ZooKeeper:/live_nodes/127.0.0.1:34614_l%2Frk
   [junit4]   2> 1208694 T2093 oascc.SolrZkClient.makePath makePath: /live_nodes/127.0.0.1:34614_l%2Frk
   [junit4]   2> 1208698 T2093 oascc.SolrZkClient.makePath makePath: /overseer_elect/election
   [junit4]   2> 1208715 T2093 oascc.SolrZkClient.makePath makePath: /overseer_elect/leader
   [junit4]   2> 1208718 T2093 oasc.Overseer.start Overseer (id=90145517630980099-127.0.0.1:34614_l%2Frk-n_0000000000) starting
   [junit4]   2> 1208723 T2093 oascc.SolrZkClient.makePath makePath: /overseer/queue-work
   [junit4]   2> 1208736 T2117 oasc.OverseerCollectionProcessor.run Process current queue of collection creations
   [junit4]   2> 1208736 T2093 oascc.SolrZkClient.makePath makePath: /clusterstate.json
   [junit4]   2> 1208739 T2093 oascc.SolrZkClient.makePath makePath: /aliases.json
   [junit4]   2> 1208746 T2093 oascc.ZkStateReader.createClusterStateWatchersAndUpdate Updating cluster state from ZooKeeper... 
   [junit4]   2> 1208749 T2116 oasc.Overseer$ClusterStateUpdater.run Starting to work on the main queue
   [junit4]   2> 1208752 T2093 oasc.CorePropertiesLocator.discover Looking for core definitions underneath /usr/home/hudson/hudson-slave/workspace/Lucene-Solr-Tests-4.x-Java6/solr/build/solr-core/test/J1/./org.apache.solr.cloud.CollectionsAPIDistributedZkTest-controljetty-1375511438786
   [junit4]   2> 1208920 T2093 oasc.CorePropertiesLocator.discoverUnder Found core conf in /usr/home/hudson/hudson-slave/workspace/Lucene-Solr-Tests-4.x-Java6/solr/build/solr-core/test/J1/./org.apache.solr.cloud.CollectionsAPIDistributedZkTest-controljetty-1375511438786/conf/
   [junit4]   2> 1208921 T2093 oasc.CorePropertiesLocator.discover Found 1 core definitions
   [junit4]   2> 1208922 T2093 oass.SolrDispatchFilter.init user.dir=/usr/home/hudson/hudson-slave/workspace/Lucene-Solr-Tests-4.x-Java6/solr/build/solr-core/test/J1
   [junit4]   2> 1208922 T2093 oass.SolrDispatchFilter.init SolrDispatchFilter.init() done
   [junit4]   2> 1208923 T2093 oascsi.HttpClientUtil.createClient Creating new http client, config:maxConnections=128&maxConnectionsPerHost=32&followRedirects=false
   [junit4]   2> 1208939 T2093 oascsi.HttpClientUtil.createClient Creating new http client, config:
   [junit4]   2> 1208940 T2093 oascc.ConnectionManager.waitForConnected Waiting for client to connect to ZooKeeper
   [junit4]   2> 1208942 T2120 oascc.ConnectionManager.process Watcher org.apache.solr.common.cloud.ConnectionManager@6824a077 name:ZooKeeperConnection Watcher:127.0.0.1:59274/solr got event WatchedEvent state:SyncConnected type:None path:null path:null type:None
   [junit4]   2> 1208943 T2093 oascc.ConnectionManager.waitForConnected Client is connected to ZooKeeper
   [junit4]   2> 1208944 T2093 oascc.ZkStateReader.createClusterStateWatchersAndUpdate Updating cluster state from ZooKeeper... 
   [junit4]   2> 1208947 T2093 oasc.ChaosMonkey.monkeyLog monkey: init - expire sessions:true cause connection loss:true
   [junit4]   2> 1209216 T2093 oejs.Server.doStart jetty-8.1.10.v20130312
   [junit4]   2> 1209219 T2093 oejs.AbstractConnector.doStart Started SocketConnector@127.0.0.1:36874
   [junit4]   2> 1209220 T2093 oass.SolrDispatchFilter.init SolrDispatchFilter.init()
   [junit4]   2> 1209221 T2093 oasc.SolrResourceLoader.locateSolrHome JNDI not configured for solr (NoInitialContextEx)
   [junit4]   2> 1209221 T2093 oasc.SolrResourceLoader.locateSolrHome using system property solr.solr.home: /usr/home/hudson/hudson-slave/workspace/Lucene-Solr-Tests-4.x-Java6/solr/build/solr-core/test/J1/./org.apache.solr.cloud.CollectionsAPIDistributedZkTest-jetty1-1375511439512
   [junit4]   2> 1209221 T2093 oasc.SolrResourceLoader.<init> new SolrResourceLoader for directory: '/usr/home/hudson/hudson-slave/workspace/Lucene-Solr-Tests-4.x-Java6/solr/build/solr-core/test/J1/./org.apache.solr.cloud.CollectionsAPIDistributedZkTest-jetty1-1375511439512/'
   [junit4]   2> 1209261 T2093 oasc.ConfigSolr.fromFile Loading container configuration from /usr/home/hudson/hudson-slave/workspace/Lucene-Solr-Tests-4.x-Java6/solr/build/solr-core/test/J1/./org.apache.solr.cloud.CollectionsAPIDistributedZkTest-jetty1-1375511439512/solr.xml
   [junit4]   2> 1209333 T2093 oasc.ConfigSolrXml.<init> Config-defined core root directory: 
   [junit4]   2> 1209334 T2093 oasc.CoreContainer.<init> New CoreContainer 781245774
   [junit4]   2> 1209334 T2093 oasc.CoreContainer.load Loading cores into CoreContainer [instanceDir=/usr/home/hudson/hudson-slave/workspace/Lucene-Solr-Tests-4.x-Java6/solr/build/solr-core/test/J1/./org.apache.solr.cloud.CollectionsAPIDistributedZkTest-jetty1-1375511439512/]
   [junit4]   2> 1209336 T2093 oashc.HttpShardHandlerFactory.getParameter Setting socketTimeout to: 120000
   [junit4]   2> 1209337 T2093 oashc.HttpShardHandlerFactory.getParameter Setting urlScheme to: http://
   [junit4]   2> 1209337 T2093 oashc.HttpShardHandlerFactory.getParameter Setting connTimeout to: 15000
   [junit4]   2> 1209337 T2093 oashc.HttpShardHandlerFactory.getParameter Setting maxConnectionsPerHost to: 20
   [junit4]   2> 1209338 T2093 oashc.HttpShardHandlerFactory.getParameter Setting corePoolSize to: 0
   [junit4]   2> 1209338 T2093 oashc.HttpShardHandlerFactory.getParameter Setting maximumPoolSize to: 2147483647
   [junit4]   2> 1209339 T2093 oashc.HttpShardHandlerFactory.getParameter Setting maxThreadIdleTime to: 5
   [junit4]   2> 1209339 T2093 oashc.HttpShardHandlerFactory.getParameter Setting sizeOfQueue to: -1
   [junit4]   2> 1209340 T2093 oashc.HttpShardHandlerFactory.getParameter Setting fairnessPolicy to: false
   [junit4]   2> 1209340 T2093 oascsi.HttpClientUtil.createClient Creating new http client, config:maxConnectionsPerHost=20&maxConnections=10000&socketTimeout=120000&connTimeout=15000&retry=false
   [junit4]   2> 1209357 T2093 oasc.ZkContainer.initZooKeeper Zookeeper client=127.0.0.1:59274/solr
   [junit4]   2> 1209357 T2093 oasc.ZkController.checkChrootPath zkHost includes chroot
   [junit4]   2> 1209358 T2093 oascc.ConnectionManager.waitForConnected Waiting for client to connect to ZooKeeper
   [junit4]   2> 1209417 T2131 oascc.ConnectionManager.process Watcher org.apache.solr.common.cloud.ConnectionManager@28b143c4 name:ZooKeeperConnection Watcher:127.0.0.1:59274 got event WatchedEvent state:SyncConnected type:None path:null path:null type:None
   [junit4]   2> 1209418 T2093 oascc.ConnectionManager.waitForConnected Client is connected to ZooKeeper
   [junit4]   2> 1209421 T2093 oascsi.HttpClientUtil.createClient Creating new http client, config:maxConnections=500&maxConnectionsPerHost=16&socketTimeout=120000&connTimeout=15000
   [junit4]   2> 1209432 T2093 oascc.ConnectionManager.waitForConnected Waiting for client to connect to ZooKeeper
   [junit4]   2> 1209455 T2133 oascc.ConnectionManager.process Watcher org.apache.solr.common.cloud.ConnectionManager@1fb939ff name:ZooKeeperConnection Watcher:127.0.0.1:59274/solr got event WatchedEvent state:SyncConnected type:None path:null path:null type:None
   [junit4]   2> 1209455 T2093 oascc.ConnectionManager.waitForConnected Client is connected to ZooKeeper
   [junit4]   2> 1209484 T2093 oascc.ZkStateReader.createClusterStateWatchersAndUpdate Updating cluster state from ZooKeeper... 
   [junit4]   2> 1210488 T2093 oasc.ZkController.createEphemeralLiveNode Register node as live in ZooKeeper:/live_nodes/127.0.0.1:36874_l%2Frk
   [junit4]   2> 1210493 T2093 oascc.SolrZkClient.makePath makePath: /live_nodes/127.0.0.1:36874_l%2Frk
   [junit4]   2> 1210497 T2120 oascc.ZkStateReader$3.process Updating live nodes... (2)
   [junit4]   2> 1210497 T2133 oascc.ZkStateReader$3.process Updating live nodes... (2)
   [junit4]   2> 1210497 T2115 oascc.ZkStateReader$3.process Updating live nodes... (2)
   [junit4]   2> 1210514 T2093 oasc.CorePropertiesLocator.discover Looking for core definitions underneath /usr/home/hudson/hudson-slave/workspace/Lucene-Solr-Tests-4.x-Java6/solr/build/solr-core/test/J1/./org.apache.solr.cloud.CollectionsAPIDistributedZkTest-jetty1-1375511439512
   [junit4]   2> 1210680 T2093 oasc.CorePropertiesLocator.discoverUnder Found core conf in /usr/home/hudson/hudson-slave/workspace/Lucene-Solr-Tests-4.x-Java6/solr/build/solr-core/test/J1/./org.apache.solr.cloud.CollectionsAPIDistributedZkTest-jetty1-1375511439512/conf/
   [junit4]   2> 1210683 T2093 oasc.CorePropertiesLocator.discover Found 1 core definitions
   [junit4]   2> 1210684 T2093 oass.SolrDispatchFilter.init user.dir=/usr/home/hudson/hudson-slave/workspace/Lucene-Solr-Tests-4.x-Java6/solr/build/solr-core/test/J1
   [junit4]   2> 1210684 T2093 oass.SolrDispatchFilter.init SolrDispatchFilter.init() done
   [junit4]   2> 1210685 T2093 oascsi.HttpClientUtil.createClient Creating new http client, config:maxConnections=128&maxConnectionsPerHost=32&followRedirects=false
   [junit4]   2> 1210968 T2093 oejs.Server.doStart jetty-8.1.10.v20130312
   [junit4]   2> 1210971 T2093 oejs.AbstractConnector.doStart Started SocketConnector@127.0.0.1:44045
   [junit4]   2> 1210971 T2093 oass.SolrDispatchFilter.init SolrDispatchFilter.init()
   [junit4]   2> 1210972 T2093 oasc.SolrResourceLoader.locateSolrHome JNDI not configured for solr (NoInitialContextEx)
   [junit4]   2> 1210972 T2093 oasc.SolrResourceLoader.locateSolrHome using system property solr.solr.home: /usr/home/hudson/hudson-slave/workspace/Lucene-Solr-Tests-4.x-Java6/solr/build/solr-core/test/J1/./org.apache.solr.cloud.CollectionsAPIDistributedZkTest-jetty2-1375511441264
   [junit4]   2> 1210973 T2093 oasc.SolrResourceLoader.<init> new SolrResourceLoader for directory: '/usr/home/hudson/hudson-slave/workspace/Lucene-Solr-Tests-4.x-Java6/solr/build/solr-core/test/J1/./org.apache.solr.cloud.CollectionsAPIDistributedZkTest-jetty2-1375511441264/'
   [junit4]   2> 1211015 T2093 oasc.ConfigSolr.fromFile Loading container configuration from /usr/home/hudson/hudson-slave/workspace/Lucene-Solr-Tests-4.x-Java6/solr/build/solr-core/test/J1/./org.apache.solr.cloud.CollectionsAPIDistributedZkTest-jetty2-1375511441264/solr.xml
   [junit4]   2> 1211086 T2093 oasc.ConfigSolrXml.<init> Config-defined core root directory: 
   [junit4]   2> 1211087 T2093 oasc.CoreContainer.<init> New CoreContainer 1601898568
   [junit4]   2> 1211087 T2093 oasc.CoreContainer.load Loading cores into CoreContainer [instanceDir=/usr/home/hudson/hudson-slave/workspace/Lucene-Solr-Tests-4.x-Java6/solr/build/solr-core/test/J1/./org.apache.solr.cloud.CollectionsAPIDistributedZkTest-jetty2-1375511441264/]
   [junit4]   2> 1211089 T2093 oashc.HttpShardHandlerFactory.getParameter Setting socketTimeout to: 120000
   [junit4]   2> 1211089 T2093 oashc.HttpShardHandlerFactory.getParameter Setting urlScheme to: http://
   [junit4]   2> 1211090 T2093 oashc.HttpShardHandlerFactory.getParameter Setting connTimeout to: 15000
   [junit4]   2> 1211090 T2093 oashc.HttpShardHandlerFactory.getParameter Setting maxConnectionsPerHost to: 20
   [junit4]   2> 1211091 T2093 oashc.HttpShardHandlerFactory.getParameter Setting corePoolSize to: 0
   [junit4]   2> 1211091 T2093 oashc.HttpShardHandlerFactory.getParameter Setting maximumPoolSize to: 2147483647
   [junit4]   2> 1211092 T2093 oashc.HttpShardHandlerFactory.getParameter Setting maxThreadIdleTime to: 5
   [junit4]   2> 1211092 T2093 oashc.HttpShardHandlerFactory.getParameter Setting sizeOfQueue to: -1
   [junit4]   2> 1211093 T2093 oashc.HttpShardHandlerFactory.getParameter Setting fairnessPolicy to: false
   [junit4]   2> 1211093 T2093 oascsi.HttpClientUtil.createClient Creating new http client, config:maxConnectionsPerHost=20&maxConnections=10000&socketTimeout=120000&connTimeout=15000&retry=false
   [junit4]   2> 1211108 T2093 oasc.ZkContainer.initZooKeeper Zookeeper client=127.0.0.1:59274/solr
   [junit4]   2> 1211108 T2093 oasc.ZkController.checkChrootPath zkHost includes chroot
   [junit4]   2> 1211109 T2093 oascc.ConnectionManager.waitForConnected Waiting for client to connect to ZooKeeper
   [junit4]   2> 1211140 T2145 oascc.ConnectionManager.process Watcher org.apache.solr.common.cloud.ConnectionManager@65cdff1 name:ZooKeeperConnection Watcher:127.0.0.1:59274 got event WatchedEvent state:SyncConnected type:None path:null path:null type:None
   [junit4]   2> 1211140 T2093 oascc.ConnectionManager.waitForConnected Client is connected to ZooKeeper
   [junit4]   2> 1211143 T2093 oascsi.HttpClientUtil.createClient Creating new http client, config:maxConnections=500&maxConnectionsPerHost=16&socketTimeout=120000&connTimeout=15000
   [junit4]   2> 1211152 T2093 oascc.ConnectionManager.waitForConnected Waiting for client to connect to ZooKeeper
   [junit4]   2> 1211154 T2147 oascc.ConnectionManager.process Watcher org.apache.solr.common.cloud.ConnectionManager@7f5ce775 name:ZooKeeperConnection Watcher:127.0.0.1:59274/solr got event WatchedEvent state:SyncConnected type:None path:null path:null type:None
   [junit4]   2> 1211155 T2093 oascc.ConnectionManager.waitForConnected Client is connected to ZooKeeper
   [junit4]   2> 1211167 T2093 oascc.ZkStateReader.createClusterStateWatchersAndUpdate Updating cluster state from ZooKeeper... 
   [junit4]   2> 1212171 T2093 oasc.ZkController.createEphemeralLiveNode Register node as live in ZooKeeper:/live_nodes/127.0.0.1:44045_l%2Frk
   [junit4]   2> 1212185 T2093 oascc.SolrZkClient.makePath makePath: /live_nodes/127.0.0.1:44045_l%2Frk
   [junit4]   2> 1212188 T2120 oascc.ZkStateReader$3.process Updating live nodes... (3)
   [junit4]   2> 1212188 T2115 oascc.ZkStateReader$3.process Updating live nodes... (3)
   [junit4]   2> 1212188 T2147 oascc.ZkStateReader$3.process Updating live nodes... (3)
   [junit4]   2> 1212188 T2133 oascc.ZkStateReader$3.process Updating live nodes... (3)
   [junit4]   2> 1212195 T2093 oasc.CorePropertiesLocator.discover Looking for core definitions underneath /usr/home/hudson/hudson-slave/workspace/Lucene-Solr-Tests-4.x-Java6/solr/build/solr-core/test/J1/./org.apache.solr.cloud.CollectionsAPIDistributedZkTest-jetty2-1375511441264
   [junit4]   2> 1212200 T2093 oasc.CorePropertiesLocator.discoverUnder Found core conf in /usr/home/hudson/hudson-slave/workspace/Lucene-Solr-Tests-4.x-Java6/solr/build/solr-core/test/J1/./org.apache.solr.cloud.CollectionsAPIDistributedZkTest-jetty2-1375511441264/conf/
   [junit4]   2> 1212364 T2093 oasc.CorePropertiesLocator.discover Found 1 core definitions
   [junit4]   2> 1212364 T2093 oass.SolrDispatchFilter.init user.dir=/usr/home/hudson/hudson-slave/workspace/Lucene-Solr-Tests-4.x-Java6/solr/build/solr-core/test/J1
   [junit4]   2> 1212365 T2093 oass.SolrDispatchFilter.init SolrDispatchFilter.init() done
   [junit4]   2> 1212365 T2093 oascsi.HttpClientUtil.createClient Creating new http client, config:maxConnections=128&maxConnectionsPerHost=32&followRedirects=false
   [junit4]   2> 1212649 T2093 oejs.Server.doStart jetty-8.1.10.v20130312
   [junit4]   2> 1212652 T2093 oejs.AbstractConnector.doStart Started SocketConnector@127.0.0.1:31261
   [junit4]   2> 1212653 T2093 oass.SolrDispatchFilter.init SolrDispatchFilter.init()
   [junit4]   2> 1212653 T2093 oasc.SolrResourceLoader.locateSolrHome JNDI not configured for solr (NoInitialContextEx)
   [junit4]   2> 1212654 T2093 oasc.SolrResourceLoader.locateSolrHome using system property solr.solr.home: /usr/home/hudson/hudson-slave/workspace/Lucene-Solr-Tests-4.x-Java6/solr/build/solr-core/test/J1/./org.apache.solr.cloud.CollectionsAPIDistributedZkTest-jetty3-1375511442945
   [junit4]   2> 1212654 T2093 oasc.SolrResourceLoader.<init> new SolrResourceLoader for directory: '/usr/home/hudson/hudson-slave/workspace/Lucene-Solr-Tests-4.x-Java6/solr/build/solr-core/test/J1/./org.apache.solr.cloud.CollectionsAPIDistributedZkTest-jetty3-1375511442945/'
   [junit4]   2> 1212690 T2093 oasc.ConfigSolr.fromFile Loading container configuration from /usr/home/hudson/hudson-slave/workspace/Lucene-Solr-Tests-4.x-Java6/solr/build/solr-core/test/J1/./org.apache.solr.cloud.CollectionsAPIDistributedZkTest-jetty3-1375511442945/solr.xml
   [junit4]   2> 1212761 T2093 oasc.ConfigSolrXml.<init> Config-defined core root directory: 
   [junit4]   2> 1212762 T2093 oasc.CoreContainer.<init> New CoreContainer 1754813116
   [junit4]   2> 1212762 T2093 oasc.CoreContainer.load Loading cores into CoreContainer [instanceDir=/usr/home/hudson/hudson-slave/workspace/Lucene-Solr-Tests-4.x-Java6/solr/build/solr-core/test/J1/./org.apache.solr.cloud.CollectionsAPIDistributedZkTest-jetty3-1375511442945/]
   [junit4]   2> 1212764 T2093 oashc.HttpShardHandlerFactory.getParameter Setting socketTimeout to: 120000
   [junit4]   2> 1212764 T2093 oashc.HttpShardHandlerFactory.getParameter Setting urlScheme to: http://
   [junit4]   2> 1212765 T2093 oashc.HttpShardHandlerFactory.getParameter Setting connTimeout to: 15000
   [junit4]   2> 1212765 T2093 oashc.HttpShardHandlerFactory.getParameter Setting maxConnectionsPerHost to: 20
   [junit4]   2> 1212766 T2093 oashc.HttpShardHandlerFactory.getParameter Setting corePoolSize to: 0
   [junit4]   2> 1212766 T2093 oashc.HttpShardHandlerFactory.getParameter Setting maximumPoolSize to: 2147483647
   [junit4]   2> 1212767 T2093 oashc.HttpShardHandlerFactory.getParameter Setting maxThreadIdleTime to: 5
   [junit4]   2> 1212767 T2093 oashc.HttpShardHandlerFactory.getParameter Setting sizeOfQueue to: -1
   [junit4]   2> 1212768 T2093 oashc.HttpShardHandlerFactory.getParameter Setting fairnessPolicy to: false
   [junit4]   2> 1212768 T2093 oascsi.HttpClientUtil.createClient Creating new http client, config:maxConnectionsPerHost=20&maxConnections=10000&socketTimeout=120000&connTimeout=15000&retry=false
   [junit4]   2> 1212783 T2093 oasc.ZkContainer.initZooKeeper Zookeeper client=127.0.0.1:59274/solr
   [junit4]   2> 1212783 T2093 oasc.ZkController.checkChrootPath zkHost includes chroot
   [junit4]   2> 1212784 T2093 oascc.ConnectionManager.waitForConnected Waiting for client to connect to ZooKeeper
   [junit4]   2> 1212813 T2159 oascc.ConnectionManager.process Watcher org.apache.solr.common.cloud.ConnectionManager@685fea49 name:ZooKeeperConnection Watcher:127.0.0.1:59274 got event WatchedEvent state:SyncConnected type:None path:null path:null type:None
   [junit4]   2> 1212813 T2093 oascc.ConnectionManager.waitForConnected Client is connected to ZooKeeper
   [junit4]   2> 1212817 T2093 oascsi.HttpClientUtil.createClient Creating new http client, config:maxConnections=500&maxConnectionsPerHost=16&socketTimeout=120000&connTimeout=15000
   [junit4]   2> 1212827 T2093 oascc.ConnectionManager.waitForConnected Waiting for client to connect to ZooKeeper
   [junit4]   2> 1212829 T2161 oascc.ConnectionManager.process Watcher org.apache.solr.common.cloud.ConnectionManager@2d94c1 name:ZooKeeperConnection Watcher:127.0.0.1:59274/solr got event WatchedEvent state:SyncConnected type:None path:null path:null type:None
   [junit4]   2> 1212829 T2093 oascc.ConnectionManager.waitForConnected Client is connected to ZooKeeper
   [junit4]   2> 1212841 T2093 oascc.ZkStateReader.createClusterStateWatchersAndUpdate Updating cluster state from ZooKeeper... 
   [junit4]   2> 1213845 T2093 oasc.ZkController.createEphemeralLiveNode Register node as live in ZooKeeper:/live_nodes/127.0.0.1:31261_l%2Frk
   [junit4]   2> 1213847 T2093 oascc.SolrZkClient.makePath makePath: /live_nodes/127.0.0.1:31261_l%2Frk
   [junit4]   2> 1213851 T2120 oascc.ZkStateReader$3.process Updating live nodes... (4)
   [junit4]   2> 1213851 T2161 oascc.ZkStateReader$3.process Updating live nodes... (4)
   [junit4]   2> 1213851 T2115 oascc.ZkStateReader$3.process Updating live nodes... (4)
   [junit4]   2> 1213851 T2133 oascc.ZkStateReader$3.process Updating live nodes... (4)
   [junit4]   2> 1213851 T2147 oascc.ZkStateReader$3.process Updating live nodes... (4)
   [junit4]   2> 1213863 T2093 oasc.CorePropertiesLocator.discover Looking for core definitions underneath /usr/home/hudson/hudson-slave/workspace/Lucene-Solr-Tests-4.x-Java6/solr/build/solr-core/test/J1/./org.apache.solr.cloud.CollectionsAPIDistributedZkTest-jetty3-1375511442945
   [junit4]   2> 1214028 T2093 oasc.CorePropertiesLocator.discoverUnder Found core conf in /usr/home/hudson/hudson-slave/workspace/Lucene-Solr-Tests-4.x-Java6/solr/build/solr-core/test/J1/./org.apache.solr.cloud.CollectionsAPIDistributedZkTest-jetty3-1375511442945/conf/
   [junit4]   2> 1214032 T2093 oasc.CorePropertiesLocator.discover Found 1 core definitions
   [junit4]   2> 1214032 T2093 oass.SolrDispatchFilter.init user.dir=/usr/home/hudson/hudson-slave/workspace/Lucene-Solr-Tests-4.x-Java6/solr/build/solr-core/test/J1
   [junit4]   2> 1214033 T2093 oass.SolrDispatchFilter.init SolrDispatchFilter.init() done
   [junit4]   2> 1214033 T2093 oascsi.HttpClientUtil.createClient Creating new http client, config:maxConnections=128&maxConnectionsPerHost=32&followRedirects=false
   [junit4]   2> 1214322 T2093 oejs.Server.doStart jetty-8.1.10.v20130312
   [junit4]   2> 1214324 T2093 oejs.AbstractConnector.doStart Started SocketConnector@127.0.0.1:35719
   [junit4]   2> 1214325 T2093 oass.SolrDispatchFilter.init SolrDispatchFilter.init()
   [junit4]   2> 1214326 T2093 oasc.SolrResourceLoader.locateSolrHome JNDI not configured for solr (NoInitialContextEx)
   [junit4]   2> 1214326 T2093 oasc.SolrResourceLoader.locateSolrHome using system property solr.solr.home: /usr/home/hudson/hudson-slave/workspace/Lucene-Solr-Tests-4.x-Java6/solr/build/solr-core/test/J1/./org.apache.solr.cloud.CollectionsAPIDistributedZkTest-jetty4-1375511444613
   [junit4]   2> 1214327 T2093 oasc.SolrResourceLoader.<init> new SolrResourceLoader for directory: '/usr/home/hudson/hudson-slave/workspace/Lucene-Solr-Tests-4.x-Java6/solr/build/solr-core/test/J1/./org.apache.solr.cloud.CollectionsAPIDistributedZkTest-jetty4-1375511444613/'
   [junit4]   2> 1214363 T2093 oasc.ConfigSolr.fromFile Loading container configuration from /usr/home/hudson/hudson-slave/workspace/Lucene-Solr-Tests-4.x-Java6/solr/build/solr-core/test/J1/./org.apache.solr.cloud.CollectionsAPIDistributedZkTest-jetty4-1375511444613/solr.xml
   [junit4]   2> 1214434 T2093 oasc.ConfigSolrXml.<init> Config-defined core root directory: 
   [junit4]   2> 1214435 T2093 oasc.CoreContainer.<init> New CoreContainer 343693099
   [junit4]   2> 1214435 T2093 oasc.CoreContainer.load Loading cores into CoreContainer [instanceDir=/usr/home/hudson/hudson-slave/workspace/Lucene-Solr-Tests-4.x-Java6/solr/build/solr-core/test/J1/./org.apache.solr.cloud.CollectionsAPIDistributedZkTest-jetty4-1375511444613/]
   [junit4]   2> 1214443 T2093 oashc.HttpShardHandlerFactory.getParameter Setting socketTimeout to: 120000
   [junit4]   2> 1214443 T2093 oashc.HttpShardHandlerFactory.getParameter Setting urlScheme to: http://
   [junit4]   2> 1214444 T2093 oashc.HttpShardHandlerFactory.getParameter Setting connTimeout to: 15000
   [junit4]   2> 1214444 T2093 oashc.HttpShardHandlerFactory.getParameter Setting maxConnectionsPerHost to: 20
   [junit4]   2> 1214445 T2093 oashc.HttpShardHandlerFactory.getParameter Setting corePoolSize to: 0
   [junit4]   2> 1214445 T2093 oashc.HttpShardHandlerFactory.getParameter Setting maximumPoolSize to: 2147483647
   [junit4]   2> 1214446 T2093 oashc.HttpShardHandlerFactory.getParameter Setting maxThreadIdleTime to: 5
   [junit4]   2> 1214446 T2093 oashc.HttpShardHandlerFactory.getParameter Setting sizeOfQueue to: -1
   [junit4]   2> 1214447 T2093 oashc.HttpShardHandlerFactory.getParameter Setting fairnessPolicy to: false
   [junit4]   2> 1214447 T2093 oascsi.HttpClientUtil.createClient Creating new http client, config:maxConnectionsPerHost=20&maxConnections=10000&socketTimeout=120000&connTimeout=15000&retry=false
   [junit4]   2> 1214464 T2093 oasc.ZkContainer.initZooKeeper Zookeeper client=127.0.0.1:59274/solr
   [junit4]   2> 1214464 T2093 oasc.ZkController.checkChrootPath zkHost includes chroot
   [junit4]   2> 1214465 T2093 oascc.ConnectionManager.waitForConnected Waiting for client to connect to ZooKeeper
   [junit4]   2> 1214468 T2173 oascc.ConnectionManager.process Watcher org.apache.solr.common.cloud.ConnectionManager@2cdb2b2d name:ZooKeeperConnection Watcher:127.0.0.1:59274 got event WatchedEvent state:SyncConnected type:None path:null path:null type:None
   [junit4]   2> 1214468 T2093 oascc.ConnectionManager.waitForConnected Client is connected to ZooKeeper
   [junit4]   2> 1214472 T2093 oascsi.HttpClientUtil.createClient Creating new http client, config:maxConnections=500&maxConnectionsPerHost=16&socketTimeout=120000&connTimeout=15000
   [junit4]   2> 1214484 T2093 oascc.ConnectionManager.waitForConnected Waiting for client to connect to ZooKeeper
   [junit4]   2> 1214486 T2175 oascc.ConnectionManager.process Watcher org.apache.solr.common.cloud.ConnectionManager@30315d29 name:ZooKeeperConnection Watcher:127.0.0.1:59274/solr got event WatchedEvent state:SyncConnected type:None path:null path:null type:None
   [junit4]   2> 1214486 T2093 oascc.ConnectionManager.waitForConnected Client is connected to ZooKeeper
   [junit4]   2> 1214543 T2093 oascc.ZkStateReader.createClusterStateWatchersAndUpdate Updating cluster state from ZooKeeper... 
   [junit4]   2> 1215546 T2093 oasc.ZkController.createEphemeralLiveNode Register node as live in ZooKeeper:/live_nodes/127.0.0.1:35719_l%2Frk
   [junit4]   2> 1215548 T2093 oascc.SolrZkClient.makePath makePath: /live_nodes/127.0.0.1:35719_l%2Frk
   [junit4]   2> 1215552 T2147 oascc.ZkStateReader$3.process Updating live nodes... (5)
   [junit4]   2> 1215552 T2161 oascc.ZkStateReader$3.process Updating live nodes... (5)
   [junit4]   2> 1215552 T2115 oascc.ZkStateReader$3.process Updating live nodes... (5)
   [junit4]   2> 1215552 T2133 oascc.ZkStateReader$3.process Updating live nodes... (5)
   [junit4]   2> 1215552 T2175 oascc.ZkStateReader$3.process Updating live nodes... (5)
   [junit4]   2> 1215552 T2120 oascc.ZkStateReader$3.process Updating live nodes... (5)
   [junit4]   2> 1215571 T2093 oasc.CorePropertiesLocator.discover Looking for core definitions underneath /usr/home/hudson/hudson-slave/workspace/Lucene-Solr-Tests-4.x-Java6/solr/build/solr-core/test/J1/./org.apache.solr.cloud.CollectionsAPIDistributedZkTest-jetty4-1375511444613
   [junit4]   2> 1215739 T2093 oasc.CorePropertiesLocator.discoverUnder Found core conf in /usr/home/hudson/hudson-slave/workspace/Lucene-Solr-Tests-4.x-Java6/solr/build/solr-core/test/J1/./org.apache.solr.cloud.CollectionsAPIDistributedZkTest-jetty4-1375511444613/conf/
   [junit4]   2> 1215742 T2093 oasc.CorePropertiesLocator.discover Found 1 core definitions
   [junit4]   2> 1215743 T2093 oass.SolrDispatchFilter.init user.dir=/usr/home/hudson/hudson-slave/workspace/Lucene-Solr-Tests-4.x-Java6/solr/build/solr-core/test/J1
   [junit4]   2> 1215743 T2093 oass.SolrDispatchFilter.init SolrDispatchFilter.init() done
   [junit4]   2> 1215744 T2093 oascsi.HttpClientUtil.createClient Creating new http client, config:maxConnections=128&maxConnectionsPerHost=32&followRedirects=false
   [junit4]   2> 1215758 T2093 oascsi.HttpClientUtil.createClient Creating new http client, config:maxConnections=128&maxConnectionsPerHost=32&followRedirects=false
   [junit4]   2> 1215769 T2123 oasha.CollectionsHandler.handleCreateAction Creating Collection : numShards=2&name=nodes_used_collection&replicationFactor=2&action=CREATE&wt=javabin&version=2
   [junit4]   2> 1215771 T2115 oasc.DistributedQueue$LatchChildWatcher.process Watcher fired on path: /overseer/collection-queue-work state: SyncConnected type NodeChildrenChanged
   [junit4]   2> 1215772 T2117 oasc.OverseerCollectionProcessor.run Overseer Collection Processor: Get the message id:/overseer/collection-queue-work/qn-0000000000 message:{
   [junit4]   2> 	  "operation":"createcollection",
   [junit4]   2> 	  "numShards":"2",
   [junit4]   2> 	  "name":"nodes_used_collection",
   [junit4]   2> 	  "replicationFactor":"2"}
   [junit4]   2> 1215773 T2117 oasc.OverseerCollectionProcessor.processMessage WARN OverseerCollectionProcessor.processMessage : createcollection , {
   [junit4]   2> 	  "operation":"createcollection",
   [junit4]   2> 	  "numShards":"2",
   [junit4]   2> 	  "name":"nodes_used_collection",
   [junit4]   2> 	  "replicationFactor":"2"}
   [junit4]   2> 1216263 T2116 oascc.ZkStateReader.updateClusterState Updating cloud state from ZooKeeper... 
   [junit4]   2> 1216264 T2116 oasc.Overseer$ClusterStateUpdater.buildCollection building a new collection: nodes_used_collection
   [junit4]   2> 1216264 T2116 oasc.Overseer$ClusterStateUpdater.createCollection Create collection nodes_used_collection with shards [shard1, shard2]
   [junit4]   2> 1216278 T2175 oascc.ZkStateReader$2.process A cluster state change: WatchedEvent state:SyncConnected type:NodeDataChanged path:/clusterstate.json, has occurred - updating... (live nodes size: 5)
   [junit4]   2> 1216279 T2133 oascc.ZkStateReader$2.process A cluster state change: WatchedEvent state:SyncConnected type:NodeDataChanged path:/clusterstate.json, has occurred - updating... (live nodes size: 5)
   [junit4]   2> 1216279 T2147 oascc.ZkStateReader$2.process A cluster state change: WatchedEvent state:SyncConnected type:NodeDataChanged path:/clusterstate.json, has occurred - updating... (live nodes size: 5)
   [junit4]   2> 1216279 T2115 oascc.ZkStateReader$2.process A cluster state change: WatchedEvent state:SyncConnected type:NodeDataChanged path:/clusterstate.json, has occurred - updating... (live nodes size: 5)
   [junit4]   2> 1216279 T2161 oascc.ZkStateReader$2.process A cluster state change: WatchedEvent state:SyncConnected type:NodeDataChanged path:/clusterstate.json, has occurred - updating... (live nodes size: 5)
   [junit4]   2> 1216279 T2120 oascc.ZkStateReader$2.process A cluster state change: WatchedEvent state:SyncConnected type:NodeDataChanged path:/clusterstate.json, has occurred - updating... (live nodes size: 5)
   [junit4]   2> 1216291 T2117 oasc.OverseerCollectionProcessor.createCollection going to create cores replicas shardNames [shard1, shard2] , repFactor : 2
   [junit4]   2> 1216291 T2117 oasc.OverseerCollectionProcessor.createCollection Creating shard nodes_used_collection_shard1_replica1 as part of slice shard1 of collection nodes_used_collection on 127.0.0.1:36874_l%2Frk
   [junit4]   2> 1216291 T2117 oasc.OverseerCollectionProcessor.createCollection Creating shard nodes_used_collection_shard1_replica2 as part of slice shard1 of collection nodes_used_collection on 127.0.0.1:34614_l%2Frk
   [junit4]   2> 1216292 T2117 oasc.OverseerCollectionProcessor.createCollection Creating shard nodes_used_collection_shard2_replica1 as part of slice shard2 of collection nodes_used_collection on 127.0.0.1:31261_l%2Frk
   [junit4]   2> 1216293 T2117 oasc.OverseerCollectionProcessor.createCollection Creating shard nodes_used_collection_shard2_replica2 as part of slice shard2 of collection nodes_used_collection on 127.0.0.1:35719_l%2Frk
   [junit4]   2> 1216295 T2124 oasc.ZkController.publish publishing core=nodes_used_collection_shard1_replica1 state=down
   [junit4]   2> 1216295 T2105 oasc.ZkController.publish publishing core=nodes_used_collection_shard1_replica2 state=down
   [junit4]   2> 1216296 T2151 oasc.ZkController.publish publishing core=nodes_used_collection_shard2_replica1 state=down
   [junit4]   2> 1216296 T2165 oasc.ZkController.publish publishing core=nodes_used_collection_shard2_replica2 state=down
   [junit4]   2> 1216297 T2124 oasc.ZkController.waitForCoreNodeName look for our core node name
   [junit4]   2> 1216299 T2105 oasc.ZkController.waitForCoreNodeName look for our core node name
   [junit4]   2> 1216299 T2165 oasc.ZkController.waitForCoreNodeName look for our core node name
   [junit4]   2> 1216299 T2151 oasc.ZkController.waitForCoreNodeName look for our core node name
   [junit4]   2> 1217786 T2116 oascc.ZkStateReader.updateClusterState Updating cloud state from ZooKeeper... 
   [junit4]   2> 1217787 T2116 oasc.Overseer$ClusterStateUpdater.updateState WARN Could not find collection node for nodes_used_collection, skipping publish state
   [junit4]   2> 1217787 T2116 oasc.Overseer$ClusterStateUpdater.updateState Update state numShards=2 message={
   [junit4]   2> 	  "operation":"state",
   [junit4]   2> 	  "core_node_name":"core_node1",
   [junit4]   2> 	  "numShards":"2",
   [junit4]   2> 	  "shard":"shard1",
   [junit4]   2> 	  "roles":null,
   [junit4]   2> 	  "state":"down",
   [junit4]   2> 	  "shard_state":"active",
   [junit4]   2> 	  "core":"nodes_used_collection_shard1_replica1",
   [junit4]   2> 	  "collection":"nodes_used_collection",
   [junit4]   2> 	  "shard_range":null,
   [junit4]   2> 	  "node_name":"127.0.0.1:36874_l%2Frk",
   [junit4]   2> 	  "base_url":"http://127.0.0.1:36874/l/rk"}
   [junit4]   2> 1217792 T2116 oasc.Overseer$ClusterStateUpdater.updateState WARN Could not find collection node for nodes_used_collection, skipping publish state
   [junit4]   2> 1217792 T2116 oasc.Overseer$ClusterStateUpdater.updateState Update state numShards=2 message={
   [junit4]   2> 	  "operation":"state",
   [junit4]   2> 	  "core_node_name":"core_node2",
   [junit4]   2> 	  "numShards":"2",
   [junit4]   2> 	  "shard":"shard1",
   [junit4]   2> 	  "roles":null,
   [junit4]   2> 	  "state":"down",
   [junit4]   2> 	  "shard_state":"active",
   [junit4]   2> 	  "core":"nodes_used_collection_shard1_replica2",
   [junit4]   2> 	  "collection":"nodes_used_collection",
   [junit4]   2> 	  "shard_range":null,
   [junit4]   2> 	  "node_name":"127.0.0.1:34614_l%2Frk",
   [junit4]   2> 	  "base_url":"http://127.0.0.1:34614/l/rk"}
   [junit4]   2> 1217804 T2116 oasc.Overseer$ClusterStateUpdater.updateState WARN Could not find collection node for nodes_used_collection, skipping publish state
   [junit4]   2> 1217804 T2116 oasc.Overseer$ClusterStateUpdater.updateState Update state numShards=2 message={
   [junit4]   2> 	  "operation":"state",
   [junit4]   2> 	  "core_node_name":"core_node3",
   [junit4]   2> 	  "numShards":"2",
   [junit4]   2> 	  "shard":"shard2",
   [junit4]   2> 	  "roles":null,
   [junit4]   2> 	  "state":"down",
   [junit4]   2> 	  "shard_state":"active",
   [junit4]   2> 	  "core":"nodes_used_collection_shard2_replica1",
   [junit4]   2> 	  "collection":"nodes_used_collection",
   [junit4]   2> 	  "shard_range":null,
   [junit4]   2> 	  "node_name":"127.0.0.1:31261_l%2Frk",
   [junit4]   2> 	  "base_url":"http://127.0.0.1:31261/l/rk"}
   [junit4]   2> 1217808 T2116 oasc.Overseer$ClusterStateUpdater.updateState WARN Could not find collection node for nodes_used_collection, skipping publish state
   [junit4]   2> 1217809 T2116 oasc.Overseer$ClusterStateUpdater.updateState Update state numShards=2 message={
   [junit4]   2> 	  "operation":"state",
   [junit4]   2> 	  "core_node_name":"core_node4",
   [junit4]   2> 	  "numShards":"2",
   [junit4]   2> 	  "shard":"shard2",
   [junit4]   2> 	  "roles":null,
   [junit4]   2> 	  "state":"down",
   [junit4]   2> 	  "shard_state":"active",
   [junit4]   2> 	  "core":"nodes_used_collection_shard2_replica2",
   [junit4]   2> 	  "collection":"nodes_used_collection",
   [junit4]   2> 	  "shard_range":null,
   [junit4]   2> 	  "node_name":"127.0.0.1:35719_l%2Frk",
   [junit4]   2> 	  "base_url":"http://127.0.0.1:35719/l/rk"}
   [junit4]   2> 1217813 T2120 oascc.ZkStateReader$2.process A cluster state change: WatchedEvent state:SyncConnected type:NodeDataChanged path:/clusterstate.json, has occurred - updating... (live nodes size: 5)
   [junit4]   2> 1217813 T2133 oascc.ZkStateReader$2.process A cluster state change: WatchedEvent state:SyncConnected type:NodeDataChanged path:/clusterstate.json, has occurred - updating... (live nodes size: 5)
   [junit4]   2> 1217813 T2147 oascc.ZkStateReader$2.process A cluster state change: WatchedEvent state:SyncConnected type:NodeDataChanged path:/clusterstate.json, has occurred - updating... (live nodes size: 5)
   [junit4]   2> 1217813 T2115 oascc.ZkStateReader$2.process A cluster state change: WatchedEvent state:SyncConnected type:NodeDataChanged path:/clusterstate.json, has occurred - updating... (live nodes size: 5)
   [junit4]   2> 1217813 T2175 oascc.ZkStateReader$2.process A cluster state change: WatchedEvent state:SyncConnected type:NodeDataChanged path:/clusterstate.json, has occurred - updating... (live nodes size: 5)
   [junit4]   2> 1217813 T2161 oascc.ZkStateReader$2.process A cluster state change: WatchedEvent state:SyncConnected type:NodeDataChanged path:/clusterstate.json, has occurred - updating... (live nodes size: 5)
   [junit4]   2> 1218301 T2124 oasc.ZkController.waitForShardId waiting to find shard id in clusterstate for nodes_used_collection_shard1_replica1
   [junit4]   2> 1218302 T2151 oasc.ZkController.waitForShardId waiting to find shard id in clusterstate for nodes_used_collection_shard2_replica1
   [junit4]   2> 1218302 T2124 oasc.CorePropertiesLocator.writePropertiesFile ERROR Couldn't persist core properties to /usr/home/hudson/hudson-slave/workspace/Lucene-Solr-Tests-4.x-Java6/solr/build/solr-core/test/J1/./org.apache.solr.cloud.CollectionsAPIDistributedZkTest-jetty1-1375511439512/nodes_used_collection_shard1_replica1/core.properties: java.io.FileNotFoundException: /usr/home/hudson/hudson-slave/workspace/Lucene-Solr-Tests-4.x-Java6/solr/build/solr-core/test/J1/./org.apache.solr.cloud.CollectionsAPIDistributedZkTest-jetty1-1375511439512/nodes_used_collection_shard1_replica1/core.properties (No such file or directory)
   [junit4]   2> 1218302 T2165 oasc.ZkController.waitForShardId waiting to find shard id in clusterstate for nodes_used_collection_shard2_replica2
   [junit4]   2> 1218303 T2151 oasc.CorePropertiesLocator.writePropertiesFile ERROR Couldn't persist core properties to /usr/home/hudson/hudson-slave/workspace/Lucene-Solr-Tests-4.x-Java6/solr/build/solr-core/test/J1/./org.apache.solr.cloud.CollectionsAPIDistributedZkTest-jetty3-1375511442945/nodes_used_collection_shard2_replica1/core.properties: java.io.FileNotFoundException: /usr/home/hudson/hudson-slave/workspace/Lucene-Solr-Tests-4.x-Java6/solr/build/solr-core/test/J1/./org.apache.solr.cloud.CollectionsAPIDistributedZkTest-jetty3-1375511442945/nodes_used_collection_shard2_replica1/core.properties (No such file or directory)
   [junit4]   2> 1218302 T2124 oasc.CoreContainer.create Creating SolrCore 'nodes_used_collection_shard1_replica1' using instanceDir: /usr/home/hudson/hudson-slave/workspace/Lucene-Solr-Tests-4.x-Java6/solr/build/solr-core/test/J1/./org.apache.solr.cloud.CollectionsAPIDistributedZkTest-jetty1-1375511439512/nodes_used_collection_shard1_replica1
   [junit4]   2> 1218304 T2165 oasc.CorePropertiesLocator.writePropertiesFile ERROR Couldn't persist core properties to /usr/home/hudson/hudson-slave/workspace/Lucene-Solr-Tests-4.x-Java6/solr/build/solr-core/test/J1/./org.apache.solr.cloud.CollectionsAPIDistributedZkTest-jetty4-1375511444613/nodes_used_collection_shard2_replica2/core.properties: java.io.FileNotFoundException: /usr/home/hudson/hudson-slave/workspace/Lucene-Solr-Tests-4.x-Java6/solr/build/solr-core/test/J1/./org.apache.solr.cloud.CollectionsAPIDistributedZkTest-jetty4-1375511444613/nodes_used_collection_shard2_replica2/core.properties (No such file or directory)
   [junit4]   2> 1218304 T2124 oasc.ZkController.createCollectionZkNode Check for collection zkNode:nodes_used_collection
   [junit4]   2> 1218304 T2105 oasc.ZkController.waitForShardId waiting to find shard id in clusterstate for nodes_used_collection_shard1_replica2
   [junit4]   2> 1218303 T2151 oasc.CoreContainer.create Creating SolrCore 'nodes_used_collection_shard2_replica1' using instanceDir: /usr/home/hudson/hudson-slave/workspace/Lucene-Solr-Tests-4.x-Java6/solr/build/solr-core/test/J1/./org.apache.solr.cloud.CollectionsAPIDistributedZkTest-jetty3-1375511442945/nodes_used_collection_shard2_replica1
   [junit4]   2> 1218305 T2124 oasc.ZkController.createCollectionZkNode Creating collection in ZooKeeper:nodes_used_collection
   [junit4]   2> 1218304 T2165 oasc.CoreContainer.create Creating SolrCore 'nodes_used_collection_shard2_replica2' using instanceDir: /usr/home/hudson/hudson-slave/workspace/Lucene-Solr-Tests-4.x-Java6/solr/build/solr-core/test/J1/./org.apache.solr.cloud.CollectionsAPIDistributedZkTest-jetty4-1375511444613/nodes_used_collection_shard2_replica2
   [junit4]   2> 1218306 T2165 oasc.ZkController.createCollectionZkNode Check for collection zkNode:nodes_used_collection
   [junit4]   2> 1218306 T2105 oasc.CorePropertiesLocator.writePropertiesFile ERROR Couldn't persist core properties to /usr/home/hudson/hudson-slave/workspace/Lucene-Solr-Tests-4.x-Java6/solr/build/solr-core/test/J1/./org.apache.solr.cloud.CollectionsAPIDistributedZkTest-controljetty-1375511438786/nodes_used_collection_shard1_replica2/core.properties: java.io.FileNotFoundException: /usr/home/hudson/hudson-slave/workspace/Lucene-Solr-Tests-4.x-Java6/solr/build/solr-core/test/J1/./org.apache.solr.cloud.CollectionsAPIDistributedZkTest-controljetty-1375511438786/nodes_used_collection_shard1_replica2/core.properties (No such file or directory)
   [junit4]   2> 1218306 T2124 oasc.ZkController.getConfName Looking for collection configName
   [junit4]   2> 1218305 T2151 oasc.ZkController.createCollectionZkNode Check for collection zkNode:nodes_used_collection
   [junit4]   2> 1218307 T2165 oasc.ZkController.createCollectionZkNode Creating collection in ZooKeeper:nodes_used_collection
   [junit4]   2> 1218307 T2105 oasc.CoreContainer.create Creating SolrCore 'nodes_used_collection_shard1_replica2' using instanceDir: /usr/home/hudson/hudson-slave/workspace/Lucene-Solr-Tests-4.x-Java6/solr/build/solr-core/test/J1/./org.apache.solr.cloud.CollectionsAPIDistributedZkTest-controljetty-1375511438786/nodes_used_collection_shard1_replica2
   [junit4]   2> 1218308 T2124 oasc.ZkController.getConfName Only one config set found in zk - using it:conf1
   [junit4]   2> 1218308 T2151 oasc.ZkController.createCollectionZkNode Creating collection in ZooKeeper:nodes_used_collection
   [junit4]   2> 1218308 T2165 oasc.ZkController.getConfName Looking for collection configName
   [junit4]   2> 1218309 T2151 oasc.ZkController.getConfName Looking for collection configName
   [junit4]   2> 1218308 T2124 oascc.SolrZkClient.makePath makePath: /collections/nodes_used_collection
   [junit4]   2> 1218308 T2105 oasc.ZkController.createCollectionZkNode Check for collection zkNode:nodes_used_collection
   [junit4]   2> 1218310 T2165 oasc.ZkController.getConfName Only one config set found in zk - using it:conf1
   [junit4]   2> 1218310 T2151 oasc.ZkController.getConfName Only one config set found in zk - using it:conf1
   [junit4]   2> 1218311 T2105 oasc.ZkController.createCollectionZkNode Creating collection in ZooKeeper:nodes_used_collection
   [junit4]   2> 1218311 T2165 oascc.SolrZkClient.makePath makePath: /collections/nodes_used_collection
   [junit4]   2> 1218311 T2105 oasc.ZkController.getConfName Looking for collection configName
   [junit4]   2> 1218311 T2151 oascc.SolrZkClient.makePath makePath: /collections/nodes_used_collection
   [junit4]   2> 1218313 T2124 oasc.ZkController.readConfigName Load collection config from:/collections/nodes_used_collection
   [junit4]   2> 1218313 T2105 oascc.SolrZkClient.makePath makePath: /collections/nodes_used_collection
   [junit4]   2> 1218314 T2165 oasc.ZkController.readConfigName Load collection config from:/collections/nodes_used_collection
   [junit4]   2> 1218314 T2124 oasc.SolrResourceLoader.<init> new SolrResourceLoader for directory: '/usr/home/hudson/hudson-slave/workspace/Lucene-Solr-Tests-4.x-Java6/solr/build/solr-core/test/J1/./org.apache.solr.cloud.CollectionsAPIDistributedZkTest-jetty1-1375511439512/nodes_used_collection_shard1_replica1/'
   [junit4]   2> 1218324 T2151 oasc.ZkController.readConfigName Load collection config from:/collections/nodes_used_collection
   [junit4]   2> 1218325 T2105 oasc.ZkController.readConfigName Load collection config from:/collections/nodes_used_collection
   [junit4]   2> 1218326 T2165 oasc.SolrResourceLoader.<init> new SolrResourceLoader for directory: '/usr/home/hudson/hudson-slave/workspace/Lucene-Solr-Tests-4.x-Java6/solr/build/solr-core/test/J1/./org.apache.solr.cloud.CollectionsAPIDistributedZkTest-jetty4-1375511444613/nodes_used_collection_shard2_replica2/'
   [junit4]   2> 1218326 T2151 oasc.SolrResourceLoader.<init> new SolrResourceLoader for directory: '/usr/home/hudson/hudson-slave/workspace/Lucene-Solr-Tests-4.x-Java6/solr/build/solr-core/test/J1/./org.apache.solr.cloud.CollectionsAPIDistributedZkTest-jetty3-1375511442945/nodes_used_collection_shard2_replica1/'
   [junit4]   2> 1218327 T2105 oasc.SolrResourceLoader.<init> new SolrResourceLoader for directory: '/usr/home/hudson/hudson-slave/workspace/Lucene-Solr-Tests-4.x-Java6/solr/build/solr-core/test/J1/./org.apache.solr.cloud.CollectionsAPIDistributedZkTest-controljetty-1375511438786/nodes_used_collection_shard1_replica2/'
   [junit4]   2> 1218426 T2151 oasc.SolrConfig.<init> Using Lucene MatchVersion: LUCENE_45
   [junit4]   2> 1218427 T2124 oasc.SolrConfig.<init> Using Lucene MatchVersion: LUCENE_45
   [junit4]   2> 1218427 T2105 oasc.SolrConfig.<init> Using Lucene MatchVersion: LUCENE_45
   [junit4]   2> 1218427 T2165 oasc.SolrConfig.<init> Using Lucene MatchVersion: LUCENE_45
   [junit4]   2> 1218506 T2151 oasc.SolrConfig.<init> Loaded SolrConfig: solrconfig.xml
   [junit4]   2> 1218506 T2165 oasc.SolrConfig.<init> Loaded SolrConfig: solrconfig.xml
   [junit4]   2> 1218506 T2124 oasc.SolrConfig.<init> Loaded SolrConfig: solrconfig.xml
   [junit4]   2> 1218507 T2105 oasc.SolrConfig.<init> Loaded SolrConfig: solrconfig.xml
   [junit4]   2> 1218608 T2151 oass.IndexSchema.readSchema Reading Solr Schema from schema.xml
   [junit4]   2> 1218608 T2165 oass.IndexSchema.readSchema Reading Solr Schema from schema.xml
   [junit4]   2> 1218609 T2124 oass.IndexSchema.readSchema Reading Solr Schema from schema.xml
   [junit4]   2> 1218609 T2105 oass.IndexSchema.readSchema Reading Solr Schema from schema.xml
   [junit4]   2> 1218620 T2151 oass.IndexSchema.readSchema [nodes_used_collection_shard2_replica1] Schema name=test
   [junit4]   2> 1218621 T2124 oass.IndexSchema.readSchema [nodes_used_collection_shard1_replica1] Schema name=test
   [junit4]   2> 1218621 T2105 oass.IndexSchema.readSchema [nodes_used_collection_shard1_replica2] Schema name=test
   [junit4]   2> 1218621 T2165 oass.IndexSchema.readSchema [nodes_used_collection_shard2_replica2] Schema name=test
   [junit4]   2> 1219418 T2165 oass.ByteField.init WARN ByteField is deprecated and will be removed in 5.0. You should use TrieIntField instead.
   [junit4]   2> 1219419 T2151 oass.ByteField.init WARN ByteField is deprecated and will be removed in 5.0. You should use TrieIntField instead.
   [junit4]   2> 1219419 T2165 oass.ShortField.init WARN ShortField is deprecated and will be removed in 5.0. You should use TrieIntField instead.
   [junit4]   2> 1219419 T2151 oass.ShortField.init WARN ShortField is deprecated and will be removed in 5.0. You should use TrieIntField instead.
   [junit4]   2> 1219420 T2165 oass.OpenExchangeRatesOrgProvider.init Initialized with rates=open-exchange-rates.json, refreshInterval=1440.
   [junit4]   2> 1219421 T2124 oass.ByteField.init WARN ByteField is deprecated and will be removed in 5.0. You should use TrieIntField instead.
   [junit4]   2> 1219421 T2151 oass.OpenExchangeRatesOrgProvider.init Initialized with rates=open-exchange-rates.json, refreshInterval=1440.
   [junit4]   2> 1219421 T2105 oass.ByteField.init WARN ByteField is deprecated and will be removed in 5.0. You should use TrieIntField instead.
   [junit4]   2> 1219421 T2124 oass.ShortField.init WARN ShortField is deprecated and will be removed in 5.0. You should use TrieIntField instead.
   [junit4]   2> 1219422 T2105 oass.ShortField.init WARN ShortField is deprecated and will be removed in 5.0. You should use TrieIntField instead.
   [junit4]   2> 1219423 T2124 oass.OpenExchangeRatesOrgProvider.init Initialized with rates=open-exchange-rates.json, refreshInterval=1440.
   [junit4]   2> 1219423 T2105 oass.OpenExchangeRatesOrgProvider.init Initialized with rates=open-exchange-rates.json, refreshInterval=1440.
   [junit4]   2> 1219436 T2151 oass.IndexSchema.readSchema default search field in schema is text
   [junit4]   2> 1219436 T2165 oass.IndexSchema.readSchema default search field in schema is text
   [junit4]   2> 1219437 T2124 oass.IndexSchema.readSchema default search field in schema is text
   [junit4]   2> 1219437 T2105 oass.IndexSchema.readSchema default search field in schema is text
   [junit4]   2> 1219441 T2151 oass.IndexSchema.readSchema unique key field: id
   [junit4]   2> 1219442 T2165 oass.IndexSchema.readSchema unique key field: id
   [junit4]   2> 1219442 T2124 oass.IndexSchema.readSchema unique key field: id
   [junit4]   2> 1219442 T2105 oass.IndexSchema.readSchema unique key field: id
   [junit4]   2> 1219458 T2151 oass.FileExchangeRateProvider.reload Reloading exchange rates from file currency.xml
   [junit4]   2> 1219458 T2124 oass.FileExchangeRateProvider.reload Reloading exchange rates from file currency.xml
   [junit4]   2> 1219458 T2105 oass.FileExchangeRateProvider.reload Reloading exchange rates from file currency.xml
   [junit4]   2> 1219458 T2165 oass.FileExchangeRateProvider.reload Reloading exchange rates from file currency.xml
   [junit4]   2> 1219464 T2151 oass.FileExchangeRateProvider.reload Reloading exchange rates from file currency.xml
   [junit4]   2> 1219464 T2105 oass.FileExchangeRateProvider.reload Reloading exchange rates from file currency.xml
   [junit4]   2> 1219464 T2124 oass.FileExchangeRateProvider.reload Reloading exchange rates from file currency.xml
   [junit4]   2> 1219465 T2165 oass.FileExchangeRateProvider.reload Reloading exchange rates from file currency.xml
   [junit4]   2> 1219469 T2151 oass.OpenExchangeRatesOrgProvider.reload Reloading exchange rates from open-exchange-rates.json
   [junit4]   2> 1219469 T2105 oass.OpenExchangeRatesOrgProvider.reload Reloading exchange rates from open-exchange-rates.json
   [junit4]   2> 1219470 T2124 oass.OpenExchangeRatesOrgProvider.reload Reloading exchange rates from open-exchange-rates.json
   [junit4]   2> 1219470 T2151 oass.OpenExchangeRatesOrgProvider$OpenExchangeRates.<init> WARN Unknown key IMPORTANT NOTE
   [junit4]   2> 1219471 T2105 oass.OpenExchangeRatesOrgProvider$OpenExchangeRates.<init> WARN Unknown key IMPORTANT NOTE
   [junit4]   2> 1219471 T2151 oass.OpenExchangeRatesOrgProvider$OpenExchangeRates.<init> WARN Expected key, got STRING
   [junit4]   2> 1219470 T2165 oass.OpenExchangeRatesOrgProvider.reload Reloading exchange rates from open-exchange-rates.json
   [junit4]   2> 1219472 T2151 oass.OpenExchangeRatesOrgProvider.reload Reloading exchange rates from open-exchange-rates.json
   [junit4]   2> 1219471 T2124 oass.OpenExchangeRatesOrgProvider$OpenExchangeRates.<init> WARN Unknown key IMPORTANT NOTE
   [junit4]   2> 1219473 T2124 oass.OpenExchangeRatesOrgProvider$OpenExchangeRates.<init> WARN Expected key, got STRING
   [junit4]   2> 1219471 T2105 oass.OpenExchangeRatesOrgProvider$OpenExchangeRates.<init> WARN Expected key, got STRING
   [junit4]   2> 1219473 T2151 oass.OpenExchangeRatesOrgProvider$OpenExchangeRates.<init> WARN Unknown key IMPORTANT NOTE
   [junit4]   2> 1219473 T2124 oass.OpenExchangeRatesOrgProvider.reload Reloading exchange rates from open-exchange-rates.json
   [junit4]   2> 1219473 T2165 oass.OpenExchangeRatesOrgProvider$OpenExchangeRates.<init> WARN Unknown key IMPORTANT NOTE
   [junit4]   2> 1219474 T2151 oass.OpenExchangeRatesOrgProvider$OpenExchangeRates.<init> WARN Expected key, got STRING
   [junit4]   2> 1219475 T2124 oass.OpenExchangeRatesOrgProvider$OpenExchangeRates.<init> WARN Unknown key IMPORTANT NOTE
   [junit4]   2> 1219475 T2124 oass.OpenExchangeRatesOrgProvider$OpenExchangeRates.<init> WARN Expected key, got STRING
   [junit4]   2> 1219474 T2105 oass.OpenExchangeRatesOrgProvider.reload Reloading exchange rates from open-exchange-rates.json
   [junit4]   2> 1219476 T2124 oasc.SolrCore.initDirectoryFactory org.apache.solr.core.MockDirectoryFactory
   [junit4]   2> 1219475 T2151 oasc.SolrCore.initDirectoryFactory org.apache.solr.core.MockDirectoryFactory
   [junit4]   2> 1219475 T2165 oass.OpenExchangeRatesOrgProvider$OpenExchangeRates.<init> WARN Expected key, got STRING
   [junit4]   2> 1219477 T2105 oass.OpenExchangeRatesOrgProvider$OpenExchangeRates.<init> WARN Unknown key IMPORTANT NOTE
   [junit4]   2> 1219477 T2151 oasc.SolrCore.<init> [nodes_used_collection_shard2_replica1] Opening new SolrCore at /usr/home/hudson/hudson-slave/workspace/Lucene-Solr-Tests-4.x-Java6/solr/build/solr-core/test/J1/./org.apache.solr.cloud.CollectionsAPIDistributedZkTest-jetty3-1375511442945/nodes_used_collection_shard2_replica1/, dataDir=/usr/home/hudson/hudson-slave/workspace/Lucene-Solr-Tests-4.x-Java6/solr/build/solr-core/test/J1/./org.apache.solr.cloud.CollectionsAPIDistributedZkTest-jetty3-1375511442945//nodes_used_collection_shard2_replica1/data/
   [junit4]   2> 1219477 T2124 oasc.SolrCore.<init> [nodes_used_collection_shard1_replica1] Opening new SolrCore at /usr/home/hudson/hudson-slave/workspace/Lucene-Solr-Tests-4.x-Java6/solr/build/solr-core/test/J1/./org.apache.solr.cloud.CollectionsAPIDistributedZkTest-jetty1-1375511439512/nodes_used_collection_shard1_replica1/, dataDir=/usr/home/hudson/hudson-slave/workspace/Lucene-Solr-Tests-4.x-Java6/solr/build/solr-core/test/J1/./org.apache.solr.cloud.CollectionsAPIDistributedZkTest-jetty1-1375511439512//nodes_used_collection_shard1_replica1/data/
   [junit4]   2> 1219479 T2151 oasc.JmxMonitoredMap.<init> JMX monitoring is enabled. Adding Solr mbeans to JMX Server: com.sun.jmx.mbeanserver.JmxMBeanServer@70b125bd
   [junit4]   2> 1219478 T2105 oass.OpenExchangeRatesOrgProvider$OpenExchangeRates.<init> WARN Expected key, got STRING
   [junit4]   2> 1219477 T2165 oass.OpenExchangeRatesOrgProvider.reload Reloading exchange rates from open-exchange-rates.json
   [junit4]   2> 1219480 T2105 oasc.SolrCore.initDirectoryFactory org.apache.solr.core.MockDirectoryFactory
   [junit4]   2> 1219479 T2124 oasc.JmxMonitoredMap.<init> JMX monitoring is enabled. Adding Solr mbeans to JMX Server: com.sun.jmx.mbeanserver.JmxMBeanServer@70b125bd
   [junit4]   2> 1219480 T2105 oasc.SolrCore.<init> [nodes_used_collection_shard1_replica2] Opening new SolrCore at /usr/home/hudson/hudson-slave/workspace/Lucene-Solr-Tests-4.x-Java6/solr/build/solr-core/test/J1/./org.apache.solr.cloud.CollectionsAPIDistributedZkTest-controljetty-1375511438786/nodes_used_collection_shard1_replica2/, dataDir=/usr/home/hudson/hudson-slave/workspace/Lucene-Solr-Tests-4.x-Java6/solr/build/solr-core/test/J1/./org.apache.solr.cloud.CollectionsAPIDistributedZkTest-controljetty-1375511438786//nodes_used_collection_shard1_replica2/data/
   [junit4]   2> 1219480 T2151 oasc.CachingDirectoryFactory.get return new directory for /usr/home/hudson/hudson-slave/workspace/Lucene-Solr-Tests-4.x-Java6/solr/build/solr-core/test/J1/./org.apache.solr.cloud.CollectionsAPIDistributedZkTest-jetty3-1375511442945//nodes_used_collection_shard2_replica1/data
   [junit4]   2> 1219482 T2124 oasc.CachingDirectoryFactory.get return new directory for /usr/home/hudson/hudson-slave/workspace/Lucene-Solr-Tests-4.x-Java6/solr/build/solr-core/test/J1/./org.apache.solr.cloud.CollectionsAPIDistributedZkTest-jetty1-1375511439512//nodes_used_collection_shard1_replica1/data
   [junit4]   2> 1219482 T2151 oasc.SolrCore.getNewIndexDir New index directory detected: old=null new=/usr/home/hudson/hudson-slave/workspace/Lucene-Solr-Tests-4.x-Java6/solr/build/solr-core/test/J1/./org.apache.solr.cloud.CollectionsAPIDistributedZkTest-jetty3-1375511442945//nodes_used_collection_shard2_replica1/data/index/
   [junit4]   2> 1219481 T2105 oasc.JmxMonitoredMap.<init> JMX monitoring is enabled. Adding Solr mbeans to JMX Server: com.sun.jmx.mbeanserver.JmxMBeanServer@70b125bd
   [junit4]   2> 1219481 T2165 oass.OpenExchangeRatesOrgProvider$OpenExchangeRates.<init> WARN Unknown key IMPORTANT NOTE
   [junit4]   2> 1219483 T2165 oass.OpenExchangeRatesOrgProvider$OpenExchangeRates.<init> WARN Expected key, got STRING
   [junit4]   2> 1219482 T2151 oasc.SolrCore.initIndex WARN [nodes_used_collection_shard2_replica1] Solr index directory '/usr/home/hudson/hudson-slave/workspace/Lucene-Solr-Tests-4.x-Java6/solr/build/solr-core/test/J1/./org.apache.solr.cloud.CollectionsAPIDistributedZkTest-jetty3-1375511442945/nodes_used_collection_shard2_replica1/data/index' doesn't exist. Creating new index...
   [junit4]   2> 1219482 T2124 oasc.SolrCore.getNewIndexDir New index directory detected: old=null new=/usr/home/hudson/hudson-slave/workspace/Lucene-Solr-Tests-4.x-Java6/solr/build/solr-core/test/J1/./org.apache.solr.cloud.CollectionsAPIDistributedZkTest-jetty1-1375511439512//nodes_used_collection_shard1_replica1/data/index/
   [junit4]   2> 1219484 T2151 oasc.CachingDirectoryFactory.get return new directory for /usr/home/hudson/hudson-slave/workspace/Lucene-Solr-Tests-4.x-Java6/solr/build/solr-core/test/J1/./org.apache.solr.cloud.CollectionsAPIDistributedZkTest-jetty3-1375511442945//nodes_used_collection_shard2_replica1/data/index
   [junit4]   2> 1219484 T2165 oasc.SolrCore.initDirectoryFactory org.apache.solr.core.MockDirectoryFactory
   [junit4]   2> 1219483 T2105 oasc.CachingDirectoryFactory.get return new directory for /usr/home/hudson/hudson-slave/workspace/Lucene-Solr-Tests-4.x-Java6/solr/build/solr-core/test/J1/./org.apache.solr.cloud.CollectionsAPIDistributedZkTest-controljetty-1375511438786//nodes_used_collection_shard1_replica2/data
   [junit4]   2> 1219485 T2165 oasc.SolrCore.<init> [nodes_used_collection_shard2_replica2] Opening new SolrCore at /usr/home/hudson/hudson-slave/workspace/Lucene-Solr-Tests-4.x-Java6/solr/build/solr-core/test/J1/./org.apache.solr.cloud.CollectionsAPIDistributedZkTest-jetty4-1375511444613/nodes_used_collection_shard2_replica2/, dataDir=/usr/home/hudson/hudson-slave/workspace/Lucene-Solr-Tests-4.x-Java6/solr/build/solr-core/test/J1/./org.apache.solr.cloud.CollectionsAPIDistributedZkTest-jetty4-1375511444613//nodes_used_collection_shard2_replica2/data/
   [junit4]   2> 1219484 T2124 oasc.SolrCore.initIndex WARN [nodes_used_collection_shard1_replica1] Solr index directory '/usr/home/hudson/hudson-slave/workspace/Lucene-Solr-Tests-4.x-Java6/solr/build/solr-core/test/J1/./org.apache.solr.cloud.CollectionsAPIDistributedZkTest-jetty1-1375511439512/nodes_used_collection_shard1_replica1/data/index' doesn't exist. Creating new index...
   [junit4]   2> 1219486 T2165 oasc.JmxMonitoredMap.<init> JMX monitoring is enabled. Adding Solr mbeans to JMX Server: com.sun.jmx.mbeanserver.JmxMBeanServer@70b125bd
   [junit4]   2> 1219485 T2105 oasc.SolrCore.getNewIndexDir New index directory detected: old=null new=/usr/home/hudson/hudson-slave/workspace/Lucene-Solr-Tests-4.x-Java6/solr/build/solr-core/test/J1/./org.apache.solr.cloud.CollectionsAPIDistributedZkTest-controljetty-1375511438786//nodes_used_collection_shard1_replica2/data/index/
   [junit4]   2> 1219486 T2124 oasc.CachingDirectoryFactory.get return new directory for /usr/home/hudson/hudson-slave/workspace/Lucene-Solr-Tests-4.x-Java6/solr/build/solr-core/test/J1/./org.apache.solr.cloud.CollectionsAPIDistributedZkTest-jetty1-1375511439512//nodes_used_collection_shard1_replica1/data/index
   [junit4]   2> 1219487 T2165 oasc.CachingDirectoryFactory.get return new directory for /usr/home/hudson/hudson-slave/workspace/Lucene-Solr-Tests-4.x-Java6/solr/build/solr-core/test/J1/./org.apache.solr.cloud.CollectionsAPIDistributedZkTest-jetty4-1375511444613//nodes_used_collection_shard2_replica2/data
   [junit4]   2> 1219487 T2105 oasc.SolrCore.initIndex WARN [nodes_used_collection_shard1_replica2] Solr index directory '/usr/home/hudson/hudson-slave/workspace/Lucene-Solr-Tests-4.x-Java6/solr/build/solr-core/test/J1/./org.apache.solr.cloud.CollectionsAPIDistributedZkTest-controljetty-1375511438786/nodes_used_collection_shard1_replica2/data/index' doesn't exist. Creating new index...
   [junit4]   2> 1219488 T2165 oasc.SolrCore.getNewIndexDir New index directory detected: old=null new=/usr/home/hudson/hudson-slave/workspace/Lucene-Solr-Tests-4.x-Java6/solr/build/solr-core/test/J1/./org.apache.solr.cloud.CollectionsAPIDistributedZkTest-jetty4-1375511444613//nodes_used_collection_shard2_replica2/data/index/
   [junit4]   2> 1219488 T2105 oasc.CachingDirectoryFactory.get return new directory for /usr/home/hudson/hudson-slave/workspace/Lucene-Solr-Tests-4.x-Java6/solr/build/solr-core/test/J1/./org.apache.solr.cloud.CollectionsAPIDistributedZkTest-controljetty-1375511438786//nodes_used_collection_shard1_replica2/data/index
   [junit4]   2> 1219489 T2165 oasc.SolrCore.initIndex WARN [nodes_used_collection_shard2_replica2] Solr index directory '/usr/home/hudson/hudson-slave/workspace/Lucene-Solr-Tests-4.x-Java6/solr/build/solr-core/test/J1/./org.apache.solr.cloud.CollectionsAPIDistributedZkTest-jetty4-1375511444613/nodes_used_collection_shard2_replica2/data/index' doesn't exist. Creating new index...
   [junit4]   2> 1219489 T2151 oasc.SolrDeletionPolicy.onCommit SolrDeletionPolicy.onCommit: commits: num=1
   [junit4]   2> 		commit{dir=MockDirWrapper(org.apache.lucene.store.RAMDirectory@2d51a56a lockFactory=org.apache.lucene.store.NativeFSLockFactory@665cb2d6),segFN=segments_1,generation=1}
   [junit4]   2> 1219490 T2165 oasc.CachingDirectoryFactory.get return new directory for /usr/home/hudson/hudson-slave/workspace/Lucene-Solr-Tests-4.x-Java6/solr/build/solr-core/test/J1/./org.apache.solr.cloud.CollectionsAPIDistributedZkTest-jetty4-1375511444613//nodes_used_collection_shard2_replica2/data/index
   [junit4]   2> 1219490 T2151 oasc.SolrDeletionPolicy.updateCommits newest commit generation = 1
   [junit4]   2> 1219493 T2124 oasc.SolrDeletionPolicy.onCommit SolrDeletionPolicy.onCommit: commits: num=1
   [junit4]   2> 		commit{dir=MockDirWrapper(org.apache.lucene.store.RAMDirectory@710dc848 lockFactory=org.apache.lucene.store.NativeFSLockFactory@1823b59d),segFN=segments_1,generation=1}
   [junit4]   2> 1219494 T2124 oasc.SolrDeletionPolicy.updateCommits newest commit generation = 1
   [junit4]   2> 1219495 T2105 oasc.SolrDeletionPolicy.onCommit SolrDeletionPolicy.onCommit: commits: num=1
   [junit4]   2> 		commit{dir=MockDirWrapper(org.apache.lucene.store.RAMDirectory@68120b50 lockFactory=org.apache.lucene.store.NativeFSLockFactory@3bb835a1),segFN=segments_1,generation=1}
   [junit4]   2> 1219495 T2105 oasc.SolrDeletionPolicy.updateCommits newest commit generation = 1
   [junit4]   2> 1219495 T2151 oasup.UpdateRequestProcessorChain.init inserting DistributedUpdateProcessorFactory into updateRequestProcessorChain "dedupe"
   [junit4]   2> 1219496 T2165 oasc.SolrDeletionPolicy.onCommit SolrDeletionPolicy.onCommit: commits: num=1
   [junit4]   2> 		commit{dir=MockDirWrapper(org.apache.lucene.store.RAMDirectory@6ef548df lockFactory=org.apache.lucene.store.NativeFSLockFactory@6620c832),segFN=segments_1,generation=1}
   [junit4]   2> 1219496 T2151 oasup.UpdateRequestProcessorChain.init inserting DistributedUpdateProcessorFactory into updateRequestProcessorChain "stored_sig"
   [junit4]   2> 1219497 T2165 oasc.SolrDeletionPolicy.updateCommits newest commit generation = 1
   [junit4]   2> 1219497 T2151 oasup.UpdateRequestProcessorChain.init inserting DistributedUpdateProcessorFactory into updateRequestProcessorChain "distrib-dup-test-chain-implicit"
   [junit4]   2> 1219498 T2151 oasc.RequestHandlers.initHandlersFromConfig created standard: solr.StandardRequestHandler
   [junit4]   2> 1219499 T2124 oasup.UpdateRequestProcessorChain.init inserting DistributedUpdateProcessorFactory into updateRequestProcessorChain "dedupe"
   [junit4]   2> 1219499 T2151 oasc.RequestHandlers.initHandlersFromConfig created /get: solr.RealTimeGetHandler
   [junit4]   2> 1219500 T2151 oasc.RequestHandlers.initHandlersFromConfig adding lazy requestHandler: solr.ReplicationHandler
   [junit4]   2> 1219499 T2124 oasup.UpdateRequestProcessorChain.init inserting DistributedUpdateProcessorFactory into updateRequestProcessorChain "stored_sig"
   [junit4]   2> 1219500 T2151 oasc.RequestHandlers.initHandlersFromConfig created /replication: solr.ReplicationHandler
   [junit4]   2> 1219501 T2105 oasup.UpdateRequestProcessorChain.init inserting DistributedUpdateProcessorFactory into updateRequestProcessorChain "dedupe"
   [junit4]   2> 1219501 T2151 oasc.RequestHandlers.initHandlersFromConfig created /update: solr.UpdateRequestHandler
   [junit4]   2> 1219501 T2124 oasup.UpdateRequestProcessorChain.init inserting DistributedUpdateProcessorFactory into updateRequestProcessorChain "distrib-dup-test-chain-implicit"
   [junit4]   2> 1219502 T2151 oasc.RequestHandlers.initHandlersFromConfig created /admin/: org.apache.solr.handler.admin.AdminHandlers
   [junit4]   2> 1219502 T2124 oasc.RequestHandlers.initHandlersFromConfig created standard: solr.StandardRequestHandler
   [junit4]   2> 1219501 T2105 oasup.UpdateRequestProcessorChain.init inserting DistributedUpdateProcessorFactory into updateRequestProcessorChain "stored_sig"
   [junit4]   2> 1219503 T2124 oasc.RequestHandlers.initHandlersFromConfig created /get: solr.RealTimeGetHandler
   [junit4]   2> 1219502 T2165 oasup.UpdateRequestProcessorChain.init inserting DistributedUpdateProcessorFactory into updateRequestProcessorChain "dedupe"
   [junit4]   2> 1219503 T2105 oasup.UpdateRequestProcessorChain.init inserting DistributedUpdateProcessorFactory into updateRequestProcessorChain "distrib-dup-test-chain-implicit"
   [junit4]   2> 1219503 T2124 oasc.RequestHandlers.initHandlersFromConfig adding lazy requestHandler: solr.ReplicationHandler
   [junit4]   2> 1219504 T2105 oasc.RequestHandlers.initHandlersFromConfig created standard: solr.StandardRequestHandler
   [junit4]   2> 1219504 T2165 oasup.UpdateRequestProcessorChain.init inserting DistributedUpdateProcessorFactory into updateRequestProcessorChain "stored_sig"
   [junit4]   2> 1219505 T2105 oasc.RequestHandlers.initHandlersFromConfig created /get: solr.RealTimeGetHandler
   [junit4]   2> 1219505 T2105 oasc.RequestHandlers.initHandlersFromConfig adding lazy requestHandler: solr.ReplicationHandler
   [junit4]   2> 1219505 T2124 oasc.RequestHandlers.initHandlersFromConfig created /replication: solr.ReplicationHandler
   [junit4]   2> 1219506 T2105 oasc.RequestHandlers.initHandlersFromConfig created /replication: solr.ReplicationHandler
   [junit4]   2> 1219506 T2124 oasc.RequestHandlers.initHandlersFromConfig created /update: solr.UpdateRequestHandler
   [junit4]   2> 1219507 T2105 oasc.RequestHandlers.initHandlersFromConfig created /update: solr.UpdateRequestHandler
   [junit4]   2> 1219505 T2165 oasup.UpdateRequestProcessorChain.init inserting DistributedUpdateProcessorFactory into updateRequestProcessorChain "distrib-dup-test-chain-implicit"
   [junit4]   2> 1219507 T2105 oasc.RequestHandlers.initHandlersFromConfig created /admin/: org.apache.solr.handler.admin.AdminHandlers
   [junit4]   2> 1219508 T2165 oasc.RequestHandlers.initHandlersFromConfig created standard: solr.StandardRequestHandler
   [junit4]   2> 1219507 T2124 oasc.RequestHandlers.initHandlersFromConfig created /admin/: org.apache.solr.handler.admin.AdminHandlers
   [junit4]   2> 1219509 T2165 oasc.RequestHandlers.initHandlersFromConfig created /get: solr.RealTimeGetHandler
   [junit4]   2> 1219509 T2165 oasc.RequestHandlers.initHandlersFromConfig adding lazy requestHandler: solr.ReplicationHandler
   [junit4]   2> 1219509 T2165 oasc.RequestHandlers.initHandlersFromConfig created /replication: solr.ReplicationHandler
   [junit4]   2> 1219510 T2165 oasc.RequestHandlers.initHandlersFromConfig created /update: solr.UpdateRequestHandler
   [junit4]   2> 1219511 T2165 oasc.RequestHandlers.initHandlersFromConfig created /admin/: org.apache.solr.handler.admin.AdminHandlers
   [junit4]   2> 1219513 T2151 oashl.XMLLoader.init xsltCacheLifetimeSeconds=60
   [junit4]   2> 1219513 T2124 oashl.XMLLoader.init xsltCacheLifetimeSeconds=60
   [junit4]   2> 1219513 T2105 oashl.XMLLoader.init xsltCacheLifetimeSeconds=60
   [junit4]   2> 1219514 T2165 oashl.XMLLoader.init xsltCacheLifetimeSeconds=60
   [junit4]   2> 1219525 T2151 oass.SolrIndexSearcher.<init> Opening Searcher@30d573ad main
   [junit4]   2> 1219526 T2165 oass.SolrIndexSearcher.<init> Opening Searcher@792569e2 main
   [junit4]   2> 1219525 T2124 oass.SolrIndexSearcher.<init> Opening Searcher@2dc1a60f main
   [junit4]   2> 1219526 T2105 oass.SolrIndexSearcher.<init> Opening Searcher@69744579 main
   [junit4]   2> 1219527 T2151 oasu.CommitTracker.<init> Hard AutoCommit: disabled
   [junit4]   2> 1219527 T2151 oasu.CommitTracker.<init> Soft AutoCommit: disabled
   [junit4]   2> 1219528 T2165 oasu.CommitTracker.<init> Hard AutoCommit: disabled
   [junit4]   2> 1219528 T2105 oasu.CommitTracker.<init> Hard AutoCommit: disabled
   [junit4]   2> 1219528 T2124 oasu.CommitTracker.<init> Hard AutoCommit: disabled
   [junit4]   2> 1219529 T2105 oasu.CommitTracker.<init> Soft AutoCommit: disabled
   [junit4]   2> 1219528 T2165 oasu.CommitTracker.<init> Soft AutoCommit: disabled
   [junit4]   2> 1219529 T2124 oasu.CommitTracker.<init> Soft AutoCommit: disabled
   [junit4]   2> 1219532 T2181 oasc.SolrCore.registerSearcher [nodes_used_collection_shard2_replica1] Registered new searcher Searcher@30d573ad main{StandardDirectoryReader(segments_1:1)}
   [junit4]   2> 1219533 T2184 oasc.SolrCore.registerSearcher [nodes_used_collection_shard1_replica2] Registered new searcher Searcher@69744579 main{StandardDirectoryReader(segments_1:1)}
   [junit4]   2> 1219533 T2183 oasc.SolrCore.registerSearcher [nodes_used_collection_shard2_replica2] Registered new searcher Searcher@792569e2 main{StandardDirectoryReader(segments_1:1)}
   [junit4]   2> 1219534 T2182 oasc.SolrCore.registerSearcher [nodes_used_collection_shard1_replica1] Registered new searcher Searcher@2dc1a60f main{StandardDirectoryReader(segments_1:1)}
   [junit4]   2> 1219534 T2151 oasc.CoreContainer.registerCore registering core: nodes_used_collection_shard2_replica1
   [junit4]   2> 1219534 T2151 oasc.ZkController.register Register replica - core:nodes_used_collection_shard2_replica1 address:http://127.0.0.1:31261/l/rk collection:nodes_used_collection shard:shard2
   [junit4]   2> 1219535 T2151 oascsi.HttpClientUtil.createClient Creating new http client, config:maxConnections=10000&maxConnectionsPerHost=20&connTimeout=15000&socketTimeout=30000&retry=false
   [junit4]   2> 1219535 T2105 oasc.CoreContainer.registerCore registering core: nodes_used_collection_shard1_replica2
   [junit4]   2> 1219535 T2165 oasc.CoreContainer.registerCore registering core: nodes_used_collection_shard2_replica2
   [junit4]   2> 1219536 T2124 oasc.CoreContainer.registerCore registering core: nodes_used_collection_shard1_replica1
   [junit4]   2> 1219535 T2105 oasc.ZkController.register Register replica - core:nodes_used_collection_shard1_replica2 address:http://127.0.0.1:34614/l/rk collection:nodes_used_collection shard:shard1
   [junit4]   2> 1219536 T2124 oasc.ZkController.register Register replica - core:nodes_used_collection_shard1_replica1 address:http://127.0.0.1:36874/l/rk collection:nodes_used_collection shard:shard1
   [junit4]   2> 1219536 T2165 oasc.ZkController.register Register replica - core:nodes_used_collection_shard2_replica2 address:http://127.0.0.1:35719/l/rk collection:nodes_used_collection shard:shard2
   [junit4]   2> 1219537 T2124 oascsi.HttpClientUtil.createClient Creating new http client, config:maxConnections=10000&maxConnectionsPerHost=20&connTimeout=15000&socketTimeout=30000&retry=false
   [junit4]   2> 1219536 T2105 oascsi.HttpClientUtil.createClient Creating new http client, config:maxConnections=10000&maxConnectionsPerHost=20&connTimeout=15000&socketTimeout=30000&retry=false
   [junit4]   2> 1219537 T2165 oascsi.HttpClientUtil.createClient Creating new http client, config:maxConnections=10000&maxConnectionsPerHost=20&connTimeout=15000&socketTimeout=30000&retry=false
   [junit4]   2> 1219566 T2165 oascc.SolrZkClient.makePath makePath: /collections/nodes_used_collection/leader_elect/shard2/election
   [junit4]   2> 1219566 T2151 oascc.SolrZkClient.makePath makePath: /collections/nodes_used_collection/leader_elect/shard2/election
   [junit4]   2> 1219566 T2105 oascc.SolrZkClient.makePath makePath: /collections/nodes_used_collection/leader_elect/shard1/election
   [junit4]   2> 1219566 T2124 oascc.SolrZkClient.makePath makePath: /collections/nodes_used_collection/leader_elect/shard1/election
   [junit4]   2> 1219603 T2151 oasc.ShardLeaderElectionContext.runLeaderProcess Running the leader process for shard shard2
   [junit4]   2> 1219604 T2124 oasc.ShardLeaderElectionContext.runLeaderProcess Running the leader process for shard shard1
   [junit4]   2> 1219607 T2151 oasc.ShardLeaderElectionContext.waitForReplicasToComeUp Enough replicas found to continue.
   [junit4]   2> 1219607 T2124 oasc.ShardLeaderElectionContext.waitForReplicasToComeUp Enough replicas found to continue.
   [junit4]   2> 1219607 T2151 oasc.ShardLeaderElectionContext.runLeaderProcess I may be the new leader - try and sync
   [junit4]   2> 1219607 T2124 oasc.ShardLeaderElectionContext.runLeaderProcess I may be the new leader - try and sync
   [junit4]   2> 1219608 T2151 oasc.SyncStrategy.sync Sync replicas to http://127.0.0.1:31261/l/rk/nodes_used_collection_shard2_replica1/
   [junit4]   2> 1219608 T2124 oasc.SyncStrategy.sync Sync replicas to http://127.0.0.1:36874/l/rk/nodes_used_collection_shard1_replica1/
   [junit4]   2> 1219609 T2151 oasu.PeerSync.sync PeerSync: core=nodes_used_collection_shard2_replica1 url=http://127.0.0.1:31261/l/rk START replicas=[http://127.0.0.1:35719/l/rk/nodes_used_collection_shard2_replica2/] nUpdates=100
   [junit4]   2> 1219609 T2124 oasu.PeerSync.sync PeerSync: core=nodes_used_collection_shard1_replica1 url=http://127.0.0.1:36874/l/rk START replicas=[http://127.0.0.1:34614/l/rk/nodes_used_collection_sh

[...truncated too long message...]

.http.conn.ConnectTimeoutException: Connect to 127.0.0.1:44045 timed out
   [junit4]    > 	at org.apache.http.conn.scheme.PlainSocketFactory.connectSocket(PlainSocketFactory.java:129)
   [junit4]    > 	at org.apache.http.impl.conn.DefaultClientConnectionOperator.openConnection(DefaultClientConnectionOperator.java:180)
   [junit4]    > 	at org.apache.http.impl.conn.ManagedClientConnectionImpl.open(ManagedClientConnectionImpl.java:294)
   [junit4]    > 	at org.apache.http.impl.client.DefaultRequestDirector.tryConnect(DefaultRequestDirector.java:645)
   [junit4]    > 	at org.apache.http.impl.client.DefaultRequestDirector.execute(DefaultRequestDirector.java:480)
   [junit4]    > 	at org.apache.http.impl.client.AbstractHttpClient.execute(AbstractHttpClient.java:906)
   [junit4]    > 	at org.apache.http.impl.client.AbstractHttpClient.execute(AbstractHttpClient.java:805)
   [junit4]    > 	at org.apache.http.impl.client.AbstractHttpClient.execute(AbstractHttpClient.java:784)
   [junit4]    > 	at org.apache.solr.client.solrj.impl.HttpSolrServer.request(HttpSolrServer.java:365)
   [junit4]    > 	... 45 more
   [junit4]   2> 1348703 T2093 oas.SolrTestCaseJ4.deleteCore ###deleteCore
   [junit4]   2> 140830 T2092 ccr.ThreadLeakControl.checkThreadLeaks WARNING Will linger awaiting termination of 1 leaked thread(s).
   [junit4]   2> 1348734 T2175 oasc.LeaderElector$1.process WARN  org.apache.zookeeper.KeeperException$SessionExpiredException: KeeperErrorCode = Session expired for /collections/new_implicit_coll_0/leader_elect/c/election
   [junit4]   2> 	at org.apache.zookeeper.KeeperException.create(KeeperException.java:127)
   [junit4]   2> 	at org.apache.zookeeper.KeeperException.create(KeeperException.java:51)
   [junit4]   2> 	at org.apache.zookeeper.ZooKeeper.getChildren(ZooKeeper.java:1468)
   [junit4]   2> 	at org.apache.solr.common.cloud.SolrZkClient$6.execute(SolrZkClient.java:235)
   [junit4]   2> 	at org.apache.solr.common.cloud.SolrZkClient$6.execute(SolrZkClient.java:232)
   [junit4]   2> 	at org.apache.solr.common.cloud.ZkCmdExecutor.retryOperation(ZkCmdExecutor.java:65)
   [junit4]   2> 	at org.apache.solr.common.cloud.SolrZkClient.getChildren(SolrZkClient.java:232)
   [junit4]   2> 	at org.apache.solr.cloud.LeaderElector.checkIfIamLeader(LeaderElector.java:84)
   [junit4]   2> 	at org.apache.solr.cloud.LeaderElector.access$000(LeaderElector.java:55)
   [junit4]   2> 	at org.apache.solr.cloud.LeaderElector$1.process(LeaderElector.java:129)
   [junit4]   2> 	at org.apache.zookeeper.ClientCnxn$EventThread.processEvent(ClientCnxn.java:519)
   [junit4]   2> 	at org.apache.zookeeper.ClientCnxn$EventThread.run(ClientCnxn.java:495)
   [junit4]   2> 
   [junit4]   2> 1348734 T2175 oasc.LeaderElector$1.process WARN  org.apache.zookeeper.KeeperException$SessionExpiredException: KeeperErrorCode = Session expired for /collections/new_implicit_coll_1/leader_elect/a/election
   [junit4]   2> 	at org.apache.zookeeper.KeeperException.create(KeeperException.java:127)
   [junit4]   2> 	at org.apache.zookeeper.KeeperException.create(KeeperException.java:51)
   [junit4]   2> 	at org.apache.zookeeper.ZooKeeper.getChildren(ZooKeeper.java:1468)
   [junit4]   2> 	at org.apache.solr.common.cloud.SolrZkClient$6.execute(SolrZkClient.java:235)
   [junit4]   2> 	at org.apache.solr.common.cloud.SolrZkClient$6.execute(SolrZkClient.java:232)
   [junit4]   2> 	at org.apache.solr.common.cloud.ZkCmdExecutor.retryOperation(ZkCmdExecutor.java:65)
   [junit4]   2> 	at org.apache.solr.common.cloud.SolrZkClient.getChildren(SolrZkClient.java:232)
   [junit4]   2> 	at org.apache.solr.cloud.LeaderElector.checkIfIamLeader(LeaderElector.java:84)
   [junit4]   2> 	at org.apache.solr.cloud.LeaderElector.access$000(LeaderElector.java:55)
   [junit4]   2> 	at org.apache.solr.cloud.LeaderElector$1.process(LeaderElector.java:129)
   [junit4]   2> 	at org.apache.zookeeper.ClientCnxn$EventThread.processEvent(ClientCnxn.java:519)
   [junit4]   2> 	at org.apache.zookeeper.ClientCnxn$EventThread.run(ClientCnxn.java:495)
   [junit4]   2> 
   [junit4]   2> 1348735 T2175 oasc.LeaderElector$1.process WARN  org.apache.zookeeper.KeeperException$SessionExpiredException: KeeperErrorCode = Session expired for /collections/new_implicit_coll_1/leader_elect/d/election
   [junit4]   2> 	at org.apache.zookeeper.KeeperException.create(KeeperException.java:127)
   [junit4]   2> 	at org.apache.zookeeper.KeeperException.create(KeeperException.java:51)
   [junit4]   2> 	at org.apache.zookeeper.ZooKeeper.getChildren(ZooKeeper.java:1468)
   [junit4]   2> 	at org.apache.solr.common.cloud.SolrZkClient$6.execute(SolrZkClient.java:235)
   [junit4]   2> 	at org.apache.solr.common.cloud.SolrZkClient$6.execute(SolrZkClient.java:232)
   [junit4]   2> 	at org.apache.solr.common.cloud.ZkCmdExecutor.retryOperation(ZkCmdExecutor.java:65)
   [junit4]   2> 	at org.apache.solr.common.cloud.SolrZkClient.getChildren(SolrZkClient.java:232)
   [junit4]   2> 	at org.apache.solr.cloud.LeaderElector.checkIfIamLeader(LeaderElector.java:84)
   [junit4]   2> 	at org.apache.solr.cloud.LeaderElector.access$000(LeaderElector.java:55)
   [junit4]   2> 	at org.apache.solr.cloud.LeaderElector$1.process(LeaderElector.java:129)
   [junit4]   2> 	at org.apache.zookeeper.ClientCnxn$EventThread.processEvent(ClientCnxn.java:519)
   [junit4]   2> 	at org.apache.zookeeper.ClientCnxn$EventThread.run(ClientCnxn.java:495)
   [junit4]   2> 
   [junit4]   2> 1348735 T2175 oascc.ZkStateReader$2.process A cluster state change: WatchedEvent state:SyncConnected type:NodeChildrenChanged path:/live_nodes, has occurred - updating... (live nodes size: 1)
   [junit4]   2> 1348735 T2175 oascc.ZkStateReader$2.process WARN ZooKeeper watch triggered, but Solr cannot talk to ZK
   [junit4]   2> 1348736 T2175 oascc.ZkStateReader$3.process WARN ZooKeeper watch triggered, but Solr cannot talk to ZK
   [junit4]   2> NOTE: test params are: codec=Lucene42: {timestamp=PostingsFormat(name=MockSep), range_facet_l=PostingsFormat(name=MockSep), id=PostingsFormat(name=MockRandom), range_facet_sl=PostingsFormat(name=MockRandom), a_t=PostingsFormat(name=MockSep), text=PostingsFormat(name=NestedPulsing), range_facet_si=PostingsFormat(name=MockSep), _version_=PostingsFormat(name=TestBloomFilteredLucene41Postings), other_tl1=PostingsFormat(name=TestBloomFilteredLucene41Postings), multiDefault=PostingsFormat(name=MockSep), a_si=PostingsFormat(name=TestBloomFilteredLucene41Postings), intDefault=PostingsFormat(name=TestBloomFilteredLucene41Postings)}, docValues:{}, sim=RandomSimilarityProvider(queryNorm=false,coord=crazy): {}, locale=ru_RU, timezone=Australia/Victoria
   [junit4]   2> NOTE: FreeBSD 9.1-RELEASE-p3 amd64/Sun Microsystems Inc. 1.6.0_32 (64-bit)/cpus=16,threads=6,free=288295728,total=524419072
   [junit4]   2> NOTE: All tests run in this JVM: [SuggesterWFSTTest, BadCopyFieldTest, HighlighterConfigTest, IndexReaderFactoryTest, FileUtilsTest, QueryResultKeyTest, TimeZoneUtilsTest, TestReloadAndDeleteDocs, TestLMJelinekMercerSimilarityFactory, TestJmxIntegration, TestZkChroot, SampleTest, ChaosMonkeySafeLeaderTest, TestComponentsName, TestDistributedSearch, TestStressReorder, SolrIndexConfigTest, TestPropInject, HardAutoCommitTest, BasicZkTest, SuggesterTSTTest, TestReload, PreAnalyzedUpdateProcessorTest, SpellPossibilityIteratorTest, DirectSolrSpellCheckerTest, IndexSchemaRuntimeFieldTest, TestCoreDiscovery, DefaultValueUpdateProcessorTest, TestIndexingPerformance, DocumentAnalysisRequestHandlerTest, EchoParamsTest, NotRequiredUniqueKeyTest, HighlighterTest, SpellCheckComponentTest, TestFoldingMultitermQuery, TermVectorComponentDistributedTest, DeleteShardTest, StandardRequestHandlerTest, MultiTermTest, TestCloudManagedSchema, RequestHandlersTest, TestArbitraryIndexDir, TestSchemaVersionResource, TestWordDelimiterFilterFactory, ClusterStateTest, TestNumberUtils, OpenExchangeRatesOrgProviderTest, HdfsCollectionsAPIDistributedZkTest, SpellCheckCollatorTest, TestUtils, TestAnalyzedSuggestions, TestFiltering, UniqFieldsUpdateProcessorFactoryTest, TestCodecSupport, TestFieldCollectionResource, PingRequestHandlerTest, TestSuggestSpellingConverter, TestDistributedGrouping, AssignTest, RequiredFieldsTest, TestSolr4Spatial, TestMergePolicyConfig, TestPostingsSolrHighlighter, TestInfoStreamLogging, DistanceFunctionTest, XmlUpdateRequestHandlerTest, SolrRequestParserTest, TestRandomFaceting, CurrencyFieldOpenExchangeTest, DOMUtilTest, TestFastOutputStream, StatsComponentTest, CoreAdminCreateDiscoverTest, URLClassifyProcessorTest, HdfsRecoveryZkTest, TestElisionMultitermQuery, BasicDistributedZk2Test, CollectionsAPIDistributedZkTest]
   [junit4] Completed on J1 in 141.11s, 1 test, 1 error <<< FAILURES!

[...truncated 506 lines...]
BUILD FAILED
/usr/home/hudson/hudson-slave/workspace/Lucene-Solr-Tests-4.x-Java6/build.xml:395: The following error occurred while executing this line:
/usr/home/hudson/hudson-slave/workspace/Lucene-Solr-Tests-4.x-Java6/build.xml:375: The following error occurred while executing this line:
/usr/home/hudson/hudson-slave/workspace/Lucene-Solr-Tests-4.x-Java6/build.xml:39: The following error occurred while executing this line:
/usr/home/hudson/hudson-slave/workspace/Lucene-Solr-Tests-4.x-Java6/solr/build.xml:181: The following error occurred while executing this line:
/usr/home/hudson/hudson-slave/workspace/Lucene-Solr-Tests-4.x-Java6/solr/common-build.xml:449: The following error occurred while executing this line:
/usr/home/hudson/hudson-slave/workspace/Lucene-Solr-Tests-4.x-Java6/lucene/common-build.xml:1233: The following error occurred while executing this line:
/usr/home/hudson/hudson-slave/workspace/Lucene-Solr-Tests-4.x-Java6/lucene/common-build.xml:876: There were test failures: 321 suites, 1352 tests, 1 error, 34 ignored (6 assumptions)

Total time: 58 minutes 38 seconds
Build step 'Invoke Ant' marked build as failure
Archiving artifacts
Recording test results
Email was triggered for: Failure
Sending email for trigger: Failure



Mime
View raw message